Generic Data Quality Suite
type: Suite
type: Ontology
imports: dqd
created: 2023-10-09T11:47:02Z
description: This DQ Suite provides generic metrics for data quality measurement.

ValueCompleteness
type: Class
subclass of: Metric
label: Value Completeness
comment: The 'Value Completeness' metric computes the ratio between the number of null values and the number of all values.
is part of dimension: Completeness

ValueInBoundaries
type: Class
subclass of: Metric
label: Value in boundaries
comment: The 'Value in boundaries' metric computes the ratio between the number of values that are within certain boundaries and all values.
is part of dimension: Accuracy