Maximum Temperature
type: Concept
definition: The equipment setting which specifies the maximum achievable temperature by the machine.
in scheme: Materials Tribology Lab at KIT
scope note: K
scope note: °C
scope note: float

Polishing Cloth
type: Concept
definition: Contains information about the cloth used during a polishing step.
in scheme: Materials Tribology Lab at KIT
scope note: dictionary

Speed Setpoint
type: Concept
definition: The speed setting assigned to be maintained by the machine in a scientific process.
in scheme: Materials Tribology Lab at KIT
scope note: µms^(-1)
scope note: mms^(-1)
scope note: ms^(-1)
scope note: kmh^(-1)
scope note: float

Relative Height at Track Relative Positive End
type: Concept
definition: The relative height measured for example by the stage at the relative positive track end.
in scheme: Materials Tribology Lab at KIT
scope note: µm
scope note: nm
scope note: mm
scope note: m
scope note: cm
scope note: float

Timestamp
type: Concept
definition: Subsection holds information about when the experiment was conducted.
in scheme: Materials Tribology Lab at KIT
scope note: date

Omniprobe Micromanipulator E225868
type: Concept
definition: n/a
in scheme: Materials Tribology Lab at KIT
scope note: option

Initial Amount of Interfacial Medium
type: Concept
definition: The initial amount of interfacial medium supplied to a process.
in scheme: Materials Tribology Lab at KIT
scope note: ml
scope note: l
scope note: float

None
type: Concept
definition: n/a
in scheme: Materials Tribology Lab at KIT
scope note: option

Test Program (Set of Operating Points)
type: Concept
definition: n/a
in scheme: Materials Tribology Lab at KIT
scope note: option

Actual Applied Deadweight Setpoint
type: Concept
definition: The weight applied by the weighing object placed to supply normal load.
in scheme: Materials Tribology Lab at KIT
scope note: kg
scope note: g
scope note: float

well Diamantdrahtsägen GmbH
type: Concept
definition: Mannheim, Germany
in scheme: Materials Tribology Lab at KIT
scope note: option

Type of Abrasive
type: Concept
definition: Denotes the type of substrate which holds abrasive medium.
in scheme: Materials Tribology Lab at KIT
scope note: string

Y-Dimension
type: Concept
definition: The size along the y dimension.
in scheme: Materials Tribology Lab at KIT
scope note: µm
scope note: nm
scope note: mm
scope note: m
scope note: cm
scope note: float

Reduce Waviness
type: Concept
definition: Get a flat surface. Done with a coarse grinding tool typically.
in scheme: Materials Tribology Lab at KIT
scope note: option

LabVIEW Program(s) Info
type: Concept
definition: Class containing information about the file containing the program to run an experiment.
in scheme: Materials Tribology Lab at KIT
scope note: dictionary

Maximum Number of Specimens
type: Concept
definition: Maximum number of specimens which can be attached to the machine
in scheme: Materials Tribology Lab at KIT
scope note: integer

Infeed Mode
type: Concept
definition: Instances of this class indicate the type of infeed method.
in scheme: Materials Tribology Lab at KIT
scope note: string

Aral Multrol G 100
type: Concept
definition: n/a
in scheme: Materials Tribology Lab at KIT
scope note: option

gf
type: Concept
definition: gram force
in scheme: Materials Tribology Lab at KIT
scope note: option

Haseltal Werkzeugbau und Kunststofftechnik GmbH
type: Concept
definition: n/a
in scheme: Materials Tribology Lab at KIT
scope note: option

Starting Temperature
type: Concept
definition: The equipment setting which specifies the starting temperature setting of a machine.
in scheme: Materials Tribology Lab at KIT
scope note: K
scope note: °C
scope note: float

Horizontal Field Width
type: Concept
definition: n/A
in scheme: Materials Tribology Lab at KIT
scope note: µm
scope note: nm
scope note: mm
scope note: float

Straightness Accuracy
type: Concept
definition: Instances of this class represent the maximum deviation from a prescribed straight motion across the entire measurement range.
in scheme: Materials Tribology Lab at KIT
scope note: µm
scope note: nm
scope note: mm
scope note: m
scope note: cm
scope note: float

Row
type: Concept
definition: n/a
in scheme: Materials Tribology Lab at KIT
scope note: option

Controller Attributes
type: Concept
definition: Class containing attributes about the installed subsystems' controller responsible for making parts move/act in the tribometer.
in scheme: Materials Tribology Lab at KIT
scope note: dictionary

Lab Bench
type: Concept
definition: n/a
in scheme: Materials Tribology Lab at KIT
scope note: option

Tactile Surface Profilometry
type: Concept
definition: Class representing the monitored processes that produce a (set of) file(s) whose contents could be used for 1D visualization.
in scheme: Materials Tribology Lab at KIT
scope note: process
scope note: record
scope note: https://purls.helmholtz-metadaten.de/vp/kitmtxx-41732562-vp/phy_xxx_xxx-3c41e6aa10d14a51b0c7a950b897fbba-vp: https://purls.helmholtz-metadaten.de/vp/kitmtxx-41732562-vp/blo_spe_xxx-ae137cec891644ec9e9d131be42ef67c-vp
scope note: https://purls.helmholtz-metadaten.de/vp/kitmtxx-41732562-vp/cha_xxx_xxx-5b70f2376c68474381ef5cc428fe240b-vp: https://purls.helmholtz-metadaten.de/vp/kitmtxx-41732562-vp/blo_spe_xxx-ae137cec891644ec9e9d131be42ef67c-vp
scope note: https://purls.helmholtz-metadaten.de/vp/kitmtxx-41732562-vp/emp_xxx_xxx-b0c09f9f6cd948839bac12aa4a2ad55d-vp: https://purls.helmholtz-metadaten.de/vp/kitmtxx-41732562-vp/tac_sur_pro-ec98dbf380804321bb8aa65a96c41b24-vp

Procedure End Time
type: Concept
definition: Subsection holds information about when the procedure was finished.
in scheme: Materials Tribology Lab at KIT
scope note: date

Deposition or Cut Settings
type: Concept
definition: Contains information about the settings of the Cross Section Cutting Step.
in scheme: Materials Tribology Lab at KIT
scope note: dictionary

Number of Collected Profiles
type: Concept
definition: Instances of this class represent the total number of measurements for one sample.
in scheme: Materials Tribology Lab at KIT
scope note: integer

Cumulative Specimen Exposure Time in Ambient Air
type: Concept
definition: Term containing the time the specimen was already exposed to air before the process/procedure/experiment has started.
in scheme: Materials Tribology Lab at KIT
scope note: s
scope note: min
scope note: h
scope note: float

Cooling
type: Concept
definition: Process step that reduces temperature
in scheme: Materials Tribology Lab at KIT
scope note: option

Ion Beam Ga+
type: Concept
definition: A beam which consists of Ga+ ions.
in scheme: Materials Tribology Lab at KIT
related match: ion beam.yaml
scope note: option

Software
type: Concept
definition: Class representing a software developed for research processes.
in scheme: Materials Tribology Lab at KIT
scope note: data
scope note: record

System or Setup Inputs (Tribological Experiment System)
type: Concept
definition: Class containing information about the parameters that are put into the involved scientific equipment to run it optimally, but are not directly part of achieving the experimental objectives.
in scheme: Materials Tribology Lab at KIT
scope note: dictionary

Positioning System Turning Speed
type: Concept
definition: Instances of this class characterize the set turning speed.
in scheme: Materials Tribology Lab at KIT
scope note: min^(-1)
scope note: float

DBL 6513.00
type: Concept
definition: n/a
in scheme: Materials Tribology Lab at KIT
scope note: option

Cutting Direction
type: Concept
definition: Direction in which the saw cuts the specimen
in scheme: Materials Tribology Lab at KIT
scope note: string

Physical Unit Conversion Details
type: Concept
definition: Instances of this class contain the information about the neccessary information to convert recorded V or mA signals into the respective physical unit.
in scheme: Materials Tribology Lab at KIT
scope note: dictionary

cm
type: Concept
definition: n/a
in scheme: Materials Tribology Lab at KIT
scope note: option

Experimental Conditions
type: Concept
definition: Class containing information about the parameters specific to the scientific procedure.
in scheme: Materials Tribology Lab at KIT
scope note: dictionary

Raw Data
type: Concept
definition: n/a
in scheme: Materials Tribology Lab at KIT
scope note: option

C-863 Mercury Servocontroller
type: Concept
definition: n/a
in scheme: Materials Tribology Lab at KIT
scope note: option

Z-00
type: Concept
definition: n/a
in scheme: Materials Tribology Lab at KIT
scope note: option

Housing Description
type: Concept
definition: More detailed description of the housing components than in Housing Method.
in scheme: Materials Tribology Lab at KIT
scope note: dictionary

Interfacial Lubricating Medium
type: Concept
definition: Objects of this class act as the immediate medium at the tribological interface, which is not the surrounding medium of the instrument as a whole.
in scheme: Materials Tribology Lab at KIT
scope note: object
scope note: record

Bachelor's Thesis
type: Concept
definition: n/a
in scheme: Materials Tribology Lab at KIT
scope note: option

Height Fluctuation Range
type: Concept
definition: For unidrectional tribological experiments using a disc as basebody, this meta-information describes the maximum cyclic fluctuation in the disk's height with respect with the counterbody, before the experiment begins.
in scheme: Materials Tribology Lab at KIT
scope note: µm
scope note: nm
scope note: mm
scope note: m
scope note: cm
scope note: float

SE Detector R580
type: Concept
definition: n/a
in scheme: Materials Tribology Lab at KIT
scope note: option

Interfacial Medium Supply Method
type: Concept
definition: Way of supply of the interfacial medium during an industrial or scientific process. Could be for lubrication and/or cooling purposes.
in scheme: Materials Tribology Lab at KIT
scope note: string

SAE Standard
type: Concept
definition: Class containing information about the technical standard of the interfacial medium.
in scheme: Materials Tribology Lab at KIT
scope note: string

Measure Forces and Moments
type: Concept
definition: n/a
in scheme: Materials Tribology Lab at KIT
scope note: option

Tilt Angle Range
type: Concept
definition: The tilt angle range of the stage.
in scheme: Materials Tribology Lab at KIT
scope note: °
scope note: float

Linear Variable Differential Transformer (LVDT) Sensing
type: Concept
definition: n/a
in scheme: Materials Tribology Lab at KIT
scope note: option

Manual
type: Concept
definition: n/a
in scheme: Materials Tribology Lab at KIT
scope note: option

TSD-651C25-M6
type: Concept
definition: n/a
in scheme: Materials Tribology Lab at KIT
scope note: option

*.bin File Technical Specifications
type: Concept
definition: Instances of this class contain the information to open/access/read and interprete a *.bin file's contents adequately.
in scheme: Materials Tribology Lab at KIT
scope note: dictionary

316a
type: Concept
definition: n/a
in scheme: Materials Tribology Lab at KIT
scope note: option

µm
type: Concept
definition: n/a
in scheme: Materials Tribology Lab at KIT
scope note: option

Greisinger electronic
type: Concept
definition: n/a
in scheme: Materials Tribology Lab at KIT
scope note: option

Grinding Machine
type: Concept
definition: Objects of this class pertain to the category of machines called grinding machine.
in scheme: Materials Tribology Lab at KIT
scope note: object
scope note: record
scope note: https://purls.helmholtz-metadaten.de/vp/kitmtxx-41732562-vp/ism_xxx_xxx-cd4f36f6200648d294054682584c8e2b-vp: https://purls.helmholtz-metadaten.de/vp/kitmtxx-41732562-vp/gri_mac_xxx-b0492ca6bf9043909ee541221a225895-vp

Alois Schmitt GmbH & Co. KG
type: Concept
definition: n/a
in scheme: Materials Tribology Lab at KIT
scope note: option

Lubricant for Polishing
type: Concept
definition: A lubricant used along with the polishing medium to lubricate the sample/specimen during the polishing process.
in scheme: Materials Tribology Lab at KIT
scope note: object
scope note: record

Overlapping Area
type: Concept
definition: Percentage of overlapping area.
in scheme: Materials Tribology Lab at KIT
scope note: %
scope note: float

MaTecK Material-Technologie & Kristalle GmbH
type: Concept
definition: n/a
in scheme: Materials Tribology Lab at KIT
scope note: option

*.csv
type: Concept
definition: n/a
in scheme: Materials Tribology Lab at KIT
scope note: option

Hardening
type: Concept
definition: A process to increase hardness of a metal. Typically done by heating to a certain temperature and subsequent quenching.
in scheme: Materials Tribology Lab at KIT
scope note: option

Back
type: Concept
definition: n/a
in scheme: Materials Tribology Lab at KIT
scope note: option

Carbamide
type: Concept
definition: n/a
in scheme: Materials Tribology Lab at KIT
scope note: option

WC-Ni
type: Concept
definition: n/a
in scheme: Materials Tribology Lab at KIT
scope note: option

Pole Surface Length
type: Concept
definition: Instances of this class specify the pole surface size.
in scheme: Materials Tribology Lab at KIT
scope note: µm
scope note: nm
scope note: mm
scope note: m
scope note: cm
scope note: float

originatesFromSpecimen
type: Concept
definition: Relates a scientific process to the objects which are physically established as its result. It can also mean it is a combination/separation of other objects, or their subparts. This property relates the parent to the child object.
in scheme: Materials Tribology Lab at KIT
scope note: relationship_type
scope note: none

-104
type: Concept
definition: n/a
in scheme: Materials Tribology Lab at KIT
scope note: option

Software Versions
type: Concept
definition: Array of Software Versions
in scheme: Materials Tribology Lab at KIT
scope note: dictionary

Polishing Process Step Type
type: Concept
definition: Describes the step in the polishing process.
in scheme: Materials Tribology Lab at KIT
scope note: string

Rod
type: Concept
definition: n/a
in scheme: Materials Tribology Lab at KIT
scope note: option

MB
type: Concept
definition: n/a
in scheme: Materials Tribology Lab at KIT
scope note: option

List of Equipment Roles
type: Concept
definition: Class containing information about the periphery's role/s in a tribometer.
in scheme: Materials Tribology Lab at KIT
scope note: dictionary

μTC, 30.49
type: Concept
definition: n/a
in scheme: Materials Tribology Lab at KIT
scope note: option

Connected Conditioner Info
type: Concept
definition: Class containing attributes about the installed sensors responsible for conditioning sensor outputs of a sensor.
in scheme: Materials Tribology Lab at KIT
scope note: dictionary

Space Length
type: Concept
definition: The maximum length inside the chamber of a furnace.
in scheme: Materials Tribology Lab at KIT
scope note: µm
scope note: nm
scope note: mm
scope note: m
scope note: cm
scope note: float

Transverse
type: Concept
definition: n/a
in scheme: Materials Tribology Lab at KIT
scope note: option

Viscosity Specifications
type: Concept
definition: Class containing information about the viscosity of the the piece of interfacial medium.
in scheme: Materials Tribology Lab at KIT
scope note: dictionary

Specimen ID
type: Concept
definition: A unique alphanumeric ID of a specimen. Could be an assigned unique ID. Could be a list of unique IDs.
in scheme: Materials Tribology Lab at KIT
scope note: string

Maximum Turning Speed
type: Concept
definition: The maximum permissable turning speed.
in scheme: Materials Tribology Lab at KIT
scope note: min^(-1)
scope note: float

Process Summary (Electron Microscopy)
type: Concept
definition: Class containing information about the electron microscopy session.
in scheme: Materials Tribology Lab at KIT
scope note: dictionary

Number of Rows
type: Concept
definition: Denotes the total number of rows in the tabular data file.
in scheme: Materials Tribology Lab at KIT
scope note: integer

Temperature Controller
type: Concept
definition: Objects of this class pertain to the category of machines called temperature controller.
in scheme: Materials Tribology Lab at KIT
scope note: string

Equipment or Product Model
type: Concept
definition: The model name of equipment/object, which the company has given to its product.
in scheme: Materials Tribology Lab at KIT
scope note: string

Windows 10
type: Concept
definition: n/a
in scheme: Materials Tribology Lab at KIT
scope note: option

Grinding Tool Type
type: Concept
definition: Instances of this class give the type of grinding tool used by equipment.
in scheme: Materials Tribology Lab at KIT
scope note: string

Specimen Cleaning
type: Concept
definition: Class representing the physical process of reducing the amount of residue on a physical object's surfaces.
in scheme: Materials Tribology Lab at KIT
scope note: process
scope note: record
scope note: https://purls.helmholtz-metadaten.de/vp/kitmtxx-41732562-vp/phy_xxx_xxx-3c41e6aa10d14a51b0c7a950b897fbba-vp: https://purls.helmholtz-metadaten.de/vp/kitmtxx-41732562-vp/blo_spe_xxx-ae137cec891644ec9e9d131be42ef67c-vp
scope note: https://purls.helmholtz-metadaten.de/vp/kitmtxx-41732562-vp/emp_xxx_xxx-b0c09f9f6cd948839bac12aa4a2ad55d-vp: https://purls.helmholtz-metadaten.de/vp/kitmtxx-41732562-vp/ult_cle_xxx-192eb37ff24644798963cd87107e9a5f-vp

Measured
type: Concept
definition: Values that are acquired by means of DAQ devices.
in scheme: Materials Tribology Lab at KIT
scope note: option

Piezo Drive
type: Concept
definition: n/a
in scheme: Materials Tribology Lab at KIT
scope note: option

Duration Setpoint
type: Concept
definition: The duration setting assigned to be maintained by the machine in a specific process.
in scheme: Materials Tribology Lab at KIT
scope note: s
scope note: min
scope note: h
scope note: float

Total Number of Reciprocation Cycles
type: Concept
definition: Denotes the total number of reciprocation cycles.
in scheme: Materials Tribology Lab at KIT
scope note: integer

Label
type: Concept
definition: n/a
in scheme: Materials Tribology Lab at KIT
scope note: option

tab
type: Concept
definition: n/a
in scheme: Materials Tribology Lab at KIT
scope note: option

Electrolyte
type: Concept
definition: Contains information describing a medium containing ions that is electrically conducting through the movement of those ions, but not conducting electrons.
in scheme: Materials Tribology Lab at KIT
scope note: object
scope note: record

Surrounding Medium
type: Concept
definition: For Tribological Processes: Objects of this class act as the medium between the tribological interface, or interfacial medium (if present), and the air in the lab as a whole. This, for example, the medium in a glove box.
in scheme: Materials Tribology Lab at KIT
scope note: string

Target Heating or Cooling Temperature
type: Concept
definition: The equipment setting which specifies the temperature setting of a machine.
in scheme: Materials Tribology Lab at KIT
scope note: K
scope note: °C
scope note: float

D25
type: Concept
definition: n/a
in scheme: Materials Tribology Lab at KIT
scope note: option

Z-200
type: Concept
definition: n/a
in scheme: Materials Tribology Lab at KIT
scope note: option

Cutting Pressure Setpoint
type: Concept
definition: The setting assigned to be maintained by the machine.
in scheme: Materials Tribology Lab at KIT
scope note: Pa
scope note: MPa
scope note: mbar
scope note: float

Polygon
type: Concept
definition: n/a
in scheme: Materials Tribology Lab at KIT
scope note: option

Flash Point Specifications
type: Concept
definition: Class containing information about the flash point the piece of interfacial medium.
in scheme: Materials Tribology Lab at KIT
scope note: dictionary

Mass
type: Concept
definition: The specification of an object defining its mass.
in scheme: Materials Tribology Lab at KIT
scope note: kg
scope note: g
scope note: float

Cup Grinding Tool Info
type: Concept
definition: Class containing information that characterizes the grinding tool.
in scheme: Materials Tribology Lab at KIT
scope note: dictionary

Relative Starting Position Setpoint
type: Concept
definition: n/a
in scheme: Materials Tribology Lab at KIT
scope note: µm
scope note: nm
scope note: mm
scope note: m
scope note: cm
scope note: float

Minimum Measurement Speed
type: Concept
definition: Instances of this class represent the minimum permissable measument speed.
in scheme: Materials Tribology Lab at KIT
scope note: µms^(-1)
scope note: mms^(-1)
scope note: ms^(-1)
scope note: kmh^(-1)
scope note: float

2110
type: Concept
definition: n/a
in scheme: Materials Tribology Lab at KIT
scope note: option

Double-sided Tape
type: Concept
definition: Double-sided tape secures the specimen's bottom surface to the equipment's structure.
in scheme: Materials Tribology Lab at KIT
scope note: option

Nominally Known Material Information
type: Concept
definition: Class containing information about the material details of a block specimen. These pieces of information are either reported (and assumed true) by the vendor, or are of general knowledge, but have not specifically been measured by a FAIR'ly described process.
in scheme: Materials Tribology Lab at KIT
scope note: dictionary

Y-Position
type: Concept
definition: Position of an object on another object in y direction.
in scheme: Materials Tribology Lab at KIT
scope note: float

Circle
type: Concept
definition: n/a
in scheme: Materials Tribology Lab at KIT
scope note: option

Vacuum Pressure
type: Concept
definition: Pressure of the reached vacuum.
in scheme: Materials Tribology Lab at KIT
scope note: Pa
scope note: MPa
scope note: mbar
scope note: float

Cup Grinding Machine
type: Concept
definition: Objects of this class pertain to the category of machines called cup grinding machine.
in scheme: Materials Tribology Lab at KIT
scope note: object
scope note: record
scope note: https://purls.helmholtz-metadaten.de/vp/kitmtxx-41732562-vp/ism_xxx_xxx-cd4f36f6200648d294054682584c8e2b-vp: https://purls.helmholtz-metadaten.de/vp/kitmtxx-41732562-vp/cup_gri_mac-3136c4f5a61247ca9cf390b86f050459-vp

Relative Transverse Position
type: Concept
definition: Position on the specimen orthogonal to sliding direction
in scheme: Materials Tribology Lab at KIT
scope note: µm
scope note: nm
scope note: mm
scope note: m
scope note: cm
scope note: float

m
type: Concept
definition: n/a
in scheme: Materials Tribology Lab at KIT
scope note: option

Grit
type: Concept
definition: Denotes the size of the abrasive particles.
in scheme: Materials Tribology Lab at KIT
scope note: string

Ultrasonic Cleaner
type: Concept
definition: Objects of this class pertain to the category of machines called ultrasonic cleaner.
in scheme: Materials Tribology Lab at KIT
scope note: object
scope note: record
scope note: https://purls.helmholtz-metadaten.de/vp/kitmtxx-41732562-vp/ism_xxx_xxx-cd4f36f6200648d294054682584c8e2b-vp: https://purls.helmholtz-metadaten.de/vp/kitmtxx-41732562-vp/ult_cle_xxx-192eb37ff24644798963cd87107e9a5f-vp

Maximum Travel Speed
type: Concept
definition: Instances of this class represent the maximum permissable travel speed, while no measurement is taken.
in scheme: Materials Tribology Lab at KIT
scope note: µms^(-1)
scope note: mms^(-1)
scope note: ms^(-1)
scope note: kmh^(-1)
scope note: float

Z-direction Maximum Measurement Speed
type: Concept
definition: Instances of this class represent the maximum z-direction (vertical) speed at which the system can capture.
in scheme: Materials Tribology Lab at KIT
scope note: µms^(-1)
scope note: mms^(-1)
scope note: ms^(-1)
scope note: kmh^(-1)
scope note: float

Build-in Drive
type: Concept
definition: n/a
in scheme: Materials Tribology Lab at KIT
scope note: option

Relative Height at Track Relative Negative End
type: Concept
definition: The relative height measured for example by the stage at the relative negative track end.
in scheme: Materials Tribology Lab at KIT
scope note: µm
scope note: nm
scope note: mm
scope note: m
scope note: cm
scope note: float

Leica
type: Concept
definition: n/a
in scheme: Materials Tribology Lab at KIT
scope note: option

Brinell
type: Concept
definition: n/a
in scheme: Materials Tribology Lab at KIT
scope note: option

HY 180-4
type: Concept
definition: n/a
in scheme: Materials Tribology Lab at KIT
scope note: option

X Number of Points
type: Concept
definition: Instances of this class characterize the measurement number of scanning points per line in x-direction, as defined by the equipment.
in scheme: Materials Tribology Lab at KIT
scope note: Pixel
scope note: integer

Fraunhofer IWM
type: Concept
definition: n/a
in scheme: Materials Tribology Lab at KIT
scope note: option

Turning Frequency
type: Concept
definition: Instances of this class quantify the turning frequency in a process.
in scheme: Materials Tribology Lab at KIT
scope note: min^(-1)
scope note: kHz
scope note: Hz
scope note: float

Porous Alumina (Soft)
type: Concept
definition: n/a
in scheme: Materials Tribology Lab at KIT
scope note: option

Polishing Process Parameters
type: Concept
definition: Term containing information about the parameters specific to the process.
in scheme: Materials Tribology Lab at KIT
scope note: dictionary

Goodfellow
type: Concept
definition: n/a
in scheme: Materials Tribology Lab at KIT
scope note: option

Electropolishing Goal
type: Concept
definition: Denotes the goal of the instance of the process.
in scheme: Materials Tribology Lab at KIT
scope note: string

Duration
type: Concept
definition: The duration of a procedure.
in scheme: Materials Tribology Lab at KIT
scope note: s
scope note: min
scope note: h
scope note: float

Surrounding Medium Control Method
type: Concept
definition: Object of this class state what type of method was used to control the susrrounding medium.
in scheme: Materials Tribology Lab at KIT
scope note: string

No Gas Deposition
type: Concept
definition: n/a
in scheme: Materials Tribology Lab at KIT
scope note: option

EK80
type: Concept
definition: n/a
in scheme: Materials Tribology Lab at KIT
scope note: option

Last Name
type: Concept
definition: Operator's last name/s (= family name/s).
in scheme: Materials Tribology Lab at KIT
scope note: string

PowerPro 4000
type: Concept
definition: n/a
in scheme: Materials Tribology Lab at KIT
scope note: option

*.txt File Technical Specifications
type: Concept
definition: Instances of this class contain the information to open/access/read and interprete a *.txt file's contents adequately.
in scheme: Materials Tribology Lab at KIT
scope note: dictionary

File (Data Processing)
type: Concept
definition: Term containing a collection of metadata, each associated with a file or a series of files, generated as the output of a data processing process and sharing the same metadata.
in scheme: Materials Tribology Lab at KIT
scope note: data
scope note: record

ISO Standard
type: Concept
definition: Class containing information about the technical standard of the interfacial medium.
in scheme: Materials Tribology Lab at KIT
scope note: string

Cross Section Cutting Step
type: Concept
definition: Describes the step of cross section cutting.
in scheme: Materials Tribology Lab at KIT
scope note: string

File (Tribological Experiment)
type: Concept
definition: Term containing a collection of metadata, each associated with a file or a series of files, generated as the output of a tribological experiment and sharing the same metadata.
in scheme: Materials Tribology Lab at KIT
scope note: data
scope note: record

Maximum Stage Range
type: Concept
definition: The maximum range in which the stage can be moved.
in scheme: Materials Tribology Lab at KIT
scope note: dictionary

Optical Surface Profilometry
type: Concept
definition: Class representing the monitored processes that produce a (set of) file(s) whose contents could be used for visualization.
in scheme: Materials Tribology Lab at KIT
scope note: process
scope note: record
scope note: https://purls.helmholtz-metadaten.de/vp/kitmtxx-41732562-vp/cha_xxx_xxx-5b70f2376c68474381ef5cc428fe240b-vp: https://purls.helmholtz-metadaten.de/vp/kitmtxx-41732562-vp/blo_spe_xxx-ae137cec891644ec9e9d131be42ef67c-vp
scope note: https://purls.helmholtz-metadaten.de/vp/kitmtxx-41732562-vp/emp_xxx_xxx-b0c09f9f6cd948839bac12aa4a2ad55d-vp: https://purls.helmholtz-metadaten.de/vp/kitmtxx-41732562-vp/opt_sur_pro-9658f444fa7b4e6b8ebf0c678491e2c0-vp
scope note: https://purls.helmholtz-metadaten.de/vp/kitmtxx-41732562-vp/que_xxx_xxx-1b4f515c8fc54791b8f6269ca30a4d6a-vp: https://purls.helmholtz-metadaten.de/vp/kitmtxx-41732562-vp/tri_exp_xxx-9b84c31083254e40a6eb78601271d381-vp
scope note: https://purls.helmholtz-metadaten.de/vp/kitmtxx-41732562-vp/que_xxx_xxx-dc882ce905ba4dfbb3a906b1c1b0cdad-vp: https://purls.helmholtz-metadaten.de/vp/kitmtxx-41732562-vp/opt_mic_xxx-c73af6d31f314907b33d212d43f61891-vp

Cloeren Technology GmbH
type: Concept
definition: Wegberg, Germany
in scheme: Materials Tribology Lab at KIT
scope note: option

Mass Density Acquisition Temperature
type: Concept
definition: The specification of an object defining its mass density acquisition temperature.
in scheme: Materials Tribology Lab at KIT
scope note: K
scope note: °C
scope note: float

Diamond Suspension
type: Concept
definition: n/a
in scheme: Materials Tribology Lab at KIT
scope note: option

Box Dimensions
type: Concept
definition: Dimensions of the specified box.
in scheme: Materials Tribology Lab at KIT
scope note: dictionary

D181
type: Concept
definition: n/a
in scheme: Materials Tribology Lab at KIT
scope note: option

Measure ultrasonic
type: Concept
definition: n/a
in scheme: Materials Tribology Lab at KIT
scope note: option

Version Date
type: Concept
definition: Release date of the version.
in scheme: Materials Tribology Lab at KIT
scope note: date

Pressure Before Venting
type: Concept
definition: Term containing information about the vacuum before venting the chamber to mount the sample. It is used to track the quality of vacuum in the chamber and serves as an indicator if any part of the vacuum system is causing problems
in scheme: Materials Tribology Lab at KIT
scope note: Pa
scope note: MPa
scope note: mbar
scope note: float

Inductive Sensing
type: Concept
definition: n/a
in scheme: Materials Tribology Lab at KIT
scope note: option

Emitter
type: Concept
definition: The name of the beam source of the equipment.
in scheme: Materials Tribology Lab at KIT
scope note: string

Dead Weight(s) (Dampened)
type: Concept
definition: n/a
in scheme: Materials Tribology Lab at KIT
scope note: option

Clamping Area Diameter
type: Concept
definition: The maximum permissable diameter of specimen to be held.
in scheme: Materials Tribology Lab at KIT
scope note: µm
scope note: nm
scope note: mm
scope note: m
scope note: cm
scope note: float

FB 15046
type: Concept
definition: n/a
in scheme: Materials Tribology Lab at KIT
scope note: option

Uncontrolled Environment Relative Humidity
type: Concept
definition: The phenomenon called relative humidity of the surrounding environment.
in scheme: Materials Tribology Lab at KIT
scope note: %
scope note: float

M-403.2PD
type: Concept
definition: n/a
in scheme: Materials Tribology Lab at KIT
scope note: option

Mass Density
type: Concept
definition: The specification of an object defining its mass density.
in scheme: Materials Tribology Lab at KIT
scope note: kg*m^(-3)
scope note: float

Cutting Face Side
type: Concept
definition: The side of the specimen being cut.
in scheme: Materials Tribology Lab at KIT
scope note: string

Principal Investigator
type: Concept
definition: n/a
in scheme: Materials Tribology Lab at KIT
scope note: option

Material Information
type: Concept
definition: Class containing information about the material details of a block specimen.
in scheme: Materials Tribology Lab at KIT
scope note: dictionary

Technical Specifications (Tactile Surface Profilometer)
type: Concept
definition: Class containing information about the technical specifications of a tactile surface profilometer.
in scheme: Materials Tribology Lab at KIT
scope note: dictionary

makesUseOfConsumable
type: Concept
definition: This relationship relates a scientific process to an object which supports the process, but is readily replacable during or after the process, as it its function deteriorates over time.
in scheme: Materials Tribology Lab at KIT
scope note: relationship_type
scope note: none

Scanning Electron Microscope
type: Concept
definition: n/a
in scheme: Materials Tribology Lab at KIT
scope note: object
scope note: record
scope note: https://purls.helmholtz-metadaten.de/vp/kitmtxx-41732562-vp/ism_xxx_xxx-cd4f36f6200648d294054682584c8e2b-vp: https://purls.helmholtz-metadaten.de/vp/kitmtxx-41732562-vp/sca_ele_mic-30855d0d4b6049a6a8fc94f07cdcc312-vp

Principle of Vapor Generation
type: Concept
definition: Principle of Vapor Generation
in scheme: Materials Tribology Lab at KIT
scope note: string

Transformation Direction
type: Concept
definition: Describes the direction which coordinate system is transformed into which.
in scheme: Materials Tribology Lab at KIT
scope note: string

Lenses Used
type: Concept
definition: Contains information about the lenses used during the process.
in scheme: Materials Tribology Lab at KIT
scope note: dictionary

Tribological Interest Side(s)
type: Concept
definition: The principal tribological side/s of interest. Defined by ISO (not US) technical drawing standards. Valid after a feature and its side have been defined.
in scheme: Materials Tribology Lab at KIT
scope note: string

Magnetic
type: Concept
definition: A magnet secures a specimen's surface to the equipment's structure.
in scheme: Materials Tribology Lab at KIT
scope note: option

Space Width
type: Concept
definition: The maximum width inside the chamber of a furnace.
in scheme: Materials Tribology Lab at KIT
scope note: µm
scope note: nm
scope note: mm
scope note: m
scope note: cm
scope note: float

Composition Information
type: Concept
definition: A natural-language description of the composition of the medium.
in scheme: Materials Tribology Lab at KIT
scope note: string

D91
type: Concept
definition: n/a
in scheme: Materials Tribology Lab at KIT
scope note: option

Available Subsystems Information
type: Concept
definition: Term containing information about subsystems which offer additional functionality to the machine.
in scheme: Materials Tribology Lab at KIT
scope note: dictionary

Cutting Face
type: Concept
definition: Term used to specify to specify the cut edge of the specimen(s).
in scheme: Materials Tribology Lab at KIT
scope note: dictionary

min^(-1)
type: Concept
definition: n/a
in scheme: Materials Tribology Lab at KIT
scope note: option

General Info (Publication)
type: Concept
definition: Objects of this class contain information that describes the data.
in scheme: Materials Tribology Lab at KIT
scope note: dictionary

Clamping Area Width
type: Concept
definition: The maximum permissable width of specimen to be held. Shorter than Length dimension.
in scheme: Materials Tribology Lab at KIT
scope note: µm
scope note: nm
scope note: mm
scope note: m
scope note: cm
scope note: float

Minimum Beam Voltage
type: Concept
definition: The minimum beam voltage under which the equipment can operate.
in scheme: Materials Tribology Lab at KIT
scope note: V
scope note: kV
scope note: float

Capacitive Sensing
type: Concept
definition: n/a
in scheme: Materials Tribology Lab at KIT
scope note: option

half-automatic (central pressure)
type: Concept
definition: n/a
in scheme: Materials Tribology Lab at KIT
scope note: option

DC Motor
type: Concept
definition: n/a
in scheme: Materials Tribology Lab at KIT
scope note: option

Specimen Sledge
type: Concept
definition: n/a
in scheme: Materials Tribology Lab at KIT
scope note: option

DAQ Connection Port
type: Concept
definition: The port which collects/outputs signal to a DAQ device.
in scheme: Materials Tribology Lab at KIT
scope note: string

KL 1500
type: Concept
definition: n/a
in scheme: Materials Tribology Lab at KIT
scope note: option

Software Name
type: Concept
definition: The official name of the software under which it's distributed.
in scheme: Materials Tribology Lab at KIT
scope note: string

General Info (Specimen)
type: Concept
definition: Objects of this class contain information that unequivocally identifies a specimen.
in scheme: Materials Tribology Lab at KIT
scope note: dictionary

Operator(s) in Charge
type: Concept
definition: Class containing information about who performed a scientific process, or is responsible for an object.
in scheme: Materials Tribology Lab at KIT
scope note: dictionary

Cup Grinding Wheel
type: Concept
definition: n/a
in scheme: Materials Tribology Lab at KIT
scope note: option

Magnetic Drive (Counterweighed and Dampened)
type: Concept
definition: n/a
in scheme: Materials Tribology Lab at KIT
scope note: option

Raw Data Mapping
type: Concept
definition: n/a
in scheme: Materials Tribology Lab at KIT
scope note: option

Motion Speed Setpoint
type: Concept
definition: Instances of this class characterize the relative motion of an object. For Demagnetizing: The (estimated) speed of the demagnetizing motion. Sometimes is given as seconds per demagnetizing motion.
in scheme: Materials Tribology Lab at KIT
scope note: µms^(-1)
scope note: mms^(-1)
scope note: ms^(-1)
scope note: kmh^(-1)
scope note: float

Alignment
type: Concept
definition: Explanation of the alignment of the pattern with features on the specimen surface.
in scheme: Materials Tribology Lab at KIT
scope note: string

Furnace
type: Concept
definition: Objects of this class pertain to the category of machines called furnace.
in scheme: Materials Tribology Lab at KIT
scope note: object
scope note: record
scope note: https://purls.helmholtz-metadaten.de/vp/kitmtxx-41732562-vp/ism_xxx_xxx-cd4f36f6200648d294054682584c8e2b-vp: https://purls.helmholtz-metadaten.de/vp/kitmtxx-41732562-vp/fur_xxx_xxx-c04aefd269c64c6fa2773c318193f2d6-vp

Measure Load Cell Displacement - Respectively the Normal Force
type: Concept
definition: n/a
in scheme: Materials Tribology Lab at KIT
scope note: option

Surface Imaging Summary
type: Concept
definition: Contains multiple types of information related to the surface imaging.
in scheme: Materials Tribology Lab at KIT
scope note: dictionary

Target Controlled Humidity
type: Concept
definition: The humidity setpoint for the climate inside the climate box.
in scheme: Materials Tribology Lab at KIT
scope note: %
scope note: float

%
type: Concept
definition: This reads as % Relative Humidity, but "% RH" is not SI unit, so it is kept just as "%".
in scheme: Materials Tribology Lab at KIT
scope note: option

Dorfner Schleifmittel GmbH Leonberg
type: Concept
definition: n/a
in scheme: Materials Tribology Lab at KIT
scope note: option

Vertical Starting Position
type: Concept
definition: Instances of this class characterize the vertical start height in a process.
in scheme: Materials Tribology Lab at KIT
scope note: µm
scope note: nm
scope note: mm
scope note: m
scope note: cm
scope note: float

Material Empirical Formula
type: Concept
definition: In chemistry, the empirical formula of a chemical compound is the simplest positive integer ratio of atoms present in a compound.
in scheme: Materials Tribology Lab at KIT
scope note: string

Normal Load Setpoint
type: Concept
definition: The prescribed normal load set at the beginning of a process.
in scheme: Materials Tribology Lab at KIT
scope note: N
scope note: kgf
scope note: gf
scope note: float

Cleaning Duration
type: Concept
definition: The duration setting assigned to be maintained by the machine or user in a cleaning process.
in scheme: Materials Tribology Lab at KIT
scope note: s
scope note: min
scope note: h
scope note: float

Stylus Tip Type
type: Concept
definition: Instances of this class specify the classification type of stylus tip.
in scheme: Materials Tribology Lab at KIT
scope note: string

Negative
type: Concept
definition: n/a
in scheme: Materials Tribology Lab at KIT
scope note: option

*.txt
type: Concept
definition: n/a
in scheme: Materials Tribology Lab at KIT
scope note: option

Technical Specifications (Light Microscope)
type: Concept
definition: Term containing information about the technical specifications of a light microscope.
in scheme: Materials Tribology Lab at KIT
scope note: dictionary

Vertical Measuring Column Subsystem
type: Concept
definition: Class containing information about the technical specifications of a tactile profilometer vertical measuring column.
in scheme: Materials Tribology Lab at KIT
scope note: dictionary

Pour Point
type: Concept
definition: Object's Pour Point.
in scheme: Materials Tribology Lab at KIT
scope note: K
scope note: °C
scope note: float

Institution Name
type: Concept
definition: The official name of the institution which the responsible person/operator belongs to.
in scheme: Materials Tribology Lab at KIT
scope note: string

Clockwise
type: Concept
definition: n/a
in scheme: Materials Tribology Lab at KIT
scope note: option

Knoop
type: Concept
definition: n/a
in scheme: Materials Tribology Lab at KIT
scope note: option

Annealing
type: Concept
definition: n/a
in scheme: Materials Tribology Lab at KIT
scope note: option

Working Frequency
type: Concept
definition: Instances of this class quantify the frequency in a process that a machine supports.
in scheme: Materials Tribology Lab at KIT
scope note: min^(-1)
scope note: kHz
scope note: Hz
scope note: float

G&N Genauigkeits Maschinenbau Nuernberg GmbH
type: Concept
definition: n/a
in scheme: Materials Tribology Lab at KIT
scope note: option

Hommel-Etamic
type: Concept
definition: n/a
in scheme: Materials Tribology Lab at KIT
scope note: option

LEO-801
type: Concept
definition: n/a
in scheme: Materials Tribology Lab at KIT
scope note: option

Operating Space Info
type: Concept
definition: Class containing information about the furnace's available space for sample treatment.
in scheme: Materials Tribology Lab at KIT
scope note: dictionary

Polymer
type: Concept
definition: n/a
in scheme: Materials Tribology Lab at KIT
scope note: option

Motion Inducing Subsystems Attributes
type: Concept
definition: Class containing attributes about the installed subsystems responsible for making parts move in the tribometer.
in scheme: Materials Tribology Lab at KIT
scope note: dictionary

Y-direction Travel Range
type: Concept
definition: Instances of this class represent the distance between the lower and upper limits of the y-axis/secondary lateral axis/slow axis.
in scheme: Materials Tribology Lab at KIT
scope note: µm
scope note: nm
scope note: mm
scope note: m
scope note: cm
scope note: float

*.xls
type: Concept
definition: n/a
in scheme: Materials Tribology Lab at KIT
scope note: option

Bachelor Candidate
type: Concept
definition: n/a
in scheme: Materials Tribology Lab at KIT
scope note: option

Maximum Duration
type: Concept
definition: Instances of this class characterize the maximum permissible duration for a process maintained by a machine.
in scheme: Materials Tribology Lab at KIT
scope note: s
scope note: min
scope note: h
scope note: float

Polishing Machine
type: Concept
definition: Objects of this class pertain to the category of machines called polishing machine.
in scheme: Materials Tribology Lab at KIT
scope note: object
scope note: record
scope note: https://purls.helmholtz-metadaten.de/vp/kitmtxx-41732562-vp/ism_xxx_xxx-cd4f36f6200648d294054682584c8e2b-vp: https://purls.helmholtz-metadaten.de/vp/kitmtxx-41732562-vp/pol_mac_xxx-20c35bf0b41948689b5bae72ab59bdb4-vp

Spark Out Table Rotations
type: Concept
definition: Instances of this class characterize the spark out time given in number of table rotations.
in scheme: Materials Tribology Lab at KIT
scope note: float

Abrasive Material Type
type: Concept
definition: Instances of this class specify the abrasive material that a grinding tool is made of. This refers to the material doing the actual grinding, not the bond (if there is any).
in scheme: Materials Tribology Lab at KIT
scope note: string

Cooling Rate Specifications
type: Concept
definition: Class containing information about the furnace's cooling time to room temperature.
in scheme: Materials Tribology Lab at KIT
scope note: dictionary

Technical Specifications (Electrolyte)
type: Concept
definition: Term containing information about the technical specifications of an electrolyte.
in scheme: Materials Tribology Lab at KIT
scope note: dictionary

EK36
type: Concept
definition: n/a
in scheme: Materials Tribology Lab at KIT
scope note: option

MPS 2
type: Concept
definition: n/a
in scheme: Materials Tribology Lab at KIT
scope note: option

Maximum Electropolishing Voltage
type: Concept
definition: The maximum value of the electropolishing voltage at which the machine can safely operate.
in scheme: Materials Tribology Lab at KIT
scope note: V
scope note: float

Manufacturing Process
type: Concept
definition: Contains information about the manufacturing process of the medium.
in scheme: Materials Tribology Lab at KIT
scope note: string

Working Area Length
type: Concept
definition: Instances of this class specify the available length of the area for manipulation within a machine.
in scheme: Materials Tribology Lab at KIT
scope note: µm
scope note: nm
scope note: mm
scope note: m
scope note: cm
scope note: float

S2.15
type: Concept
definition: n/a
in scheme: Materials Tribology Lab at KIT
scope note: option

Immersion Mode
type: Concept
definition: n/a
in scheme: Materials Tribology Lab at KIT
scope note: option

Time of Last Self Calibration
type: Concept
definition: Instances of this class contain information about the time when an electronic equipment was self calibrated last (e.g. DAQ Board).
in scheme: Materials Tribology Lab at KIT
scope note: date

S3.08
type: Concept
definition: n/a
in scheme: Materials Tribology Lab at KIT
scope note: option

File Technical Specifications
type: Concept
definition: Instances of this class contain the information to open/access/read and interprete a file's contents adequately.
in scheme: Materials Tribology Lab at KIT
scope note: dictionary

Multi Load Cell
type: Concept
definition: n/a
in scheme: Materials Tribology Lab at KIT
scope note: option

Scanning Tip Specifications
type: Concept
definition: Class containing information about the parameters that identify the scanning tip and its use in the profilometry measurement.
in scheme: Materials Tribology Lab at KIT
scope note: dictionary

Solvent Type
type: Concept
definition: The type of solvent and the way it is referred to. The friendly way to identify it.
in scheme: Materials Tribology Lab at KIT
scope note: string

Probing System
type: Concept
definition: Class containing information about the technical specifications of a tactile probing system.
in scheme: Materials Tribology Lab at KIT
scope note: dictionary

Reshaped Raw Data
type: Concept
definition: n/a
in scheme: Materials Tribology Lab at KIT
scope note: option

De-Ionized Water
type: Concept
definition: n/a
in scheme: Materials Tribology Lab at KIT
scope note: option

Height
type: Concept
definition: The specification of an object defining its height.
in scheme: Materials Tribology Lab at KIT
scope note: µm
scope note: nm
scope note: mm
scope note: m
scope note: cm
scope note: float

Electropolishing Area
type: Concept
definition: The size of the electropolished area of the sample.
in scheme: Materials Tribology Lab at KIT
scope note: mm^2
scope note: cm^2
scope note: float

Block Specimen
type: Concept
definition: Objects of this class contain a self-bound collection of mass bearing particles.
in scheme: Materials Tribology Lab at KIT
related match: specimen.yaml
scope note: object
scope note: record
scope note: https://purls.helmholtz-metadaten.de/vp/kitmtxx-41732562-vp/ori_xxx_xxx-a308af15cef14d8096b3a61ad8a2701d-vp: https://purls.helmholtz-metadaten.de/vp/kitmtxx-41732562-vp/blo_spe_xxx-ae137cec891644ec9e9d131be42ef67c-vp

Motion Inducing Subsystem Settings
type: Concept
definition: Class containing information about all settings related to the motion inducing subsystems of the setup that played a role when conducting an experiment.
in scheme: Materials Tribology Lab at KIT
scope note: dictionary

Technical Specifications (Sawing Blade)
type: Concept
definition: Term containing information about the technical specifications of a sawing blade.
in scheme: Materials Tribology Lab at KIT
scope note: dictionary

Remove Scale Layer
type: Concept
definition: n/a
in scheme: Materials Tribology Lab at KIT
scope note: option

Kennametal Inc.
type: Concept
definition: n/a
in scheme: Materials Tribology Lab at KIT
scope note: option

Measure Acoustic Emission
type: Concept
definition: n/a
in scheme: Materials Tribology Lab at KIT
scope note: option

Publication
type: Concept
definition: Objects of this class contain publications of the kind of papers, posters or theses.
in scheme: Materials Tribology Lab at KIT
scope note: data
scope note: record
scope note: https://purls.helmholtz-metadaten.de/vp/kitmtxx-41732562-vp/doc_xxx_xxx-0e7f7d94b537444bb387aaecf77cbb0a-vp: https://purls.helmholtz-metadaten.de/vp/kitmtxx-41732562-vp/tri_xxx_xxx-c98170df4aa14cd38e9ba0d1b94ebdf0-vp

Band Saw Cutting Speed
type: Concept
definition: The maximum permissable round tube diameter.
in scheme: Materials Tribology Lab at KIT
scope note: min^(-1)
scope note: float

Camera for Chamber View
type: Concept
definition: n/a
in scheme: Materials Tribology Lab at KIT
scope note: option

Citation
type: Concept
definition: Description how to correctly cite the software or data.
in scheme: Materials Tribology Lab at KIT
scope note: string

Carbolite Gero GmbH & Co. KG
type: Concept
definition: Neuhausen, Germany
in scheme: Materials Tribology Lab at KIT
scope note: option

211-15÷16
type: Concept
definition: n/a
in scheme: Materials Tribology Lab at KIT
scope note: option

Measurement Range
type: Concept
definition: The measurement range of the given sensor.
in scheme: Materials Tribology Lab at KIT
scope note: µm
scope note: nm
scope note: mm
scope note: m
scope note: cm
scope note: float

queriesPositionOfWearTrackFromProcess
type: Concept
definition: Denotes that a given process relies on the position of the wear track on a specimen to conduct a measurement or procedure. The position of the wear track is part of the metadata of the parent digital object.
in scheme: Materials Tribology Lab at KIT
scope note: relationship_type
scope note: none

X-direction Measurement Range
type: Concept
definition: Instances of this class represent the maximum range of values in x-direction (first lateral) that the system can capture in one acquisition process/one measurement.
in scheme: Materials Tribology Lab at KIT
scope note: µm
scope note: nm
scope note: mm
scope note: m
scope note: cm
scope note: float

Specimen Cleaning Procedure Type
type: Concept
definition: Instances of this class specify the classification type of specimen cleaning procedure.
in scheme: Materials Tribology Lab at KIT
scope note: string

Paper
type: Concept
definition: Paper
in scheme: Materials Tribology Lab at KIT
scope note: option

Air (Unconditioned)
type: Concept
definition: n/a
in scheme: Materials Tribology Lab at KIT
scope note: option

Polishing Medium Type
type: Concept
definition: Term containing information about the type of the abrasive particles within the polishing medium
in scheme: Materials Tribology Lab at KIT
scope note: string

Power Supply Voltage
type: Concept
definition: The physical quantity that characterizes the operating voltage at which the power supply is used.
in scheme: Materials Tribology Lab at KIT
scope note: V
scope note: float

Automatic
type: Concept
definition: n/a
in scheme: Materials Tribology Lab at KIT
scope note: option

Technical Specifications (Wire Saw)
type: Concept
definition: Term containing information about the technical specifications of a wire saw.
in scheme: Materials Tribology Lab at KIT
scope note: dictionary

Connected PC
type: Concept
definition: Class containing information about the PC's connected to a tribometer.
in scheme: Materials Tribology Lab at KIT
scope note: dictionary

°
type: Concept
definition: n/a
in scheme: Materials Tribology Lab at KIT
scope note: option

Sliding Track Length
type: Concept
definition: Length between both end points of the sliding track.
in scheme: Materials Tribology Lab at KIT
scope note: mm
scope note: float

Physik Instrumente (PI) GmbH & Co. KG
type: Concept
definition: Karlsruhe, Germany
in scheme: Materials Tribology Lab at KIT
scope note: option

Version Controlled Repository
type: Concept
definition: Link to a version controlled repository for software and data, e.g. GitLab.com.
in scheme: Materials Tribology Lab at KIT
scope note: string

Metadata
type: Concept
definition: n/a
in scheme: Materials Tribology Lab at KIT
scope note: option

MZE, 30.48
type: Concept
definition: n/a
in scheme: Materials Tribology Lab at KIT
scope note: option

PhD Candidate
type: Concept
definition: n/a
in scheme: Materials Tribology Lab at KIT
scope note: option

Wiping
type: Concept
definition: The process of wiping the sample's surface with some kind of tissue/fabric. Can involve a liquid medium (solvent).
in scheme: Materials Tribology Lab at KIT
scope note: option

HV10
type: Concept
definition: n/a
in scheme: Materials Tribology Lab at KIT
scope note: option

Distilled Water
type: Concept
definition: n/a
in scheme: Materials Tribology Lab at KIT
scope note: option

Maximum Positioning System Turning Speed
type: Concept
definition: Instances of this class characterize the maximum permissable turning speed.
in scheme: Materials Tribology Lab at KIT
scope note: min^(-1)
scope note: float

Materials Tribology Lab at KIT
type: ConceptScheme
contributor: Malte Flachmann
contributor: Ilia Bagov
contributor: Nikolay Garabedian
contributor: Torben Tiezema
contributor: Yulong Li
contributor: Julia Rau
contributor: Ines Blatter
contributor: Antje Dollmann
contributor: Michael Seitz
contributor: Christian Greiner
created: 2023-04-24T12:13:32.220Z
license: https://creativecommons.org/licenses/by/4.0
publisher: Ilia Bagov

Exchangeable
type: Concept
definition: n/a
in scheme: Materials Tribology Lab at KIT
scope note: option

Abrasive Paper
type: Concept
definition: A substrate which holds abrasive medium
in scheme: Materials Tribology Lab at KIT
scope note: option

Buehler
type: Concept
definition: Buehler, Esslingen am Neckar, Deutschland
in scheme: Materials Tribology Lab at KIT
scope note: option

Cross Section Imaging
type: Concept
definition: Term containing information about the images taken after cutting.
in scheme: Materials Tribology Lab at KIT
scope note: dictionary

Radial Position on Disc
type: Concept
definition: Instances of this class characterize the contact position with respect to the center of a disc in a pin-on-disc tribological experiment.
in scheme: Materials Tribology Lab at KIT
scope note: µm
scope note: nm
scope note: mm
scope note: m
scope note: cm
scope note: float

Multi Charge Amplifier Type 5019A
type: Concept
definition: n/a
in scheme: Materials Tribology Lab at KIT
scope note: option

Material Name
type: Concept
definition: The type of material and the way it is referred to. The friendly way to identify it.
in scheme: Materials Tribology Lab at KIT
scope note: string

Thickness
type: Concept
definition: The specification of an object defining its thickness.
in scheme: Materials Tribology Lab at KIT
scope note: µm
scope note: nm
scope note: mm
scope note: m
scope note: cm
scope note: float

Minimum Normal Load
type: Concept
definition: Instances of this class represent the minimum permissable normal load.
in scheme: Materials Tribology Lab at KIT
scope note: N
scope note: kgf
scope note: gf
scope note: float

Spark Out Rotary Speed
type: Concept
definition: Instances of this class characterize the specimen positioning system rotary speed during spark out phase. Only needed if the value is different from the value for key 'Workpiece positioning system rotary speed'.
in scheme: Materials Tribology Lab at KIT
scope note: min^(-1)
scope note: float

Measurement Range
type: Concept
definition: Instances of this class represent the maximum range of values that the system can capture in one acquisition process/one measurement.
in scheme: Materials Tribology Lab at KIT
scope note: µm
scope note: nm
scope note: mm
scope note: m
scope note: cm
scope note: float

half-automatic (single pressure)
type: Concept
definition: n/a
in scheme: Materials Tribology Lab at KIT
scope note: option

Line
type: Concept
definition: n/a
in scheme: Materials Tribology Lab at KIT
scope note: option

Bottom
type: Concept
definition: n/a
in scheme: Materials Tribology Lab at KIT
scope note: option

Radius
type: Concept
definition: The specification of a preferencially curved object defining its radius.
in scheme: Materials Tribology Lab at KIT
scope note: µm
scope note: nm
scope note: mm
scope note: m
scope note: cm
scope note: float

queriesPositionOfFeatureFomProcess
type: Concept
definition: Denotes that a given process relies on the position of a notable feature on a specimen to conduct a measurement or procedure. The position of the feature can be, indirectly, part of the data or metadata of the parent digital object.
in scheme: Materials Tribology Lab at KIT
scope note: relationship_type
scope note: none

Tip Angle
type: Concept
definition: Instances of this class represent the angle of a measuring tip, when examined from the side in a measurement.
in scheme: Materials Tribology Lab at KIT
scope note: °
scope note: float

DAQ AI Offset
type: Concept
definition: DAQ Analog Input offset.
in scheme: Materials Tribology Lab at KIT
scope note: float

Maximum Probe Current
type: Concept
definition: The maximum probe current under which the equipment can operate.
in scheme: Materials Tribology Lab at KIT
scope note: pA
scope note: nA
scope note: µA
scope note: mA
scope note: A
scope note: kA
scope note: float

Software-Generated
type: Concept
definition: Values that originate from the software (e.g. time stamps, cycle number indicating values, test programm step numbers etc.)
in scheme: Materials Tribology Lab at KIT
scope note: option

Specimen Mounting Specifications
type: Concept
definition: Class containing information about the specimen mounting in a cup grinding machine.
in scheme: Materials Tribology Lab at KIT
scope note: dictionary

M-404.2DG
type: Concept
definition: n/a
in scheme: Materials Tribology Lab at KIT
scope note: option

Plµ Neox
type: Concept
definition: n/a
in scheme: Materials Tribology Lab at KIT
scope note: option

Grinding Process Parameters
type: Concept
definition: Term containing information about the parameters specific to the process.
in scheme: Materials Tribology Lab at KIT
scope note: dictionary

Rinsing
type: Concept
definition: The process of rinsing the sample's surface with a jet of liquid medium.
in scheme: Materials Tribology Lab at KIT
scope note: option

Air Dry
type: Concept
definition: n/a
in scheme: Materials Tribology Lab at KIT
scope note: option

Size of Values to Read
type: Concept
definition: Instances of this class indicate the size in bits of the values to read.
in scheme: Materials Tribology Lab at KIT
scope note: MB
scope note: kB
scope note: bit
scope note: integer

Technical Specifications (Scanning Electron Microscope)
type: Concept
definition: Term containing information about the technical specifications of a scanning electron microscope.
in scheme: Materials Tribology Lab at KIT
scope note: dictionary

null
type: Concept
definition: Equvallent to not entering any value - the preferred solution. Usually denotes a proportion - like "times" something, for example, magnification; or some type of count a count.
in scheme: Materials Tribology Lab at KIT
scope note: option

*.zip
type: Concept
definition: n/a
in scheme: Materials Tribology Lab at KIT
scope note: option

Box Information
type: Concept
definition: Term containing information about scanning with the beam for the deposition or cutting pattern.
in scheme: Materials Tribology Lab at KIT
scope note: dictionary

Measure Stage Position of Sliding Direction Axis Motion
type: Concept
definition: n/a
in scheme: Materials Tribology Lab at KIT
scope note: option

Beam Used
type: Concept
definition: The type of beam used in the process.
in scheme: Materials Tribology Lab at KIT
scope note: string

ai3
type: Concept
definition: n/a
in scheme: Materials Tribology Lab at KIT
scope note: option

Single-crystal Sapphire
type: Concept
definition: n/a
in scheme: Materials Tribology Lab at KIT
scope note: option

7-10-106
type: Concept
definition: n/a
in scheme: Materials Tribology Lab at KIT
scope note: option

Wire Specifications
type: Concept
definition: Term containing information about the technical specifications of the wire
in scheme: Materials Tribology Lab at KIT
scope note: dictionary

Cleaning Step
type: Concept
definition: n/a
in scheme: Materials Tribology Lab at KIT
scope note: option

Principle of Motion Delivery
type: Concept
definition: Field that holds information about the working principle of a subsystem.
in scheme: Materials Tribology Lab at KIT
scope note: string

Rectangle
type: Concept
definition: n/a
in scheme: Materials Tribology Lab at KIT
scope note: option

DC Motor with a Preloaded Precision Leadscrew
type: Concept
definition: n/a
in scheme: Materials Tribology Lab at KIT
scope note: option

Sliding
type: Concept
definition: n/a
in scheme: Materials Tribology Lab at KIT
scope note: option

Z-direction Travel Range
type: Concept
definition: Instances of this class represent the distance between the lower and upper limits of the z-axis/vertical axis.
in scheme: Materials Tribology Lab at KIT
scope note: µm
scope note: nm
scope note: mm
scope note: m
scope note: cm
scope note: float

Keyence
type: Concept
definition: n/a
in scheme: Materials Tribology Lab at KIT
scope note: option

Minimum Incremental Motion
type: Concept
definition: n/a
in scheme: Materials Tribology Lab at KIT
scope note: µm
scope note: nm
scope note: mm
scope note: m
scope note: cm
scope note: float

User Role
type: Concept
definition: Information about a user's role inside an institution's structure.
in scheme: Materials Tribology Lab at KIT
scope note: string

Decimal Separator
type: Concept
definition: Instances of this class specify the decimal separator used in a file.
in scheme: Materials Tribology Lab at KIT
scope note: string

Bolt (Mandrel)
type: Concept
definition: n/a
in scheme: Materials Tribology Lab at KIT
scope note: option

First Data Column
type: Concept
definition: Denotes the sequential number of the firs column in the tabular data file, which contains raw data values.
in scheme: Materials Tribology Lab at KIT
scope note: integer

Leica KL1500
type: Concept
definition: n/a
in scheme: Materials Tribology Lab at KIT
scope note: option

%*V^(-1)
type: Concept
definition: n/a
in scheme: Materials Tribology Lab at KIT
scope note: option

CHR 150 N
type: Concept
definition: n/a
in scheme: Materials Tribology Lab at KIT
scope note: option

Pt
type: Concept
definition: Platinum
in scheme: Materials Tribology Lab at KIT
scope note: option

Face Orientation Information
type: Concept
definition: Class containing information about the spatial orientation of a block specimen.
in scheme: Materials Tribology Lab at KIT
scope note: dictionary

Tool Cleaning Accessory Type
type: Concept
definition: Instances of this class specify the classification type of tool cleaning accessory.
in scheme: Materials Tribology Lab at KIT
scope note: string

DAQ Used Channel Info
type: Concept
definition: Class containing combined information about the parameters that are put into the involved DAQ channels, to run it optimally, but are not directly part of achieving the experimental objectives.
in scheme: Materials Tribology Lab at KIT
scope note: dictionary

Archive File Technical Specifications
type: Concept
definition: Contains the information to open/access/read and interpret an archive file's contents adequately.
in scheme: Materials Tribology Lab at KIT
scope note: dictionary

K
type: Concept
definition: n/a
in scheme: Materials Tribology Lab at KIT
scope note: option

Experiment End Time
type: Concept
definition: Subsection holds information about when the experiment was finished.
in scheme: Materials Tribology Lab at KIT
scope note: date

Pre-Process Cleaning
type: Concept
definition: n/a
in scheme: Materials Tribology Lab at KIT
scope note: option

Heat Treatment Goal
type: Concept
definition: Instances of this class specify the classification goal of heat treatment.
in scheme: Materials Tribology Lab at KIT
scope note: string

Flash Point
type: Concept
definition: Object's Flash Point.
in scheme: Materials Tribology Lab at KIT
scope note: K
scope note: °C
scope note: float

Cup Grinding Steps Array
type: Concept
definition: Class containing the ordered list of sequential steps, in terms of parameters, specific to the process.
in scheme: Materials Tribology Lab at KIT
scope note: dictionary

mm*s^(-1)
type: Concept
definition: n/a
in scheme: Materials Tribology Lab at KIT
scope note: option

Runtime Setpoint
type: Concept
definition: The duration setting assigned to be maintained by the machine in a tribological process.
in scheme: Materials Tribology Lab at KIT
scope note: s
scope note: min
scope note: h
scope note: float

Maximum Beam Voltage
type: Concept
definition: The maximum beam voltage under which the equipment can operate.
in scheme: Materials Tribology Lab at KIT
scope note: V
scope note: kV
scope note: float

Shell
type: Concept
definition: n/a
in scheme: Materials Tribology Lab at KIT
scope note: option

Y-direction Measurement Resolution
type: Concept
definition: Instances of this class represent the y-axis/secondary lateral axis/slow axis resolution that the system can capture.
in scheme: Materials Tribology Lab at KIT
scope note: µm
scope note: nm
scope note: mm
scope note: m
scope note: cm
scope note: float

Spark Out Time
type: Concept
definition: Instances of this class characterize the time the machine is allowed to spark out after the last feed, i.e. grind with low pressure.
in scheme: Materials Tribology Lab at KIT
scope note: s
scope note: min
scope note: h
scope note: float

Water
type: Concept
definition: n/a
in scheme: Materials Tribology Lab at KIT
scope note: option

CrFeAl Heating Coil
type: Concept
definition: n/a
in scheme: Materials Tribology Lab at KIT
scope note: option

Technical Specifications (Polishing Machine)
type: Concept
definition: Term containing information about the technical specifications of a polishing machine.
in scheme: Materials Tribology Lab at KIT
scope note: dictionary

Input File(s) Info
type: Concept
definition: Class containing information about files used for a process, e.g. input files supplied to the controlling software to run an experiment or raw data for data processing and analysis.
in scheme: Materials Tribology Lab at KIT
scope note: dictionary

Conversion Offset
type: Concept
definition: Scaling offset that has to be applied to data. The conversion offset to convert V/mA raw-signal into something physically meaningful.
in scheme: Materials Tribology Lab at KIT
scope note: µmV^(-1)
scope note: µms^(-1)
scope note: µm
scope note: W
scope note: V
scope note: s
scope note: Pa
scope note: null
scope note: nm
scope note: NV^(-1)
scope note: N
scope note: MPa
scope note: mm^2s^(-1)
scope note: mms^(-1)
scope note: mm
scope note: mlh^(-1)
scope note: ml
scope note: min^(-1)
scope note: min
scope note: mbar
scope note: MB
scope note: ms^(-1)
scope note: m
scope note: l
scope note: kmh^(-1)
scope note: kHz
scope note: kgf
scope note: kgm^(-3)
scope note: kg
scope note: kB
scope note: K
scope note: Hz
scope note: HV20
scope note: HV10
scope note: h
scope note: gf
scope note: g
scope note: cm
scope note: bit
scope note: °C
scope note: °
scope note: %V^(-1)
scope note: %
scope note: float

manual
type: Concept
definition: n/a
in scheme: Materials Tribology Lab at KIT
scope note: option

Cross Section Position
type: Concept
definition: Contains information on where the CS is cut, e.g., “in the center of wear track #XY”.
in scheme: Materials Tribology Lab at KIT
scope note: string

Tool Cleaning Time Interval Type
type: Concept
definition: Instances of this class specify the classification type of tool cleaning time interval.
in scheme: Materials Tribology Lab at KIT
scope note: string

Beam Current
type: Concept
definition: Electrical current which flows along the beam path.
in scheme: Materials Tribology Lab at KIT
related match: beam current.yaml
scope note: nA
scope note: µA
scope note: mA
scope note: A
scope note: float

Clamping Area Length
type: Concept
definition: The maximum permissable length of specimen to be held.
in scheme: Materials Tribology Lab at KIT
scope note: µm
scope note: nm
scope note: mm
scope note: m
scope note: cm
scope note: float

ai4
type: Concept
definition: n/a
in scheme: Materials Tribology Lab at KIT
scope note: option

Experiment Summary
type: Concept
definition: Class containing derived information aafter the experiment has finished. All derived information stems from the information recorded in other locations of the record.
in scheme: Materials Tribology Lab at KIT
scope note: dictionary

Magnetic Field Emission Classification Standard
type: Concept
definition: Class containing information about the technical standard observed by the magnetic field emission.
in scheme: Materials Tribology Lab at KIT
scope note: string

10XDI-N
type: Concept
definition: n/a
in scheme: Materials Tribology Lab at KIT
scope note: option

Z-direction Minimum Measurement Speed
type: Concept
definition: Instances of this class represent the minimum z-direction (vertical) speed at which the system can capture.
in scheme: Materials Tribology Lab at KIT
scope note: µms^(-1)
scope note: mms^(-1)
scope note: ms^(-1)
scope note: kmh^(-1)
scope note: float

Method of Specimen Positioning
type: Concept
definition: Instances of this class indicate the type of sample containment method for positioning it in a particular place.
in scheme: Materials Tribology Lab at KIT
scope note: string

ai1
type: Concept
definition: n/a
in scheme: Materials Tribology Lab at KIT
scope note: option

Gluing Specimen with Carbon Patch onto FIB Stub
type: Concept
definition: n/a
in scheme: Materials Tribology Lab at KIT
scope note: option

HV20
type: Concept
definition: n/a
in scheme: Materials Tribology Lab at KIT
scope note: option

ai0
type: Concept
definition: n/a
in scheme: Materials Tribology Lab at KIT
scope note: option

Windows XP
type: Concept
definition: n/a
in scheme: Materials Tribology Lab at KIT
scope note: option

EDX Mode
type: Concept
definition: n/a
in scheme: Materials Tribology Lab at KIT
scope note: option

ao0
type: Concept
definition: n/a
in scheme: Materials Tribology Lab at KIT
scope note: option

Continuous
type: Concept
definition: n/a
in scheme: Materials Tribology Lab at KIT
scope note: option

Power Supply Wattage
type: Concept
definition: The physical quantity that characterizes the power conversion capability of a power supply
in scheme: Materials Tribology Lab at KIT
scope note: W
scope note: float

Spatial Information
type: Concept
definition: Class containing information about the spatial (dimensions, position and arientation) details of a block specimen.
in scheme: Materials Tribology Lab at KIT
scope note: dictionary

S2.14
type: Concept
definition: n/a
in scheme: Materials Tribology Lab at KIT
scope note: option

General Info (Software)
type: Concept
definition: Objects of this class contain information that describes the data.
in scheme: Materials Tribology Lab at KIT
scope note: dictionary

kg*m^(-3)
type: Concept
definition: n/a
in scheme: Materials Tribology Lab at KIT
scope note: option

010
type: Concept
definition: n/a
in scheme: Materials Tribology Lab at KIT
scope note: option

IAM-CMS
type: Concept
definition: Institute for Applied Materials - Computational Materials Science
in scheme: Materials Tribology Lab at KIT
scope note: option

*.bin
type: Concept
definition: n/a
in scheme: Materials Tribology Lab at KIT
scope note: option

Direction of Sequence
type: Concept
definition: Denotes the direction in which the sequential data should be read.
in scheme: Materials Tribology Lab at KIT
scope note: string

EDX
type: Concept
definition: Information if EBSD was used during SEM session.
in scheme: Materials Tribology Lab at KIT
scope note: boolean

Demagnetization
type: Concept
definition: Class representing the monitored processes that produce a (set of) file(s) whose contents could be used for 1D visualization.
in scheme: Materials Tribology Lab at KIT
scope note: process
scope note: record
scope note: https://purls.helmholtz-metadaten.de/vp/kitmtxx-41732562-vp/phy_xxx_xxx-3c41e6aa10d14a51b0c7a950b897fbba-vp: https://purls.helmholtz-metadaten.de/vp/kitmtxx-41732562-vp/blo_spe_xxx-ae137cec891644ec9e9d131be42ef67c-vp
scope note: https://purls.helmholtz-metadaten.de/vp/kitmtxx-41732562-vp/emp_xxx_xxx-b0c09f9f6cd948839bac12aa4a2ad55d-vp: https://purls.helmholtz-metadaten.de/vp/kitmtxx-41732562-vp/dem_pla_xxx-c4882064ea124afab8aae0b78eeae19c-vp

Field-Free Mode
type: Concept
definition: n/a
in scheme: Materials Tribology Lab at KIT
scope note: option

TUC 2442 91
type: Concept
definition: n/a
in scheme: Materials Tribology Lab at KIT
scope note: option

Sample Point Array for Spectrogram
type: Concept
definition: n/a
in scheme: Materials Tribology Lab at KIT
scope note: option

Pellet
type: Concept
definition: n/a
in scheme: Materials Tribology Lab at KIT
scope note: option

Technical Specifications (Optical Surface Profilometer)
type: Concept
definition: Class containing information about the technical specifications of a optical surface profilometer.
in scheme: Materials Tribology Lab at KIT
scope note: dictionary

Minimum Magnification
type: Concept
definition: n/a
in scheme: Materials Tribology Lab at KIT
scope note: float

Spreadsheet
type: Concept
definition: A tabular data type with named columns and/or rows.
in scheme: Materials Tribology Lab at KIT
scope note: option

Micro-Epsilon Eltrotec GmbH
type: Concept
definition: Göppingen, Germany
in scheme: Materials Tribology Lab at KIT
scope note: option

Electropolishing Program
type: Concept
definition: n/a
in scheme: Materials Tribology Lab at KIT
scope note: string

Cold Air Jet
type: Concept
definition: n/a
in scheme: Materials Tribology Lab at KIT
scope note: option

Base Speed
type: Concept
definition: The speed of the rotating plate.
in scheme: Materials Tribology Lab at KIT
scope note: min^(-1)
scope note: float

USB-6212
type: Concept
definition: n/a
in scheme: Materials Tribology Lab at KIT
scope note: option

Z-direction Measurement Range
type: Concept
definition: Instances of this class represent the maximum range of values in z-direction (vertical) that the system can capture in one acquisition process/one measurement.
in scheme: Materials Tribology Lab at KIT
scope note: µm
scope note: nm
scope note: mm
scope note: m
scope note: cm
scope note: float

Cap on Bolt
type: Concept
definition: A cap that compresses the specimen around its periphery while being tightened on the end of a threaded rod, in turn attached to equipment.
in scheme: Materials Tribology Lab at KIT
scope note: option

Cleaning Cross Section
type: Concept
definition: n/a
in scheme: Materials Tribology Lab at KIT
scope note: option

General Info (Process)
type: Concept
definition: Objects of this class contain information that unequivocally identifies the process.
in scheme: Materials Tribology Lab at KIT
scope note: dictionary

Advisor
type: Concept
definition: Name of the advisor of the work or thesis.
in scheme: Materials Tribology Lab at KIT
scope note: list

Porous Alumina (Soft Followed by Hard)
type: Concept
definition: n/a
in scheme: Materials Tribology Lab at KIT
scope note: option

Is Specimen Material Ferromagnetic
type: Concept
definition: Information on whether the material is ferromagnetic or not. The magnetic state (or magnetic phase) of a material depends on temperature, pressure, and the applied magnetic field. A material may exhibit more than one form of magnetism as these variables change.
in scheme: Materials Tribology Lab at KIT
scope note: boolean

Windows Vista
type: Concept
definition: n/a
in scheme: Materials Tribology Lab at KIT
scope note: option

Windows 98
type: Concept
definition: n/a
in scheme: Materials Tribology Lab at KIT
scope note: option

Available Hardness Testing Cameras Array
type: Concept
definition: Class containing information about the available hardness testing cameras of a hardness testing system.
in scheme: Materials Tribology Lab at KIT
scope note: dictionary

Floor
type: Concept
definition: The floor in a building. Ground floor has value "0". First underground/basement floor has value "-1"
in scheme: Materials Tribology Lab at KIT
scope note: integer

CSEM
type: Concept
definition: n/a
in scheme: Materials Tribology Lab at KIT
scope note: option

Overview Camera
type: Concept
definition: n/a
in scheme: Materials Tribology Lab at KIT
scope note: option

Binary File Scaling Factor
type: Concept
definition: Scaling factor that has to be applied to all data in a file to get meaningful values.
in scheme: Materials Tribology Lab at KIT
scope note: float

usesSoftware
type: Concept
definition: Denotes that a given process uses a piece of software to process data.
in scheme: Materials Tribology Lab at KIT
scope note: relationship_type
scope note: none

Back and Forth
type: Concept
definition: n/a
in scheme: Materials Tribology Lab at KIT
scope note: option

1
type: Concept
definition: n/a
in scheme: Materials Tribology Lab at KIT
scope note: option

Procedure Start Time
type: Concept
definition: Subsection holds information about when the procedure was started.
in scheme: Materials Tribology Lab at KIT
scope note: date

Big-Endian Ordering, 64-Bit Long Data Type
type: Concept
definition: n/a
in scheme: Materials Tribology Lab at KIT
scope note: option

Confocal
type: Concept
definition: n/a
in scheme: Materials Tribology Lab at KIT
scope note: option

km*h^(-1)
type: Concept
definition: n/a
in scheme: Materials Tribology Lab at KIT
scope note: option

D46
type: Concept
definition: n/a
in scheme: Materials Tribology Lab at KIT
scope note: option

Axis Rotation Angle
type: Concept
definition: Describes the angle offset between two coordinate systems.
in scheme: Materials Tribology Lab at KIT
scope note: °
scope note: float

Master's Thesis
type: Concept
definition: n/a
in scheme: Materials Tribology Lab at KIT
scope note: option

Model 4240
type: Concept
definition: n/a
in scheme: Materials Tribology Lab at KIT
scope note: option

211-15/16
type: Concept
definition: n/a
in scheme: Materials Tribology Lab at KIT
scope note: option

Big-Endian Ordering
type: Concept
definition: n/a
in scheme: Materials Tribology Lab at KIT
scope note: option

Droplet (with replenishment)
type: Concept
definition: n/a
in scheme: Materials Tribology Lab at KIT
scope note: option

Time at Receipt of Delivery
type: Concept
definition: Instances of this class identify when a delivery was left at the research institution. Please note: In the Kadi4Mat the data type for this is Date — dd. "Month" yyyy HH:MM:SS.
in scheme: Materials Tribology Lab at KIT
scope note: date

Tribometer
type: Concept
definition: Objects of this class pertain to the category of machines that perform tribological experiments as their primary use.
in scheme: Materials Tribology Lab at KIT
scope note: object
scope note: record
scope note: https://purls.helmholtz-metadaten.de/vp/kitmtxx-41732562-vp/ism_xxx_xxx-cd4f36f6200648d294054682584c8e2b-vp: https://purls.helmholtz-metadaten.de/vp/kitmtxx-41732562-vp/tri_xxx_xxx-c98170df4aa14cd38e9ba0d1b94ebdf0-vp

Measure the Height of the Counter Body's Bulk - Respectively Its Wear
type: Concept
definition: n/a
in scheme: Materials Tribology Lab at KIT
scope note: option

Desiccator Storage History
type: Concept
definition: Historical list of desiccator in- and outputs of the specimen.
in scheme: Materials Tribology Lab at KIT
scope note: dictionary

Delimiter
type: Concept
definition: Instances of this class specify the delimiter used in a file.
in scheme: Materials Tribology Lab at KIT
scope note: string

*.tif
type: Concept
definition: n/a
in scheme: Materials Tribology Lab at KIT
scope note: option

Stone Table with Active Pneumatic Dampers
type: Concept
definition: n/a
in scheme: Materials Tribology Lab at KIT
scope note: option

Measure Load Cell Displacement - Respectively the Friction Force
type: Concept
definition: n/a
in scheme: Materials Tribology Lab at KIT
scope note: option

Abbreviation
type: Concept
definition: The agreed on abbreviation (= short common name) of the variable the time series captured.
in scheme: Materials Tribology Lab at KIT
scope note: string

Curved Unidirectional
type: Concept
definition: n/a
in scheme: Materials Tribology Lab at KIT
scope note: option

VH-Z250R
type: Concept
definition: n/a
in scheme: Materials Tribology Lab at KIT
scope note: option

Sphere
type: Concept
definition: n/a
in scheme: Materials Tribology Lab at KIT
scope note: option

Ran Preprogrammed Cleaning Procedure
type: Concept
definition: Denotes whether the machine was cleaned using the preprogrammed cleaning procedure.
in scheme: Materials Tribology Lab at KIT
scope note: boolean

Measure the Height of the Base Body's Surface of Tribological Interest - Respectively Its Waviness
type: Concept
definition: n/a
in scheme: Materials Tribology Lab at KIT
scope note: option

After-test Unloaded Zero Offset Load
type: Concept
definition: The force for uncertatinty calculation of the normal force sensor immediately after the experiment finished.
in scheme: Materials Tribology Lab at KIT
scope note: float

Z-Dimension
type: Concept
definition: The size along the z dimension.
in scheme: Materials Tribology Lab at KIT
scope note: µm
scope note: nm
scope note: mm
scope note: m
scope note: cm
scope note: float

Plasma Cleaner Unit LP
type: Concept
definition: n/a
in scheme: Materials Tribology Lab at KIT
scope note: option

Electropolishing Window Area
type: Concept
definition: The area of the window on the mask which defines the electropolished area.
in scheme: Materials Tribology Lab at KIT
scope note: mm^2
scope note: cm^2
scope note: float

Technical Specifications (Electropolishing Machine)
type: Concept
definition: Term containing information about the technical specifications of an electropolishing machine.
in scheme: Materials Tribology Lab at KIT
scope note: dictionary

Elastic Spring
type: Concept
definition: n/a
in scheme: Materials Tribology Lab at KIT
scope note: option

Ceramic
type: Concept
definition: n/a
in scheme: Materials Tribology Lab at KIT
scope note: option

W
type: Concept
definition: n/a
in scheme: Materials Tribology Lab at KIT
scope note: option

Band Saw
type: Concept
definition: Objects of this class pertain to the category of machines called band saw.
in scheme: Materials Tribology Lab at KIT
scope note: object
scope note: record
scope note: https://purls.helmholtz-metadaten.de/vp/kitmtxx-41732562-vp/ism_xxx_xxx-cd4f36f6200648d294054682584c8e2b-vp: https://purls.helmholtz-metadaten.de/vp/kitmtxx-41732562-vp/ban_saw_xxx-12c7e62cfce14dc783d3015895fc400e-vp

File (Electron Microscopy)
type: Concept
definition: Term containing a collection of metadata, each associated with a file or a series of files, generated as the output of an electron microscopy process and sharing the same metadata.
in scheme: Materials Tribology Lab at KIT
scope note: data
scope note: record

Climate Box
type: Concept
definition: n/a
in scheme: Materials Tribology Lab at KIT
scope note: option

Air (Humidity Controlled)
type: Concept
definition: n/a
in scheme: Materials Tribology Lab at KIT
scope note: option

Cup Grinding Goal
type: Concept
definition: Instances of this class specify the classification goal of cup grinding step.
in scheme: Materials Tribology Lab at KIT
scope note: string

BNC
type: Concept
definition: n/a
in scheme: Materials Tribology Lab at KIT
scope note: option

Specimen Positioning Info
type: Concept
definition: Class containing information that characterizes the block specimen positioning.
in scheme: Materials Tribology Lab at KIT
scope note: dictionary

Centre Suisse d'Electronique et de Microtechnique
type: Concept
definition: n/a
in scheme: Materials Tribology Lab at KIT
scope note: option

Heat Treatment Type
type: Concept
definition: Instances of this class specify the classification type of heat treatment.
in scheme: Materials Tribology Lab at KIT
scope note: string

006
type: Concept
definition: n/a
in scheme: Materials Tribology Lab at KIT
scope note: option

Polishing Orientation Steps
type: Concept
definition: Contains a list of step of specimen orientations on the polishing machine.
in scheme: Materials Tribology Lab at KIT
scope note: dictionary

Head Speed
type: Concept
definition: The speed of the head.
in scheme: Materials Tribology Lab at KIT
scope note: min^(-1)
scope note: float

File Name
type: Concept
definition: Denotes the name of a given file.
in scheme: Materials Tribology Lab at KIT
scope note: string

Hardness Scale
type: Concept
definition: The unit that locks the meaning of the amount of the phenomenon of hardness. This gives the scale used for the measurement.
in scheme: Materials Tribology Lab at KIT
scope note: string

Falcon 608
type: Concept
definition: n/a
in scheme: Materials Tribology Lab at KIT
scope note: option

Minimum Working Tool Turning Speed
type: Concept
definition: Instances of this class characterize the minimum permissable working tool turning speed.
in scheme: Materials Tribology Lab at KIT
scope note: min^(-1)
scope note: float

Unsigned Integer
type: Concept
definition: n/a
in scheme: Materials Tribology Lab at KIT
scope note: option

Scan Direction
type: Concept
definition: Direction of the beam scan of the procedure step
in scheme: Materials Tribology Lab at KIT
scope note: string

Sawing Blade
type: Concept
definition: The cutting component of a machine used in a cutting process.
in scheme: Materials Tribology Lab at KIT
scope note: object
scope note: record

Equipment Resolution
type: Concept
definition: Equipment Distance/Displacement Resolution
in scheme: Materials Tribology Lab at KIT
scope note: µm
scope note: nm
scope note: mm
scope note: m
scope note: cm
scope note: float

Used Objective
type: Concept
definition: The type of objective used during the process.
in scheme: Materials Tribology Lab at KIT
scope note: string

Diamond Wire
type: Concept
definition: n/a
in scheme: Materials Tribology Lab at KIT
scope note: option

ml*h^(-1)
type: Concept
definition: n/a
in scheme: Materials Tribology Lab at KIT
scope note: option

takesDataFromProcess
type: Concept
definition: Denotes that a given process takes data from a previous process or a dataset. This property relates a data manipulation process to the process that generated the data needed to be supplied for its excution.
in scheme: Materials Tribology Lab at KIT
scope note: relationship_type
scope note: none

Rinsed with Water
type: Concept
definition: Contains information on whether the sample was rinsed with water after the electropolishing process.
in scheme: Materials Tribology Lab at KIT
scope note: boolean

Y Number of Points
type: Concept
definition: Instances of this class characterize the measurement number of scanning points per line in y-direction, as defined by the equipment.
in scheme: Materials Tribology Lab at KIT
scope note: Pixel
scope note: integer

Dwell Time
type: Concept
definition: Time period during which the beam remains on one position/stationary.
in scheme: Materials Tribology Lab at KIT
related match: dwell time.yaml
scope note: ns
scope note: μs
scope note: s
scope note: min
scope note: h
scope note: float

Actual Sampling Rate
type: Concept
definition: The actual sample rate of the time series. Please note that this might not be the same as the sample rate setpoint used when conducting the experiment.
in scheme: Materials Tribology Lab at KIT
scope note: min^(-1)
scope note: kHz
scope note: Hz
scope note: float

kgf
type: Concept
definition: kg force
in scheme: Materials Tribology Lab at KIT
scope note: option

Base Body Rotation
type: Concept
definition: n/a
in scheme: Materials Tribology Lab at KIT
scope note: option

Magnification
type: Concept
definition: Denotes the magnification factor(s) used during the process.
in scheme: Materials Tribology Lab at KIT
scope note: float

Light Microscope
type: Concept
definition: n/a
in scheme: Materials Tribology Lab at KIT
scope note: object
scope note: record
scope note: https://purls.helmholtz-metadaten.de/vp/kitmtxx-41732562-vp/ism_xxx_xxx-cd4f36f6200648d294054682584c8e2b-vp: https://purls.helmholtz-metadaten.de/vp/kitmtxx-41732562-vp/lig_mic_xxx-de64ef91f8544beda63bbf43c6ffdce1-vp

List of Available Hardness Measurement Types
type: Concept
definition: Class containing information about the available hardness testing indenters of a hardness testing system.
in scheme: Materials Tribology Lab at KIT
scope note: string

Character
type: Concept
definition: n/a
in scheme: Materials Tribology Lab at KIT
scope note: option

Space Height
type: Concept
definition: The maximum height inside the chamber of a furnace.
in scheme: Materials Tribology Lab at KIT
scope note: µm
scope note: nm
scope note: mm
scope note: m
scope note: cm
scope note: float

Motion Direction
type: Concept
definition: Instances of this class characterize the direction of motion during the time the demagnetizing field is affecting the workpiece/specimen.
in scheme: Materials Tribology Lab at KIT
scope note: string

Apprentice
type: Concept
definition: n/a
in scheme: Materials Tribology Lab at KIT
scope note: option

Diamond 5 µm 90°
type: Concept
definition: n/a
in scheme: Materials Tribology Lab at KIT
scope note: option

MPS 2 R300
type: Concept
definition: n/a
in scheme: Materials Tribology Lab at KIT
scope note: option

Replenishment Rate
type: Concept
definition: The amount of interfacial medium supplied to a process per time, when continuous replenishment setting is used.
in scheme: Materials Tribology Lab at KIT
scope note: ml*h^(-1)
scope note: float

Lens
type: Concept
definition: n/a
in scheme: Materials Tribology Lab at KIT
scope note: option

Electropolishing Machine
type: Concept
definition: Objects of this class pertain to the category of machines that perform electropolishing tasks as their primary use.
in scheme: Materials Tribology Lab at KIT
scope note: object
scope note: record
scope note: https://purls.helmholtz-metadaten.de/vp/kitmtxx-41732562-vp/ism_xxx_xxx-cd4f36f6200648d294054682584c8e2b-vp: https://purls.helmholtz-metadaten.de/vp/kitmtxx-41732562-vp/ele_mac_xxx-903f852b9cef4385aaa4a8fef788e7b5-vp

EBSD
type: Concept
definition: Information if EBSD was used during SEM session.
in scheme: Materials Tribology Lab at KIT
scope note: boolean

Vertical Infeed Table Rotations Interval
type: Concept
definition: Instances of this class characterize the number of 360° rotations the sample mounting table completes in between two infeed steps.
in scheme: Materials Tribology Lab at KIT
scope note: float

General Info (Interfacial Lubricating Medium)
type: Concept
definition: Objects of this class contain information that unequivocally identifies a piece of interfacial lubricating medium.
in scheme: Materials Tribology Lab at KIT
scope note: dictionary

Postdoc
type: Concept
definition: n/a
in scheme: Materials Tribology Lab at KIT
scope note: option

X-Position
type: Concept
definition: Position of an object on another object in x direction.
in scheme: Materials Tribology Lab at KIT
scope note: float

Wieland
type: Concept
definition: n/a
in scheme: Materials Tribology Lab at KIT
scope note: option

Dark Correction Performed
type: Concept
definition: Instances of this class indicate whether the sensor's dark correction functions prior to the measurement was performed.
in scheme: Materials Tribology Lab at KIT
scope note: boolean

Electron Microscopy
type: Concept
definition: n/a
in scheme: Materials Tribology Lab at KIT
scope note: process
scope note: record
scope note: https://purls.helmholtz-metadaten.de/vp/kitmtxx-41732562-vp/phy_xxx_xxx-3c41e6aa10d14a51b0c7a950b897fbba-vp: https://purls.helmholtz-metadaten.de/vp/kitmtxx-41732562-vp/blo_spe_xxx-ae137cec891644ec9e9d131be42ef67c-vp
scope note: https://purls.helmholtz-metadaten.de/vp/kitmtxx-41732562-vp/cha_xxx_xxx-5b70f2376c68474381ef5cc428fe240b-vp: https://purls.helmholtz-metadaten.de/vp/kitmtxx-41732562-vp/blo_spe_xxx-ae137cec891644ec9e9d131be42ef67c-vp
scope note: https://purls.helmholtz-metadaten.de/vp/kitmtxx-41732562-vp/emp_xxx_xxx-b0c09f9f6cd948839bac12aa4a2ad55d-vp: https://purls.helmholtz-metadaten.de/vp/kitmtxx-41732562-vp/sca_ele_mic-30855d0d4b6049a6a8fc94f07cdcc312-vp
scope note: https://purls.helmholtz-metadaten.de/vp/kitmtxx-41732562-vp/que_xxx_xxx-1b4f515c8fc54791b8f6269ca30a4d6a-vp: https://purls.helmholtz-metadaten.de/vp/kitmtxx-41732562-vp/tri_exp_xxx-9b84c31083254e40a6eb78601271d381-vp
scope note: https://purls.helmholtz-metadaten.de/vp/kitmtxx-41732562-vp/que_xxx_xxx-dc882ce905ba4dfbb3a906b1c1b0cdad-vp: https://purls.helmholtz-metadaten.de/vp/kitmtxx-41732562-vp/opt_mic_xxx-c73af6d31f314907b33d212d43f61891-vp

Diameter
type: Concept
definition: The specification of a preferencially curved object defining its diameter.
in scheme: Materials Tribology Lab at KIT
scope note: µm
scope note: nm
scope note: mm
scope note: m
scope note: cm
scope note: float

Protection Class
type: Concept
definition: Instances of this class characterize the IP class of a machine.
in scheme: Materials Tribology Lab at KIT
scope note: string

Metal Sawing
type: Concept
definition: Class representing the physical process of separating metal bodies for eventual use in scientific process or equipment.
in scheme: Materials Tribology Lab at KIT
scope note: process
scope note: record
scope note: https://purls.helmholtz-metadaten.de/vp/kitmtxx-41732562-vp/phy_xxx_xxx-3c41e6aa10d14a51b0c7a950b897fbba-vp: https://purls.helmholtz-metadaten.de/vp/kitmtxx-41732562-vp/blo_spe_xxx-ae137cec891644ec9e9d131be42ef67c-vp
scope note: https://purls.helmholtz-metadaten.de/vp/kitmtxx-41732562-vp/phy_xxx_xxx-9da2eadd1cba429c8381945b334fe39c-vp: https://purls.helmholtz-metadaten.de/vp/kitmtxx-41732562-vp/blo_spe_xxx-ae137cec891644ec9e9d131be42ef67c-vp
scope note: https://purls.helmholtz-metadaten.de/vp/kitmtxx-41732562-vp/emp_xxx_xxx-b0c09f9f6cd948839bac12aa4a2ad55d-vp: https://purls.helmholtz-metadaten.de/vp/kitmtxx-41732562-vp/ban_saw_xxx-12c7e62cfce14dc783d3015895fc400e-vp, https://purls.helmholtz-metadaten.de/vp/kitmtxx-41732562-vp/wir_saw_xxx-25611f86ae4d460a9747e0f5c301d8a0-vp, https://purls.helmholtz-metadaten.de/vp/kitmtxx-41732562-vp/saw_bla_xxx-99b624c642ed43b1b6cf21cb17b7ceb6-vp

Technical Specifications (Furnace)
type: Concept
definition: Class containing information about the technical specifications of a furnace.
in scheme: Materials Tribology Lab at KIT
scope note: dictionary

ai2
type: Concept
definition: n/a
in scheme: Materials Tribology Lab at KIT
scope note: option

DAQ Attributes
type: Concept
definition: Class containing attributes about the installed DAQs.
in scheme: Materials Tribology Lab at KIT
scope note: dictionary

Solvent
type: Concept
definition: n/a
in scheme: Materials Tribology Lab at KIT
scope note: option

Porous Alumina (Hard)
type: Concept
definition: n/a
in scheme: Materials Tribology Lab at KIT
scope note: option

Vertical End Position
type: Concept
definition: Instances of this class characterize the vertical end height in a process.
in scheme: Materials Tribology Lab at KIT
scope note: µm
scope note: nm
scope note: mm
scope note: m
scope note: cm
scope note: float

Electrolyte Composition
type: Concept
definition: Contains information about the constituents of an electrolyte.
in scheme: Materials Tribology Lab at KIT
scope note: dictionary

Line Contact
type: Concept
definition: E.g. pressing a cylinder with its curved side on a flat surface.
in scheme: Materials Tribology Lab at KIT
scope note: option

Esprit
type: Concept
definition: n/a
in scheme: Materials Tribology Lab at KIT
scope note: option

Duty Cycle
type: Concept
definition: Instances of this class characterize the duty cycle of the plate.
in scheme: Materials Tribology Lab at KIT
scope note: %
scope note: float

Technical Specifications (Demagnetizing Plate)
type: Concept
definition: Class containing information about the technical specifications of a demagnetizing plate.
in scheme: Materials Tribology Lab at KIT
scope note: dictionary

Leybold GmbH
type: Concept
definition: Cologne, Germany
in scheme: Materials Tribology Lab at KIT
scope note: option

Total Elapsed Time
type: Concept
definition: Instances of this class represent the total elapsed time of an experiment.
in scheme: Materials Tribology Lab at KIT
scope note: s
scope note: min
scope note: h
scope note: float

Array of Info on Sensors
type: Concept
definition: Class containing information about all the installed sensors detecting physical quantities during the course of an experiment. These can be force sensors, distance sensors, acoustic transducers etc.
in scheme: Materials Tribology Lab at KIT
scope note: dictionary

Positional Repeatability
type: Concept
definition: Instances of this class represent the maximum deviation from a prescribed position.
in scheme: Materials Tribology Lab at KIT
scope note: µm
scope note: nm
scope note: mm
scope note: m
scope note: cm
scope note: float

ml
type: Concept
definition: n/a
in scheme: Materials Tribology Lab at KIT
scope note: option

Room Number
type: Concept
definition: The "unique identifier" of the room in which a process occurs or an object resides.
in scheme: Materials Tribology Lab at KIT
scope note: string

Mass amount
type: Concept
definition: Mass amount of an ingredient.
in scheme: Materials Tribology Lab at KIT
scope note: kg
scope note: g
scope note: mg
scope note: float

Graph of Processed Data
type: Concept
definition: n/a
in scheme: Materials Tribology Lab at KIT
scope note: option

Helios Nanolab 650
type: Concept
definition: n/a
in scheme: Materials Tribology Lab at KIT
scope note: option

Available Hardness Testing Lenses Array
type: Concept
definition: Class containing information about the available hardness testing lenses of a hardness testing system.
in scheme: Materials Tribology Lab at KIT
scope note: dictionary

Setup Start Time
type: Concept
definition: Subsection holds information about when the setup of an experiment was started.
in scheme: Materials Tribology Lab at KIT
scope note: date

Control the Tribometer in Use
type: Concept
definition: n/a
in scheme: Materials Tribology Lab at KIT
scope note: option

Jumo dTRON 04.1
type: Concept
definition: n/a
in scheme: Materials Tribology Lab at KIT
scope note: option

Grinding Process Step Type
type: Concept
definition: Describes the step in the grinding process.
in scheme: Materials Tribology Lab at KIT
scope note: string

Mercedes-Benz Standard
type: Concept
definition: Class containing information about the technical standard of the interfacial medium.
in scheme: Materials Tribology Lab at KIT
scope note: string

Maximum Horizontal Field Width
type: Concept
definition: The maximum HFW of the beam.
in scheme: Materials Tribology Lab at KIT
scope note: µm
scope note: nm
scope note: mm
scope note: m
scope note: cm
scope note: float

Heating
type: Concept
definition: Process step that increases temperature.
in scheme: Materials Tribology Lab at KIT
scope note: option

Generic Matrix
type: Concept
definition: A 2-dimensional tabular data type. A more generic version of 'Spreadsheet'.
in scheme: Materials Tribology Lab at KIT
scope note: option

characterizesSpecimen
type: Concept
definition: Denotes that a given process characterizes a block specimen. For example: optical microscopy, weight measurement, length measurement.
in scheme: Materials Tribology Lab at KIT
scope note: relationship_type
scope note: none

LEO Ultrasonic Co Ltd
type: Concept
definition: n/a
in scheme: Materials Tribology Lab at KIT
scope note: option

Technical Specifications (Ultrasonic Cleaner)
type: Concept
definition: Class containing information about the technical specifications of a ultrasonic cleaner.
in scheme: Materials Tribology Lab at KIT
scope note: dictionary

iFast Developer's Kit
type: Concept
definition: n/a
in scheme: Materials Tribology Lab at KIT
scope note: option

Interfacial Medium Supply Continuity
type: Concept
definition: Continuity of supply of the interfacial medium during an industrial or scientific process, where replenishment occurs. Could be for lubrication and/or cooling purposes.
in scheme: Materials Tribology Lab at KIT
scope note: string

FEI Company
type: Concept
definition: FEI Company, Hillsboro, OR, USA
in scheme: Materials Tribology Lab at KIT
scope note: option

Grinding
type: Concept
definition: Class representing the physical process of grinding of a specimen with the aim of changing its surface characteristics.
in scheme: Materials Tribology Lab at KIT
scope note: process
scope note: record
scope note: https://purls.helmholtz-metadaten.de/vp/kitmtxx-41732562-vp/phy_xxx_xxx-3c41e6aa10d14a51b0c7a950b897fbba-vp: https://purls.helmholtz-metadaten.de/vp/kitmtxx-41732562-vp/blo_spe_xxx-ae137cec891644ec9e9d131be42ef67c-vp
scope note: https://purls.helmholtz-metadaten.de/vp/kitmtxx-41732562-vp/emp_xxx_xxx-b0c09f9f6cd948839bac12aa4a2ad55d-vp: https://purls.helmholtz-metadaten.de/vp/kitmtxx-41732562-vp/ult_cle_xxx-192eb37ff24644798963cd87107e9a5f-vp, https://purls.helmholtz-metadaten.de/vp/kitmtxx-41732562-vp/gri_mac_xxx-b0492ca6bf9043909ee541221a225895-vp

Base Rotation Direction
type: Concept
definition: The rotation direction of the base.
in scheme: Materials Tribology Lab at KIT
scope note: string

Machine Dimensions
type: Concept
definition: Class containing information about the dimensions of an object.
in scheme: Materials Tribology Lab at KIT
scope note: dictionary

documentsDescriptionOf
type: Concept
definition: Relates to an object's ability to store information about the description of another object.
in scheme: Materials Tribology Lab at KIT
scope note: relationship_type
scope note: none

Datatype Class
type: Concept
definition: Instances of this class give the class of values to read in a file.
in scheme: Materials Tribology Lab at KIT
scope note: string

Vertical Step Size
type: Concept
definition: Instances of this class characterize the vertical step size in a process.
in scheme: Materials Tribology Lab at KIT
scope note: µm
scope note: nm
scope note: mm
scope note: m
scope note: cm
scope note: float

e- Flash HD
type: Concept
definition: n/a
in scheme: Materials Tribology Lab at KIT
scope note: option

Relaxation Duration Setpoint
type: Concept
definition: The prescribed duration of relaxation of the induced load, in order for a system to stabilize prior to the start/end of the process.
in scheme: Materials Tribology Lab at KIT
scope note: s
scope note: min
scope note: h
scope note: float

Signed Integer
type: Concept
definition: n/a
in scheme: Materials Tribology Lab at KIT
scope note: option

OPTIMUS TKD
type: Concept
definition: n/a
in scheme: Materials Tribology Lab at KIT
scope note: option

Optical Surface Profilometer
type: Concept
definition: Objects of this class pertain to the category of machines called optical surface profilometer.
in scheme: Materials Tribology Lab at KIT
scope note: object
scope note: record
scope note: https://purls.helmholtz-metadaten.de/vp/kitmtxx-41732562-vp/ism_xxx_xxx-cd4f36f6200648d294054682584c8e2b-vp: https://purls.helmholtz-metadaten.de/vp/kitmtxx-41732562-vp/opt_sur_pro-9658f444fa7b4e6b8ebf0c678491e2c0-vp

Relative Lateral Position of Sensor
type: Concept
definition: n/a
in scheme: Materials Tribology Lab at KIT
scope note: µm
scope note: nm
scope note: mm
scope note: m
scope note: cm
scope note: float

Polishing Details
type: Concept
definition: Contains information specific to the polishing procedure.
in scheme: Materials Tribology Lab at KIT
scope note: dictionary

V-408.232020
type: Concept
definition: n/a
in scheme: Materials Tribology Lab at KIT
scope note: option

TKD
type: Concept
definition: Contains information whether TKD (transmission Kikuchi diffraction) was used or not.
in scheme: Materials Tribology Lab at KIT
scope note: boolean

VH-Z20R
type: Concept
definition: n/a
in scheme: Materials Tribology Lab at KIT
scope note: option

Scratch Mark
type: Concept
definition: n/a
in scheme: Materials Tribology Lab at KIT
scope note: option

Frequency Array for Spectrogram
type: Concept
definition: n/a
in scheme: Materials Tribology Lab at KIT
scope note: option

Reshaped and Augmented Raw Data
type: Concept
definition: n/a
in scheme: Materials Tribology Lab at KIT
scope note: option

File(s) Purpose
type: Concept
definition: Instances of this class specify the purpose of generation of a specific output file during conduction of the experiment. Free text allowed.
in scheme: Materials Tribology Lab at KIT
scope note: string

Self-Mixed
type: Concept
definition: n/a
in scheme: Materials Tribology Lab at KIT
scope note: option

xT microscope Control
type: Concept
definition: n/a
in scheme: Materials Tribology Lab at KIT
scope note: option

Location Information
type: Concept
definition: Class containing a collection of pieces of information about where a process occured, or an object typically resides or is stored.
in scheme: Materials Tribology Lab at KIT
scope note: dictionary

Linear Unidirectional
type: Concept
definition: n/a
in scheme: Materials Tribology Lab at KIT
scope note: option

Cemented Carbide
type: Concept
definition: n/a
in scheme: Materials Tribology Lab at KIT
scope note: option

Vacuum
type: Concept
definition: The end of a vacuum line is directly attached to specimen's surface to keep it attached to a piece of equipment.
in scheme: Materials Tribology Lab at KIT
scope note: option

-105
type: Concept
definition: n/a
in scheme: Materials Tribology Lab at KIT
scope note: option

Infeed Info
type: Concept
definition: Class containing information that gives information on the infeed parameters in this grinding step.
in scheme: Materials Tribology Lab at KIT
scope note: dictionary

Point Contact
type: Concept
definition: The type of contact that forms when a convex spherical (or aspherical) curved object is pressed against a flat surface or another convex shaped object.
in scheme: Materials Tribology Lab at KIT
scope note: option

Technical Specifications (Polishing Medium)
type: Concept
definition: Term containing information about the technical specifications of a polishing medium.
in scheme: Materials Tribology Lab at KIT
scope note: dictionary

MSC7401
type: Concept
definition: n/a
in scheme: Materials Tribology Lab at KIT
scope note: option

Building
type: Concept
definition: The "unique identifier" of the building within the specific institution.
in scheme: Materials Tribology Lab at KIT
scope note: string

Little-Endian Ordering, 64-Bit Long Data Type
type: Concept
definition: n/a
in scheme: Materials Tribology Lab at KIT
scope note: option

Camera View Type
type: Concept
definition: Instances of this class specify the available camera views.
in scheme: Materials Tribology Lab at KIT
scope note: string

Maximum Specimen Height With Ceramic Cup Mounted
type: Concept
definition: The maximum height a workpiece/sample is allowed to have when a (previously unused) ceramic grinding cup is mounted.
in scheme: Materials Tribology Lab at KIT
scope note: µm
scope note: nm
scope note: mm
scope note: m
scope note: cm
scope note: float

VS 15665-OL
type: Concept
definition: n/a
in scheme: Materials Tribology Lab at KIT
scope note: option

Stream File
type: Concept
definition: n/a
in scheme: Materials Tribology Lab at KIT
scope note: option

µm*V^(-1)
type: Concept
definition: n/a
in scheme: Materials Tribology Lab at KIT
scope note: option

Connected Amplifier Info
type: Concept
definition: n/a
in scheme: Materials Tribology Lab at KIT
scope note: dictionary

Technician
type: Concept
definition: n/a
in scheme: Materials Tribology Lab at KIT
scope note: option

X Offset
type: Concept
definition: Instances of this class characterize the measurement offset in x-direction as defined by the equipment.
in scheme: Materials Tribology Lab at KIT
scope note: µm
scope note: nm
scope note: mm
scope note: m
scope note: cm
scope note: float

Magnetic Drive
type: Concept
definition: n/a
in scheme: Materials Tribology Lab at KIT
scope note: option

Clamping Method
type: Concept
definition: Way of of clamping of a physical object.
in scheme: Materials Tribology Lab at KIT
scope note: string

Blowing With Compressed Air
type: Concept
definition: Remove loose particles/dust/residue by applying compressed air.
in scheme: Materials Tribology Lab at KIT
scope note: option

Oil
type: Concept
definition: n/a
in scheme: Materials Tribology Lab at KIT
scope note: option

GMN Georg Mueller Nuernberg AG
type: Concept
definition: n/a
in scheme: Materials Tribology Lab at KIT
scope note: option

Starting Direction
type: Concept
definition: The intial direction of motion when the relative motion sets in.
in scheme: Materials Tribology Lab at KIT
scope note: string

Reciprocating
type: Concept
definition: n/a
in scheme: Materials Tribology Lab at KIT
scope note: option

Purchased
type: Concept
definition: n/a
in scheme: Materials Tribology Lab at KIT
scope note: option

DT6112
type: Concept
definition: n/a
in scheme: Materials Tribology Lab at KIT
scope note: option

Blade Specifications
type: Concept
definition: Class containing information about the technical specifications of a bandsaw blade.
in scheme: Materials Tribology Lab at KIT
scope note: dictionary

.
type: Concept
definition: n/a
in scheme: Materials Tribology Lab at KIT
scope note: option

Maximum Working Tool Turning Speed
type: Concept
definition: Instances of this class characterize the maximum permissable working tool turning speed.
in scheme: Materials Tribology Lab at KIT
scope note: min^(-1)
scope note: float

Array of Info on Objectives
type: Concept
definition: n/a
in scheme: Materials Tribology Lab at KIT
scope note: dictionary

Specimen Orientation
type: Concept
definition: Term informs about the specimen orientation.
in scheme: Materials Tribology Lab at KIT
scope note: string

Gas Deposition
type: Concept
definition: Material which is deposited from the gas phase using electron or Ga+ beam.
in scheme: Materials Tribology Lab at KIT
scope note: string

Y Offset Between Profiles
type: Concept
definition: Instances of this class characterize the measurement offset in y-direction when multiple profiles from the same sample are taken.
in scheme: Materials Tribology Lab at KIT
scope note: µm
scope note: nm
scope note: mm
scope note: m
scope note: cm
scope note: float

General Info (External Process)
type: Concept
definition: Objects of this class contain information that describes known information about a process external to the research insitution.
in scheme: Materials Tribology Lab at KIT
scope note: dictionary

PCI
type: Concept
definition: n/a
in scheme: Materials Tribology Lab at KIT
scope note: option

003
type: Concept
definition: n/a
in scheme: Materials Tribology Lab at KIT
scope note: option

Abrasive Particles Material
type: Concept
definition: The name of the material of the abrasive particles.
in scheme: Materials Tribology Lab at KIT
scope note: string

Mass Density Specifications
type: Concept
definition: Class containing information about the mass density of the the piece of interfacial medium.
in scheme: Materials Tribology Lab at KIT
scope note: dictionary

Focusing Method
type: Concept
definition: The method of focusing the microscope.
in scheme: Materials Tribology Lab at KIT
scope note: string

Beams Information
type: Concept
definition: Contains information about the beams available in the machine.
in scheme: Materials Tribology Lab at KIT
scope note: dictionary

Principle of Load Application
type: Concept
definition: The method (principle) of load application. For Tribometers, the way the normal load is applied can have a big influence on the tribologically induced processes in the frictional contact and the long-term evolution of the tribo-system (e.g. due to wear).
in scheme: Materials Tribology Lab at KIT
scope note: string

Innovatest
type: Concept
definition: n/a
in scheme: Materials Tribology Lab at KIT
scope note: option

Holding
type: Concept
definition: n/a
in scheme: Materials Tribology Lab at KIT
scope note: option

2.62
type: Concept
definition: n/a
in scheme: Materials Tribology Lab at KIT
scope note: option

Floating-Point Number
type: Concept
definition: n/a
in scheme: Materials Tribology Lab at KIT
scope note: option

System or Setup Inputs (Demagnetization)
type: Concept
definition: Class containing information about the parameters that are put into the involved scientific equipment to run it optimally.
in scheme: Materials Tribology Lab at KIT
scope note: dictionary

mm^2*s^(-1)
type: Concept
definition: n/a
in scheme: Materials Tribology Lab at KIT
scope note: option

Disc
type: Concept
definition: n/a
in scheme: Materials Tribology Lab at KIT
scope note: option

Poster
type: Concept
definition: Poster
in scheme: Materials Tribology Lab at KIT
scope note: option

Working Distance
type: Concept
definition: Denotes the distance from the front of the lens to the focal plane.
in scheme: Materials Tribology Lab at KIT
scope note: µm
scope note: nm
scope note: mm
scope note: m
scope note: cm
scope note: float

Polishing Medium Information
type: Concept
definition: Contains information about the polishing medium used during the process.
in scheme: Materials Tribology Lab at KIT
scope note: dictionary

XY Table Specifications
type: Concept
definition: Class containing information about the XY table of a hardness testing system.
in scheme: Materials Tribology Lab at KIT
scope note: dictionary

Front-Right-Top Intersection
type: Concept
definition: n/a
in scheme: Materials Tribology Lab at KIT
scope note: option

Coolant
type: Concept
definition: Coolants are used most often in industrial processes. Important: this is the object in term of its function/role/application, and not its particular chemical composition (that would be instead an abstract representation of the internal structure).
in scheme: Materials Tribology Lab at KIT
scope note: string

Z 16758
type: Concept
definition: n/a
in scheme: Materials Tribology Lab at KIT
scope note: option

ISO 2719
type: Concept
definition: n/a
in scheme: Materials Tribology Lab at KIT
scope note: option

Terminal Configuration
type: Concept
definition: Instances of this class give the configuration for reading or writing at a terminal.
in scheme: Materials Tribology Lab at KIT
scope note: string

Tape Used
type: Concept
definition: Denotes whether scotch tape was used to reduce the electropolished area. If the desired area is not covered by the existing masks, it is possible to define the area by use of said scotch tape.
in scheme: Materials Tribology Lab at KIT
scope note: boolean

Pneumatic
type: Concept
definition: n/a
in scheme: Materials Tribology Lab at KIT
scope note: option

Motion Inducing Subsystems Info Array
type: Concept
definition: Class containing information about the installed subsystems responsible for making parts move in the tribometer.
in scheme: Materials Tribology Lab at KIT
scope note: dictionary

Kinematic Viscosity Acquisition Temperature
type: Concept
definition: The specification of an object defining its kinematic viscosity acquisition temperature.
in scheme: Materials Tribology Lab at KIT
scope note: K
scope note: °C
scope note: float

Electron Beam e-
type: Concept
definition: A beam which consists of electrons.
in scheme: Materials Tribology Lab at KIT
related match: electron beam.yaml
scope note: option

Technical Specifications (Lubricant for Polishing)
type: Concept
definition: Term containing information about the technical specifications of a lubricant for polishing.
in scheme: Materials Tribology Lab at KIT
scope note: dictionary

mbar
type: Concept
definition: n/a
in scheme: Materials Tribology Lab at KIT
scope note: option

Cooling Medium Flow Rate
type: Concept
definition: Instances of this class characterize the prescribed coolant flow rate.
in scheme: Materials Tribology Lab at KIT
scope note: %
scope note: float

N
type: Concept
definition: n/a
in scheme: Materials Tribology Lab at KIT
scope note: option

Commercial Machining
type: Concept
definition: Class representing the physical process of machining a block of material for eventual use in scientific processes or equipment. The exact process is unknown, but it is performed by a firm that is external to the scientific institution.
in scheme: Materials Tribology Lab at KIT
scope note: process
scope note: record
scope note: https://purls.helmholtz-metadaten.de/vp/kitmtxx-41732562-vp/phy_xxx_xxx-3c41e6aa10d14a51b0c7a950b897fbba-vp: https://purls.helmholtz-metadaten.de/vp/kitmtxx-41732562-vp/blo_spe_xxx-ae137cec891644ec9e9d131be42ef67c-vp
scope note: https://purls.helmholtz-metadaten.de/vp/kitmtxx-41732562-vp/phy_xxx_xxx-9da2eadd1cba429c8381945b334fe39c-vp: https://purls.helmholtz-metadaten.de/vp/kitmtxx-41732562-vp/blo_spe_xxx-ae137cec891644ec9e9d131be42ef67c-vp

Gluing Specimen onto FIB Stub with Silver Glue
type: Concept
definition: n/a
in scheme: Materials Tribology Lab at KIT
scope note: option

Diamond
type: Concept
definition: n/a
in scheme: Materials Tribology Lab at KIT
scope note: option

SEM
type: Concept
definition: Contains information whether SEM was used or not.
in scheme: Materials Tribology Lab at KIT
scope note: boolean

IP54
type: Concept
definition: n/a
in scheme: Materials Tribology Lab at KIT
scope note: option

OFHC Copper
type: Concept
definition: n/a
in scheme: Materials Tribology Lab at KIT
scope note: option

Distance Between Specimen and Plate
type: Concept
definition: Instances of this class give information about the distance between the specimen and the demagnetizing plate. Often an estimate is good enough for this value.
in scheme: Materials Tribology Lab at KIT
scope note: µm
scope note: nm
scope note: mm
scope note: m
scope note: cm
scope note: float

Beam Settings
type: Concept
definition: Term containing information about the beam settings used for a procedure step
in scheme: Materials Tribology Lab at KIT
scope note: dictionary

Kinematic Viscosity Specifications
type: Concept
definition: Class containing information about the kinematic viscosity of the piece of interfacial medium.
in scheme: Materials Tribology Lab at KIT
scope note: dictionary

,
type: Concept
definition: n/a
in scheme: Materials Tribology Lab at KIT
scope note: option

Hardness Measurement
type: Concept
definition: Class representing the monitored processes that produce a (set of) file(s) with various types whose contents indicate the hardness of a speciment based on indentation measurement.
in scheme: Materials Tribology Lab at KIT
scope note: process
scope note: record
scope note: https://purls.helmholtz-metadaten.de/vp/kitmtxx-41732562-vp/cha_xxx_xxx-5b70f2376c68474381ef5cc428fe240b-vp: https://purls.helmholtz-metadaten.de/vp/kitmtxx-41732562-vp/blo_spe_xxx-ae137cec891644ec9e9d131be42ef67c-vp
scope note: https://purls.helmholtz-metadaten.de/vp/kitmtxx-41732562-vp/phy_xxx_xxx-3c41e6aa10d14a51b0c7a950b897fbba-vp: https://purls.helmholtz-metadaten.de/vp/kitmtxx-41732562-vp/blo_spe_xxx-ae137cec891644ec9e9d131be42ef67c-vp
scope note: https://purls.helmholtz-metadaten.de/vp/kitmtxx-41732562-vp/emp_xxx_xxx-b0c09f9f6cd948839bac12aa4a2ad55d-vp: https://purls.helmholtz-metadaten.de/vp/kitmtxx-41732562-vp/har_tes_xxx-d1fe762442144018958df899aaffe37d-vp

Interfacial Medium Settings
type: Concept
definition: Instances of this class list information on the chosen parameters to define the controllables associated with the delivery of interfacial medium.
in scheme: Materials Tribology Lab at KIT
scope note: dictionary

Ultrasonic Cleaning
type: Concept
definition: The process of ultrasonic cleaning a sample immersed in a liquid medium (solvent).
in scheme: Materials Tribology Lab at KIT
scope note: option

Electrolyte Temperature
type: Concept
definition: The temperature of the electrolyte prior to the beginning of the process.
in scheme: Materials Tribology Lab at KIT
scope note: K
scope note: °C
scope note: float

Kistler
type: Concept
definition: n/a
in scheme: Materials Tribology Lab at KIT
scope note: option

Cross Section Cutting Steps Array
type: Concept
definition: Term containing the ordered list of sequential steps, in terms of parameters, specific to the process.
in scheme: Materials Tribology Lab at KIT
scope note: dictionary

LabVIEW
type: Concept
definition: n/a
in scheme: Materials Tribology Lab at KIT
scope note: option

C
type: Concept
definition: Carbon
in scheme: Materials Tribology Lab at KIT
scope note: option

Submission Date
type: Concept
definition: Date of submission.
in scheme: Materials Tribology Lab at KIT
scope note: date

License
type: Concept
definition: License for software, data etc.
in scheme: Materials Tribology Lab at KIT
scope note: string

012
type: Concept
definition: n/a
in scheme: Materials Tribology Lab at KIT
scope note: option

Number of Plasma Cleanings
type: Concept
definition: Number of plasma cleanings performed.
in scheme: Materials Tribology Lab at KIT
scope note: integer

Bitmap
type: Concept
definition: n/a
in scheme: Materials Tribology Lab at KIT
scope note: option

Contact Type
type: Concept
definition: The (intial) type of contact used in a tribological experiment.
in scheme: Materials Tribology Lab at KIT
scope note: string

Interfacial Medium Source of Replenishment
type: Concept
definition: Source of supply of the interfacial medium during an industrial or scientific process, where replenishment occurs. Could be for lubrication and/or cooling purposes.
in scheme: Materials Tribology Lab at KIT
scope note: string

005
type: Concept
definition: n/a
in scheme: Materials Tribology Lab at KIT
scope note: option

HiWi
type: Concept
definition: n/a
in scheme: Materials Tribology Lab at KIT
scope note: option

MicroProf
type: Concept
definition: n/a
in scheme: Materials Tribology Lab at KIT
scope note: option

mN
type: Concept
definition: n/a
in scheme: Materials Tribology Lab at KIT
scope note: option

6
type: Concept
definition: n/a
in scheme: Materials Tribology Lab at KIT
scope note: option

Ingredient
type: Concept
definition: Ingredient of a chemical mixture.
in scheme: Materials Tribology Lab at KIT
scope note: string

MAN Standard
type: Concept
definition: Class containing information about the technical standard of the interfacial medium.
in scheme: Materials Tribology Lab at KIT
scope note: string

Cycle Setpoint
type: Concept
definition: The cycle setting assigned to be maintained by the machine in a tribological process.
in scheme: Materials Tribology Lab at KIT
scope note: integer

Grinding Step
type: Concept
definition: n/a
in scheme: Materials Tribology Lab at KIT
scope note: option

Number of option Value Sets in File
type: Concept
definition: Instances of this class provide information on how many option value sets a file contains (= number of option time series or number of recorded channels).
in scheme: Materials Tribology Lab at KIT
scope note: integer

Technical Specifications (Grinding Machine)
type: Concept
definition: Class containing information about the technical specifications of a grinding machine.
in scheme: Materials Tribology Lab at KIT
scope note: dictionary

Cutting Speed Setpoint
type: Concept
definition: The setting assigned to be maintained by the machine.
in scheme: Materials Tribology Lab at KIT
scope note: µms^(-1)
scope note: mms^(-1)
scope note: ms^(-1)
scope note: kmh^(-1)
scope note: float

Variable Load Parameters
type: Concept
definition: Class containing a bundle of parameters needed for a scientific process.
in scheme: Materials Tribology Lab at KIT
scope note: dictionary

Polishing
type: Concept
definition: Class representing the physical process of polishing of a specimen with the aim of changing its surface characteristics.
in scheme: Materials Tribology Lab at KIT
scope note: process
scope note: record
scope note: https://purls.helmholtz-metadaten.de/vp/kitmtxx-41732562-vp/phy_xxx_xxx-3c41e6aa10d14a51b0c7a950b897fbba-vp: https://purls.helmholtz-metadaten.de/vp/kitmtxx-41732562-vp/blo_spe_xxx-ae137cec891644ec9e9d131be42ef67c-vp
scope note: https://purls.helmholtz-metadaten.de/vp/kitmtxx-41732562-vp/emp_xxx_xxx-b0c09f9f6cd948839bac12aa4a2ad55d-vp: https://purls.helmholtz-metadaten.de/vp/kitmtxx-41732562-vp/ult_cle_xxx-192eb37ff24644798963cd87107e9a5f-vp, https://purls.helmholtz-metadaten.de/vp/kitmtxx-41732562-vp/pol_mac_xxx-20c35bf0b41948689b5bae72ab59bdb4-vp, https://purls.helmholtz-metadaten.de/vp/kitmtxx-41732562-vp/gri_mac_xxx-b0492ca6bf9043909ee541221a225895-vp
scope note: https://purls.helmholtz-metadaten.de/vp/kitmtxx-41732562-vp/mak_xxx_xxx-85937c1afc674792af65bffa0748aa31-vp: https://purls.helmholtz-metadaten.de/vp/kitmtxx-41732562-vp/pol_med_xxx-2b7335ba9b0143feb2e936545b8ea4e2-vp, https://purls.helmholtz-metadaten.de/vp/kitmtxx-41732562-vp/lub_for_pol-a64e0b5bcd2d44bd8c3d7aa2853007f4-vp

Plate Rotation Direction
type: Concept
definition: The rotation direction of the plate.
in scheme: Materials Tribology Lab at KIT
scope note: string

Material Category (Interfacial Medium)
type: Concept
definition: The lubricant class which interfacial medium fits into best.
in scheme: Materials Tribology Lab at KIT
scope note: string

Plate
type: Concept
definition: n/a
in scheme: Materials Tribology Lab at KIT
scope note: option

DAQ AI Factor
type: Concept
definition: DAQ Analog Input proportionality factor.
in scheme: Materials Tribology Lab at KIT
scope note: float

kHz
type: Concept
definition: n/a
in scheme: Materials Tribology Lab at KIT
scope note: option

OptoSigma
type: Concept
definition: n/a
in scheme: Materials Tribology Lab at KIT
scope note: option

Bolt
type: Concept
definition: A bolt or bolts compressing the specimen directly to the machinery's construction.
in scheme: Materials Tribology Lab at KIT
scope note: option

Uncontrolled Environment Temperature
type: Concept
definition: The phenomenon called temperature of the surroundings.
in scheme: Materials Tribology Lab at KIT
scope note: K
scope note: °C
scope note: float

Electron Microscopy Preparation
type: Concept
definition: Preparation for electron microscopy.
in scheme: Materials Tribology Lab at KIT
scope note: dictionary

ATM GmbH
type: Concept
definition: ATM GmbH, Mammelzen, Germany
in scheme: Materials Tribology Lab at KIT
scope note: option

Equipped for Wet Grinding
type: Concept
definition: Boolean that indicates whether the grinding machine is properly equipped for wet grinding processes i.e. utilizing a liquid cooling medium. Often this is realized by some sort of enhousing or fume hood.
in scheme: Materials Tribology Lab at KIT
scope note: boolean

AO Offset
type: Concept
definition: Analog Output offset amount.
in scheme: Materials Tribology Lab at KIT
scope note: float

Process Summary (Electropolishing)
type: Concept
definition: Class containing derived information after electropolishing.
in scheme: Materials Tribology Lab at KIT
scope note: dictionary

Mounting Information Array
type: Concept
definition: Instances of this class specify the way samples were mounted and — consequently — oriented to one another at the beginning of the experiment.
in scheme: Materials Tribology Lab at KIT
scope note: dictionary

Unit of Measure
type: Concept
definition: Instances of this class lock the meaning of a magnitude.
in scheme: Materials Tribology Lab at KIT
scope note: string

s
type: Concept
definition: n/a
in scheme: Materials Tribology Lab at KIT
scope note: option

Signal Recording
type: Concept
definition: n/a
in scheme: Materials Tribology Lab at KIT
scope note: option

X Offset Between Profiles
type: Concept
definition: Instances of this class characterize the measurement offset in x-direction when multiple profiles from the same sample are taken.
in scheme: Materials Tribology Lab at KIT
scope note: µm
scope note: nm
scope note: mm
scope note: m
scope note: cm
scope note: float

White Light Interferometry
type: Concept
definition: n/a
in scheme: Materials Tribology Lab at KIT
scope note: option

Sensofar
type: Concept
definition: n/a
in scheme: Materials Tribology Lab at KIT
scope note: option

Right
type: Concept
definition: n/a
in scheme: Materials Tribology Lab at KIT
scope note: option

Processed Data
type: Concept
definition: n/a
in scheme: Materials Tribology Lab at KIT
scope note: option

Measurement Resolution
type: Concept
definition: Instances of this class represent the maximum resolution that the system can capture in one acquisition process/one measurement.
in scheme: Materials Tribology Lab at KIT
scope note: µm
scope note: nm
scope note: mm
scope note: m
scope note: cm
scope note: %
scope note: float

Professor
type: Concept
definition: n/a
in scheme: Materials Tribology Lab at KIT
scope note: option

Scan Topography
type: Concept
definition: n/a
in scheme: Materials Tribology Lab at KIT
scope note: option

Wire Grit Size
type: Concept
definition: Average diameter of the abrasive particles on the wire.
in scheme: Materials Tribology Lab at KIT
scope note: µm
scope note: nm
scope note: mm
scope note: m
scope note: cm
scope note: float

Master Candidate
type: Concept
definition: n/a
in scheme: Materials Tribology Lab at KIT
scope note: option

Used Data Files Array
type: Concept
definition: List of files used for data processing.
in scheme: Materials Tribology Lab at KIT
scope note: string

50XDI-N
type: Concept
definition: n/a
in scheme: Materials Tribology Lab at KIT
scope note: option

Wire Base Material
type: Concept
definition: The name of the base material of the wire.
in scheme: Materials Tribology Lab at KIT
scope note: string

mm
type: Concept
definition: n/a
in scheme: Materials Tribology Lab at KIT
scope note: option

USB-6002
type: Concept
definition: n/a
in scheme: Materials Tribology Lab at KIT
scope note: option

Software Version
type: Concept
definition: The version of a particular software.
in scheme: Materials Tribology Lab at KIT
scope note: string

Bruker Corporation
type: Concept
definition: Bruker Corporation, Billerica, MA, USA
in scheme: Materials Tribology Lab at KIT
scope note: option

VH-Z00R
type: Concept
definition: n/a
in scheme: Materials Tribology Lab at KIT
scope note: option

Pt dep
type: Concept
definition: n/a
in scheme: Materials Tribology Lab at KIT
scope note: option

DTA-10D-CA
type: Concept
definition: n/a
in scheme: Materials Tribology Lab at KIT
scope note: option

Fries Research and Technology GmbH
type: Concept
definition: n/a
in scheme: Materials Tribology Lab at KIT
scope note: option

Equipment Friendly Name
type: Concept
definition: The type of machine and the way it is referred to. The friendly way to identify it.
in scheme: Materials Tribology Lab at KIT
scope note: string

Electropolishing Process Parameters
type: Concept
definition: Term containing information about the parameters specific to the process.
in scheme: Materials Tribology Lab at KIT
scope note: dictionary

Tactile Surface Profilometer
type: Concept
definition: Objects of this class pertain to the category of machines called tactile surface profilometer.
in scheme: Materials Tribology Lab at KIT
scope note: object
scope note: record
scope note: https://purls.helmholtz-metadaten.de/vp/kitmtxx-41732562-vp/ism_xxx_xxx-cd4f36f6200648d294054682584c8e2b-vp: https://purls.helmholtz-metadaten.de/vp/kitmtxx-41732562-vp/tac_sur_pro-ec98dbf380804321bb8aa65a96c41b24-vp

Gwyddion
type: Concept
definition: n/a
in scheme: Materials Tribology Lab at KIT
scope note: option

General Info (Equipment)
type: Concept
definition: Objects of this class contain information that unequivocally identifies a piece of equipment.
in scheme: Materials Tribology Lab at KIT
scope note: dictionary

Cup Grinding Tool ID
type: Concept
definition: Instances of this class specify the model of cup grinding tool.
in scheme: Materials Tribology Lab at KIT
scope note: string

Motion Control
type: Concept
definition: n/a
in scheme: Materials Tribology Lab at KIT
scope note: option

Magnetic Field Emission Classification
type: Concept
definition: Class containing information about the technical standard emission observed by the magnetic field.
in scheme: Materials Tribology Lab at KIT
scope note: string

User Token
type: Concept
definition: Operator's abbreviation (if existent). Only needed for users of the Fraunhofer IWM.
in scheme: Materials Tribology Lab at KIT
scope note: string

Top
type: Concept
definition: n/a
in scheme: Materials Tribology Lab at KIT
scope note: option

File (Hardness Measurement)
type: Concept
definition: Term containing a collection of metadata, each associated with a file or a series of files, generated as the output of a hardness measurement process and sharing the same metadata.
in scheme: Materials Tribology Lab at KIT
scope note: data
scope note: record

Minimum Probe Current
type: Concept
definition: The minimum probe current under which the machine can operate.
in scheme: Materials Tribology Lab at KIT
scope note: pA
scope note: nA
scope note: µA
scope note: mA
scope note: A
scope note: kA
scope note: float

Power Consumption
type: Concept
definition: Instances of this class characterize the power consumption of a laboratory equipment.
in scheme: Materials Tribology Lab at KIT
scope note: W
scope note: float

Vibration Mitigation Method
type: Concept
definition: Object of this class provide information about the mounting base or foundation the measurment equipment sits on. This influences how vibrations created due to an experiment interact with the surroundings and how vibrations from the environment might influence the outcome of an experiment.
in scheme: Materials Tribology Lab at KIT
scope note: string

Maximum Base Speed
type: Concept
definition: Maximum base speed at which the machine can operate.
in scheme: Materials Tribology Lab at KIT
scope note: min^(-1)
scope note: float

Equipment Abbreviation
type: Concept
definition: The agreed upon abbreviation of the equipment.
in scheme: Materials Tribology Lab at KIT
scope note: string

LectroPol5
type: Concept
definition: n/a
in scheme: Materials Tribology Lab at KIT
scope note: option

USB
type: Concept
definition: n/a
in scheme: Materials Tribology Lab at KIT
scope note: option

Vickers
type: Concept
definition: n/a
in scheme: Materials Tribology Lab at KIT
scope note: option

Maximum Measurement Speed
type: Concept
definition: Instances of this class represent the maximum permissable measument speed.
in scheme: Materials Tribology Lab at KIT
scope note: µms^(-1)
scope note: mms^(-1)
scope note: ms^(-1)
scope note: kmh^(-1)
scope note: float

Wire Saw
type: Concept
definition: Objects of this class pertain to the category of machines called wire saw.
in scheme: Materials Tribology Lab at KIT
scope note: object
scope note: record
scope note: https://purls.helmholtz-metadaten.de/vp/kitmtxx-41732562-vp/ism_xxx_xxx-cd4f36f6200648d294054682584c8e2b-vp: https://purls.helmholtz-metadaten.de/vp/kitmtxx-41732562-vp/wir_saw_xxx-25611f86ae4d460a9747e0f5c301d8a0-vp

002
type: Concept
definition: n/a
in scheme: Materials Tribology Lab at KIT
scope note: option

Number of Columns
type: Concept
definition: Denotes the total number of columns in the tabular data file.
in scheme: Materials Tribology Lab at KIT
scope note: integer

v5.5.1 build 3318
type: Concept
definition: n/a
in scheme: Materials Tribology Lab at KIT
scope note: option

Width
type: Concept
definition: The specification of an object defining its width.
in scheme: Materials Tribology Lab at KIT
scope note: µm
scope note: nm
scope note: mm
scope note: m
scope note: cm
scope note: float

RSE
type: Concept
definition: n/a
in scheme: Materials Tribology Lab at KIT
scope note: option

Surface Imaging
type: Concept
definition: Term containing information about the taken surface images.
in scheme: Materials Tribology Lab at KIT
scope note: dictionary

AO Factor
type: Concept
definition: Analog Output proportionality factor.
in scheme: Materials Tribology Lab at KIT
scope note: float

Structural Information
type: Concept
definition: Class containing information about the technical Structural Specifications of a Tribometer
in scheme: Materials Tribology Lab at KIT
scope note: dictionary

Consumables Used
type: Concept
definition: Class containing a collection of the consumables that participated in a scientific process.
in scheme: Materials Tribology Lab at KIT
scope note: dictionary

Tip Radius
type: Concept
definition: Instances of this class represent the radius of a measuring tip.
in scheme: Materials Tribology Lab at KIT
scope note: µm
scope note: nm
scope note: mm
scope note: m
scope note: cm
scope note: float

TURBOVAC 90i
type: Concept
definition: n/a
in scheme: Materials Tribology Lab at KIT
scope note: option

6.1
type: Concept
definition: n/a
in scheme: Materials Tribology Lab at KIT
scope note: option

CAV Standard
type: Concept
definition: Class containing information about the technical standard of the interfacial medium.
in scheme: Materials Tribology Lab at KIT
scope note: string

Technical Specifications (Tribometer)
type: Concept
definition: Class containing information about the technical Specifications of a Tribometer
in scheme: Materials Tribology Lab at KIT
scope note: dictionary

Metal
type: Concept
definition: n/a
in scheme: Materials Tribology Lab at KIT
scope note: option

Available Hardness Testing Indenters Array
type: Concept
definition: Term containing information about the available hardness testing indenters of a hardness testing system.
in scheme: Materials Tribology Lab at KIT
scope note: string

Propanol
type: Concept
definition: n/a
in scheme: Materials Tribology Lab at KIT
scope note: option

Technical Specifications (Hardness Testing System)
type: Concept
definition: Class containing information about the technical specifications of a hardness testing system.
in scheme: Materials Tribology Lab at KIT
scope note: dictionary

Grinding Equipment
type: Concept
definition: Term containing information about the equipment used during the grinding process.
in scheme: Materials Tribology Lab at KIT
scope note: dictionary

Total Number of Reciprocating Cycles
type: Concept
definition: n/a
in scheme: Materials Tribology Lab at KIT
scope note: integer

Little-Endian Ordering
type: Concept
definition: n/a
in scheme: Materials Tribology Lab at KIT
scope note: option

File Name Pattern
type: Concept
definition: The naming pattern of the given file.
in scheme: Materials Tribology Lab at KIT
scope note: string

Uniform Specimen Height
type: Concept
definition: First step of grinding. The grinding tool will typically start to abrade at merely one point of the surface. After this process step, the whole surface is being abraded.
in scheme: Materials Tribology Lab at KIT
scope note: option

Pa
type: Concept
definition: n/a
in scheme: Materials Tribology Lab at KIT
scope note: option

Saphirwerk AG
type: Concept
definition: Brügg, Switzerland
in scheme: Materials Tribology Lab at KIT
scope note: option

Transverse Subsystem
type: Concept
definition: Class containing information about the technical specifications of a tactile profilometer transverse system.
in scheme: Materials Tribology Lab at KIT
scope note: dictionary

Differential
type: Concept
definition: n/a
in scheme: Materials Tribology Lab at KIT
scope note: option

Maintain Predefined Humidity
type: Concept
definition: n/a
in scheme: Materials Tribology Lab at KIT
scope note: option

Abrasive Particles Material
type: Concept
definition: Denotes the material of the abrasive particles.
in scheme: Materials Tribology Lab at KIT
scope note: string

Column
type: Concept
definition: n/a
in scheme: Materials Tribology Lab at KIT
scope note: option

Travel Range
type: Concept
definition: The travel range of the tribometer.
in scheme: Materials Tribology Lab at KIT
scope note: µm
scope note: nm
scope note: mm
scope note: m
scope note: cm
scope note: °
scope note: float

Shape
type: Concept
definition: The very basic shape of a block specimen or other geometric element.
in scheme: Materials Tribology Lab at KIT
scope note: string

Category 2
type: Concept
definition: n/a
in scheme: Materials Tribology Lab at KIT
scope note: option

Condenser Volume
type: Concept
definition: The volume of the condenser.
in scheme: Materials Tribology Lab at KIT
scope note: ml
scope note: l
scope note: float

Best Estimate of Sliding Track Starting Position w.r.t. Prescribed Origin
type: Concept
definition: Collection of parameters which describe the coordinate transformation between the two specimen coordinate systems.
in scheme: Materials Tribology Lab at KIT
scope note: dictionary

Equipment ID
type: Concept
definition: The unique alphanumeric ID of the machine. Could be the serial number or any other assigned unique ID.
in scheme: Materials Tribology Lab at KIT
scope note: string

Python
type: Concept
definition: n/a
in scheme: Materials Tribology Lab at KIT
scope note: option

Maximum Head Speed
type: Concept
definition: Maximum head speed at which the machine can operate.
in scheme: Materials Tribology Lab at KIT
scope note: min^(-1)
scope note: float

Counter Body Clamping Method
type: Concept
definition: Way of clamping of a physical object with the role of being a counter body (specimen) in a tribometer.
in scheme: Materials Tribology Lab at KIT
scope note: string

Ethanol
type: Concept
definition: n/a
in scheme: Materials Tribology Lab at KIT
scope note: option

D96
type: Concept
definition: n/a
in scheme: Materials Tribology Lab at KIT
scope note: option

Time Duration
type: Concept
definition: The equipment setting which specifies the temperature setting of a machine.
in scheme: Materials Tribology Lab at KIT
scope note: s
scope note: min
scope note: h
scope note: float

Company or Vendor Name
type: Concept
definition: The official name of the insitution where the object was manufactured.
in scheme: Materials Tribology Lab at KIT
scope note: string

Maximum Magnification
type: Concept
definition: n/a
in scheme: Materials Tribology Lab at KIT
scope note: float

Acetone
type: Concept
definition: n/a
in scheme: Materials Tribology Lab at KIT
scope note: option

Data Processing and Plotting Script
type: Concept
definition: n/a
in scheme: Materials Tribology Lab at KIT
scope note: option

X-direction Travel Range
type: Concept
definition: Instances of this class represent the distance between the lower and upper limits of the x-axis/main lateral axis/fast axis.
in scheme: Materials Tribology Lab at KIT
scope note: µm
scope note: nm
scope note: mm
scope note: m
scope note: cm
scope note: float

IAM-ZM
type: Concept
definition: Institute for Applied Materials - Reliability and Microstructure. German name: Institut für Angewandte Materialien – Zuverlässigkeit und Mikrostruktur. Previously known as IAM-CMS.
in scheme: Materials Tribology Lab at KIT
scope note: option

Operating System Name
type: Concept
definition: Name of computer operating system.
in scheme: Materials Tribology Lab at KIT
scope note: string

V 1404
type: Concept
definition: n/a
in scheme: Materials Tribology Lab at KIT
scope note: option

Hardness Measurement Type
type: Concept
definition: Instances of this class specify the hardness measuring principle.
in scheme: Materials Tribology Lab at KIT
scope note: string

Desiccator Access Direction
type: Concept
definition: Direction of the access to the desiccator, specimen in or out of the desiccator.
in scheme: Materials Tribology Lab at KIT
scope note: string

Quenching
type: Concept
definition: Process step intended to cool a metal at a rapid rate. This is most often done to produce a martensite transformation. Depending on the alloy and other considerations (such as concern for maximum hardness vs. cracking and distortion), cooling may be done with forced air or other gases, (such as nitrogen). Liquids may be used, due to their better thermal conductivity, such as oil or water.
in scheme: Materials Tribology Lab at KIT
scope note: option

Detector
type: Concept
definition: The name of the used detector.
in scheme: Materials Tribology Lab at KIT
scope note: string

DAQ Interface Name
type: Concept
definition: Field that specifies the interface that is used to connect the DAQ device to the recording PC.
in scheme: Materials Tribology Lab at KIT
scope note: string

Grit Size
type: Concept
definition: The physical characteristic called grit size.
in scheme: Materials Tribology Lab at KIT
scope note: µm
scope note: nm
scope note: mm
scope note: m
scope note: cm
scope note: float

Phosphoric Acid
type: Concept
definition: n/a
in scheme: Materials Tribology Lab at KIT
scope note: option

Tribological Experiment
type: Concept
definition: Class representing the monitored processes that produce a (set of) wear track(s) on or below a physical surface.
in scheme: Materials Tribology Lab at KIT
scope note: process
scope note: record
scope note: https://purls.helmholtz-metadaten.de/vp/kitmtxx-41732562-vp/emp_xxx_xxx-b0c09f9f6cd948839bac12aa4a2ad55d-vp: https://purls.helmholtz-metadaten.de/vp/kitmtxx-41732562-vp/tri_xxx_xxx-c98170df4aa14cd38e9ba0d1b94ebdf0-vp
scope note: https://purls.helmholtz-metadaten.de/vp/kitmtxx-41732562-vp/mak_xxx_xxx-85937c1afc674792af65bffa0748aa31-vp: https://purls.helmholtz-metadaten.de/vp/kitmtxx-41732562-vp/int_med_xxx-49981b08aa8e441ba36e6fe7e3760a0a-vp
scope note: https://purls.helmholtz-metadaten.de/vp/kitmtxx-41732562-vp/str_xxx_xxx-38d3d4c5680f48e3990540545f2079b0-vp: https://purls.helmholtz-metadaten.de/vp/kitmtxx-41732562-vp/blo_spe_xxx-ae137cec891644ec9e9d131be42ef67c-vp
scope note: https://purls.helmholtz-metadaten.de/vp/kitmtxx-41732562-vp/str_xxx_xxx-cb318eeeefba400e84a04629fbd58e2a-vp: https://purls.helmholtz-metadaten.de/vp/kitmtxx-41732562-vp/blo_spe_xxx-ae137cec891644ec9e9d131be42ef67c-vp

T8000 R120-400
type: Concept
definition: n/a
in scheme: Materials Tribology Lab at KIT
scope note: option

Institute
type: Concept
definition: The official name of the institute which the responsible person/operator belongs to.
in scheme: Materials Tribology Lab at KIT
scope note: string

MPa
type: Concept
definition: n/a
in scheme: Materials Tribology Lab at KIT
scope note: option

stressesAsCounterBody
type: Concept
definition: Denotes that a given process stresses a given block specimen as a counter body in the relevant process. A clear definition of what is to be called ""base body"" and what ""counter body"" in a tribologcial system does not exist. We therefore will use the following set of definitions — whereby always the first applicable definition should be used in a given case (going through the list from top to bottom): The Base body in a model experiment is the sample or body... ...whose nominal contact area is not permanently tribologically stressed during the experiment. ...that is larger. ...expected to show less wear at the end of the experiment. ...that is static during the experiment.
in scheme: Materials Tribology Lab at KIT
scope note: relationship_type
scope note: none

Bosch Standard
type: Concept
definition: Class containing information about the technical standard of the interfacial medium.
in scheme: Materials Tribology Lab at KIT
scope note: string

Minimum Base Speed
type: Concept
definition: Minimum base speed at which the machine can operate.
in scheme: Materials Tribology Lab at KIT
scope note: min^(-1)
scope note: float

Load Settings
type: Concept
definition: Instances of this class list information on the chosen parameters to define the controllables associated with the load for mechanical interaction in the system.
in scheme: Materials Tribology Lab at KIT
scope note: dictionary

Electropolishing Steps
type: Concept
definition: Describes the sequential order of electropolishing steps.
in scheme: Materials Tribology Lab at KIT
scope note: dictionary

Array of Connected PC's
type: Concept
definition: Class containing information about the PC's connected to a tribometer.
in scheme: Materials Tribology Lab at KIT
scope note: dictionary

Pole Surface Width
type: Concept
definition: Instances of this class specify the pole surface size.
in scheme: Materials Tribology Lab at KIT
scope note: µm
scope note: nm
scope note: mm
scope note: m
scope note: cm
scope note: float

N*V^(-1)
type: Concept
definition: n/a
in scheme: Materials Tribology Lab at KIT
scope note: option

Counterclockwise
type: Concept
definition: n/a
in scheme: Materials Tribology Lab at KIT
scope note: option

(Human Readable) Processed Data
type: Concept
definition: n/a
in scheme: Materials Tribology Lab at KIT
scope note: option

Comment
type: Concept
definition: Unconstrained statement by operator about a process or object.
in scheme: Materials Tribology Lab at KIT
scope note: string

MATLAB
type: Concept
definition: n/a
in scheme: Materials Tribology Lab at KIT
scope note: option

PI MiKroMove
type: Concept
definition: n/a
in scheme: Materials Tribology Lab at KIT
scope note: option

Binary File Offset Amount
type: Concept
definition: Offset amount that has to be applied to all data in a file to get meaningful values.
in scheme: Materials Tribology Lab at KIT
scope note: float

Grinding Steps
type: Concept
definition: Class containing the ordered list of sequential steps, in terms of parameters, specific to the process.
in scheme: Materials Tribology Lab at KIT
scope note: dictionary

Measurement Direction
type: Concept
definition: Instances of this class characterize the measurement direction as defined by the equipment specifications.
in scheme: Materials Tribology Lab at KIT
scope note: integer

681
type: Concept
definition: n/a
in scheme: Materials Tribology Lab at KIT
scope note: option

18.0.1F2 (64-bit)
type: Concept
definition: n/a
in scheme: Materials Tribology Lab at KIT
scope note: option

4113
type: Concept
definition: n/a
in scheme: Materials Tribology Lab at KIT
scope note: option

EK200
type: Concept
definition: n/a
in scheme: Materials Tribology Lab at KIT
scope note: option

Axis Name
type: Concept
definition: Field to specify for which of the general motion axis of a tribometer this subsystem is responsible.
in scheme: Materials Tribology Lab at KIT
scope note: string

Electropolishing
type: Concept
definition: Class representing the monitored processes that produce an electropolishing procedure which removes surface layers.
in scheme: Materials Tribology Lab at KIT
scope note: process
scope note: record
scope note: https://purls.helmholtz-metadaten.de/vp/kitmtxx-41732562-vp/phy_xxx_xxx-3c41e6aa10d14a51b0c7a950b897fbba-vp: https://purls.helmholtz-metadaten.de/vp/kitmtxx-41732562-vp/blo_spe_xxx-ae137cec891644ec9e9d131be42ef67c-vp
scope note: https://purls.helmholtz-metadaten.de/vp/kitmtxx-41732562-vp/mak_xxx_xxx-85937c1afc674792af65bffa0748aa31-vp: https://purls.helmholtz-metadaten.de/vp/kitmtxx-41732562-vp/ele_xxx_xxx-bb7ad7a160aa4ffea9a480879ffa0351-vp
scope note: https://purls.helmholtz-metadaten.de/vp/kitmtxx-41732562-vp/emp_xxx_xxx-b0c09f9f6cd948839bac12aa4a2ad55d-vp: https://purls.helmholtz-metadaten.de/vp/kitmtxx-41732562-vp/ult_cle_xxx-192eb37ff24644798963cd87107e9a5f-vp, https://purls.helmholtz-metadaten.de/vp/kitmtxx-41732562-vp/ele_mac_xxx-903f852b9cef4385aaa4a8fef788e7b5-vp

Material Category (Block Specimen)
type: Concept
definition: The material class which block specimen fits into best.
in scheme: Materials Tribology Lab at KIT
scope note: string

Angular Offset Between Profiles
type: Concept
definition: Instances of this class characterize the measurement offset in radial-direction when multiple profiles from the same sample are taken.
in scheme: Materials Tribology Lab at KIT
scope note: °
scope note: float

Data Processing
type: Concept
definition: Class representing the execution of a particular computer code which extracts/reshapes/processes data from one form to another.
in scheme: Materials Tribology Lab at KIT
scope note: process
scope note: record
scope note: https://purls.helmholtz-metadaten.de/vp/kitmtxx-41732562-vp/tak_xxx_xxx-ca48d075c7de4872b4f12e464652bcb1-vp: https://purls.helmholtz-metadaten.de/vp/kitmtxx-41732562-vp/dat_pro_xxx-b44582ea9cd7420896bc0b644cdcf8f5-vp, https://purls.helmholtz-metadaten.de/vp/kitmtxx-41732562-vp/opt_sur_pro-f096c110525747cab4fe81f4a23b20f8-vp, https://purls.helmholtz-metadaten.de/vp/kitmtxx-41732562-vp/tac_sur_pro-76cb2538e8b5460b8f71e0ede2db6ddc-vp, https://purls.helmholtz-metadaten.de/vp/kitmtxx-41732562-vp/tri_exp_xxx-9b84c31083254e40a6eb78601271d381-vp, https://purls.helmholtz-metadaten.de/vp/kitmtxx-41732562-vp/ele_mic_xxx-840bbf9ffd9648fc883b251d106e3733-vp, https://purls.helmholtz-metadaten.de/vp/kitmtxx-41732562-vp/opt_mic_xxx-c73af6d31f314907b33d212d43f61891-vp
scope note: https://purls.helmholtz-metadaten.de/vp/kitmtxx-41732562-vp/use_xxx_xxx-f130aac753c3467a9ef4cd8d2163a609-vp: https://purls.helmholtz-metadaten.de/vp/kitmtxx-41732562-vp/sof_xxx_xxx-43c5e712afb04a16a8954dbb3c865c0f-vp

Friendly Name
type: Concept
definition: The user friendly (= long common) name of the variable the time series captured.
in scheme: Materials Tribology Lab at KIT
scope note: string

Total Traveled Distance
type: Concept
definition: Information about the "distance equivalent" that an experimental contact has been exposed to by the end of an experiment.
in scheme: Materials Tribology Lab at KIT
scope note: µm
scope note: nm
scope note: mm
scope note: m
scope note: cm
scope note: float

Heat Rods
type: Concept
definition: n/a
in scheme: Materials Tribology Lab at KIT
scope note: option

SiC
type: Concept
definition: n/a
in scheme: Materials Tribology Lab at KIT
scope note: option

Tabular Data Contents Specifications
type: Concept
definition: Contains the information about the content of tabular data file (what information is stored and how to interpret it).
in scheme: Materials Tribology Lab at KIT
scope note: dictionary

Oxford Instruments
type: Concept
definition: n/a
in scheme: Materials Tribology Lab at KIT
scope note: option

Polishing Step
type: Concept
definition: n/a
in scheme: Materials Tribology Lab at KIT
scope note: option

Orientation Indicating Feature Side
type: Concept
definition: The side on which indicating feature is. Defined by ISO (not US) technical drawing standards.
in scheme: Materials Tribology Lab at KIT
scope note: string

Y-direction Measurement Range
type: Concept
definition: Instances of this class represent the maximum range of values in y-direction (second lateral) that the system can capture in one acquisition process/one measurement.
in scheme: Materials Tribology Lab at KIT
scope note: µm
scope note: nm
scope note: mm
scope note: m
scope note: cm
scope note: float

Working Area Width
type: Concept
definition: Instances of this class specify the available width of the area for manipulation within a machine.
in scheme: Materials Tribology Lab at KIT
scope note: µm
scope note: nm
scope note: mm
scope note: m
scope note: cm
scope note: float

Dual Beam Helios NanoLab 650
type: Concept
definition: n/a
in scheme: Materials Tribology Lab at KIT
scope note: option

Length
type: Concept
definition: The specification of an object defining its length.
in scheme: Materials Tribology Lab at KIT
scope note: µm
scope note: nm
scope note: mm
scope note: m
scope note: cm
scope note: float

Maximum Voltage Setpoint
type: Concept
definition: The physical quantity that characterizes the maximum voltage at which the connection is used.
in scheme: Materials Tribology Lab at KIT
scope note: V
scope note: float

Sawing Process Parameters
type: Concept
definition: Class containing information about the parameters specific to the process.
in scheme: Materials Tribology Lab at KIT
scope note: dictionary

Open Cycle - Fresh Medium
type: Concept
definition: n/a
in scheme: Materials Tribology Lab at KIT
scope note: option

Transversal Axis Position
type: Concept
definition: Describes the transversal offset between two coordinate systems.
in scheme: Materials Tribology Lab at KIT
scope note: float

Type of Filter
type: Concept
definition: The type of optical filter used during the process.
in scheme: Materials Tribology Lab at KIT
scope note: string

employsEquipment
type: Concept
definition: Denotes the relationship between a piece of equipment and the procedure it is applied to.
in scheme: Materials Tribology Lab at KIT
scope note: relationship_type
scope note: none

Technical Specifications (Band Saw)
type: Concept
definition: Class containing information about the technical specifications of a bandsaw.
in scheme: Materials Tribology Lab at KIT
scope note: dictionary

Vertical Infeed Time Interval
type: Concept
definition: Instances of this class characterize the vertical infeed time interval in a process. i.e. The time in between two option infeed operations.
in scheme: Materials Tribology Lab at KIT
scope note: s
scope note: min
scope note: h
scope note: float

Process Summary (Data Processing)
type: Concept
definition: Summarizes process parameters and procedures of data processing.
in scheme: Materials Tribology Lab at KIT
scope note: dictionary

Dimensions Information
type: Concept
definition: Class containing information about the spatial dimensions of a block specimen.
in scheme: Materials Tribology Lab at KIT
scope note: dictionary

Uncontrolled Atmospheric Pressure
type: Concept
definition: The phenomenon called atmospheric pressure of the surroundings.
in scheme: Materials Tribology Lab at KIT
scope note: Pa
scope note: MPa
scope note: mbar
scope note: float

CSH02-CAm1,4
type: Concept
definition: n/a
in scheme: Materials Tribology Lab at KIT
scope note: option

Maximum Specimen Treatable Thickness
type: Concept
definition: The specification of an object defining its thickness.
in scheme: Materials Tribology Lab at KIT
scope note: µm
scope note: nm
scope note: mm
scope note: m
scope note: cm
scope note: float

Origin Position on Side of Tribological Interest
type: Concept
definition: Describes the corner of the specimen in respect to which the origin of the specimen coordinate system is set.
in scheme: Materials Tribology Lab at KIT
scope note: string

µm*s^(-1)
type: Concept
definition: n/a
in scheme: Materials Tribology Lab at KIT
scope note: option

M110
type: Concept
definition: n/a
in scheme: Materials Tribology Lab at KIT
scope note: option

V
type: Concept
definition: n/a
in scheme: Materials Tribology Lab at KIT
scope note: option

Hardness Tester
type: Concept
definition: Objects of this class pertain to the category of machines called hardness tester.
in scheme: Materials Tribology Lab at KIT
scope note: object
scope note: record
scope note: https://purls.helmholtz-metadaten.de/vp/kitmtxx-41732562-vp/ism_xxx_xxx-cd4f36f6200648d294054682584c8e2b-vp: https://purls.helmholtz-metadaten.de/vp/kitmtxx-41732562-vp/har_tes_xxx-d1fe762442144018958df899aaffe37d-vp

Hz
type: Concept
definition: n/a
in scheme: Materials Tribology Lab at KIT
scope note: option

Success
type: Concept
definition: Success of the heat treatment procedure.
in scheme: Materials Tribology Lab at KIT
scope note: boolean

Volumetric amount
type: Concept
definition: Volumetric amount of an ingredient.
in scheme: Materials Tribology Lab at KIT
scope note: ml
scope note: float

N-Dimensional Tabular Data Specifications
type: Concept
definition: Contains the information describing a tabular data file.
in scheme: Materials Tribology Lab at KIT
scope note: dictionary

S3.09
type: Concept
definition: n/a
in scheme: Materials Tribology Lab at KIT
scope note: option

Dead Weight(s)
type: Concept
definition: n/a
in scheme: Materials Tribology Lab at KIT
scope note: option

DIN EN 12198
type: Concept
definition: n/a
in scheme: Materials Tribology Lab at KIT
scope note: option

Conversion Factor
type: Concept
definition: Scaling factor that has to be applied to data. The conversion factor to convert V/mA raw-signal into something physically meaningful.
in scheme: Materials Tribology Lab at KIT
scope note: µmV^(-1)
scope note: µms^(-1)
scope note: µm
scope note: W
scope note: V
scope note: s
scope note: Pa
scope note: null
scope note: nm
scope note: NV^(-1)
scope note: N
scope note: MPa
scope note: mm^2s^(-1)
scope note: mms^(-1)
scope note: mm
scope note: mlh^(-1)
scope note: ml
scope note: min^(-1)
scope note: min
scope note: mbar
scope note: MB
scope note: ms^(-1)
scope note: m
scope note: l
scope note: kmh^(-1)
scope note: kHz
scope note: kgf
scope note: kgm^(-3)
scope note: kg
scope note: kB
scope note: K
scope note: Hz
scope note: HV20
scope note: HV10
scope note: h
scope note: gf
scope note: g
scope note: cm
scope note: bit
scope note: °C
scope note: °
scope note: %V^(-1)
scope note: %
scope note: mNV^(-1)
scope note: mmV^(-1)
scope note: float

Front-Left-Top Intersection
type: Concept
definition: n/a
in scheme: Materials Tribology Lab at KIT
scope note: option

Kinematic Mount and Bolt
type: Concept
definition: A bolt or bolts compressing the specimen directly to a kinematic mount, which in turn is attached to the equipment's structure.
in scheme: Materials Tribology Lab at KIT
scope note: option

Maximum Electrolyte Flow Rate
type: Concept
definition: Maximum electrolyte flow rate at which the machine can safely operate.
in scheme: Materials Tribology Lab at KIT
scope note: float

Lateral Axis Position
type: Concept
definition: Describes the magnitude of lateral axis offset between two coordinate system.
in scheme: Materials Tribology Lab at KIT
scope note: float

kg
type: Concept
definition: n/a
in scheme: Materials Tribology Lab at KIT
scope note: option

Targeted Normal Load
type: Concept
definition: The targeted normal load as a function of another direct input (e.g. dead weight) at the beginning of a process.
in scheme: Materials Tribology Lab at KIT
scope note: mN
scope note: N
scope note: kgf
scope note: gf
scope note: float

Maximum Normal Load
type: Concept
definition: Instances of this class represent the maximum permissable normal load.
in scheme: Materials Tribology Lab at KIT
scope note: N
scope note: kgf
scope note: gf
scope note: float

Setup End Time
type: Concept
definition: Subsection holds information about when the setup of an experiment was finished.
in scheme: Materials Tribology Lab at KIT
scope note: date

First Data Row
type: Concept
definition: Denotes the sequential number of the firs row in the tabular data file, which contains raw data values.
in scheme: Materials Tribology Lab at KIT
scope note: integer

Raw Data Reshaping and Augmentation Script
type: Concept
definition: n/a
in scheme: Materials Tribology Lab at KIT
scope note: option

X-direction Measurement Resolution
type: Concept
definition: Instances of this class represent the x-axis/main lateral axis/fast axis resolution that the system can capture.
in scheme: Materials Tribology Lab at KIT
scope note: µm
scope note: nm
scope note: mm
scope note: m
scope note: cm
scope note: float

Minimum Positioning System Turning Speed
type: Concept
definition: Instances of this class characterize the minimum permissable turning speed.
in scheme: Materials Tribology Lab at KIT
scope note: min^(-1)
scope note: float

m*s^(-1)
type: Concept
definition: n/a
in scheme: Materials Tribology Lab at KIT
scope note: option

physicallyModifies
type: Concept
definition: Denotes that a given process results in a modified size/shape/state/appearance/topography of the original physical item. This property relates a process to the objects which are physically influenced temporarily (elastically), or permanently (plastically).
in scheme: Materials Tribology Lab at KIT
scope note: relationship_type
scope note: none

Minimum Duration
type: Concept
definition: Instances of this class characterize the minimum permissible duration for a process maintained by a machine.
in scheme: Materials Tribology Lab at KIT
scope note: s
scope note: min
scope note: h
scope note: float

Regular Cross Section
type: Concept
definition: n/a
in scheme: Materials Tribology Lab at KIT
scope note: option

Demagnetizing Plate
type: Concept
definition: Objects of this class pertain to the category of machines called demagnetizing plate.
in scheme: Materials Tribology Lab at KIT
scope note: object
scope note: record
scope note: https://purls.helmholtz-metadaten.de/vp/kitmtxx-41732562-vp/ism_xxx_xxx-cd4f36f6200648d294054682584c8e2b-vp: https://purls.helmholtz-metadaten.de/vp/kitmtxx-41732562-vp/dem_pla_xxx-c4882064ea124afab8aae0b78eeae19c-vp

*.csv File Technical Specifications
type: Concept
definition: Instances of this class contain the information to open/access/read and interprete a *.csv file's contents adequately.
in scheme: Materials Tribology Lab at KIT
scope note: dictionary

Uncontrolled Environmental Conditions
type: Concept
definition: Information on surrounding conditions that are not actively chosen or controlled by the researcher, which, however, might play a role in the outcome of the scientific process (e.g. "moon phase", "weather", ...).
in scheme: Materials Tribology Lab at KIT
scope note: dictionary

Amplitude Matrix for Spectrogram
type: Concept
definition: n/a
in scheme: Materials Tribology Lab at KIT
scope note: option

Tabular Data Type
type: Concept
definition: Defines the specific type of tabular data.
in scheme: Materials Tribology Lab at KIT
scope note: string

Heating Rate Specifications
type: Concept
definition: Class containing information about the furnace's heating time to temperature.
in scheme: Materials Tribology Lab at KIT
scope note: dictionary

X-Dimension
type: Concept
definition: The size along the x dimension.
in scheme: Materials Tribology Lab at KIT
scope note: µm
scope note: nm
scope note: mm
scope note: m
scope note: cm
scope note: float

Grinding Cup
type: Concept
definition: n/a
in scheme: Materials Tribology Lab at KIT
scope note: option

Probe Arm Mounting Method
type: Concept
definition: Instances of this class characterize the method of clamping of a probe arm.
in scheme: Materials Tribology Lab at KIT
scope note: string

Z-250
type: Concept
definition: n/a
in scheme: Materials Tribology Lab at KIT
scope note: option

Pre-test Unloaded Relaxed Zero Offset Load
type: Concept
definition: The force of the normal force sensor immediately after preloading the stage.
in scheme: Materials Tribology Lab at KIT
scope note: float

Specimen Submersion Method
type: Concept
definition: Way of containing a liquid during a scientific process. Only fixed, and not improvised, solutions.
in scheme: Materials Tribology Lab at KIT
scope note: string

Motion End Distance in Front of Demagnetizing Plate
type: Concept
definition: Instances of this class give information about the distance between sample and trailing edge of the demagnetizing plate after finishing the respective demagnetizing motion.
in scheme: Materials Tribology Lab at KIT
scope note: µm
scope note: nm
scope note: mm
scope note: m
scope note: cm
scope note: float

Si
type: Concept
definition: n/a
in scheme: Materials Tribology Lab at KIT
scope note: option

Grease
type: Concept
definition: n/a
in scheme: Materials Tribology Lab at KIT
scope note: option

National Instruments
type: Concept
definition: Austin, Texas, USA
in scheme: Materials Tribology Lab at KIT
scope note: option

Lens Magnification
type: Concept
definition: Instances of this class specify the lens magnification.
in scheme: Materials Tribology Lab at KIT
scope note: float

semi-automated
type: Concept
definition: n/a
in scheme: Materials Tribology Lab at KIT
scope note: option

ai6
type: Concept
definition: n/a
in scheme: Materials Tribology Lab at KIT
scope note: option

Al2O3
type: Concept
definition: n/a
in scheme: Materials Tribology Lab at KIT
scope note: option

Polishing Steps Array
type: Concept
definition: Describes the sequential order of polishing steps.
in scheme: Materials Tribology Lab at KIT
scope note: dictionary

Specimen Cleaning Steps Array
type: Concept
definition: Class containing the ordered list of sequential steps, in terms of parameters, specific to the process.
in scheme: Materials Tribology Lab at KIT
scope note: dictionary

physicallyResultsIn
type: Concept
definition: This rekationship relates a scientific process to the objects which are physically established as its result. It can also mean it is a combination/separation of other objects, or their subparts. This property relates the process to the child object.
in scheme: Materials Tribology Lab at KIT
scope note: relationship_type
scope note: none

Storage
type: Concept
definition: Denotes the storage location of the specimen.
in scheme: Materials Tribology Lab at KIT
scope note: string

Orientation Indicating Feature Type
type: Concept
definition: The type of orientation indicating feature.
in scheme: Materials Tribology Lab at KIT
scope note: string

Position Reading Resolution
type: Concept
definition: The resolution of the position reading system.
in scheme: Materials Tribology Lab at KIT
scope note: µm
scope note: nm
scope note: mm
scope note: m
scope note: cm
scope note: float

Base Body Tilt
type: Concept
definition: n/a
in scheme: Materials Tribology Lab at KIT
scope note: option

Technical Standards
type: Concept
definition: Class containing information about the technical stadards observed by the piece of interfacial medium.
in scheme: Materials Tribology Lab at KIT
scope note: dictionary

2.4
type: Concept
definition: n/a
in scheme: Materials Tribology Lab at KIT
scope note: option

Bytes or Bits Order
type: Concept
definition: Instances of this class give the order for reading or writing bytes or bits in a file.
in scheme: Materials Tribology Lab at KIT
scope note: string

Motion Inducing Subsystem Parameters
type: Concept
definition: Class containing information about an option parameter and its setting related to a motion inducing subsystem.
in scheme: Materials Tribology Lab at KIT
scope note: dictionary

Process Summary (Heat Treatment)
type: Concept
definition: Class containing derived information about the process. All derived information stems from the information recorded in other locations of the record.
in scheme: Materials Tribology Lab at KIT
scope note: dictionary

Sequential Order Position
type: Concept
definition: The physical quantity that places an object in a specific position within a sequential order.
in scheme: Materials Tribology Lab at KIT
scope note: integer

Diamond (Fixed Installation)
type: Concept
definition: n/a
in scheme: Materials Tribology Lab at KIT
scope note: option

kB
type: Concept
definition: n/a
in scheme: Materials Tribology Lab at KIT
scope note: option

Experiment Start Time
type: Concept
definition: Subsection holds information about when the experiment was started.
in scheme: Materials Tribology Lab at KIT
scope note: date

Dry Rub
type: Concept
definition: n/a
in scheme: Materials Tribology Lab at KIT
scope note: option

Surface Image Position
type: Concept
definition: Contains information on where the surface image is taken.
in scheme: Materials Tribology Lab at KIT
scope note: string

QATM
type: Concept
definition: n/a
in scheme: Materials Tribology Lab at KIT
scope note: option

Corundum
type: Concept
definition: n/a
in scheme: Materials Tribology Lab at KIT
scope note: option

Electropolishing Voltage
type: Concept
definition: n/a
in scheme: Materials Tribology Lab at KIT
scope note: V
scope note: float

Array of Info on Connected DAQs
type: Concept
definition: Class containing information about all the installed DAQ boards relevant to the tribometer's measurement.
in scheme: Materials Tribology Lab at KIT
scope note: dictionary

Source Category
type: Concept
definition: Instances of this class give the class of source/origin of a measurement.
in scheme: Materials Tribology Lab at KIT
scope note: string

Composite
type: Concept
definition: n/a
in scheme: Materials Tribology Lab at KIT
scope note: option

Heraeus
type: Concept
definition: n/a
in scheme: Materials Tribology Lab at KIT
scope note: option

S2.05
type: Concept
definition: n/a
in scheme: Materials Tribology Lab at KIT
scope note: option

Bruker Nano Analytics
type: Concept
definition: n/a
in scheme: Materials Tribology Lab at KIT
scope note: option

Pin-on-Disc Machine
type: Concept
definition: n/a
in scheme: Materials Tribology Lab at KIT
scope note: option

Housing Method
type: Concept
definition: This objects of this class specify if the equipment is equipped with a climate box around the investigated scientific process (fixed installation — not improvised solutions). This allows users to filter for pieces of equipment that in general allow experiments in thouroughly controlled environments.
in scheme: Materials Tribology Lab at KIT
scope note: string

J967D
type: Concept
definition: n/a
in scheme: Materials Tribology Lab at KIT
scope note: option

Front
type: Concept
definition: n/a
in scheme: Materials Tribology Lab at KIT
scope note: option

Interferometry
type: Concept
definition: n/a
in scheme: Materials Tribology Lab at KIT
scope note: option

Kadi4Mat Communication Script
type: Concept
definition: n/a
in scheme: Materials Tribology Lab at KIT
scope note: option

Pneumatic Drive
type: Concept
definition: n/a
in scheme: Materials Tribology Lab at KIT
scope note: option

Sensitivity
type: Concept
definition: The sensor sensitivity.
in scheme: Materials Tribology Lab at KIT
scope note: mV*Vmm^(-1)
scope note: float

General Info (Auxiliary Medium)
type: Concept
definition: Term containing information that unequivocally identifies a piece of interfacial medium.
in scheme: Materials Tribology Lab at KIT
scope note: dictionary

R2022b
type: Concept
definition: n/a
in scheme: Materials Tribology Lab at KIT
scope note: option

Motion Parameters
type: Concept
definition: Instances of this class list information on the chosen parameters to define the relative motion during an experiment.
in scheme: Materials Tribology Lab at KIT
scope note: dictionary

Application
type: Concept
definition: Application for the cross section cutting step
in scheme: Materials Tribology Lab at KIT
scope note: string

Technical Specifications (Interfacial Lubricating Medium)
type: Concept
definition: Class containing information about the technical specifications of a piece of interfacial lubricating medium.
in scheme: Materials Tribology Lab at KIT
scope note: dictionary

Minimum Head Speed
type: Concept
definition: Minimum head speed at which the machine can operate.
in scheme: Materials Tribology Lab at KIT
scope note: min^(-1)
scope note: float

FIB
type: Concept
definition: Term containing information if FIB was used.
in scheme: Materials Tribology Lab at KIT
scope note: boolean

100Cr6 Steel
type: Concept
definition: n/a
in scheme: Materials Tribology Lab at KIT
scope note: option

Cup Grinding
type: Concept
definition: Class representing the physical process of cup grinding of a specimen with the aim of changing its surface characteristics. It ends with demounting of the sample/workpiece from the mounting table.
in scheme: Materials Tribology Lab at KIT
scope note: process
scope note: record
scope note: https://purls.helmholtz-metadaten.de/vp/kitmtxx-41732562-vp/phy_xxx_xxx-3c41e6aa10d14a51b0c7a950b897fbba-vp: https://purls.helmholtz-metadaten.de/vp/kitmtxx-41732562-vp/blo_spe_xxx-ae137cec891644ec9e9d131be42ef67c-vp
scope note: https://purls.helmholtz-metadaten.de/vp/kitmtxx-41732562-vp/emp_xxx_xxx-b0c09f9f6cd948839bac12aa4a2ad55d-vp: https://purls.helmholtz-metadaten.de/vp/kitmtxx-41732562-vp/cup_gri_mac-3136c4f5a61247ca9cf390b86f050459-vp

2.31.2.0
type: Concept
definition: n/a
in scheme: Materials Tribology Lab at KIT
scope note: option

IAM-CMS
type: Concept
definition: n/a
in scheme: Materials Tribology Lab at KIT
scope note: option

Manual Drive
type: Concept
definition: n/a
in scheme: Materials Tribology Lab at KIT
scope note: option

Beam Voltage
type: Concept
definition: The voltage of the used beam.
in scheme: Materials Tribology Lab at KIT
scope note: V
scope note: kV
scope note: float

Heat Treatment Steps Array
type: Concept
definition: Class containing the ordered list of sequential steps, in terms of parameters, specific to the process.
in scheme: Materials Tribology Lab at KIT
scope note: dictionary

Sawing Blade Type
type: Concept
definition: The type of blade used for sawing.
in scheme: Materials Tribology Lab at KIT
scope note: string

Type of Publication
type: Concept
definition: Defines the type of the publication, e.g. thesis or paper.
in scheme: Materials Tribology Lab at KIT
scope note: string

Grinding Disk
type: Concept
definition: A reusable substrate which holds abrasive medium.
in scheme: Materials Tribology Lab at KIT
scope note: option

Cryo Trap
type: Concept
definition: n/a
in scheme: Materials Tribology Lab at KIT
scope note: option

Number of Procedure Repeats
type: Concept
definition: Instances of this class represent the total number of a particular repeated action.
in scheme: Materials Tribology Lab at KIT
scope note: integer

Equipment Role
type: Concept
definition: Class containing the periphery's role/s in a tribometer.
in scheme: Materials Tribology Lab at KIT
scope note: string

Z-20
type: Concept
definition: n/a
in scheme: Materials Tribology Lab at KIT
scope note: option

Indicated Face Orientation
type: Concept
definition: Class containing information about the spatial orientation of a specific face of a block specimen.
in scheme: Materials Tribology Lab at KIT
scope note: dictionary

Track Relative Position
type: Concept
definition: n/a
in scheme: Materials Tribology Lab at KIT
scope note: µm
scope note: nm
scope note: mm
scope note: m
scope note: cm
scope note: float

Description
type: Concept
definition: The description of the variable the time series captured.
in scheme: Materials Tribology Lab at KIT
scope note: string

Minimum Voltage Setpoint
type: Concept
definition: The physical quantity that characterizes the minimum voltage at which the connection is used.
in scheme: Materials Tribology Lab at KIT
scope note: V
scope note: float

Loading Mode
type: Concept
definition: The way of loading the sample(s).
in scheme: Materials Tribology Lab at KIT
scope note: string

Illumination System
type: Concept
definition: Denotes the way of introducing light to the system.
in scheme: Materials Tribology Lab at KIT
scope note: string

A6-2
type: Concept
definition: n/a
in scheme: Materials Tribology Lab at KIT
scope note: option

Flat-on-Flat Contact
type: Concept
definition: The mating surfaces are nominally flat and even.
in scheme: Materials Tribology Lab at KIT
scope note: option

System or Setup Inputs (Light Microscopy)
type: Concept
definition: Term containing information about the parameters that are put into the involved scientific equipment to run it optimally, but are not directly part of achieving the experimental objectives.
in scheme: Materials Tribology Lab at KIT
scope note: dictionary

Stone Table
type: Concept
definition: n/a
in scheme: Materials Tribology Lab at KIT
scope note: option

Mask (Electropolishing)
type: Concept
definition: Contains information about the mask used to confine the electropolished area to the desired size. The mask contains a window with a (usually) defined area.
in scheme: Materials Tribology Lab at KIT
scope note: dictionary

g
type: Concept
definition: n/a
in scheme: Materials Tribology Lab at KIT
scope note: option

Ball-on-Flat Contact
type: Concept
definition: The contact partners are a ball and a nominally flat and even surface.
in scheme: Materials Tribology Lab at KIT
scope note: option

Z-direction Measurement Resolution
type: Concept
definition: Instances of this class represent the z-direction (vertical) resolution that the system can capture.
in scheme: Materials Tribology Lab at KIT
scope note: µm
scope note: nm
scope note: mm
scope note: m
scope note: cm
scope note: float

Maximum Specimen Height With Diamond Cup Mounted
type: Concept
definition: The maximum height a workpiece/sample is allowed to have when a (previously unused) diamond grinding cup is mounted.
in scheme: Materials Tribology Lab at KIT
scope note: µm
scope note: nm
scope note: mm
scope note: m
scope note: cm
scope note: float

Number of Files in Archive
type: Concept
definition: Number of files stored in an archive.
in scheme: Materials Tribology Lab at KIT
scope note: integer

System or Setup Inputs (Tactile Surface Profilometry)
type: Concept
definition: Class containing information about the parameters that are put into the involved scientific equipment to run it optimally.
in scheme: Materials Tribology Lab at KIT
scope note: dictionary

Fine Vertical Travel Resolution
type: Concept
definition: The resolution of the precise/fine/slow vertical drive of the machine's column (the step size of this drive).
in scheme: Materials Tribology Lab at KIT
scope note: µm
scope note: nm
scope note: mm
scope note: m
scope note: cm
scope note: float

MW 210-13-3
type: Concept
definition: n/a
in scheme: Materials Tribology Lab at KIT
scope note: option

Array Produced File Metadata
type: Concept
definition: Instances of this class contain a collection of metadata records each associated with a file or a series of files sharing the same metadata.
in scheme: Materials Tribology Lab at KIT
scope note: dictionary

Number of Files
type: Concept
definition: Number of files used or generated by a process.
in scheme: Materials Tribology Lab at KIT
scope note: integer

Saphir 320
type: Concept
definition: n/a
in scheme: Materials Tribology Lab at KIT
scope note: option

First Name
type: Concept
definition: Operator's first name/s (= given name/s).
in scheme: Materials Tribology Lab at KIT
scope note: string

Chromatic Aberration
type: Concept
definition: n/a
in scheme: Materials Tribology Lab at KIT
scope note: option

Minimum Travel Speed
type: Concept
definition: Instances of this class represent the minimum permissable travel speed, while no measurement is taken.
in scheme: Materials Tribology Lab at KIT
scope note: µms^(-1)
scope note: mms^(-1)
scope note: ms^(-1)
scope note: kmh^(-1)
scope note: float

l
type: Concept
definition: n/a
in scheme: Materials Tribology Lab at KIT
scope note: option

Vacuum Pump
type: Concept
definition: Term containing information about the vacuum pump connected to a furnace.
in scheme: Materials Tribology Lab at KIT
scope note: dictionary

*.tif File Technical Specifications
type: Concept
definition: Term containing the information to open/access/read and interprete a *.tif file's contents adequately.
in scheme: Materials Tribology Lab at KIT
scope note: dictionary

Row/Column Number
type: Concept
definition: Denotes the sequential number of the respective row or column described by 'Tabular Data Contents Specifications'.
in scheme: Materials Tribology Lab at KIT
scope note: integer

°C
type: Concept
definition: n/a
in scheme: Materials Tribology Lab at KIT
scope note: option

Maximum Electropolishing Area
type: Concept
definition: The maximum possible size of the electropolished area, as defined by the window within the electropolishing mask.
in scheme: Materials Tribology Lab at KIT
scope note: mm^2
scope note: cm^2
scope note: float

3.10
type: Concept
definition: n/a
in scheme: Materials Tribology Lab at KIT
scope note: option

Discontinuous (Irregular Time Interval)
type: Concept
definition: n/a
in scheme: Materials Tribology Lab at KIT
scope note: option

Wagner Magnete
type: Concept
definition: n/a
in scheme: Materials Tribology Lab at KIT
scope note: option

Derived
type: Concept
definition: The values in the time series are dervied from another time series — typical example is the coefficient of friction.
in scheme: Materials Tribology Lab at KIT
scope note: option

Electrolyte Flow Rate
type: Concept
definition: The term denotes the flow rate of the electrolyte as specified by the vendor.
in scheme: Materials Tribology Lab at KIT
scope note: float

X-Max
type: Concept
definition: n/a
in scheme: Materials Tribology Lab at KIT
scope note: option

9.7
type: Concept
definition: n/a
in scheme: Materials Tribology Lab at KIT
scope note: option

Programming Language
type: Concept
definition: Language in which the program is written, e.g. MATLAB, Python.
in scheme: Materials Tribology Lab at KIT
scope note: string

Karlsruhe Institute of Technology (KIT)
type: Concept
definition: n/a
in scheme: Materials Tribology Lab at KIT
scope note: option

Working Area Height
type: Concept
definition: Instances of this class specify the available height of the volume for manipulation within a machine.
in scheme: Materials Tribology Lab at KIT
scope note: µm
scope note: nm
scope note: mm
scope note: m
scope note: cm
scope note: float

Warm Air Jet
type: Concept
definition: n/a
in scheme: Materials Tribology Lab at KIT
scope note: option

Measurement Principle
type: Concept
definition: The principle by which a sensor operates.
in scheme: Materials Tribology Lab at KIT
scope note: string

Final Roughness Adjustment - Finish
type: Concept
definition: The surface finish — minimal removal of waviness and generation of desired level of roughness.
in scheme: Materials Tribology Lab at KIT
scope note: option

Technical Specifications (Cup Grinding Machine)
type: Concept
definition: Class containing information about the technical specifications of a cup grinding machine.
in scheme: Materials Tribology Lab at KIT
scope note: dictionary

File Type
type: Concept
definition: Instances of this class give first information about file format/structure.
in scheme: Materials Tribology Lab at KIT
scope note: string

System or Setup Inputs (Hardness Measurement)
type: Concept
definition: Class containing information about the parameters that are put into the involved scientific equipment to run it optimally.
in scheme: Materials Tribology Lab at KIT
scope note: dictionary

Position on Source Specimen
type: Concept
definition: Position on Source Specimen. Position is measured w.r.t. the two origins as defined by "Spatial Information".
in scheme: Materials Tribology Lab at KIT
scope note: dictionary

Process Summary (Cup Grinding)
type: Concept
definition: Class containing derived information about the process. All derived information stems from the information recorded in other locations of the record.
in scheme: Materials Tribology Lab at KIT
scope note: dictionary

stressesAsBaseBody
type: Concept
definition: Denotes that a given process stresses a given block specimen as a base body in the relevant process. A clear definition of what is to be called ""base body"" and what ""counter body"" in a tribologcial system does not exist. We therefore will use the following set of definitions — whereby always the first applicable definition should be used in a given case (going through the list from top to bottom): The Base body in a model experiment is the sample or body... ...whose nominal contact area is not permanently tribologically stressed during the experiment. ...that is larger. ...expected to show less wear at the end of the experiment. ...that is static during the experiment.
in scheme: Materials Tribology Lab at KIT
scope note: relationship_type
scope note: none

Box Type
type: Concept
definition: The type of the box. E.g., Cleaning Cross Section, Regular Cross Section, Rectangle.
in scheme: Materials Tribology Lab at KIT
scope note: string

Cup Grinding Tool Type
type: Concept
definition: Instances of this class specify the classification type of cup grinding tool.
in scheme: Materials Tribology Lab at KIT
scope note: string

Kinematic Mount and Vise
type: Concept
definition: A vise compressing the specimen directly to a kinematic mount, which in turn is attached to the equipment's structure.
in scheme: Materials Tribology Lab at KIT
scope note: option

GOHT-65A50BMS-M6
type: Concept
definition: n/a
in scheme: Materials Tribology Lab at KIT
scope note: option

providesAdditionalInformationAbout
type: Concept
definition: This relationship characterizes a chain of related processes, unified by the use of the same specimen.
in scheme: Materials Tribology Lab at KIT
scope note: relationship_type
scope note: none

Keyence Deutschland GmbH
type: Concept
definition: Neu-Isenburg, Germany
in scheme: Materials Tribology Lab at KIT
scope note: option

Imaging Mode
type: Concept
definition: The mode in which the images are taken.
in scheme: Materials Tribology Lab at KIT
scope note: string

Minimum Intensity Threshold
type: Concept
definition: Instances of this class determine whether a recorded signal value is considered valid or not.
in scheme: Materials Tribology Lab at KIT
scope note: float

Turning Direction
type: Concept
definition: The direction of motion when the relative (with respect to the machine) motion sets in.
in scheme: Materials Tribology Lab at KIT
scope note: string

Coarse Roughness Adjustment
type: Concept
definition: Reduce sample roughness — which resulted e.g. from previous grinding steps — to get closer to the targeted final roughness.
in scheme: Materials Tribology Lab at KIT
scope note: option

Backlash
type: Concept
definition: n/A
in scheme: Materials Tribology Lab at KIT
scope note: µm
scope note: nm
scope note: mm
scope note: m
scope note: cm
scope note: float

Hexagonal Close Packed Crystal Basal Plane
type: Concept
definition: n/a
in scheme: Materials Tribology Lab at KIT
scope note: option

Temperature Control Method
type: Concept
definition: The objects of this class specify the type of equipment installed in a device for cooling/heating a sample directly.
in scheme: Materials Tribology Lab at KIT
scope note: string

bit
type: Concept
definition: n/a
in scheme: Materials Tribology Lab at KIT
scope note: option

Tempering
type: Concept
definition: Tempering is a process of heat treating, which is used to increase the toughness of iron-based alloys. It is usually performed after hardening, to reduce some of the excess hardness, and is done by heating the metal to some temperature below the critical point for a certain period of time, then allowing it to cool in still air.
in scheme: Materials Tribology Lab at KIT
scope note: option

Coolant Supply Method
type: Concept
definition: Method to supply the coolant.
in scheme: Materials Tribology Lab at KIT
scope note: string

Target Unit of Conversion
type: Concept
definition: Instances of this class lock the meaning of a magnitude. Their purpose is to indicate the conversion target.
in scheme: Materials Tribology Lab at KIT
scope note: string

Electropolishing Equipment
type: Concept
definition: Term containing information about the equipment used during the electropolishing process.
in scheme: Materials Tribology Lab at KIT
scope note: dictionary

Gluing
type: Concept
definition: Glue secures a specimen's surface to the equipment's structure.
in scheme: Materials Tribology Lab at KIT
scope note: option

min
type: Concept
definition: n/a
in scheme: Materials Tribology Lab at KIT
scope note: option

Specimen Container
type: Concept
definition: n/a
in scheme: Materials Tribology Lab at KIT
scope note: option

Elmag
type: Concept
definition: n/a
in scheme: Materials Tribology Lab at KIT
scope note: option

Maximum Specimen Dimensions
type: Concept
definition: Describes the maximum permissible dimensions of the specimen in the machine.
in scheme: Materials Tribology Lab at KIT
scope note: dictionary

*.xls File Technical Specifications
type: Concept
definition: Term containing the information to open/access/read and interpret a *.xls file's contents adequately.
in scheme: Materials Tribology Lab at KIT
scope note: dictionary

File (Surface Profilometry)
type: Concept
definition: Term containing a collection of metadata, each associated with a file or a series of files, generated as the output of a surface profilometry process and sharing the same metadata.
in scheme: Materials Tribology Lab at KIT
scope note: data
scope note: record

Fine Vertical Travel Range
type: Concept
definition: The travel range of the precise/fine/slow vertical drive of the machine's column (the distance in between lower limit and upper limit of the z-axis/vertical axis).
in scheme: Materials Tribology Lab at KIT
scope note: µm
scope note: nm
scope note: mm
scope note: m
scope note: cm
scope note: float

S3.05
type: Concept
definition: n/a
in scheme: Materials Tribology Lab at KIT
scope note: option

List of Available Cutting Speed Setpoints
type: Concept
definition: Class containing information about the available cutting speed setpoints of a band saw object.
in scheme: Materials Tribology Lab at KIT
scope note: dictionary

Time Series Data
type: Concept
definition: A multi-dimensional tabular data type with named columns and sequential row data values.
in scheme: Materials Tribology Lab at KIT
scope note: option

Motion Start Distance in Front of Demagnetizing Plate
type: Concept
definition: Instances of this class give information about the distance between sample and the leading edge of the demagnetizing plate at the start of the respective demagnetizing motion.
in scheme: Materials Tribology Lab at KIT
scope note: µm
scope note: nm
scope note: mm
scope note: m
scope note: cm
scope note: float

Coarse Vertical Travel Range
type: Concept
definition: The travel range of the coarse/fast vertical drive of the machine's column (the distance inbetween lower limit and upper limit of the z-axis/vertical axis).
in scheme: Materials Tribology Lab at KIT
scope note: µm
scope note: nm
scope note: mm
scope note: m
scope note: cm
scope note: float

Cross Section Summary
type: Concept
definition: Contains multiple types of information related to the cross section.
in scheme: Materials Tribology Lab at KIT
scope note: dictionary

System or Setup Inputs (Optical Surface Profilometry)
type: Concept
definition: Class containing information about the parameters that are put into the involved scientific equipment to run it optimally.
in scheme: Materials Tribology Lab at KIT
scope note: dictionary

DAQ Related Inputs
type: Concept
definition: Class containing information about the parameters that are put into the involved DAQ equipment, to run it optimally, but are not directly part of achieving the experimental objectives.
in scheme: Materials Tribology Lab at KIT
scope note: dictionary

Periphery Info
type: Concept
definition: Term containing information about the periphery components connected to a piece of equipment.
in scheme: Materials Tribology Lab at KIT
scope note: dictionary

Light Microscopy
type: Concept
definition: Term representing the process of using a light microscope.
in scheme: Materials Tribology Lab at KIT
scope note: process
scope note: record
scope note: https://purls.helmholtz-metadaten.de/vp/kitmtxx-41732562-vp/que_xxx_xxx-1b4f515c8fc54791b8f6269ca30a4d6a-vp: https://purls.helmholtz-metadaten.de/vp/kitmtxx-41732562-vp/tri_exp_xxx-9b84c31083254e40a6eb78601271d381-vp
scope note: https://purls.helmholtz-metadaten.de/vp/kitmtxx-41732562-vp/emp_xxx_xxx-b0c09f9f6cd948839bac12aa4a2ad55d-vp: https://purls.helmholtz-metadaten.de/vp/kitmtxx-41732562-vp/lig_mic_xxx-de64ef91f8544beda63bbf43c6ffdce1-vp
scope note: https://purls.helmholtz-metadaten.de/vp/kitmtxx-41732562-vp/cha_xxx_xxx-5b70f2376c68474381ef5cc428fe240b-vp: https://purls.helmholtz-metadaten.de/vp/kitmtxx-41732562-vp/blo_spe_xxx-ae137cec891644ec9e9d131be42ef67c-vp
scope note: https://purls.helmholtz-metadaten.de/vp/kitmtxx-41732562-vp/pro_xxx_xxx-0a80036373ea40d1ac7401d423b284a0-vp: https://purls.helmholtz-metadaten.de/vp/kitmtxx-41732562-vp/tri_exp_xxx-9b84c31083254e40a6eb78601271d381-vp

Y Offset
type: Concept
definition: Instances of this class characterize the measurement offset in y-direction as defined by the equipment.
in scheme: Materials Tribology Lab at KIT
scope note: µm
scope note: nm
scope note: mm
scope note: m
scope note: cm
scope note: float

Struers GmbH
type: Concept
definition: Willich, Germany
in scheme: Materials Tribology Lab at KIT
scope note: option

Flash Point Acquisition Method
type: Concept
definition: Class containing information about the flashpoint acquisition of the interfacial medium.
in scheme: Materials Tribology Lab at KIT
scope note: string

h
type: Concept
definition: n/a
in scheme: Materials Tribology Lab at KIT
scope note: option

Axis Rotation Angle Range
type: Concept
definition: Describes the range of rotation of the given axis.
in scheme: Materials Tribology Lab at KIT
scope note: °
scope note: float

Preparation Procedure
type: Concept
definition: Procedure conducted in sample preparation for electron microscopy.
in scheme: Materials Tribology Lab at KIT
scope note: string

Institution (Location)
type: Concept
definition: The premises on which an object exists or a process happens. *Not to be confused with an institution as an organization, or as an employer.
in scheme: Materials Tribology Lab at KIT
scope note: string

Variable Experimental Steps Array
type: Concept
definition: Class containing the ordered list of sequential steps, in terms of parameters, specific to the process.
in scheme: Materials Tribology Lab at KIT
scope note: dictionary

OFE Copper
type: Concept
definition: n/a
in scheme: Materials Tribology Lab at KIT
scope note: option

Left
type: Concept
definition: n/a
in scheme: Materials Tribology Lab at KIT
scope note: option

VHX-600
type: Concept
definition: n/a
in scheme: Materials Tribology Lab at KIT
scope note: option

Motion Type
type: Concept
definition: Instances of this class give the type of relative motion between base body and counter body.
in scheme: Materials Tribology Lab at KIT
scope note: string

C-891.130300
type: Concept
definition: n/a
in scheme: Materials Tribology Lab at KIT
scope note: option

Vise
type: Concept
definition: A vise mechanism compressing the base body's side surfaces to secure them to the machinery's construction.
in scheme: Materials Tribology Lab at KIT
scope note: option

Dissertation
type: Concept
definition: n/a
in scheme: Materials Tribology Lab at KIT
scope note: option

Pt e-dep surface
type: Concept
definition: n/a
in scheme: Materials Tribology Lab at KIT
scope note: option

Stone Table with Passive Pneumatic Dampers
type: Concept
definition: n/a
in scheme: Materials Tribology Lab at KIT
scope note: option

Piezo Electric
type: Concept
definition: n/a
in scheme: Materials Tribology Lab at KIT
scope note: option

Polishing Medium Grain Size
type: Concept
definition: Average grain size of polishing medium.
in scheme: Materials Tribology Lab at KIT
scope note: µm
scope note: nm
scope note: mm
scope note: m
scope note: cm
scope note: float

Array of Software Used
type: Concept
definition: Class containing information about the software used to process the data after its initial collection and recording.
in scheme: Materials Tribology Lab at KIT
scope note: dictionary

Positive
type: Concept
definition: n/a
in scheme: Materials Tribology Lab at KIT
scope note: option

Strain Gauge
type: Concept
definition: n/a
in scheme: Materials Tribology Lab at KIT
scope note: option

Sensor Calibration Values
type: Concept
definition: n/a
in scheme: Materials Tribology Lab at KIT
scope note: option

Minimum Turning Speed
type: Concept
definition: The minimum permissable turning speed.
in scheme: Materials Tribology Lab at KIT
scope note: min^(-1)
scope note: float

Kinematic Viscosity
type: Concept
definition: The specification of an object defining its kinematic viscosity.
in scheme: Materials Tribology Lab at KIT
scope note: mm^2*s^(-1)
scope note: float

A3-2
type: Concept
definition: n/a
in scheme: Materials Tribology Lab at KIT
scope note: option

R1000
type: Concept
definition: n/a
in scheme: Materials Tribology Lab at KIT
scope note: option

Isopropyl Alcohol
type: Concept
definition: n/a
in scheme: Materials Tribology Lab at KIT
scope note: option

Stepper and Lead Screw
type: Concept
definition: n/a
in scheme: Materials Tribology Lab at KIT
scope note: option

isModifiedVersionOf
type: Concept
definition: When an object preserves its original main function/characteristics, but has parts modified, then it is a new version of itself.
in scheme: Materials Tribology Lab at KIT
scope note: relationship_type
scope note: none

nm
type: Concept
definition: n/a
in scheme: Materials Tribology Lab at KIT
scope note: option

Heat Treatment
type: Concept
definition: Class representing the physical process of thermal treatment of a specimen with the aim of changing its selfcontained physical characteristcs.
in scheme: Materials Tribology Lab at KIT
scope note: process
scope note: record
scope note: https://purls.helmholtz-metadaten.de/vp/kitmtxx-41732562-vp/phy_xxx_xxx-3c41e6aa10d14a51b0c7a950b897fbba-vp: https://purls.helmholtz-metadaten.de/vp/kitmtxx-41732562-vp/blo_spe_xxx-ae137cec891644ec9e9d131be42ef67c-vp
scope note: https://purls.helmholtz-metadaten.de/vp/kitmtxx-41732562-vp/emp_xxx_xxx-b0c09f9f6cd948839bac12aa4a2ad55d-vp: https://purls.helmholtz-metadaten.de/vp/kitmtxx-41732562-vp/fur_xxx_xxx-c04aefd269c64c6fa2773c318193f2d6-vp

Strapping Specimen with Copper Tape
type: Concept
definition: n/a
in scheme: Materials Tribology Lab at KIT
scope note: option

Polishing Medium
type: Concept
definition: Contains information describing a polishing medium.
in scheme: Materials Tribology Lab at KIT
scope note: object
scope note: record

Thermo Fisher Scientific
type: Concept
definition: Waltham, Massachusetts, USA
in scheme: Materials Tribology Lab at KIT
scope note: option

Base Body Clamping Method
type: Concept
definition: Way of clamping of a physical object with the role of being a base body (specimen) in a tribometer.
in scheme: Materials Tribology Lab at KIT
scope note: string

Loading
type: Concept
definition: n/a
in scheme: Materials Tribology Lab at KIT
scope note: option