PTCI
type: ConceptConcept
type: Concept
equivalent EN: TTIP (en)
forme developpee: Partenariat transatlantique de commerce et d'investissement
forme developpee: Transatlantic Trade and Investment Partnership @en
lien: https://en.wikipedia.org/wiki/Transatlantic_Free_Trade_Area
lien: https://en.wikipedia.org/wiki/Transatlantic_Trade_and_Investment_Partnership
lien: https://fr.wikipedia.org/wiki/Partenariat_transatlantique_de_commerce_et_d%27investissement
alternative label: TAFTA - Trans-Atlantic Free Trade Agreement (en)
definition: Free trade area project which began in early 2013 whose goal is maximum trade liberalization between the United States and European Union by lowering duties and harmonizing laws, allowing for the United States and European Union to trade any good or service. @en
definition: Projet de zone de libre-échange initié au début de l'année 2013 ayant pour objectif une libéralisation maximale du commerce entre les États-Unis et l'Union européenne en réduisant les droits de douane et en harmonisant les réglementations afin de permettre aux États-Unis et à l'Union européenne de s'échanger l'ensemble de leurs produits et services.
in scheme: Économie générale
in scheme: concepts
preferred label: TTIP @en
related: concept-commerce-international
related: concept-libre-echange

AECG
type: ConceptConcept
type: Concept
equivalent EN: CETA (en)
forme developpee: Accord économique et commercial global
forme developpee: Comprehensive Economic and Trade Agreement @en
graphique: http://trade.ec.europa.eu/doclib/docs/2014/september/tradoc_152806.pdf
lien: https://en.wikipedia.org/wiki/Comprehensive_Economic_and_Trade_Agreement
lien: https://fr.wikipedia.org/wiki/Accord_%C3%A9conomique_et_commercial_global
url source: http://www.international.gc.ca/gac-amc/campaign-campagne/ceta-aecg/index.aspx
definition: Accord commercial de libre-échange bilatéral entre le Canada et l'Union européenne qui vise à supprimer à terme les droits de douane sur 99% des lignes tarifaires pour les échanges entre les parties prenantes.
definition: Free trade agreement between Canada and European Union whose goal is to remove duties on 99% of the tariff lines for commercial trade between the parties. @en
in scheme: Économie générale
in scheme: concepts
preferred label: CETA @en
related: concept-commerce-international
related: concept-libre-echange

pouvoir de convaincre
type: ConceptConcept
type: Concept
creator: Commission d'enrichissement de la langue française, FranceTerme
date parution JO: 2006-09-16
equivalent EN: soft power @en
equivalent EN: soft power (en)
definition: Capacité d'un État ou d'un groupe d'États à rallier à ses vues un ou plusieurs autres États, grâce à l'influence prépondérante qu'il exerce dans divers domaines, à son rayonnement ou au prestige qui lui est reconnu.
in scheme: Relations internationales
in scheme: concepts
notation: AFET10
related: pouvoir intelligent
related: diplomatie d'influence
related: pouvoir de contraindre

fauteur de guerre
type: ConceptConcept
type: Concept
creator: Commission d'enrichissement de la langue française, FranceTerme
date parution JO: 2013-09-15
deconseille ou frequent: war monger
equivalent EN: warmonger @en
equivalent EN: warmonger (en)
alternative label: belliciste
definition: Personne ou groupe qui favorise ou provoque le recours à la guerre.
in scheme: Défense
in scheme: Relations internationales
in scheme: concepts
notation: AFET101
related: fauteur de troubles

fauteur de troubles
type: ConceptConcept
type: Concept
creator: Commission d'enrichissement de la langue française, FranceTerme
date parution JO: 2013-09-15
deconseille ou frequent: trouble maker
equivalent EN: spoiler @en
equivalent EN: spoiler (en)
equivalent EN: troublemaker @en
equivalent EN: troublemaker (en)
definition: Personne ou groupe qui favorise les tensions internationales et cherche à en profiter.
in scheme: Relations internationales
in scheme: concepts
notation: AFET102
related: fauteur de guerre

manifestation parallèle
type: ConceptConcept
type: Concept
creator: Commission d'enrichissement de la langue française, FranceTerme
date parution JO: 2013-09-15
equivalent EN: side event @en
equivalent EN: side event (en)
definition: Manifestation qui se déroule en marge d'une autre.
in scheme: Tous domaines
in scheme: concepts
notation: AFET107

renforcement des capacités
type: ConceptConcept
type: Concept
creator: Commission d'enrichissement de la langue française, FranceTerme
date parution JO: 2006-09-16
equivalent EN: capacity-building @en
equivalent EN: capacity-building (en)
definition: Effort consenti par un pays ou un organisme en vue de renforcer les moyens matériels et humains nécessaires à un programme de développement.
in scheme: Relations internationales
in scheme: concept-SD-relations-internationales-cooperation-et-developpement
in scheme: concepts
notation: AFET11

partenaire principal
type: ConceptConcept
type: Concept
creator: Commission d'enrichissement de la langue française, FranceTerme
date parution JO: 2013-09-15
equivalent EN: senior partner @en
equivalent EN: senior partner (en)
definition: Partenaire qui joue un rôle de premier plan dans une alliance ou une association entre États ou institutions.
in scheme: Relations internationales
in scheme: concepts
notation: AFET110
related: partenaire en second

partenaire en second
type: ConceptConcept
type: Concept
creator: Commission d'enrichissement de la langue française, FranceTerme
date parution JO: 2013-09-15
equivalent EN: junior partner @en
equivalent EN: junior partner (en)
definition: Partenaire qui joue un rôle secondaire dans une alliance ou une association entre États ou institutions.
in scheme: Relations internationales
in scheme: concepts
notation: AFET111
related: partenaire principal

point de contrôle
type: ConceptConcept
type: Concept
creator: Commission d'enrichissement de la langue française, FranceTerme
date parution JO: 2006-09-16
equivalent EN: check point @en
equivalent EN: check point (en)
in scheme: Tous domaines
in scheme: concepts
notation: AFET12

scénario tendanciel
type: ConceptConcept
type: Concept
creator: Commission d'enrichissement de la langue française, FranceTerme
date parution JO: 2013-09-15
equivalent EN: business-as-usual scenario @en
equivalent EN: business-as-usual scenario (en)
definition: Scénario présentant l'évolution prévisible d'une situation en l'absence de toute nouvelle action volontaire.
in scheme: Tous domaines
in scheme: concepts
notation: AFET120
related: politique de l'inaction

transfert illégal
type: ConceptConcept
type: Concept
creator: Commission d'enrichissement de la langue française, FranceTerme
date parution JO: 2013-09-15
equivalent EN: extraordinary rendition @en
equivalent EN: extraordinary rendition (en)
definition: Pratique qui consiste, hors de tout cadre légal, à déplacer une personne le plus souvent dans un pays tiers, afin de la soumettre à une détention ou à des interrogatoires secrets.
in scheme: Droit
in scheme: Relations internationales
in scheme: concept-SD-droit-droit-international
in scheme: concept-SD-relations-internationales-droit-international
in scheme: concepts
notation: AFET122

transfert de politiques publiques
type: ConceptConcept
type: Concept
creator: Commission d'enrichissement de la langue française, FranceTerme
date parution JO: 2013-09-15
equivalent EN: policy transfer @en
equivalent EN: policy transfer (en)
definition: Mise en œuvre, par un État, de politiques et de programmes d'action transposés de ceux d'un ou de plusieurs autres États.
in scheme: Politique
in scheme: Relations internationales
in scheme: concepts
notation: AFET123
note: L'européanisation des politiques des nouveaux membres de l'Union européenne est un exemple de ce transfert.

éreintage
type: ConceptConcept
type: Concept
creator: Commission d'enrichissement de la langue française, FranceTerme
date parution JO: 2013-09-15
deconseille ou frequent: french bashing
equivalent EN: bashing @en
equivalent EN: bashing (en)
part of speech: nom masculin
alternative label: acharnement
definition: Dénigrement systématique d'une personne ou d'une catégorie de personnes, d'une organisation, d'un pays.
in scheme: Communication
in scheme: Relations internationales
in scheme: concepts
notation: AFET124

passe-partout
type: ConceptConcept
type: Concept
creator: Commission d'enrichissement de la langue française, FranceTerme
date parution JO: 2013-09-15
deconseille ou frequent: allpurpose
equivalent EN: all-purpose @en
equivalent EN: all-purpose (en)
equivalent EN: one-size-fits-all @en
equivalent EN: one-size-fits-all (en)
part of speech: adjectif invariable
alternative label: omnivalent
definition: Qui peut s'appliquer à tous les interlocuteurs ou à tous les contextes.
in scheme: Tous domaines
in scheme: concepts
notation: AFET128

mettre sur liste noire
type: ConceptConcept
type: Concept
creator: Commission d'enrichissement de la langue française, FranceTerme
date parution JO: 2013-09-15
deconseille ou frequent: blacklister
deconseille ou frequent: to blacklist
equivalent EN: blacklist @en
equivalent EN: blacklist (en)
definition: Mettre à l'écart, voire exclure, une personne, une organisation ou un pays.
in scheme: Tous domaines
in scheme: concepts
notation: AFET129
note: L'emploi du verbe blacklister, emprunté de l'anglais, est à proscrire.

poste de contrôle
type: ConceptConcept
type: Concept
creator: Commission d'enrichissement de la langue française, FranceTerme
date parution JO: 2006-09-16
equivalent EN: check point @en
equivalent EN: check point (en)
in scheme: Tous domaines
in scheme: concepts
notation: AFET13

diplomatie en ligne
type: ConceptConcept
type: Concept
creator: Commission d'enrichissement de la langue française, FranceTerme
abbreviation: cyberdiplomacy @en
date parution JO: 2015-01-16
equivalent EN: cyber-diplomacy @en
equivalent EN: cyber-diplomacy (en)
equivalent EN: cyberdiplomacy @en
equivalent EN: cyberdiplomacy (en)
equivalent EN: digital diplomacy @en
equivalent EN: digital diplomacy (en)
equivalent EN: e-diplomacy @en
equivalent EN: e-diplomacy (en)
alternative label: cyberdiplomatie
definition: Diplomatie qui s’appuie sur les moyens électroniques de communication plutôt que sur l’action des représentations diplomatiques à l’étranger ou les déplacements de diplomates.
in scheme: Relations internationales
in scheme: concepts
notation: AFET131

contre-rapporteur
type: ConceptConcept
type: Concept
creator: Commission d'enrichissement de la langue française, FranceTerme
date parution JO: 2015-01-16
equivalent EN: shadow rapporteur @en
equivalent EN: shadow rapporteur (en)
part of speech: nom masculin
definition: Personne désignée par un groupe ou un organisme pour suivre un dossier et présenter ses propres conclusions après avoir pris connaissance du rapport officiel.
in scheme: Politique
in scheme: Relations internationales
in scheme: concepts
notation: AFET134
related: contre-rapport

stratégie post-conflit
type: ConceptConcept
type: Concept
creator: Commission d'enrichissement de la langue française, FranceTerme
date parution JO: 2015-01-16
equivalent EN: post-conflict strategy @en
equivalent EN: post-conflict strategy (en)
definition: Ensemble de mesures politiques, diplomatiques ou militaires planifiées pour être mises en œuvre à l'issue d'un conflit.
in scheme: Défense
in scheme: Relations internationales
in scheme: concepts
notation: AFET136
related: stratégie de retrait

personne exposée à la corruption
type: ConceptConcept
type: Concept
creator: Commission d'enrichissement de la langue française, FranceTerme
abbreviation: PEC
abbreviation: PEP @en
date parution JO: 2015-01-16
deconseille ou frequent: personnalité politiquement exposée
deconseille ou frequent: personne politiquement exposée
equivalent EN: PEP @en
equivalent EN: PEP (en)
equivalent EN: politically exposed person @en
equivalent EN: politically exposed person (en)
definition: Personne qui, en raison du pouvoir qu’elle détient ou des fonctions qu’elle exerce, peut faire l’objet de tentatives de corruption.
in scheme: Politique
in scheme: Relations internationales
in scheme: concepts
notation: AFET142
related: enquête d'irréprochabilité

minerai de conflit
type: ConceptConcept
type: Concept
creator: Commission d'enrichissement de la langue française, FranceTerme
date parution JO: 2015-01-16
equivalent EN: conflict mineral @en
equivalent EN: conflict mineral (en)
definition: Minerai stratégique dont la possession et l’exploitation deviennent l’objet de conflits armés.
in scheme: Économie générale
in scheme: Relations internationales
in scheme: concepts
notation: AFET143
related: minerai stratégique

couperet budgétaire
type: ConceptConcept
type: Concept
creator: Commission d'enrichissement de la langue française, FranceTerme
date parution JO: 2015-01-16
equivalent EN: fiscal cliff @en
equivalent EN: fiscal cliff (en)
definition: Arrivée à échéance de dispositifs fiscaux ou budgétaires qui entraîne l'application automatique de mesures de restriction.
in scheme: Économie générale
in scheme: Relations internationales
in scheme: concepts
notation: AFET144
note: Le couperet budgétaire est une procédure qui existe aux États-Unis.
related: suspension des services publics

dissident, -e en ligne
type: ConceptConcept
type: Concept
creator: Commission d'enrichissement de la langue française, FranceTerme
date parution JO: 2015-01-16
equivalent EN: cyberdissident @en
equivalent EN: cyberdissident (en)
alternative label: cyberdissident, -e
definition: Dissident politique qui utilise les moyens de communication électroniques, notamment les réseaux sociaux, pour faire connaître ses opinions ou diffuser des informations.
in scheme: Politique
in scheme: concepts
notation: AFET146
related: cybermilitant, -e

déclinisme
type: ConceptConcept
type: Concept
creator: Commission d'enrichissement de la langue française, FranceTerme
date parution JO: 2015-01-16
equivalent EN: declinism @en
equivalent EN: declinism (en)
part of speech: nom masculin
definition: Courant d'idées selon lequel un pays, un groupe de pays ou une société est en déclin.
in scheme: Politique
in scheme: concepts
notation: AFET147

bien public mondial
type: ConceptConcept
type: Concept
creator: Commission d'enrichissement de la langue française, FranceTerme
abbreviation: BPM
abbreviation: GPG @en
date parution JO: 2008-10-19
equivalent EN: GPG @en
equivalent EN: GPG (en)
equivalent EN: global public good @en
equivalent EN: global public good (en)
definition: Ressource, bien ou service bénéficiant à tous, dont l'exploitation ou la préservation peuvent justifier une action collective internationale.
in scheme: Tous domaines
in scheme: concepts
notation: AFET15
note: Un bien public mondial peut être matériel comme le milieu marin, l'air ou l'eau, ou immatériel comme la connaissance scientifique, la justice, la santé ou les droits de l'homme.
related: diplomatie environnementale
related: espace public mondial

note par points
type: ConceptConcept
type: Concept
creator: Commission d'enrichissement de la langue française, FranceTerme
date parution JO: 2015-01-16
equivalent EN: bullet-point paper @en
equivalent EN: bullet-point paper (en)
definition: Note constituée d’un ensemble de brefs alinéas introduits par un même signe typographique.
in scheme: Communication
in scheme: concepts
notation: AFET150

minerai stratégique
type: ConceptConcept
type: Concept
creator: Commission d'enrichissement de la langue française, FranceTerme
date parution JO: 2015-01-16
equivalent EN: strategic mineral @en
equivalent EN: strategic mineral (en)
definition: Minerai dont la possession et l'exploitation constituent un enjeu économique et politique majeur.
in scheme: Économie générale
in scheme: Relations internationales
in scheme: concepts
notation: AFET155
related: minerai de conflit

regroupement d'enjeux
type: ConceptConcept
type: Concept
creator: Commission d'enrichissement de la langue française, FranceTerme
date parution JO: 2015-01-16
equivalent EN: issue linkage @en
equivalent EN: issue linkage (en)
definition: Procédé consistant, au cours d’une négociation, à traiter ensemble différentes questions en vue de parvenir à un accord global.
in scheme: Relations internationales
in scheme: concepts
notation: AFET156
related: accord global

course au droit d'asile
type: ConceptConcept
type: Concept
creator: Commission d'enrichissement de la langue française, FranceTerme
date parution JO: 2015-01-16
deconseille ou frequent: shopping de l'asile
equivalent EN: asylum shopping @en
equivalent EN: asylum shopping (en)
definition: Pratique de certains ressortissants étrangers consistant à déposer parallèlement des demandes d'asile auprès de plusieurs pays ou à comparer les conditions d’accueil offertes par différents pays avant de déposer une demande.
in scheme: Droit
in scheme: Relations internationales
in scheme: concepts
notation: AFET157
related: course au visa

suspension des services publics
type: ConceptConcept
type: Concept
creator: Commission d'enrichissement de la langue française, FranceTerme
date parution JO: 2015-01-16
deconseille ou frequent: government shut-down
equivalent EN: government shutdown @en
equivalent EN: government shutdown (en)
definition: Fermeture provisoire de certains services publics, qui est décidée par les pouvoirs publics lorsque les moyens financiers nécessaires à leur fonctionnement s’avèrent insuffisants.
in scheme: Politique
in scheme: concepts
notation: AFET158
related: couperet budgétaire

contre-rapport
type: ConceptConcept
type: Concept
creator: Commission d'enrichissement de la langue française, FranceTerme
date parution JO: 2015-01-16
equivalent EN: shadow report @en
equivalent EN: shadow report (en)
part of speech: nom masculin
in scheme: Politique
in scheme: Relations internationales
in scheme: concepts
notation: AFET159
related: contre-rapporteur

droit souple
type: ConceptConcept
type: Concept
creator: Commission d'enrichissement de la langue française, FranceTerme
date parution JO: 2008-10-19
deconseille ou frequent: droit mou
equivalent EN: soft law @en
equivalent EN: soft law (en)
definition: Notion doctrinale relative à des textes ou à des dispositions juridiques n'ayant pas par eux-mêmes d'effets contraignants mais susceptibles de contribuer, dans certaines conditions, à la formation de nouvelles règles juridiquement contraignantes.
in scheme: Droit
in scheme: Relations internationales
in scheme: concept-SD-droit-droit-international
in scheme: concept-SD-relations-internationales-droit-international
in scheme: concepts
notation: AFET16

revenant, -e
type: ConceptConcept
type: Concept
creator: Commission d'enrichissement de la langue française, FranceTerme
date parution JO: 2017-12-13
deconseille ou frequent: returnees
equivalent EN: returned foreign fighter @en
equivalent EN: returned foreign fighter (en)
equivalent EN: returnee @en
equivalent EN: returnee (en)
equivalent EN: returning foreign fighter @en
equivalent EN: returning foreign fighter (en)
part of speech: nom
definition: Citoyen qui revient dans son pays d’origine après avoir combattu dans les rangs d’une organisation terroriste à l’étranger.
in scheme: Politique
in scheme: Relations internationales
in scheme: concepts
notation: AFET161

saturation compassionnelle
type: ConceptConcept
type: Concept
creator: Commission d'enrichissement de la langue française, FranceTerme
date parution JO: 2017-12-13
equivalent EN: compassion fatigue @en
equivalent EN: compassion fatigue (en)
definition: Épuisement de la capacité de compassion de l’opinion publique, qui survient quand on fait appel à elle de façon récurrente et insistante.
in scheme: Sciences humaines
in scheme: concept-SD-sciences-humaines-sociologie
in scheme: concepts
notation: AFET162

rigoriste
type: ConceptConcept
type: Concept
creator: Commission d'enrichissement de la langue française, FranceTerme
date parution JO: 2017-12-13
deconseille ou frequent: austérien
deconseille ou frequent: austériste
deconseille ou frequent: austéritaire
equivalent EN: austerian @en
equivalent EN: austerian (en)
part of speech: nom
definition: Partisan d’une politique de rigueur, voire d’austérité, en réponse à un déséquilibre économique ou budgétaire.
in scheme: Économie générale
in scheme: concepts
notation: AFET163

dissensus
type: ConceptConcept
type: Concept
creator: Commission d'enrichissement de la langue française, FranceTerme
antonym: consensus, n.m.
date parution JO: 2016-05-07
equivalent EN: dissensus @en
equivalent EN: dissensus (en)
part of speech: nom masculin
definition: Absence de consensus constatée à l’issue d’une négociation.
in scheme: Tous domaines
in scheme: concepts
notation: AFET165

diplomatie démultipliée
type: ConceptConcept
type: Concept
creator: Commission d'enrichissement de la langue française, FranceTerme
date parution JO: 2016-05-07
deconseille ou frequent: diplomatie multiple
deconseille ou frequent: diplomatie à voies multiples
equivalent EN: multi-track diplomacy @en
equivalent EN: multi-track diplomacy (en)
definition: Forme de diplomatie caractérisée par la multiplicité des acteurs reconnus de la vie publique qui participent à sa mise en œuvre et peuvent être des collectivités locales, des assemblées parlementaires, des autorités religieuses, des organisations non gouvernementales ou encore des entreprises.
in scheme: Relations internationales
in scheme: concepts
notation: AFET168
related: diplomatie d'influence

diplomatie environnementale
type: ConceptConcept
type: Concept
creator: Commission d'enrichissement de la langue française, FranceTerme
date parution JO: 2016-05-07
deconseille ou frequent: diplomatie verte
equivalent EN: environmental diplomacy @en
equivalent EN: environmental diplomacy (en)
equivalent EN: green diplomacy @en
equivalent EN: green diplomacy (en)
alternative label: diplomatie de l'environnement
definition: Diplomatie, ouverte à des partenaires non étatiques, qui porte sur la gestion de biens publics mondiaux environnementaux.
in scheme: Environnement
in scheme: Relations internationales
in scheme: concepts
notation: AFET169
note: 1. La diplomatie environnementale vise principalement à établir des accords interétatiques concernant la réduction des émissions de gaz à effet de serre, la conservation et le partage des ressources en eau, ou la protection de la biodiversité.
note: 2. On trouve aussi le terme « diplomatie verte », qui n’est pas recommandé.
related: bien public mondial

hydrostratégie
type: ConceptConcept
type: Concept
creator: Commission d'enrichissement de la langue française, FranceTerme
date parution JO: 2008-10-19
deconseille ou frequent: hydropolitique
equivalent EN: hydropolitics @en
equivalent EN: hydropolitics (en)
part of speech: nom féminin
definition: Stratégie consistant à utiliser les ressources en eau à des fins politiques ou économiques, notamment en cas de tensions régionales ou internationales.
in scheme: Environnement
in scheme: Relations internationales
in scheme: concepts
notation: AFET17
related: pouvoir alimentaire

centre opérationnel stratégique
type: ConceptConcept
type: Concept
creator: Commission d'enrichissement de la langue française, FranceTerme
date parution JO: 2017-12-13
deconseille ou frequent: centre de commande
deconseille ou frequent: centre de planification et de conduite des opérations
equivalent EN: command center @en
equivalent EN: command center (en)
equivalent EN: command centre @en
equivalent EN: command centre (en)
equivalent EN: situation center @en
equivalent EN: situation center (en)
equivalent EN: situation centre @en
equivalent EN: situation centre (en)
equivalent EN: situation room @en
equivalent EN: situation room (en)
definition: Structure permanente destinée à faire face aux situations de crise ou de conflit, à laquelle parviennent les informations utiles à une prise de décision ; par extension, lieu où est installée cette structure.
in scheme: Défense
in scheme: Relations internationales
in scheme: concepts
notation: AFET170
note: Dans le domaine de la défense, on parle aussi de « centre de planification et de conduite des opérations ».
related: cellule de crise

cellule de crise
type: ConceptConcept
type: Concept
creator: Commission d'enrichissement de la langue française, FranceTerme
date parution JO: 2017-12-13
equivalent EN: crisis center @en
equivalent EN: crisis center (en)
equivalent EN: crisis centre @en
equivalent EN: crisis centre (en)
equivalent EN: war room @en
equivalent EN: war room (en)
definition: Structure temporaire chargée de faire face à une crise particulière ; par extension, lieu qui accueille cette structure.
in scheme: Défense
in scheme: Relations internationales
in scheme: concepts
notation: AFET171
related: centre opérationnel stratégique

guerre tiède
type: ConceptConcept
type: Concept
creator: Commission d'enrichissement de la langue française, FranceTerme
date parution JO: 2016-05-07
equivalent EN: lukewarm war @en
equivalent EN: lukewarm war (en)
definition: Situation de tension très forte entre États, qui altère gravement leurs relations sans exclure la poursuite d’échanges politiques, économiques ou culturels.
in scheme: Relations internationales
in scheme: concepts
notation: AFET173
related: paix froide

transition humanitaire
type: ConceptConcept
type: Concept
creator: Commission d'enrichissement de la langue française, FranceTerme
date parution JO: 2016-05-07
equivalent EN: humanitarian transition @en
equivalent EN: humanitarian transition (en)
definition: Période durant laquelle la responsabilité de l’action humanitaire, menée jusqu’alors dans un pays par des institutions internationales, est transférée progressivement aux autorités nationales ou locales.
in scheme: Relations internationales
in scheme: concepts
notation: AFET174

dossier du passager
type: ConceptConcept
type: Concept
creator: Commission d'enrichissement de la langue française, FranceTerme
abbreviation: DP
date parution JO: 2016-03-22
equivalent EN: PNR @en
equivalent EN: PNR (en)
equivalent EN: passenger name record @en
equivalent EN: passenger name record (en)
definition: Dossier contenant les données personnelles d’un voyageur que recueillent les entreprises de transport lors de la délivrance de billets.
in scheme: Relations internationales
in scheme: Transports et mobilité
in scheme: concepts
notation: AFET175

zone sécurisée
type: ConceptConcept
type: Concept
creator: Commission d'enrichissement de la langue française, FranceTerme
date parution JO: 2016-05-07
equivalent EN: safe area @en
equivalent EN: safe area (en)
equivalent EN: safe zone @en
equivalent EN: safe zone (en)
definition: Zone protégée où peut se réfugier une population menacée par des combats.
in scheme: Défense
in scheme: Relations internationales
in scheme: concepts
notation: AFET176

journalisme participatif
type: ConceptConcept
type: Concept
creator: Commission d'enrichissement de la langue française, FranceTerme
date parution JO: 2016-05-07
equivalent EN: open journalism @en
equivalent EN: open journalism (en)
definition: Activité journalistique qui fait appel au public pour la collecte et l’élaboration de l’information.
in scheme: Communication
in scheme: concept-SD-communication-presse
in scheme: concepts
notation: AFET177

point d'enregistrement
type: ConceptConcept
type: Concept
creator: Commission d'enrichissement de la langue française, FranceTerme
date parution JO: 2016-12-15
deconseille ou frequent: hot spot
deconseille ou frequent: processing center
equivalent EN: hotspot @en
equivalent EN: hotspot (en)
equivalent EN: processing centre @en
equivalent EN: processing centre (en)
definition: Structure administrative mise en place en un lieu donné pour identifier, enregistrer et orienter des migrants en situation d’urgence.
in scheme: Politique
in scheme: Relations internationales
in scheme: concepts
notation: AFET178
related: zone d'urgence migratoire
related: concept-TELE324

zone d'urgence migratoire
type: ConceptConcept
type: Concept
creator: Commission d'enrichissement de la langue française, FranceTerme
date parution JO: 2016-12-15
deconseille ou frequent: hot spot
equivalent EN: hotspot @en
equivalent EN: hotspot (en)
definition: Zone géographique exposée à de très fortes pressions migratoires.
in scheme: Politique
in scheme: Relations internationales
in scheme: concepts
notation: AFET179
related: point d'enregistrement

note libre
type: ConceptConcept
type: Concept
creator: Commission d'enrichissement de la langue française, FranceTerme
abbreviation: non-paper @en
abbreviation: non-paper document @en
date parution JO: 2008-10-19
deconseille ou frequent: non-papier
equivalent EN: non paper @en
equivalent EN: non paper (en)
equivalent EN: non-paper @en
equivalent EN: non-paper (en)
equivalent EN: non-paper document @en
equivalent EN: non-paper document (en)
definition: Communication informelle ne comportant pas de signature et servant, lors de discussions, à présenter des idées ou des textes qui n'engagent pas les parties.
in scheme: Relations internationales
in scheme: concepts
notation: AFET18
note: L'emploi de l'expression « non-papier » est à proscrire.

acteur non étatique
type: ConceptConcept
type: Concept
creator: Commission d'enrichissement de la langue française, FranceTerme
abbreviation: ANE
date parution JO: 2017-12-13
deconseille ou frequent: acteur non gouvernemental
equivalent EN: NSA @en
equivalent EN: NSA (en)
equivalent EN: non-governmental actor @en
equivalent EN: non-governmental actor (en)
equivalent EN: non-state actor @en
equivalent EN: non-state actor (en)
definition: Personne, groupe ou institution intervenant dans la vie nationale ou internationale sans être officiellement mandaté par un État.
in scheme: Politique
in scheme: Relations internationales
in scheme: concepts
notation: AFET180
note: Un acteur non étatique peut être une organisation non gouvernementale, une force sociale, un réseau criminel ou terroriste, un média, une firme transnationale ou une agence de notation.

avantage connexe
type: ConceptConcept
type: Concept
creator: Commission d'enrichissement de la langue française, FranceTerme
date parution JO: 2017-12-13
deconseille ou frequent: avantages connexes
deconseille ou frequent: co-bénéfice
deconseille ou frequent: retombées positives
equivalent EN: co-benefit @en
equivalent EN: co-benefit (en)
alternative label: retombée positive
definition: Profit que l’on tire, dans un domaine particulier, d’une transaction ou d’une négociation portant sur d’autres domaines.
in scheme: Tous domaines
in scheme: concepts
notation: AFET181
related: externalité

politique de l'inaction
type: ConceptConcept
type: Concept
creator: Commission d'enrichissement de la langue française, FranceTerme
date parution JO: 2017-12-13
equivalent EN: do-nothing policy @en
equivalent EN: do-nothing policy (en)
equivalent EN: do-nothing scenario @en
equivalent EN: do-nothing scenario (en)
definition: Option politique qui, dans une situation donnée, consiste à s’abstenir de toute action.
in scheme: Politique
in scheme: Relations internationales
in scheme: concepts
notation: AFET182
related: scénario tendanciel

apolaire
type: ConceptConcept
type: Concept
creator: Commission d'enrichissement de la langue française, FranceTerme
date parution JO: 2017-12-13
deconseille ou frequent: zéropolaire
equivalent EN: zeropolar @en
equivalent EN: zeropolar (en)
part of speech: adjectif
definition: Se dit d’une situation internationale dans laquelle aucun pays ou aucune alliance de pays ne dispose du poids nécessaire pour constituer un pôle dominant de pouvoir et de décision, à l’échelle planétaire.
in scheme: Relations internationales
in scheme: concepts
notation: AFET187

habillage humanitaire
type: ConceptConcept
type: Concept
creator: Commission d'enrichissement de la langue française, FranceTerme
date parution JO: 2017-12-13
equivalent EN: empathy washing @en
equivalent EN: empathy washing (en)
definition: Stratégie de communication d’une entreprise ou d’une organisation qui cherche à améliorer son image de marque en se réclamant abusivement de valeurs humanitaires.
in scheme: Communication
in scheme: Relations internationales
in scheme: concepts
notation: AFET189
related: habillage onusien

partenariat judicieux
type: ConceptConcept
type: Concept
creator: Commission d'enrichissement de la langue française, FranceTerme
date parution JO: 2008-10-19
equivalent EN: smart partnership @en
equivalent EN: smart partnership (en)
definition: Partenariat qui associe, le plus souvent dans un objectif de développement, des acteurs publics ou privés, et dans lequel chacune des parties trouve un intérêt égal.
in scheme: Économie et gestion d'entreprise
in scheme: Relations internationales
in scheme: concept-SD-economie-et-gestion-d-entreprise-cooperation-et-developpement
in scheme: concept-SD-relations-internationales-cooperation-et-developpement
in scheme: concepts
notation: AFET19

banc arrière
type: ConceptConcept
type: Concept
creator: Commission d'enrichissement de la langue française, FranceTerme
date parution JO: 2017-12-13
equivalent EN: back bench @en
equivalent EN: back bench (en)
definition: Ensemble des membres des délégations officielles assis en retrait et ne prenant pas place à la table des négociations.
in scheme: Politique
in scheme: Relations internationales
in scheme: concepts
notation: AFET193

conduite en sous-main
type: ConceptConcept
type: Concept
creator: Commission d'enrichissement de la langue française, FranceTerme
date parution JO: 2017-12-13
equivalent EN: leadership from behind @en
equivalent EN: leadership from behind (en)
equivalent EN: leading from behind @en
equivalent EN: leading from behind (en)
definition: Action diplomatique menée sans intervention officielle directe.
in scheme: Relations internationales
in scheme: concepts
notation: AFET195

habillage onusien
type: ConceptConcept
type: Concept
creator: Commission d'enrichissement de la langue française, FranceTerme
date parution JO: 2017-12-13
equivalent EN: blue washing @en
equivalent EN: blue washing (en)
definition: Stratégie de communication d’une entreprise ou d’une organisation qui cherche à améliorer son image de marque en se réclamant abusivement des valeurs promues par l’Organisation des Nations unies.
in scheme: Communication
in scheme: Relations internationales
in scheme: concepts
notation: AFET196
related: habillage humanitaire

paix froide
type: ConceptConcept
type: Concept
creator: Commission d'enrichissement de la langue française, FranceTerme
date parution JO: 2017-12-13
equivalent EN: cold peace @en
equivalent EN: cold peace (en)
alternative label: paix glacée
definition: Situation de tension entre États qui altère leurs relations mais exclut l’engagement de forces.
in scheme: Relations internationales
in scheme: concepts
notation: AFET197
related: guerre tiède

stratégie de présence minimale
type: ConceptConcept
type: Concept
creator: Commission d'enrichissement de la langue française, FranceTerme
date parution JO: 2017-12-13
equivalent EN: light footprint strategy @en
equivalent EN: light footprint strategy (en)
definition: Mode d’intervention militaire mettant en œuvre des moyens qui permettent de limiter la présence et l’exposition des forces sur un théâtre d’opérations.
in scheme: Défense
in scheme: Relations internationales
in scheme: concepts
notation: AFET198

résilience
type: ConceptConcept
type: Concept
creator: Commission d'enrichissement de la langue française, FranceTerme
date parution JO: 2008-10-19
equivalent EN: resilience @en
equivalent EN: resilience (en)
part of speech: nom féminin
definition: Capacité d'une personne ou d'une société à résister à une épreuve brutale et à en tirer parti pour se renforcer.
in scheme: Sciences humaines
in scheme: concept-SD-sciences-humaines-sciences-sociales
in scheme: concepts
notation: AFET20
related: concept-SANT164

voisinage mondial
type: ConceptConcept
type: Concept
creator: Commission d'enrichissement de la langue française, FranceTerme
abbreviation: global neighbourhood @en
date parution JO: 2008-10-19
equivalent EN: global neighborhood (US) @en
equivalent EN: global neighborhood (en-US)
equivalent EN: global neighbourhood (US) @en
equivalent EN: global neighbourhood (en-US)
definition: Extension et diversification des relations d'interdépendance entre les habitants de la Terre.
in scheme: Relations internationales
in scheme: concepts
notation: AFET21

capacité à faire face
type: ConceptConcept
type: Concept
creator: Commission d'enrichissement de la langue française, FranceTerme
date parution JO: 2008-10-19
equivalent EN: coping capacity @en
equivalent EN: coping capacity (en)
in scheme: Relations internationales
in scheme: Sciences humaines
in scheme: concept-SD-relations-internationales-cooperation-et-developpement
in scheme: concept-SD-sciences-humaines-cooperation-et-developpement
in scheme: concepts
notation: AFET22
related: concept-SANT164

diplomatie d'entreprise
type: ConceptConcept
type: Concept
creator: Commission d'enrichissement de la langue française, FranceTerme
date parution JO: 2008-10-19
equivalent EN: corporate diplomacy @en
equivalent EN: corporate diplomacy (en)
in scheme: Économie et gestion d'entreprise
in scheme: Relations internationales
in scheme: concepts
notation: AFET23

indifférence à la couleur de peau
type: ConceptConcept
type: Concept
creator: Commission d'enrichissement de la langue française, FranceTerme
abbreviation: color-blindness @en
abbreviation: colour blindness @en
abbreviation: colour-blindness @en
date parution JO: 2008-10-19
equivalent EN: color blindness (US) @en
equivalent EN: color blindness (en-US)
equivalent EN: color-blindness (US) @en
equivalent EN: color-blindness (en-US)
equivalent EN: colour blindness (US) @en
equivalent EN: colour blindness (en-US)
equivalent EN: colour-blindness (US) @en
equivalent EN: colour-blindness (en-US)
in scheme: Sciences humaines
in scheme: concept-SD-sciences-humaines-sciences-sociales
in scheme: concepts
notation: AFET24

prévention des risques de catastrophes naturelles
type: ConceptConcept
type: Concept
creator: Commission d'enrichissement de la langue française, FranceTerme
abbreviation: natural disaster risk reduction @en
date parution JO: 2008-10-19
equivalent EN: disaster risk reduction @en
equivalent EN: disaster risk reduction (en)
equivalent EN: natural disaster risk reduction @en
equivalent EN: natural disaster risk reduction (en)
in scheme: Environnement
in scheme: concept-SD-environnement-risques
in scheme: concepts
notation: AFET25

accessibilité
type: ConceptConcept
type: Concept
creator: Commission d'enrichissement de la langue française, FranceTerme
date parution JO: 2010-01-19
equivalent EN: affordability @en
equivalent EN: affordability (en)
part of speech: nom féminin
definition: Possibilité matérielle et financière d'accéder à une ressource, à un bien ou à un service.
in scheme: Économie générale
in scheme: Relations internationales
in scheme: concept-SD-economie-generale-cooperation-et-developpement
in scheme: concept-SD-relations-internationales-cooperation-et-developpement
in scheme: concepts
notation: AFET26
note: On parle notamment d'« accessibilité » à propos de l'eau ou des médicaments.

anticipation des risques
type: ConceptConcept
type: Concept
creator: Commission d'enrichissement de la langue française, FranceTerme
date parution JO: 2010-01-19
equivalent EN: disaster preparedness @en
equivalent EN: disaster preparedness (en)
equivalent EN: emergency preparedness @en
equivalent EN: emergency preparedness (en)
definition: Ensemble de mesures prises pour prévenir les catastrophes ou s'en protéger activement, en limitant leurs effets et en prévoyant une organisation efficace des secours.
in scheme: Environnement
in scheme: concept-SD-environnement-risques
in scheme: concepts
notation: AFET27

brevetabilité
type: ConceptConcept
type: Concept
creator: Commission d'enrichissement de la langue française, FranceTerme
date parution JO: 2010-01-19
equivalent EN: patentability @en
equivalent EN: patentability (en)
part of speech: nom féminin
definition: Caractère de ce qui, d'un point de vue juridique, éthique ou technique, peut être breveté.
in scheme: Tous domaines
in scheme: concepts
notation: AFET28

construction de l'État
type: ConceptConcept
type: Concept
creator: Commission d'enrichissement de la langue française, FranceTerme
date parution JO: 2010-01-19
equivalent EN: nation-building @en
equivalent EN: nation-building (en)
equivalent EN: state-building @en
equivalent EN: state-building (en)
definition: Mise en place de structures étatiques dans un pays qui n'en possédait pas jusqu'alors.
in scheme: Politique
in scheme: Relations internationales
in scheme: concepts
notation: AFET29
related: reconstruction de l'État

contre-attaque oratoire
type: ConceptConcept
type: Concept
creator: Commission d'enrichissement de la langue française, FranceTerme
date parution JO: 2019-05-03
deconseille ou frequent: whataboutisme
equivalent EN: whataboutery @en
equivalent EN: whataboutery (en)
equivalent EN: whataboutism @en
equivalent EN: whataboutism (en)
definition: Procédé rhétorique qui, dans un débat ou une discussion, vise à déstabiliser l’interlocuteur et à éviter de lui répondre en abordant un autre sujet censé le mettre dans l’embarras.
in scheme: Communication
in scheme: concepts
notation: AFET294

cyberactiviste
type: ConceptConcept
type: Concept
creator: Commission d'enrichissement de la langue française, FranceTerme
date parution JO: 2019-05-03
deconseille ou frequent: cyber activisme
deconseille ou frequent: cyber activiste
deconseille ou frequent: cyberactivism
deconseille ou frequent: cyberactivisme
deconseille ou frequent: hacktivism
deconseille ou frequent: hacktiviste
equivalent EN: cyberactivist @en
equivalent EN: cyberactivist (en)
equivalent EN: hacktivist @en
equivalent EN: hacktivist (en)
part of speech: nom
definition: Activiste qui agit dans les réseaux informatiques et recourt notamment au piratage.
in scheme: Communication
in scheme: Politique
in scheme: concepts
notation: AFET295
related: égalisateur de puissance
related: cybermilitant, -e
related: pirate

technologie civique
type: ConceptConcept
type: Concept
creator: Commission d'enrichissement de la langue française, FranceTerme
date parution JO: 2019-05-03
deconseille ou frequent: civictech
deconseille ou frequent: civitech
equivalent EN: civic tech @en
equivalent EN: civic tech (en)
equivalent EN: civic technology @en
equivalent EN: civic technology (en)
definition: Ensemble d’outils numériques conçus pour renforcer la compréhension des institutions par les citoyens et leur participation à la vie démocratique.
in scheme: Communication
in scheme: Politique
in scheme: concepts
notation: AFET296

affinitaire
type: ConceptConcept
type: Concept
creator: Commission d'enrichissement de la langue française, FranceTerme
date parution JO: 2019-05-03
equivalent EN: like-minded @en
equivalent EN: like-minded (en)
part of speech: adjectif
alternative label: homodoxe
definition: Se dit d’un groupe de pays qui partagent le même point de vue sur un sujet donné.
in scheme: Relations internationales
in scheme: concepts
notation: AFET298
scope note: Cette publication annule et remplace celle du terme « homodoxe » au Journal officiel du 15 septembre 2013.

démocrature
type: ConceptConcept
type: Concept
creator: Commission d'enrichissement de la langue française, FranceTerme
date parution JO: 2020-09-15
deconseille ou frequent: democratorship
deconseille ou frequent: dictocracy
equivalent EN: illiberal democracy @en
equivalent EN: illiberal democracy (en)
part of speech: nom féminin
alternative label: démocratie illibérale
definition: Régime politique qui, tout en respectant les règles formelles de la démocratie, notamment en matière d’élections, restreint les libertés publiques ou individuelles comme le fait une dictature.
in scheme: Politique
in scheme: concepts
notation: AFET299

droits patrimoniaux traditionnels
type: ConceptConcept
type: Concept
creator: Commission d'enrichissement de la langue française, FranceTerme
abbreviation: DPT
abbreviation: TRR @en
date parution JO: 2010-01-19
equivalent EN: TRR @en
equivalent EN: TRR (en)
equivalent EN: traditional resource rights @en
equivalent EN: traditional resource rights (en)
definition: Droits des peuples autochtones à garder et à gérer leurs biens matériels et immatériels.
in scheme: Droit
in scheme: concept-SD-droit-droit-international
in scheme: concepts
notation: AFET30

égalisateur de puissance
type: ConceptConcept
type: Concept
creator: Commission d'enrichissement de la langue française, FranceTerme
date parution JO: 2019-05-03
deconseille ou frequent: power equaliser
equivalent EN: power equalizer @en
equivalent EN: power equalizer (en)
definition: Moyen permettant d’établir un équilibre entre des États ou d’autres entités politiques de poids inégal.
in scheme: Politique
in scheme: Relations internationales
in scheme: concepts
notation: AFET301
note: 1. L’armement nucléaire, par excellence, mais aussi le cyberactivisme ou le renseignement sont des exemples d’égalisateur de puissance.
note: 2. Le terme « égalisateur de puissance » est également utilisé comme adjectif.
related: cyberactiviste

enquête d'irréprochabilité
type: ConceptConcept
type: Concept
creator: Commission d'enrichissement de la langue française, FranceTerme
date parution JO: 2019-05-03
equivalent EN: vetting process @en
equivalent EN: vetting process (en)
definition: Investigation conduite préalablement à la nomination d’un candidat à un poste sensible, notamment politique ou administratif, portant sur différents aspects de sa vie professionnelle et privée.
in scheme: Politique
in scheme: Relations internationales
in scheme: concepts
notation: AFET302
related: personne exposée à la corruption

note blanche
type: ConceptConcept
type: Concept
creator: Commission d'enrichissement de la langue française, FranceTerme
date parution JO: 2019-05-03
deconseille ou frequent: unsigned report
equivalent EN: blanc
alternative label: blanc
definition: Note brève, d’une page le plus souvent, non signée, émanant généralement d’un service de renseignement et rédigée à l’attention de hauts responsables d’un gouvernement ou d’une administration.
in scheme: Défense
in scheme: Relations internationales
in scheme: concepts
notation: AFET303

phrase-choc
type: ConceptConcept
type: Concept
creator: Commission d'enrichissement de la langue française, FranceTerme
date parution JO: 2019-05-03
deconseille ou frequent: punch line
deconseille ou frequent: punchline
part of speech: nom féminin
definition: Formule percutante d’un discours ou d’un débat destinée à frapper les esprits et à être reprise par les médias.
in scheme: Communication
in scheme: concepts
notation: AFET304
note: L’expression punch line, empruntée de l’anglais, est à proscrire.

façonnage de l'actualité
type: ConceptConcept
type: Concept
creator: Commission d'enrichissement de la langue française, FranceTerme
date parution JO: 2019-05-03
equivalent EN: agenda setting @en
equivalent EN: agenda setting (en)
definition: Action des médias sur la formation de l’opinion publique par le choix des sujets abordés et l’importance qui leur est conférée.
in scheme: Communication
in scheme: Politique
in scheme: concepts
notation: AFET305

postvérité
type: ConceptConcept
type: Concept
creator: Commission d'enrichissement de la langue française, FranceTerme
date parution JO: 2019-05-03
deconseille ou frequent: post truth
deconseille ou frequent: post-truth
deconseille ou frequent: post-vérité
equivalent EN: posttruth @en
equivalent EN: posttruth (en)
part of speech: nom féminin
definition: Situation dans laquelle l’objectivité et la véracité des faits ont moins d’influence sur la formation de l’opinion publique que le recours à des émotions, à des sentiments ou à des croyances.
in scheme: Communication
in scheme: Sciences humaines
in scheme: concepts
notation: AFET306
note: La postvérité, qui a cours notamment dans les domaines politiques ou scientifiques, peut avoir pour effet de créer un climat de scepticisme, de relativisme, voire de haine.

cyberdépendance
type: ConceptConcept
type: Concept
creator: Commission d'enrichissement de la langue française, FranceTerme
date parution JO: 2019-05-03
deconseille ou frequent: addiction digitale
deconseille ou frequent: cyber addiction
deconseille ou frequent: cyber dépendance
equivalent EN: cyberaddiction @en
equivalent EN: cyberaddiction (en)
equivalent EN: digital addiction @en
equivalent EN: digital addiction (en)
part of speech: nom féminin
alternative label: addiction au numérique
definition: État de dépendance psychologique à l’égard des techniques de l’information et de la communication.
in scheme: Informatique
in scheme: Sciences humaines
in scheme: concept-SD-informatique-sociologie
in scheme: concept-SD-sciences-humaines-sociologie
in scheme: concepts
notation: AFET307

financement incitatif
type: ConceptConcept
type: Concept
creator: Commission d'enrichissement de la langue française, FranceTerme
abbreviation: push funding @en
date parution JO: 2010-01-19
equivalent EN: impulso financiero @es
equivalent EN: impulso financiero (es)
equivalent EN: push and pull funding @en
equivalent EN: push and pull funding (en)
equivalent EN: push funding @en
equivalent EN: push funding (en)
definition: Utilisation de fonds publics ou privés pour orienter les comportements des agents économiques et sociaux.
in scheme: Finance
in scheme: Relations internationales
in scheme: concepts
notation: AFET31

mise au pilori
type: ConceptConcept
type: Concept
creator: Commission d'enrichissement de la langue française, FranceTerme
date parution JO: 2010-01-19
deconseille ou frequent: name & shame
deconseille ou frequent: name and shame
equivalent EN: naming and shaming @en
equivalent EN: naming and shaming (en)
alternative label: stigmatisation
definition: Pratique consistant à publier le nom de personnes physiques ou morales impliquées dans des activités tenues pour répréhensibles.
in scheme: Tous domaines
in scheme: concepts
notation: AFET32
related: culture de l'effacement

orateur principal
type: ConceptConcept
type: Concept
creator: Commission d'enrichissement de la langue française, FranceTerme
date parution JO: 2010-01-19
equivalent EN: keynote speaker @en
equivalent EN: keynote speaker (en)
equivalent EN: ponente principal @es
equivalent EN: ponente principal (es)
definition: Orateur qui, au début d'une conférence, d'un congrès, prononce une communication exposant les enjeux du débat.
in scheme: Communication
in scheme: Relations internationales
in scheme: concepts
notation: AFET33

ordre du jour
type: ConceptConcept
type: Concept
creator: Commission d'enrichissement de la langue française, FranceTerme
date parution JO: 2010-01-19
equivalent EN: agenda @en
equivalent EN: agenda (en)
definition: Ensemble des matières, des sujets et des questions dont une assemblée doit discuter dans un ordre donné.
in scheme: Tous domaines
in scheme: concepts
notation: AFET34
note: Par extension, le terme « ordre du jour » désigne également le document dressant la liste des points qui seront abordés au cours d'une séance ou d'une session.

programme d'action
type: ConceptConcept
type: Concept
creator: Commission d'enrichissement de la langue française, FranceTerme
date parution JO: 2010-01-19
equivalent EN: agenda @en
equivalent EN: agenda (en)
forme abregee: programme, n.m.
definition: Ensemble des actions qu'un organisme public ou privé envisage de mener à bien, le plus souvent assorti d'un calendrier.
in scheme: Tous domaines
in scheme: concepts
notation: AFET35

plaidoyer
type: ConceptConcept
type: Concept
creator: Commission d'enrichissement de la langue française, FranceTerme
date parution JO: 2010-01-19
equivalent EN: advocacy @en
equivalent EN: advocacy (en)
part of speech: nom masculin
definition: Discours qui soutient la cause des populations de certains pays et cherche à mobiliser l'opinion publique en leur faveur, en faisant connaître leurs besoins et leurs difficultés.
in scheme: Relations internationales
in scheme: concept-SD-relations-internationales-cooperation-et-developpement
in scheme: concepts
notation: AFET36

pouvoir intelligent
type: ConceptConcept
type: Concept
creator: Commission d'enrichissement de la langue française, FranceTerme
date parution JO: 2012-03-04
equivalent EN: poder inteligente @es
equivalent EN: poder inteligente (es)
equivalent EN: smart power @en
equivalent EN: smart power (en)
definition: Forme de diplomatie combinant habilement le pouvoir de contraindre et le pouvoir de convaincre.
in scheme: Relations internationales
in scheme: concepts
notation: AFET37
related: pouvoir de convaincre
related: diplomatie d'influence
related: pouvoir de contraindre

appropriation
type: ConceptConcept
type: Concept
creator: Commission d'enrichissement de la langue française, FranceTerme
date parution JO: 2006-09-16
equivalent EN: ownership @en
equivalent EN: ownership (en)
part of speech: nom féminin
definition: Participation active de la partie bénéficiaire à un projet de développement et volonté d'en assumer la responsabilité.
in scheme: Relations internationales
in scheme: concept-SD-relations-internationales-cooperation-et-developpement
in scheme: concepts
notation: AFET4

ralliement opportuniste
type: ConceptConcept
type: Concept
creator: Commission d'enrichissement de la langue française, FranceTerme
date parution JO: 2010-01-19
equivalent EN: bandwagoning @en
equivalent EN: bandwagoning (en)
alternative label: suivisme
definition: Alignement d'un État faible sur un État fort, par intérêt ou pour se conformer à l'attitude adoptée par d'autres États.
in scheme: Relations internationales
in scheme: concepts
notation: AFET40
note: 1. La notion de « ralliement opportuniste » peut, suivant les contextes, être également rendue par des expressions telles que « se mettre à la remorque » ou « prendre le train en marche ».
note: 2. Le terme « ralliement opportuniste » est parfois opposé au terme « rééquilibrage ».
related: rééquilibrage

rééquilibrage
type: ConceptConcept
type: Concept
creator: Commission d'enrichissement de la langue française, FranceTerme
date parution JO: 2010-01-19
equivalent EN: balancing @en
equivalent EN: balancing (en)
part of speech: nom masculin
definition: Alliance politique destinée à faire contrepoids à un pouvoir hégémonique ou dominant.
in scheme: Relations internationales
in scheme: concepts
notation: AFET41
note: Le terme « rééquilibrage » est parfois opposé au terme « ralliement opportuniste ».
related: ralliement opportuniste

bras de fer
type: ConceptConcept
type: Concept
creator: Commission d'enrichissement de la langue française, FranceTerme
date parution JO: 2020-09-15
deconseille ou frequent: jeu de la poule mouillée
deconseille ou frequent: jeu de la surenchère
equivalent EN: chicken game @en
equivalent EN: chicken game (en)
definition: Tactique d’intimidation qui vise à faire céder l’adversaire en lui laissant croire qu’il se heurte à une détermination infaillible.
in scheme: Communication
in scheme: Politique
in scheme: concepts
notation: AFET420

cagoules noires
type: ConceptConcept
type: Concept
creator: Commission d'enrichissement de la langue française, FranceTerme
date parution JO: 2020-09-15
deconseille ou frequent: black block
deconseille ou frequent: cagoule noire
equivalent EN: black bloc @en
equivalent EN: black bloc (en)
alternative label: bloc noir
definition: Groupe d’individus cagoulés et vêtus de noir qui recourt, à la faveur de manifestations sur la voie publique, à des actions violentes concertées, notamment contre des symboles des pouvoirs politiques et économiques.
in scheme: Politique
in scheme: concepts
notation: AFET421
note: Le terme « cagoule noire » (n.), au singulier, peut désigner le membre d’un tel groupe.

endiguement
type: ConceptConcept
type: Concept
creator: Commission d'enrichissement de la langue française, FranceTerme
date parution JO: 2020-09-15
equivalent EN: containment @en
equivalent EN: containment (en)
part of speech: nom masculin
definition: Stratégie diplomatique qui vise à circonscrire l’influence d’un adversaire, notamment dans les domaines militaire, diplomatique et idéologique.
in scheme: Politique
in scheme: Relations internationales
in scheme: concepts
notation: AFET423
related: refoulement

refoulement
type: ConceptConcept
type: Concept
creator: Commission d'enrichissement de la langue française, FranceTerme
date parution JO: 2020-09-15
deconseille ou frequent: roll-back
deconseille ou frequent: rollback
equivalent EN: roll back @en
equivalent EN: roll back (en)
part of speech: nom masculin
definition: Stratégie diplomatique qui vise non seulement à endiguer mais encore à réduire l’influence d’un adversaire, notamment dans les domaines militaire, diplomatique et idéologique.
in scheme: Politique
in scheme: Relations internationales
in scheme: concepts
notation: AFET424
related: endiguement

migrant, -e environnemental, -e
type: ConceptConcept
type: Concept
creator: Commission d'enrichissement de la langue française, FranceTerme
date parution JO: 2020-09-15
deconseille ou frequent: déplacé environnemental
deconseille ou frequent: environmental refugee
deconseille ou frequent: migrante environnementale
deconseille ou frequent: réfugié environnemental
deconseille ou frequent: réfugiée environnementale
deconseille ou frequent: écoréfugié
deconseille ou frequent: écoréfugiée
equivalent EN: environmental migrant @en
equivalent EN: environmental migrant (en)
definition: Personne amenée à quitter son lieu d’habitation en raison de phénomènes environnementaux qui bouleversent ses conditions de vie.
in scheme: Environnement
in scheme: Relations internationales
in scheme: concepts
notation: AFET425
note: La pollution des terres ou un séisme sont des exemples de phénomènes environnementaux qui peuvent contraindre une personne à quitter son lieu d’habitation.
related: migrant, -e climatique

migrant, -e climatique
type: ConceptConcept
type: Concept
creator: Commission d'enrichissement de la langue française, FranceTerme
date parution JO: 2020-09-15
deconseille ou frequent: climate change migrant
deconseille ou frequent: climate refugee
deconseille ou frequent: déplacé climatique
deconseille ou frequent: migrante climatique
deconseille ou frequent: réfugié climatique
deconseille ou frequent: réfugiée climatique
deconseille ou frequent: écoréfugié
deconseille ou frequent: écoréfugiée
equivalent EN: climate change migrant @en
equivalent EN: climate change migrant (en)
equivalent EN: climate migrant @en
equivalent EN: climate migrant (en)
definition: Personne amenée à quitter son lieu d’habitation en raison d’un changement climatique qui bouleverse ses conditions de vie.
in scheme: Environnement
in scheme: Relations internationales
in scheme: concepts
notation: AFET426
note: Le migrant climatique est un migrant environnemental.
related: migrant, -e environnemental, -e

migration de retour
type: ConceptConcept
type: Concept
creator: Commission d'enrichissement de la langue française, FranceTerme
date parution JO: 2020-09-15
deconseille ou frequent: remigrant
deconseille ou frequent: réémigration
equivalent EN: remigration @en
equivalent EN: remigration (en)
equivalent EN: return migration @en
equivalent EN: return migration (en)
alternative label: retour au pays
definition: Migration de personnes dans le pays dont elles-mêmes ou leurs ascendants sont originaires.
in scheme: Politique
in scheme: Relations internationales
in scheme: concepts
notation: AFET427

résurgence
type: ConceptConcept
type: Concept
creator: Commission d'enrichissement de la langue française, FranceTerme
date parution JO: 2020-09-15
deconseille ou frequent: effet ballon
deconseille ou frequent: effet cafard
deconseille ou frequent: effet plumeau
deconseille ou frequent: effet rebond
equivalent EN: balloon effect @en
equivalent EN: balloon effect (en)
equivalent EN: efecto cucaracha @es
equivalent EN: efecto cucaracha (es)
part of speech: nom féminin
alternative label: effet de rebond
definition: Situation dans laquelle un problème que l’on croyait avoir résolu en un endroit réapparaît ailleurs.
in scheme: Tous domaines
in scheme: concepts
notation: AFET428

urbicide
type: ConceptConcept
type: Concept
creator: Commission d'enrichissement de la langue française, FranceTerme
date parution JO: 2020-09-15
equivalent EN: urbicide @en
equivalent EN: urbicide (en)
part of speech: nom masculin
definition: Destruction délibérée, lors d’un conflit, de tout ou partie d’une ville en tant qu’objectif plus symbolique que militaire.
in scheme: Culture
in scheme: Politique
in scheme: concepts
notation: AFET429

reconstruction de l'État
type: ConceptConcept
type: Concept
creator: Commission d'enrichissement de la langue française, FranceTerme
date parution JO: 2010-01-19
equivalent EN: nation-building @en
equivalent EN: nation-building (en)
equivalent EN: state-building @en
equivalent EN: state-building (en)
definition: Rétablissement des structures étatiques dans un pays, généralement à l'issue d'une crise majeure.
in scheme: Politique
in scheme: Relations internationales
in scheme: concepts
notation: AFET43
related: construction de l'État
related: stratégie de stabilisation

millénial, -e
type: ConceptConcept
type: Concept
creator: Commission d'enrichissement de la langue française, FranceTerme
date parution JO: 2020-09-15
deconseille ou frequent: génération Y
deconseille ou frequent: millennal
deconseille ou frequent: millennials
deconseille ou frequent: millénarial
deconseille ou frequent: millénariaux
deconseille ou frequent: millénials
deconseille ou frequent: milléniaux
equivalent EN: millennial @en
equivalent EN: millennial (en)
part of speech: nom
definition: Enfant du numérique qui a atteint l’âge adulte au début du nouveau millénaire.
in scheme: Tous domaines
in scheme: concepts
notation: AFET430
note: Pluriel : milléniaux.
related: enfant du numérique

tournant décisif
type: ConceptConcept
type: Concept
creator: Commission d'enrichissement de la langue française, FranceTerme
date parution JO: 2022-07-01
deconseille ou frequent: changer la donne
deconseille ou frequent: changeur de donne
deconseille ou frequent: perturbateur de jeu
deconseille ou frequent: point tournant
deconseille ou frequent: tournant
equivalent EN: game changer @en
equivalent EN: game changer (en)
part of speech: locution nominale masculine
definition: Évènement ou élément nouveau qui marque un changement radical de situation.
in scheme: Tous domaines
in scheme: concepts
notation: AFET432

désoccidentalisation
type: ConceptConcept
type: Concept
creator: Commission d'enrichissement de la langue française, FranceTerme
date parution JO: 2022-07-01
deconseille ou frequent: Westlosigkeit
deconseille ou frequent: crise de l’Occident
deconseille ou frequent: désoccidentation
deconseille ou frequent: perte de l’influence de l’Occident
deconseille ou frequent: perte de vitesse de l'Occident
equivalent EN: Westlosigkeit @de
equivalent EN: westlessness @en
equivalent EN: westlessness (en)
part of speech: nom féminin
definition: Érosion des valeurs, de la puissance ou de l’influence de l’Occident dans le monde ou dans une partie du monde.
in scheme: Relations internationales
in scheme: concepts
notation: AFET433

autonomie stratégique ouverte
type: ConceptConcept
type: Concept
creator: Commission d'enrichissement de la langue française, FranceTerme
date parution JO: 2022-07-01
deconseille ou frequent: open strategy autonomy
equivalent EN: open strategic autonomy @en
equivalent EN: open strategic autonomy (en)
part of speech: locution nominale féminine
definition: Fait, pour un pays ou pour un ensemble de pays, de disposer des moyens de préserver ses intérêts vitaux, tout en poursuivant les échanges et la coopération avec d’autres pays.
in scheme: Relations internationales
in scheme: concepts
notation: AFET434
note: Le concept d’autonomie stratégique ouverte est apparu au sein de l’Union européenne.

clause de rétroaction
type: ConceptConcept
type: Concept
creator: Commission d'enrichissement de la langue française, FranceTerme
date parution JO: 2022-07-01
deconseille ou frequent: clause de caducité
deconseille ou frequent: règle de caducité
deconseille ou frequent: snapback clause
equivalent EN: snap-back @en
equivalent EN: snap-back (en)
equivalent EN: snapback @en
equivalent EN: snapback (en)
part of speech: locution nominale féminine
definition: Clause d’un accord selon laquelle les parties conviennent de revenir automatiquement à la situation antérieure si l’une d’entre elles ne respecte pas ses engagements.
in scheme: Relations internationales
in scheme: concepts
notation: AFET435
note: Dans le cadre du Plan d'action global commun (PAGC) du 14 juillet 2015, la clause de rétroaction permettait d’éviter la nécessité d’une nouvelle résolution dont l’adoption aurait pu se heurter au veto de l’un des membres permanents de l’Organisation des Nations unies.
scope note: Cette publication annule et remplace celle du terme « règle de caducité » au Journal officiel du 13 décembre 2017.

démocratie écologiste
type: ConceptConcept
type: Concept
creator: Commission d'enrichissement de la langue française, FranceTerme
date parution JO: 2022-07-01
deconseille ou frequent: démocratie environnementale
deconseille ou frequent: démocratie verte
deconseille ou frequent: démocratie écologique
deconseille ou frequent: ecological democracy
equivalent EN: ecocentric democracy @en
equivalent EN: ecocentric democracy (en)
equivalent EN: ecodemocracy @en
equivalent EN: ecodemocracy (en)
part of speech: locution nominale féminine
alternative label: démocratie écocentrée
definition: Démocratie qui définit ses orientations en accordant la priorité à l’écologie.
in scheme: Politique
in scheme: concepts
notation: AFET436

gouvernance multipartite
type: ConceptConcept
type: Concept
creator: Commission d'enrichissement de la langue française, FranceTerme
date parution JO: 2022-07-01
deconseille ou frequent: engagement multi-acteur
deconseille ou frequent: engagement multiacteur
deconseille ou frequent: engagement multipartite
deconseille ou frequent: gouvernance multi-acteur
deconseille ou frequent: gouvernance multiacteur
deconseille ou frequent: multistakeholder
equivalent EN: multistakeholderism @en
equivalent EN: multistakeholderism (en)
part of speech: locution nominale féminine
alternative label: gouvernance multiacteur
definition: Gouvernance qui associe diverses parties prenantes.
in scheme: Relations internationales
in scheme: concepts
notation: AFET437
note: Dans une gouvernance multipartite, l’État est une partie prenante parmi d’autres.

État profond
type: ConceptConcept
type: Concept
creator: Commission d'enrichissement de la langue française, FranceTerme
date parution JO: 2022-07-01
deconseille ou frequent: gouvernement invisible
deconseille ou frequent: État clandestin
deconseille ou frequent: État dans l’État
deconseille ou frequent: État de l'ombre
equivalent EN: deep state @en
equivalent EN: deep state (en)
part of speech: locution nominale masculine
alternative label: État souterrain
definition: Ensemble de personnes, généralement soutenues par des groupes d’intérêt, dont on suppose que les rôles clés au sein de l’État leur permettent d’influencer discrètement la politique gouvernementale ou de contrecarrer sa mise en œuvre.
in scheme: Politique
in scheme: concepts
notation: AFET438

extractivisme
type: ConceptConcept
type: Concept
creator: Commission d'enrichissement de la langue française, FranceTerme
date parution JO: 2022-07-01
equivalent EN: extractivism @en
equivalent EN: extractivism (en)
equivalent EN: extractivismo @es
equivalent EN: extractivismo (es)
equivalent EN: extrativismo (pt)
part of speech: nom masculin
definition: Exploitation massive de ressources naturelles, notamment minières.
in scheme: Économie générale
in scheme: Politique
in scheme: concepts
notation: AFET439
related: néoextractivisme

accord global
type: ConceptConcept
type: Concept
creator: Commission d'enrichissement de la langue française, FranceTerme
date parution JO: 2012-03-04
equivalent EN: global agreement @en
equivalent EN: global agreement (en)
equivalent EN: package @en
equivalent EN: package (en)
equivalent EN: package deal @en
equivalent EN: package deal (en)
definition: Aboutissement d'une négociation qui a porté sur de multiples aspects des relations entre deux ou plusieurs États.
in scheme: Relations internationales
in scheme: concepts
notation: AFET44
related: regroupement d'enjeux
related: grand marchandage

néoextractivisme
type: ConceptConcept
type: Concept
creator: Commission d'enrichissement de la langue française, FranceTerme
date parution JO: 2022-07-01
deconseille ou frequent: neo-extractivism
deconseille ou frequent: néo-extractivisme
equivalent EN: neo-extractivismo @es
equivalent EN: neo-extractivismo (es)
equivalent EN: neo-extrativismo (pt)
part of speech: nom masculin
definition: Modèle de développement fondé sur l’extractivisme, mis en œuvre par un État au service de sa politique de redistribution sociale.
in scheme: Économie générale
in scheme: Politique
in scheme: concepts
notation: AFET440
note: Le néo-extractivisme est apparu en Amérique latine au début du XXIe siècle.
related: extractivisme

planification stratégique
type: ConceptConcept
type: Concept
creator: Commission d'enrichissement de la langue française, FranceTerme
equivalent EN: policy planning @en
equivalent EN: policy planning (en)
definition: Méthode qui consiste à définir un objectif avant de mettre en place la politique pour y parvenir.
in scheme: Relations internationales
in scheme: concepts
notation: AFET441

pouvoir de manipulation
type: ConceptConcept
type: Concept
creator: Commission d'enrichissement de la langue française, FranceTerme
date parution JO: 2022-07-01
deconseille ou frequent: pouvoir de nuisance
deconseille ou frequent: pouvoir de subversion
equivalent EN: sharp power @en
equivalent EN: sharp power (en)
part of speech: locution nominale masculine
definition: Capacité d’un État à manipuler les opinions publiques d’autres États, notamment par l’usage d’infox.
in scheme: Politique
in scheme: Relations internationales
in scheme: concepts
notation: AFET442
related: infox
related: contrefaçon d'opinion

stratégie du bord de l'abîme
type: ConceptConcept
type: Concept
creator: Commission d'enrichissement de la langue française, FranceTerme
deconseille ou frequent: brinksmanship
deconseille ou frequent: politique de la corde raide
deconseille ou frequent: politique du bord de l'abîme
equivalent EN: brinkmanship @en
equivalent EN: brinkmanship (en)
definition: Tactique qui consiste à aggraver une situation dangereuse au risque de provoquer une crise, pour en tirer parti.
in scheme: Relations internationales
in scheme: concepts
notation: AFET443

transnationalisme
type: ConceptConcept
type: Concept
creator: Commission d'enrichissement de la langue française, FranceTerme
date parution JO: 2022-07-01
equivalent EN: transnationalism @en
equivalent EN: transnationalism (en)
part of speech: nom masculin
definition: Mode d’action et d’organisation de groupes non étatiques dont les activités se développent sans considération des frontières nationales.
in scheme: Relations internationales
in scheme: concepts
notation: AFET444

grand marchandage
type: ConceptConcept
type: Concept
creator: Commission d'enrichissement de la langue française, FranceTerme
date parution JO: 2012-03-04
equivalent EN: grand bargain @en
equivalent EN: grand bargain (en)
definition: Forme de négociation au cours de laquelle deux ou plusieurs États cherchent à parvenir à un accord global par des concessions mutuelles, portant sur de multiples aspects de leurs relations, sans exclure les points les plus sensibles.
in scheme: Relations internationales
in scheme: concepts
notation: AFET45
related: accord global

adossement
type: ConceptConcept
type: Concept
creator: Commission d'enrichissement de la langue française, FranceTerme
date parution JO: 2012-03-04
deconseille ou frequent: back stop
equivalent EN: backstop @en
equivalent EN: backstop (en)
equivalent EN: backstopping @en
equivalent EN: backstopping (en)
part of speech: nom masculin
definition: Activité de conseil et de suivi assurée par des consultants extérieurs pour mener à bien des projets de développement.
in scheme: Relations internationales
in scheme: concept-SD-relations-internationales-cooperation-et-developpement
in scheme: concepts
notation: AFET46
related: adosseur, -euse

adosseur, -euse
type: ConceptConcept
type: Concept
creator: Commission d'enrichissement de la langue française, FranceTerme
date parution JO: 2012-03-04
equivalent EN: backstopper @en
equivalent EN: backstopper (en)
part of speech: nom
alternative label: consultant, -e de référence
definition: Personne physique ou morale chargée de l'adossement d'un projet.
in scheme: Relations internationales
in scheme: concept-SD-relations-internationales-cooperation-et-developpement
in scheme: concepts
notation: AFET47
related: adossement

appropriation
type: ConceptConcept
type: Concept
creator: Commission d'enrichissement de la langue française, FranceTerme
date parution JO: 2006-09-16
equivalent EN: ownership @en
equivalent EN: ownership (en)
part of speech: nom féminin
definition: Adhésion à une proposition et volonté de la reprendre à son compte.
in scheme: Relations internationales
in scheme: concept-SD-relations-internationales-negociations
in scheme: concepts
notation: AFET5

changement de camp
type: ConceptConcept
type: Concept
creator: Commission d'enrichissement de la langue française, FranceTerme
date parution JO: 2012-03-04
equivalent EN: crossing the floor @en
equivalent EN: crossing the floor (en)
equivalent EN: floor-crossing @en
equivalent EN: floor-crossing (en)
definition: Attitude d'un homme politique ou d'une délégation diplomatique qui rallie un autre camp que le sien.
in scheme: Politique
in scheme: Relations internationales
in scheme: concepts
notation: AFET51

diplomatie multilatérale
type: ConceptConcept
type: Concept
creator: Commission d'enrichissement de la langue française, FranceTerme
date parution JO: 2012-03-04
equivalent EN: multilateral diplomacy @en
equivalent EN: multilateral diplomacy (en)
definition: Forme de diplomatie s'exerçant dans le cadre de rencontres où sont représentés plusieurs pays, le plus souvent sous l'égide d'une organisation internationale, et dans la perspective d'une action commune.
in scheme: Relations internationales
in scheme: concepts
notation: AFET52

diplomatie par procuration
type: ConceptConcept
type: Concept
creator: Commission d'enrichissement de la langue française, FranceTerme
date parution JO: 2012-03-04
deconseille ou frequent: diplomatie par délégation
deconseille ou frequent: diplomatie par représentation
equivalent EN: proxy diplomacy @en
equivalent EN: proxy diplomacy (en)
definition: Forme de diplomatie consistant à faire intervenir, en lieu et place d'un représentant officiel, une personne physique ou morale, pour faciliter le règlement d'une crise ou d'un conflit.
in scheme: Relations internationales
in scheme: concepts
notation: AFET53
note: On parle plutôt de « diplomatie par délégation » ou de « diplomatie par représentation » lorsque l'intermédiaire est un autre service diplomatique.

diplomatie d'influence
type: ConceptConcept
type: Concept
creator: Commission d'enrichissement de la langue française, FranceTerme
date parution JO: 2012-03-04
equivalent EN: soft diplomacy @en
equivalent EN: soft diplomacy (en)
definition: Forme de diplomatie privilégiant le pouvoir de convaincre et utilisant tous types de réseaux et de relations personnelles.
in scheme: Relations internationales
in scheme: concepts
notation: AFET56
related: pouvoir de convaincre
related: diplomatie démultipliée
related: pouvoir intelligent

État-charnière
type: ConceptConcept
type: Concept
creator: Commission d'enrichissement de la langue française, FranceTerme
date parution JO: 2012-03-04
equivalent EN: swing state @en
equivalent EN: swing state (en)
part of speech: nom masculin
definition: État des États-Unis qui peut alterner, d'un scrutin à l'autre, entre les deux partis dominants et faire basculer le résultat du vote final.
in scheme: Politique
in scheme: concepts
notation: AFET58

État fragile
type: ConceptConcept
type: Concept
creator: Commission d'enrichissement de la langue française, FranceTerme
date parution JO: 2012-03-04
equivalent EN: fragile state @en
equivalent EN: fragile state (en)
definition: État confronté à de graves difficultés d'ordre intérieur et extérieur, notamment dans les domaines de la gouvernance, de la sécurité, des finances publiques et de la protection juridique et sociale.
in scheme: Politique
in scheme: Relations internationales
in scheme: concepts
notation: AFET59
related: État défaillant
related: État failli
related: gouvernance

mémorandum d'entente
type: ConceptConcept
type: Concept
creator: Commission d'enrichissement de la langue française, FranceTerme
abbreviation: MoU @en
date parution JO: 2006-09-16
equivalent EN: MoU @en
equivalent EN: MoU (en)
equivalent EN: memorandum of understanding @en
equivalent EN: memorandum of understanding (en)
definition: Texte, dénué de valeur juridique contraignante, par lequel deux parties récapitulent leurs points de convergence dans le cours d'une négociation.
in scheme: Tous domaines
in scheme: concepts
notation: AFET6

État défaillant
type: ConceptConcept
type: Concept
creator: Commission d'enrichissement de la langue française, FranceTerme
date parution JO: 2012-03-04
equivalent EN: failing state @en
equivalent EN: failing state (en)
definition: État fragile dont les difficultés tiennent en grande partie aux insuffisances de sa gouvernance.
in scheme: Politique
in scheme: Relations internationales
in scheme: concepts
notation: AFET60
related: État fragile
related: État failli
related: gouvernance

État failli
type: ConceptConcept
type: Concept
creator: Commission d'enrichissement de la langue française, FranceTerme
date parution JO: 2012-03-04
equivalent EN: failed state @en
equivalent EN: failed state (en)
definition: État fragile en proie à des difficultés telles qu'il n'est plus en mesure d'exercer ses responsabilités régaliennes et de jouer son rôle au sein de la communauté internationale.
in scheme: Politique
in scheme: Relations internationales
in scheme: concepts
notation: AFET61
related: État fragile
related: État défaillant

guichet unique
type: ConceptConcept
type: Concept
creator: Commission d'enrichissement de la langue française, FranceTerme
date parution JO: 2012-03-04
equivalent EN: one stop shop @en
equivalent EN: one stop shop (en)
equivalent EN: one stop-one shop @en
equivalent EN: one stop-one shop (en)
definition: Point d'entrée administratif d'un État ou d'un territoire, où les migrants ont la possibilité et les demandeurs d'asile l'obligation d'effectuer toutes les démarches administratives nécessaires.
in scheme: Droit
in scheme: Relations internationales
in scheme: concepts
notation: AFET66

cybermilitant, -e
type: ConceptConcept
type: Concept
creator: Commission d'enrichissement de la langue française, FranceTerme
date parution JO: 2012-03-04
deconseille ou frequent: militant en ligne
deconseille ou frequent: militant électronique
equivalent EN: netroot @en
equivalent EN: netroot (en)
equivalent EN: netroots activist @en
equivalent EN: netroots activist (en)
part of speech: nom
definition: Partisan d'une cause, notamment politique, qui utilise les moyens de communication électroniques pour la faire avancer.
in scheme: Politique
in scheme: concepts
notation: AFET67
related: dissident, -e en ligne
related: cyberactiviste

panoplie
type: ConceptConcept
type: Concept
creator: Commission d'enrichissement de la langue française, FranceTerme
date parution JO: 2012-03-04
equivalent EN: toolbox @en
equivalent EN: toolbox (en)
part of speech: nom féminin
alternative label: boîte à outils
definition: Ensemble de moyens ou de mesures qui permettent de faire face à une situation donnée.
in scheme: Politique
in scheme: Relations internationales
in scheme: concepts
notation: AFET68

point de clivage
type: ConceptConcept
type: Concept
creator: Commission d'enrichissement de la langue française, FranceTerme
date parution JO: 2012-03-04
deconseille ou frequent: pomme de discorde
equivalent EN: wedge issue @en
equivalent EN: wedge issue (en)
definition: Sujet de désaccord de nature à diviser un groupe jusqu'alors homogène.
in scheme: Relations internationales
in scheme: concepts
notation: AFET69
note: S'il n'existe qu'un seul sujet de désaccord, on peut aussi parler de « pomme de discorde ».

obligation de rendre compte
type: ConceptConcept
type: Concept
creator: Commission d'enrichissement de la langue française, FranceTerme
date parution JO: 2006-09-16
deconseille ou frequent: comptable
equivalent EN: accountability @en
equivalent EN: accountability (en)
definition: Devoir incombant à une personne physique ou morale responsable d'une tâche de répondre des résultats et du choix des moyens mis en œuvre.
in scheme: Économie et gestion d'entreprise
in scheme: Relations internationales
in scheme: concepts
notation: AFET7
note: Pour parler d'une personne assujettie à une telle obligation, on dira qu'elle est « comptable » de sa gestion, de son bilan, etc.

politique des petits pas
type: ConceptConcept
type: Concept
creator: Commission d'enrichissement de la langue française, FranceTerme
date parution JO: 2013-09-15
equivalent EN: incrementalism @en
equivalent EN: incrementalism (en)
equivalent EN: small steps policy @en
equivalent EN: small steps policy (en)
definition: Action politique ou diplomatique qui procède par étapes, par menues avancées.
in scheme: Relations internationales
in scheme: concepts
notation: AFET70

stratégie de retrait
type: ConceptConcept
type: Concept
creator: Commission d'enrichissement de la langue française, FranceTerme
date parution JO: 2013-09-15
deconseille ou frequent: stratégie de sortie de crise
equivalent EN: exit strategy @en
equivalent EN: exit strategy (en)
definition: Ensemble de dispositions permettant, dans le cadre d'une intervention politique, économique ou militaire, de définir à l'avance et de mettre en œuvre les modalités d'un désengagement ou d'un retrait.
in scheme: Défense
in scheme: Relations internationales
in scheme: concepts
notation: AFET74
note: Dans le domaine de la défense, on trouve aussi le terme « stratégie de sortie de crise ».
related: stratégie post-conflit
related: stratégie de stabilisation

relance
type: ConceptConcept
type: Concept
creator: Commission d'enrichissement de la langue française, FranceTerme
date parution JO: 2013-09-15
equivalent EN: surge @en
equivalent EN: surge (en)
part of speech: nom féminin
definition: Impulsion nouvelle donnée à une action diplomatique.
in scheme: Relations internationales
in scheme: concepts
notation: AFET77

point récurrent
type: ConceptConcept
type: Concept
creator: Commission d'enrichissement de la langue française, FranceTerme
date parution JO: 2006-09-16
equivalent EN: rolling agenda item @en
equivalent EN: rolling agenda item (en)
definition: Point d'un ordre du jour susceptible d'être repris d'une réunion à l'autre.
in scheme: Relations internationales
in scheme: concept-SD-relations-internationales-droit-international
in scheme: concepts
notation: AFET8

course au visa
type: ConceptConcept
type: Concept
creator: Commission d'enrichissement de la langue française, FranceTerme
date parution JO: 2013-09-15
equivalent EN: visa shopping @en
equivalent EN: visa shopping (en)
definition: Dépôt simultané de demandes de visa auprès des consulats de plusieurs pays.
in scheme: Droit
in scheme: Relations internationales
in scheme: concepts
notation: AFET82
related: course au droit d'asile

réfugié de la mer
type: ConceptConcept
type: Concept
creator: Commission d'enrichissement de la langue française, FranceTerme
date parution JO: 2013-09-15
deconseille ou frequent: boat peoples
deconseille ou frequent: boatpeoples
deconseille ou frequent: réfugiés de la mer
equivalent EN: boat people @en
equivalent EN: boat people (en) [pluriel]
definition: Personne ayant fui son pays d'origine sur une embarcation de fortune.
in scheme: Relations internationales
in scheme: concepts
notation: AFET83

organisation-cadre
type: ConceptConcept
type: Concept
creator: Commission d'enrichissement de la langue française, FranceTerme
date parution JO: 2013-09-15
deconseille ou frequent: umbrella organisation
equivalent EN: Dachorganisation @de
equivalent EN: Dachorganisation (de)
equivalent EN: umbrella organization @en
equivalent EN: umbrella organization (en)
part of speech: nom féminin
alternative label: organisation faîtière
definition: Organisation qui en regroupe plusieurs autres et éventuellement les fédère.
in scheme: Économie et gestion d'entreprise
in scheme: Relations internationales
in scheme: concepts
notation: AFET84

accaparement de terres
type: ConceptConcept
type: Concept
creator: Commission d'enrichissement de la langue française, FranceTerme
date parution JO: 2013-09-15
deconseille ou frequent: landgrabbing
equivalent EN: land grabbing @en
equivalent EN: land grabbing (en)
alternative label: mainmise foncière
definition: Acquisition massive de terres agricoles par des investisseurs ou des États étrangers, souvent en vue de cultures spéculatives.
in scheme: Agriculture
in scheme: Relations internationales
in scheme: concepts
notation: AFET85

pouvoir alimentaire
type: ConceptConcept
type: Concept
creator: Commission d'enrichissement de la langue française, FranceTerme
date parution JO: 2013-09-15
equivalent EN: food power @en
equivalent EN: food power (en)
definition: Capacité d'un État, d'un groupe d'États ou de grandes entreprises à imposer leur domination en usant de moyens de pression dans le domaine agroalimentaire.
in scheme: Agriculture
in scheme: Relations internationales
in scheme: concepts
notation: AFET86
related: hydrostratégie

pouvoir de contraindre
type: ConceptConcept
type: Concept
creator: Commission d'enrichissement de la langue française, FranceTerme
date parution JO: 2006-09-16
equivalent EN: hard power @en
equivalent EN: hard power (en)
definition: Capacité d'un État ou d'un groupe d'États à imposer ses vues à un ou plusieurs autres en usant de divers moyens de pression et de coercition, sans exclure le recours à la force armée.
in scheme: Relations internationales
in scheme: concepts
notation: AFET9
related: pouvoir de convaincre
related: pouvoir intelligent

approche par thèmes
type: ConceptConcept
type: Concept
creator: Commission d'enrichissement de la langue française, FranceTerme
date parution JO: 2013-09-15
equivalent EN: basket approach @en
equivalent EN: basket approach (en)
alternative label: approche par corbeilles
definition: Méthode de négociation consistant à répartir les questions en différents thèmes pour en faciliter l'examen.
in scheme: Relations internationales
in scheme: concepts
notation: AFET90

façonnage d'image
type: ConceptConcept
type: Concept
creator: Commission d'enrichissement de la langue française, FranceTerme
date parution JO: 2013-09-15
equivalent EN: nation branding @en
equivalent EN: nation branding (en)
definition: Ensemble d'actions par lesquelles un pays cherche à valoriser son image sur la scène internationale.
in scheme: Communication
in scheme: Relations internationales
in scheme: concepts
notation: AFET93
note: Le façonnage d'image consiste notamment, pour un pays, à se prévaloir de son patrimoine historique ou culturel ou de certains points forts de son économie.

démondialisation
type: ConceptConcept
type: Concept
creator: Commission d'enrichissement de la langue française, FranceTerme
date parution JO: 2013-09-15
deconseille ou frequent: deglobalisation
equivalent EN: deglobalization @en
equivalent EN: deglobalization (en)
part of speech: nom féminin
definition: Political vision that questions globalization. @en
definition: Projet politique qui remet en cause la mondialisation.
in scheme: Économie générale
in scheme: Relations internationales
in scheme: concepts
notation: AFET96
preferred label: deglobalization @en

acide désoxyribonucléique
type: ConceptConcept
type: Concept
creator: Commission d'enrichissement de la langue française, FranceTerme
source: révision de l'arrêté du 14 septembre 1990
abbreviation: ADN
abbreviation: DNA @en
date parution JO: 2000-09-22
equivalent EN: DNA @en
equivalent EN: DNA (en)
equivalent EN: desoxyribonucleic acid @en
equivalent EN: desoxyribonucleic acid (en)
definition: Macromolécule formée de désoxyribonucléotides, qui constitue le matériel génétique de toutes les cellules eucaryotes, des cellules procaryotes et de certains virus.
in scheme: Biologie
in scheme: concept-SD-biologie-genie-genetique
in scheme: concepts
notation: AGRI1
note: Cette macromolécule est le support essentiel de l'hérédité.
related: acide ribonucléique

ADN répétitif
type: ConceptConcept
type: Concept
creator: Commission d'enrichissement de la langue française, FranceTerme
source: révision de l'arrêté du 14 septembre 1990
date parution JO: 2000-09-22
equivalent EN: repetitive DNA @en
equivalent EN: repetitive DNA (en)
definition: Séquences d'ADN identiques ou quasi identiques, qui se répètent un très grand nombre de fois dans le génome.
in scheme: Biologie
in scheme: concept-SD-biologie-genie-genetique
in scheme: concepts
notation: AGRI10

débit caractéristique
type: ConceptConcept
type: Concept
creator: Commission d'enrichissement de la langue française, FranceTerme
source: révision de l'arrêté du 7 avril 1987
date parution JO: 2000-09-22
equivalent EN: drainage design rate @en
equivalent EN: drainage design rate (en)
definition: Débit pour lequel est conçu ou projeté un aménagement hydraulique.
in scheme: Hydraulique
in scheme: concept-SD-hydraulique-drainage-agricole
in scheme: concepts
notation: AGRI100

débit de pointe
type: ConceptConcept
type: Concept
creator: Commission d'enrichissement de la langue française, FranceTerme
source: révision de l'arrêté du 7 avril 1987
date parution JO: 2000-09-22
equivalent EN: peak flow @en
equivalent EN: peak flow (en)
definition: Débit élevé observable à la sortie d'un réseau de drainage pendant et juste après une pluie.
in scheme: Hydraulique
in scheme: concept-SD-hydraulique-drainage-agricole
in scheme: concepts
notation: AGRI101

débit de tarissement
type: ConceptConcept
type: Concept
creator: Commission d'enrichissement de la langue française, FranceTerme
source: révision de l'arrêté du 7 avril 1987
date parution JO: 2000-09-22
equivalent EN: recession discharge @en
equivalent EN: recession discharge (en)
definition: Débit du réseau de drainage au cours du rabattement de la nappe dans la masse du sol, en l'absence de réalimentation par infiltration.
in scheme: Hydraulique
in scheme: concept-SD-hydraulique-drainage-agricole
in scheme: concepts
notation: AGRI102

débit d'une nappe
type: ConceptConcept
type: Concept
creator: Commission d'enrichissement de la langue française, FranceTerme
source: révision de l'arrêté du 7 avril 1987
date parution JO: 2000-09-22
equivalent EN: seepage flow @en
equivalent EN: seepage flow (en)
definition: Volume d'eau traversant, par unité de temps, une section définie d'un aquifère, sous l'effet d'un gradient hydraulique donné.
in scheme: Hydraulique
in scheme: concepts
notation: AGRI103

débit spécifique
type: ConceptConcept
type: Concept
creator: Commission d'enrichissement de la langue française, FranceTerme
source: révision de l'arrêté du 7 avril 1987
date parution JO: 2000-09-22
equivalent EN: specific discharge @en
equivalent EN: specific discharge (en)
definition: Débit rapporté à l'unité de superficie du bassin versant.
in scheme: Hydraulique
in scheme: concepts
notation: AGRI104

débit unitaire
type: ConceptConcept
type: Concept
creator: Commission d'enrichissement de la langue française, FranceTerme
source: révision de l'arrêté du 7 avril 1987
date parution JO: 2000-09-22
equivalent EN: unit discharge @en
equivalent EN: unit discharge (en)
definition: Flux d'eau à travers un milieu aquifère saturé, par unité de surface perpendiculaire à la direction de l'écoulement.
in scheme: Hydraulique
in scheme: concepts
notation: AGRI105

décalage du cadre de lecture
type: ConceptConcept
type: Concept
creator: Commission d'enrichissement de la langue française, FranceTerme
source: révision de l'arrêté du 14 septembre 1990
date parution JO: 2000-09-22
equivalent EN: frameshift mutation @en
equivalent EN: frameshift mutation (en)
equivalent EN: reading frameshift @en
equivalent EN: reading frameshift (en)
alternative label: mutation du cadre de lecture
definition: Mutation provoquée par des délétions ou des insertions qui ne sont pas des multiples de trois paires de bases, ce qui change le cadre de lecture.
in scheme: Biologie
in scheme: concept-SD-biologie-genie-genetique
in scheme: concepts
notation: AGRI106
related: délétion
related: insertion
related: cadre de lecture
related: paire de bases

défectif, -ive
type: ConceptConcept
type: Concept
creator: Commission d'enrichissement de la langue française, FranceTerme
source: révision de l'arrêté du 14 septembre 1990
date parution JO: 2000-09-22
equivalent EN: defective @en
equivalent EN: defective (en)
part of speech: adjectif
definition: Se dit d'un bactériophage ou d'un virus qui, par suite d'une ou plusieurs mutations, est incapable d'accomplir seul son cycle infectieux.
in scheme: Biologie
in scheme: concept-SD-biologie-genie-genetique
in scheme: concept-SD-biologie-virologie
in scheme: concepts
notation: AGRI107
related: phage défectif

délétion
type: ConceptConcept
type: Concept
creator: Commission d'enrichissement de la langue française, FranceTerme
source: révision de l'arrêté du 14 septembre 1990
date parution JO: 2000-09-22
equivalent EN: deletion @en
equivalent EN: deletion (en)
part of speech: nom féminin
definition: Perte d'une partie du matériel génétique pouvant aller d'un seul nucléotide à plusieurs gènes.
in scheme: Biologie
in scheme: concept-SD-biologie-genie-genetique
in scheme: concepts
notation: AGRI108
related: décalage du cadre de lecture
related: mutation ponctuelle

dénaturation d'acide nucléique
type: ConceptConcept
type: Concept
creator: Commission d'enrichissement de la langue française, FranceTerme
source: révision de l'arrêté du 14 septembre 1990
date parution JO: 2000-09-22
equivalent EN: nucleic acid denaturation @en
equivalent EN: nucleic acid denaturation (en)
definition: Conversion d'un acide nucléique de l'état double brin à l'état simple brin.
in scheme: Biologie
in scheme: concept-SD-biologie-genie-genetique
in scheme: concepts
notation: AGRI109
note: La séparation des brins est obtenue très fréquemment par la chaleur ou par alcalinisation.
related: renaturation d'acide nucléique
related: température de fusion

ADN satellite
type: ConceptConcept
type: Concept
creator: Commission d'enrichissement de la langue française, FranceTerme
source: révision de l'arrêté du 14 septembre 1990
date parution JO: 2000-09-22
equivalent EN: satellite DNA @en
equivalent EN: satellite DNA (en)
definition: Fragment d'ADN contenant des séquences répétées en tandem, et dont la composition en bases est différente de la moyenne de l'ADN génomique de l'organisme considéré.
in scheme: Biologie
in scheme: concept-SD-biologie-genie-genetique
in scheme: concepts
notation: AGRI11
note: L'ADN satellite peut être séparé du reste de l'ADN génomique par centrifugation en gradient de densité.
related: séquences répétées en tandem

dérépression
type: ConceptConcept
type: Concept
creator: Commission d'enrichissement de la langue française, FranceTerme
source: révision de l'arrêté du 14 septembre 1990
date parution JO: 2000-09-22
equivalent EN: derepression @en
equivalent EN: derepression (en)
part of speech: nom féminin
definition: Phénomène de levée des mécanismes qui répriment la transcription d'un gène ou d'un groupe de gènes.
in scheme: Biologie
in scheme: concept-SD-biologie-genie-genetique
in scheme: concepts
notation: AGRI110

diagnostic génétique
type: ConceptConcept
type: Concept
creator: Commission d'enrichissement de la langue française, FranceTerme
source: révision de l'arrêté du 14 septembre 1990
date parution JO: 2000-09-22
equivalent EN: genetic diagnosis @en
equivalent EN: genetic diagnosis (en)
definition: Détection de gènes d'un organisme par hybridation de son génome avec des sondes moléculaires spécifiques.
in scheme: Biologie
in scheme: concept-SD-biologie-genie-genetique
in scheme: concepts
notation: AGRI111
note: Cette méthode est utilisée par exemple pour le diagnostic prénatal de certaines maladies héréditaires ou pour la détermination parentale.

distance génétique
type: ConceptConcept
type: Concept
creator: Commission d'enrichissement de la langue française, FranceTerme
source: révision de l'arrêté du 14 septembre 1990
date parution JO: 2000-09-22
equivalent EN: genetic distance @en
equivalent EN: genetic distance (en)
definition: Évaluation du degré de dissemblance génétique entre deux génomes.
in scheme: Biologie
in scheme: concept-SD-biologie-genie-genetique
in scheme: concepts
notation: AGRI112

drainage-taupe
type: ConceptConcept
type: Concept
creator: Commission d'enrichissement de la langue française, FranceTerme
source: révision de l'arrêté du 7 avril 1987
date parution JO: 2000-09-22
equivalent EN: mole drainage @en
equivalent EN: mole drainage (en)
part of speech: nom masculin
definition: Technique associée au drainage, consistant en la création de galeries moulées dans un sol plastique suffisamment stable et débouchant dans un fossé ou une tranchée drainante très perméable.
in scheme: Hydraulique
in scheme: concept-SD-hydraulique-drainage-agricole
in scheme: concepts
notation: AGRI113

biomasse des géniteurs d'un stock
type: ConceptConcept
type: Concept
creator: Commission d'enrichissement de la langue française, FranceTerme
abbreviation: SSB @en
date parution JO: 2001-11-30
equivalent EN: SSB @en
equivalent EN: SSB (en)
equivalent EN: spawning stock biomass @en
equivalent EN: spawning stock biomass (en)
definition: Biomasse des individus d'un stock capables de se reproduire.
in scheme: Pêche et aquaculture
in scheme: concept-SD-peche-et-aquaculture-peche-maritime
in scheme: concepts
notation: AGRI1138

biomasse du stock
type: ConceptConcept
type: Concept
creator: Commission d'enrichissement de la langue française, FranceTerme
date parution JO: 2001-11-30
equivalent EN: stock biomass @en
equivalent EN: stock biomass (en)
definition: Poids total de tous les individus du stock, présents à un moment donné dans la zone d'extension de ce stock.
in scheme: Pêche et aquaculture
in scheme: concept-SD-peche-et-aquaculture-peche-maritime
in scheme: concepts
notation: AGRI1139

eau capillaire
type: ConceptConcept
type: Concept
creator: Commission d'enrichissement de la langue française, FranceTerme
source: révision de l'arrêté du 7 avril 1987
date parution JO: 2000-09-22
equivalent EN: capillary moisture @en
equivalent EN: capillary moisture (en)
equivalent EN: capillary water @en
equivalent EN: capillary water (en)
definition: Eau maintenue dans un milieu poreux, généralement au-dessus d'une surface libre, sous l'effet des forces capillaires, et soumise à une pression inférieure à la pression atmosphérique.
in scheme: Hydraulique
in scheme: concept-SD-hydraulique-drainage-agricole
in scheme: concepts
notation: AGRI114

capacité de capture
type: ConceptConcept
type: Concept
creator: Commission d'enrichissement de la langue française, FranceTerme
date parution JO: 2001-11-30
equivalent EN: catch capacity @en
equivalent EN: catch capacity (en)
equivalent EN: fishing capacity @en
equivalent EN: fishing capacity (en)
definition: Ensemble des moyens de capture disponibles pendant une période donnée et sur une zone déterminée.
in scheme: Pêche et aquaculture
in scheme: concept-SD-peche-et-aquaculture-peche-maritime
in scheme: concepts
notation: AGRI1140
note: Cette somme est fonction des caractéristiques des navires et des engins de pêche utilisés.

capture accessoire
type: ConceptConcept
type: Concept
creator: Commission d'enrichissement de la langue française, FranceTerme
date parution JO: 2001-11-30
equivalent EN: by-catch @en
equivalent EN: by-catch (en)
alternative label: prise accessoire
definition: Espèce capturée à l'occasion d'une pêche dirigée sur une autre espèce ou un autre groupe d'espèces.
in scheme: Pêche et aquaculture
in scheme: concept-SD-peche-et-aquaculture-peche-maritime
in scheme: concepts
notation: AGRI1141

effort de pêche
type: ConceptConcept
type: Concept
creator: Commission d'enrichissement de la langue française, FranceTerme
date parution JO: 2001-11-30
equivalent EN: fishing effort @en
equivalent EN: fishing effort (en)
definition: Ensemble des moyens de capture mis en œuvre par un navire pendant une période donnée et dans une zone déterminée.
in scheme: Pêche et aquaculture
in scheme: concept-SD-peche-et-aquaculture-peche-maritime
in scheme: concepts
notation: AGRI1142
note: La somme des moyens est fonction des caractéristiques du navire, de son activité et des engins de pêche utilisés.

espèce cible
type: ConceptConcept
type: Concept
creator: Commission d'enrichissement de la langue française, FranceTerme
date parution JO: 2001-11-30
equivalent EN: target species @en
equivalent EN: target species (en)
definition: Espèce sur laquelle le pêcheur a décidé de porter son activité de pêche et pour laquelle il a adapté son matériel.
in scheme: Pêche et aquaculture
in scheme: concept-SD-peche-et-aquaculture-peche-maritime
in scheme: concepts
notation: AGRI1143
related: métier
related: pêche ciblée
related: pêche monospécifique
related: pêche plurispécifique

métier
type: ConceptConcept
type: Concept
creator: Commission d'enrichissement de la langue française, FranceTerme
date parution JO: 2001-11-30
equivalent EN: metier @en
equivalent EN: metier (en)
part of speech: nom masculin
definition: Activité pratiquée par une unité de pêche et définie, au minimum, par une combinaison entre engin de pêche, espèce cible et zone d'activité.
in scheme: Pêche et aquaculture
in scheme: concept-SD-peche-et-aquaculture-peche-maritime
in scheme: concepts
notation: AGRI1144
note: 1. À chaque métier doit en principe correspondre un diagramme d'exploitation caractéristique par espèce.
note: 2. Plusieurs métiers peuvent être pratiqués par un même bateau.
related: espèce cible

moule
type: ConceptConcept
type: Concept
creator: Commission d'enrichissement de la langue française, FranceTerme
date parution JO: 2001-11-30
equivalent EN: count @en
equivalent EN: count (en)
part of speech: nom masculin
definition: Nombre d'individus d'une pêche monospécifique compris dans un échantillon d'un poids déterminé.
in scheme: Pêche et aquaculture
in scheme: concept-SD-peche-et-aquaculture-peche-maritime
in scheme: concepts
notation: AGRI1145
related: pêche monospécifique

pêche ciblée
type: ConceptConcept
type: Concept
creator: Commission d'enrichissement de la langue française, FranceTerme
date parution JO: 2001-11-30
equivalent EN: directed fishing @en
equivalent EN: directed fishing (en)
definition: Pêche destinée à la capture d'une espèce cible.
in scheme: Pêche et aquaculture
in scheme: concept-SD-peche-et-aquaculture-peche-maritime
in scheme: concepts
notation: AGRI1146
related: espèce cible
related: concept-peche-et-aquaculture

pêche monospécifique
type: ConceptConcept
type: Concept
creator: Commission d'enrichissement de la langue française, FranceTerme
date parution JO: 2001-11-30
equivalent EN: single-species fishery @en
equivalent EN: single-species fishery (en)
definition: Pêche dirigée vers la capture d'une seule espèce cible.
in scheme: Pêche et aquaculture
in scheme: concept-SD-peche-et-aquaculture-peche-maritime
in scheme: concepts
notation: AGRI1147
related: espèce cible
related: moule
related: concept-peche-et-aquaculture

pêche plurispécifique
type: ConceptConcept
type: Concept
creator: Commission d'enrichissement de la langue française, FranceTerme
date parution JO: 2001-11-30
equivalent EN: multispecies fishery @en
equivalent EN: multispecies fishery (en)
definition: Pêche dirigée vers la capture de plusieurs espèces cibles.
in scheme: Pêche et aquaculture
in scheme: concept-SD-peche-et-aquaculture-peche-maritime
in scheme: concepts
notation: AGRI1148
related: espèce cible
related: concept-peche-et-aquaculture

pêche sélective
type: ConceptConcept
type: Concept
creator: Commission d'enrichissement de la langue française, FranceTerme
date parution JO: 2001-11-30
equivalent EN: selective fishing @en
equivalent EN: selective fishing (en)
definition: Pêche mettant en œuvre des engins et des techniques capables de capturer soit des espèces déterminées, soit des individus de taille ou de poids déterminés.
in scheme: Pêche et aquaculture
in scheme: concept-SD-peche-et-aquaculture-peche-maritime
in scheme: concepts
notation: AGRI1149
related: pêche minotière

eau de rétention
type: ConceptConcept
type: Concept
creator: Commission d'enrichissement de la langue française, FranceTerme
source: révision de l'arrêté du 7 avril 1987
date parution JO: 2000-09-22
equivalent EN: bound water @en
equivalent EN: bound water (en)
definition: Toute eau maintenue par des liaisons physiques dans les vides du milieu poreux, saturé ou non, et non mobilisable par les seules forces de gravité.
in scheme: Hydraulique
in scheme: concept-SD-hydraulique-drainage-agricole
in scheme: concepts
notation: AGRI115

poids débarqué
type: ConceptConcept
type: Concept
creator: Commission d'enrichissement de la langue française, FranceTerme
date parution JO: 2001-11-30
equivalent EN: landed weight @en
equivalent EN: landed weight (en)
definition: Poids d'un individu ou d'un ensemble d'individus lors de la première pesée après débarquement ou transbordement.
in scheme: Pêche et aquaculture
in scheme: concept-SD-peche-et-aquaculture-peche-maritime
in scheme: concepts
notation: AGRI1150

stock
type: ConceptConcept
type: Concept
creator: Commission d'enrichissement de la langue française, FranceTerme
date parution JO: 2001-11-30
equivalent EN: stock @en
equivalent EN: stock (en)
part of speech: nom masculin
definition: Ensemble d'individus qui, du fait de caractéristiques biologiques homogènes, peut constituer une unité de gestion (stock) ou une unité d'évaluation biologique (stock biologique).
in scheme: Pêche et aquaculture
in scheme: concept-SD-peche-et-aquaculture-peche-maritime
in scheme: concepts
notation: AGRI1151
related: total autorisé de capture

stock chevauchant
type: ConceptConcept
type: Concept
creator: Commission d'enrichissement de la langue française, FranceTerme
date parution JO: 2001-11-30
equivalent EN: straddling stock @en
equivalent EN: straddling stock (en)
definition: Stock dont le cycle biologique se déroule dans un secteur géographique couvrant des zones placées sous des juridictions différentes.
in scheme: Pêche et aquaculture
in scheme: concept-SD-peche-et-aquaculture-peche-maritime
in scheme: concepts
notation: AGRI1152

stock sensible
type: ConceptConcept
type: Concept
creator: Commission d'enrichissement de la langue française, FranceTerme
date parution JO: 2001-11-30
equivalent EN: sensitive stock @en
equivalent EN: sensitive stock (en)
definition: Stock soumis à une exploitation excessive qui peut en menacer la pérennité.
in scheme: Pêche et aquaculture
in scheme: concept-SD-peche-et-aquaculture-peche-maritime
in scheme: concepts
notation: AGRI1153

stocks partagés
type: ConceptConcept
type: Concept
creator: Commission d'enrichissement de la langue française, FranceTerme
date parution JO: 2001-11-30
equivalent EN: shared stocks @en
equivalent EN: shared stocks (en)
definition: Stocks exploités par plusieurs flottilles soumises à des règlementations différentes.
in scheme: Pêche et aquaculture
in scheme: concept-SD-peche-et-aquaculture-peche-maritime
in scheme: concepts
notation: AGRI1154

TAC de précaution
type: ConceptConcept
type: Concept
creator: Commission d'enrichissement de la langue française, FranceTerme
date parution JO: 2001-11-30
equivalent EN: precautionary TAC @en
equivalent EN: precautionary TAC (en)
definition: Total autorisé de capture établi en l'absence de données suffisantes pour un diagnostic précis de l'état d'un stock, de façon à ne pas hypothéquer l'avenir de l'exploitation de ce stock ou à éviter les déclarations erronées.
in scheme: Pêche et aquaculture
in scheme: concept-SD-peche-et-aquaculture-peche-maritime
in scheme: concepts
notation: AGRI1155
related: total autorisé de capture

TAC pluriannuel
type: ConceptConcept
type: Concept
creator: Commission d'enrichissement de la langue française, FranceTerme
date parution JO: 2001-11-30
equivalent EN: multiannual TAC @en
equivalent EN: multiannual TAC (en)
definition: Total autorisé de capture défini pour une période dépassant l'année civile.
in scheme: Pêche et aquaculture
in scheme: concept-SD-peche-et-aquaculture-peche-maritime
in scheme: concepts
notation: AGRI1156
related: total autorisé de capture

TAC plurispécifique
type: ConceptConcept
type: Concept
creator: Commission d'enrichissement de la langue française, FranceTerme
date parution JO: 2001-11-30
equivalent EN: multispecies TAC @en
equivalent EN: multispecies TAC (en)
definition: Total autorisé de capture global combinant les TAC d'espèces capturables ensemble.
in scheme: Pêche et aquaculture
in scheme: concept-SD-peche-et-aquaculture-peche-maritime
in scheme: concepts
notation: AGRI1157
related: total autorisé de capture

taille minimale de capture
type: ConceptConcept
type: Concept
creator: Commission d'enrichissement de la langue française, FranceTerme
date parution JO: 2001-11-30
equivalent EN: minimum size @en
equivalent EN: minimum size (en)
definition: Taille des individus d'une espèce ou d'un groupe d'espèces, en dessous de laquelle sont interdits le stockage à bord, le transbordement, le transport, le débarquement et la commercialisation.
in scheme: Pêche et aquaculture
in scheme: concept-SD-peche-et-aquaculture-peche-maritime
in scheme: concepts
notation: AGRI1158

total autorisé de capture
type: ConceptConcept
type: Concept
creator: Commission d'enrichissement de la langue française, FranceTerme
abbreviation: TAC
date parution JO: 2001-11-30
equivalent EN: TAC @en
equivalent EN: TAC (en)
equivalent EN: total allowable catch @en
equivalent EN: total allowable catch (en)
definition: Sur un stock déterminé, quantité en poids de capture que l'on décide de ne pas dépasser, au vu de l'analyse biologique de l'état actuel du stock, afin d'assurer la pérennité de son exploitation.
in scheme: Pêche et aquaculture
in scheme: concept-SD-peche-et-aquaculture-peche-maritime
in scheme: concepts
notation: AGRI1159
related: stock
related: TAC de précaution
related: TAC pluriannuel
related: TAC plurispécifique

eau libre
type: ConceptConcept
type: Concept
creator: Commission d'enrichissement de la langue française, FranceTerme
source: révision de l'arrêté du 7 avril 1987
date parution JO: 2000-09-22
deconseille ou frequent: eau gravitaire
equivalent EN: free water @en
equivalent EN: free water (en)
definition: Eau du sol sur laquelle l'action de la gravité est prépondérante et qui est mobilisable par gravité.
in scheme: Hydraulique
in scheme: concept-SD-hydraulique-drainage-agricole
in scheme: concepts
notation: AGRI116
note: Le terme « eau gravitaire » est à éviter.

total autorisé d'effort de pêche
type: ConceptConcept
type: Concept
creator: Commission d'enrichissement de la langue française, FranceTerme
abbreviation: TAE @en
abbreviation: TAFE @en
date parution JO: 2001-11-30
equivalent EN: TAE @en
equivalent EN: TAE (en)
equivalent EN: TAFE @en
equivalent EN: TAFE (en)
equivalent EN: total allowable effort @en
equivalent EN: total allowable effort (en)
equivalent EN: total allowable fishing effort @en
equivalent EN: total allowable fishing effort (en)
forme abregee: TAE
definition: Contingentement de l'effort de pêche global dans une unité de gestion de la ressource.
in scheme: Pêche et aquaculture
in scheme: concept-SD-peche-et-aquaculture-peche-maritime
in scheme: concepts
notation: AGRI1160

normes de commercialisation
type: ConceptConcept
type: Concept
creator: Commission d'enrichissement de la langue française, FranceTerme
date parution JO: 2001-11-30
equivalent EN: common marketing standards @en
equivalent EN: common marketing standards (en)
equivalent EN: marketing standards @en
equivalent EN: marketing standards (en)
in scheme: Pêche et aquaculture
in scheme: concept-SD-peche-et-aquaculture-peche-maritime
in scheme: concepts
notation: AGRI1161

première mise en marché
type: ConceptConcept
type: Concept
creator: Commission d'enrichissement de la langue française, FranceTerme
date parution JO: 2001-11-30
equivalent EN: first marketing @en
equivalent EN: first marketing (en)
in scheme: Pêche et aquaculture
in scheme: concept-SD-peche-et-aquaculture-peche-maritime
in scheme: concepts
notation: AGRI1162

campagne de pêche
type: ConceptConcept
type: Concept
creator: Commission d'enrichissement de la langue française, FranceTerme
date parution JO: 2001-11-30
equivalent EN: fishery @en
equivalent EN: fishery (en)
in scheme: Pêche et aquaculture
in scheme: concept-SD-peche-et-aquaculture-peche-maritime
in scheme: concepts
notation: AGRI1163

pêcherie
type: ConceptConcept
type: Concept
creator: Commission d'enrichissement de la langue française, FranceTerme
date parution JO: 2001-11-30
equivalent EN: fishery @en
equivalent EN: fishery (en)
part of speech: nom féminin
in scheme: Pêche et aquaculture
in scheme: concept-SD-peche-et-aquaculture-peche-maritime
in scheme: concepts
notation: AGRI1164

licence de pêche
type: ConceptConcept
type: Concept
creator: Commission d'enrichissement de la langue française, FranceTerme
date parution JO: 2001-11-30
equivalent EN: licensing @en
equivalent EN: licensing (en)
in scheme: Pêche et aquaculture
in scheme: concept-SD-peche-et-aquaculture-peche-maritime
in scheme: concepts
notation: AGRI1165

poids vif
type: ConceptConcept
type: Concept
creator: Commission d'enrichissement de la langue française, FranceTerme
date parution JO: 2001-11-30
equivalent EN: live weight @en
equivalent EN: live weight (en)
in scheme: Pêche et aquaculture
in scheme: concept-SD-peche-et-aquaculture-peche-maritime
in scheme: concepts
notation: AGRI1166

surexploitation
type: ConceptConcept
type: Concept
creator: Commission d'enrichissement de la langue française, FranceTerme
date parution JO: 2001-11-30
equivalent EN: overfishing @en
equivalent EN: overfishing (en)
part of speech: nom féminin
in scheme: Pêche et aquaculture
in scheme: concept-SD-peche-et-aquaculture-peche-maritime
in scheme: concepts
notation: AGRI1167

organisation de producteurs
type: ConceptConcept
type: Concept
creator: Commission d'enrichissement de la langue française, FranceTerme
date parution JO: 2001-11-30
equivalent EN: producers' organization @en
equivalent EN: producers' organization (en)
in scheme: Pêche et aquaculture
in scheme: concept-SD-peche-et-aquaculture-peche-maritime
in scheme: concepts
notation: AGRI1168

capteur
type: ConceptConcept
type: Concept
creator: Commission d'enrichissement de la langue française, FranceTerme
date parution JO: 2001-11-30
equivalent EN: sensor @en
equivalent EN: sensor (en)
part of speech: nom masculin
in scheme: Pêche et aquaculture
in scheme: concept-SD-peche-et-aquaculture-peche-maritime
in scheme: concepts
notation: AGRI1169
related: concept-SPAT320

écoulement de type fluvial
type: ConceptConcept
type: Concept
creator: Commission d'enrichissement de la langue française, FranceTerme
source: révision de l'arrêté du 7 avril 1987
date parution JO: 2000-09-22
equivalent EN: sub-critical flow @en
equivalent EN: sub-critical flow (en)
forme abregee: écoulement fluvial
definition: Écoulement à surface libre dont le tirant d'eau est supérieur au tirant d'eau critique.
in scheme: Hydraulique
in scheme: concepts
notation: AGRI117
related: écoulement torrentiel

prix de retrait
type: ConceptConcept
type: Concept
creator: Commission d'enrichissement de la langue française, FranceTerme
date parution JO: 2001-11-30
equivalent EN: withdrawal price @en
equivalent EN: withdrawal price (en)
in scheme: Pêche et aquaculture
in scheme: concept-SD-peche-et-aquaculture-peche-maritime
in scheme: concepts
notation: AGRI1170

transfert de colonies de cellules
type: ConceptConcept
type: Concept
creator: Commission d'enrichissement de la langue française, FranceTerme
source: révision de l'arrêté du 14 septembre 1990
date parution JO: 2000-09-22
equivalent EN: colony lift @en
equivalent EN: colony lift (en)
in scheme: Biologie
in scheme: concept-SD-biologie-genie-genetique
in scheme: concepts
notation: AGRI1171

tarissement
type: ConceptConcept
type: Concept
creator: Commission d'enrichissement de la langue française, FranceTerme
source: révision de l'arrêté du 7 avril 1987
date parution JO: 2000-09-22
equivalent EN: recession @en
equivalent EN: recession (en)
part of speech: nom masculin
in scheme: Hydraulique
in scheme: Sciences de la Terre
in scheme: concept-SD-hydraulique-hydrogeologie
in scheme: concept-SD-sciences-de-la-terre-hydrogeologie
in scheme: concepts
notation: AGRI1172

ruissellement
type: ConceptConcept
type: Concept
creator: Commission d'enrichissement de la langue française, FranceTerme
source: révision de l'arrêté du 7 avril 1987
date parution JO: 2000-09-22
equivalent EN: runoff @en
equivalent EN: runoff (en)
part of speech: nom masculin
in scheme: Sciences de la Terre
in scheme: concept-SD-sciences-de-la-terre-hydrologie
in scheme: concepts
notation: AGRI1174

ressuyé
type: ConceptConcept
type: Concept
creator: Commission d'enrichissement de la langue française, FranceTerme
source: révision de l'arrêté du 7 avril 1987
date parution JO: 2000-09-22
equivalent EN: dried @en
equivalent EN: dried (en)
part of speech: adjectif
in scheme: Hydraulique
in scheme: concept-SD-hydraulique-drainage-agricole
in scheme: concepts
notation: AGRI1175

ressuyage
type: ConceptConcept
type: Concept
creator: Commission d'enrichissement de la langue française, FranceTerme
source: révision de l'arrêté du 7 avril 1987
date parution JO: 2000-09-22
equivalent EN: drying @en
equivalent EN: drying (en)
part of speech: nom masculin
in scheme: Hydraulique
in scheme: concept-SD-hydraulique-drainage-agricole
in scheme: concepts
notation: AGRI1176

journal de pêche
type: ConceptConcept
type: Concept
creator: Commission d'enrichissement de la langue française, FranceTerme
source: révision de l'arrêté du 28 novembre 1985
date parution JO: 2000-09-22
equivalent EN: log book @en
equivalent EN: log book (en)
in scheme: Pêche et aquaculture
in scheme: concept-SD-peche-et-aquaculture-peche-maritime
in scheme: concepts
notation: AGRI1177

génie génétique
type: ConceptConcept
type: Concept
creator: Commission d'enrichissement de la langue française, FranceTerme
source: révision de l'arrêté du 14 septembre 1990
date parution JO: 2000-09-22
equivalent EN: genetic engineering @en
equivalent EN: genetic engineering (en)
in scheme: Biologie
in scheme: concepts
notation: AGRI1178

excès d'eau
type: ConceptConcept
type: Concept
creator: Commission d'enrichissement de la langue française, FranceTerme
source: révision de l'arrêté du 7 avril 1987
date parution JO: 2000-09-22
equivalent EN: excess water @en
equivalent EN: excess water (en)
in scheme: Hydraulique
in scheme: concept-SD-hydraulique-drainage-agricole
in scheme: concepts
notation: AGRI1179

écoulement laminaire
type: ConceptConcept
type: Concept
creator: Commission d'enrichissement de la langue française, FranceTerme
source: révision de l'arrêté du 7 avril 1987
date parution JO: 2000-09-22
equivalent EN: laminar flow @en
equivalent EN: laminar flow (en)
definition: Mouvement d'un fluide dont la vitesse réelle est suffisamment faible pour que le phénomène de turbulence soit négligeable.
in scheme: Hydraulique
in scheme: concepts
notation: AGRI118
note: 1. La perte de charge hydraulique est directement proportionnelle au débit.
note: 2. « Écoulement laminaire » est l'antonyme d' « écoulement turbulent ».

efficace
type: ConceptConcept
type: Concept
creator: Commission d'enrichissement de la langue française, FranceTerme
source: révision de l'arrêté du 7 avril 1987
date parution JO: 2000-09-22
equivalent EN: effective @en
equivalent EN: effective (en)
part of speech: adjectif
in scheme: Agriculture
in scheme: Sciences de la Terre
in scheme: concept-SD-agriculture-hydrologie
in scheme: concept-SD-sciences-de-la-terre-hydrologie
in scheme: concepts
notation: AGRI1180

caisse de criée
type: ConceptConcept
type: Concept
creator: Commission d'enrichissement de la langue française, FranceTerme
source: révision de l'arrêté du 28 novembre 1985
date parution JO: 2000-09-22
equivalent EN: box @en
equivalent EN: box (en)
in scheme: Pêche et aquaculture
in scheme: concept-SD-peche-et-aquaculture-peche-maritime
in scheme: concepts
notation: AGRI1181

agroalimentaire
type: ConceptConcept
type: Concept
creator: Commission d'enrichissement de la langue française, FranceTerme
date parution JO: 2004-06-12
deconseille ou frequent: agri-food industry
deconseille ou frequent: agri-food sector
deconseille ou frequent: agri-food system
deconseille ou frequent: agro-alimentaire
deconseille ou frequent: agro-food industry
deconseille ou frequent: agro-food sector
deconseille ou frequent: agro-food system
deconseille ou frequent: food and agriculture industry
equivalent EN: agri-food (US) @en
equivalent EN: agri-food (en-US) [industry, sector, system...]
equivalent EN: agro-food (GB) @en
equivalent EN: agro-food (en-GB) [industry, sector, system...]
equivalent EN: food and agriculture @en
equivalent EN: food and agriculture (en) [industry]
equivalent EN: food business @en
equivalent EN: food business (en)
part of speech: adjectif
definition: Qualifie l'ensemble des activités de transformation des produits alimentaires.
in scheme: Agriculture
in scheme: concept-SD-agriculture-industries-agricoles-et-alimentaires
in scheme: concepts
notation: AGRI1184
note: L'usage du terme « agroalimentaire » comme substantif masculin est attesté.
related: agro-industrie

réexamen
type: ConceptConcept
type: Concept
creator: Commission d'enrichissement de la langue française, FranceTerme
date parution JO: 2004-06-12
equivalent EN: reperformance @en
equivalent EN: reperformance (en)
part of speech: nom masculin
definition: Vérification de la correcte application des procédures de contrôle.
in scheme: Agriculture
in scheme: concept-SD-agriculture-politique-agricole
in scheme: concepts
notation: AGRI1185

écoulement permanent
type: ConceptConcept
type: Concept
creator: Commission d'enrichissement de la langue française, FranceTerme
source: révision de l'arrêté du 7 avril 1987
date parution JO: 2000-09-22
equivalent EN: steady flow @en
equivalent EN: steady flow (en)
alternative label: écoulement en régime d'équilibre
alternative label: écoulement stationnaire
definition: Écoulement à flux constant sous des conditions de potentiel invariable dans le temps.
in scheme: Hydraulique
in scheme: concepts
notation: AGRI119

amplification en chaîne par polymérase
type: ConceptConcept
type: Concept
creator: Commission d'enrichissement de la langue française, FranceTerme
abbreviation: ACP
abbreviation: PCR @en
date parution JO: 2006-11-23
deconseille ou frequent: méthode PCR
equivalent EN: PCR @en
equivalent EN: PCR (en)
equivalent EN: PCR method @en
equivalent EN: PCR method (en)
equivalent EN: polymerase chain reaction @en
equivalent EN: polymerase chain reaction (en)
definition: Procédé d'amplification exponentielle in vitro d'une séquence définie d'ADN, faisant intervenir des cycles successifs d'appariements d'oligonucléotides spécifiques et d'élongation à l'aide d'une polymérase.
in scheme: Biologie
in scheme: concept-SD-biologie-biochimie-et-biologie-moleculaire
in scheme: concept-SD-biologie-genetique
in scheme: concepts
notation: AGRI1191
note: 1. On trouve aussi, dans le langage professionnel, le terme « méthode PCR » ou, plus simplement, « PCR ».
note: 2. La méthode peut être appliquée à de l'ADN cloné, de l'ADN génomique purifié, ou à de l'ADN présent dans une seule cellule, une tache de sang, un follicule de cheveu ou un fossile.
related: polymorphisme de l'ADN révélé par amplification aléatoire
related: produit d'amplification
related: site de séquence ciblée
related: amplification rapide d'extrémités d'ADNc
scope note: Cette publication annule et remplace celle du Journal officiel du 22 septembre 2000.

analyse en série de l'expression des gènes
type: ConceptConcept
type: Concept
creator: Commission d'enrichissement de la langue française, FranceTerme
abbreviation: SAGE @en
date parution JO: 2006-11-23
deconseille ou frequent: méthode SAGE
equivalent EN: SAGE @en
equivalent EN: SAGE (en)
equivalent EN: SAGE method @en
equivalent EN: SAGE method (en)
equivalent EN: serial analysis of gene expression @en
equivalent EN: serial analysis of gene expression (en)
definition: Méthode permettant d'établir un profil d'expression génique par l'analyse quantitative de milliers de transcrits d'une cellule ou d'un tissu.
in scheme: Biologie
in scheme: concept-SD-biologie-biochimie-et-biologie-moleculaire
in scheme: concept-SD-biologie-genetique
in scheme: concepts
notation: AGRI1192
note: 1. On trouve aussi, dans le langage professionnel, le terme « méthode SAGE ».
note: 2. La méthode est fondée sur l'isolement, par endonucléase de restriction, de courts fragments d'ADN complémentaire issus d'une population d'ARN messagers qui sont réassemblés, sous forme d'étiquettes en série, en une longue molécule d'acide nucléique, amplifiée et séquencée.
note: 3. Une courte séquence (étiquette de 10 à 14 nucléotides) suffit à caractériser chacun des ARN messagers ; le nombre d'occurrences d'une même étiquette permet de déterminer le niveau d'expression du transcrit correspondant.
related: ARN messager
related: ADN complémentaire

étiquette de séquence transcrite
type: ConceptConcept
type: Concept
creator: Commission d'enrichissement de la langue française, FranceTerme
abbreviation: EST
date parution JO: 2006-11-23
deconseille ou frequent: dbEST
deconseille ou frequent: étiquettes de séquences transcrites
equivalent EN: EST @en
equivalent EN: EST (en)
equivalent EN: expressed sequence tag @en
equivalent EN: expressed sequence tag (en)
definition: Courte séquence de 300 à 500 nucléotides, résultant du séquençage partiel de chacun des clones de banques d'ADN complémentaire obtenus après extraction des ARN messagers d'un matériel vivant.
in scheme: Biologie
in scheme: concept-SD-biologie-biochimie-et-biologie-moleculaire
in scheme: concept-SD-biologie-genetique
in scheme: concepts
notation: AGRI1193
note: Les étiquettes de séquences transcrites (EST) fournissent une image instantanée des gènes exprimés dans un matériel. Ces séquences partielles sont comparées une à une à celles stockées dans les bases de données (en anglais : dbEST) et peuvent être utilisées pour la cartographie de l'ADN génomique.
related: ARN messager
related: ADN complémentaire

exposition sur phage
type: ConceptConcept
type: Concept
creator: Commission d'enrichissement de la langue française, FranceTerme
date parution JO: 2006-11-23
equivalent EN: phage display @en
equivalent EN: phage display (en)
definition: Incrustation, à la surface de l'enveloppe protéique d'un phage filamenteux, de peptides, de fragments d'anticorps ou d'autres protéines, provoquée par l'introduction de séquences correspondantes d'oligonucléotides dans le génome de ce phage.
in scheme: Biologie
in scheme: concept-SD-biologie-biochimie-et-biologie-moleculaire
in scheme: concept-SD-biologie-genetique
in scheme: concepts
notation: AGRI1194
note: Cette technique permet de caractériser de nouveaux épitopes d'antigènes, de sélectionner des anticorps monoclonaux, d'identifier des substrats d'enzymes, des ligands naturels, des récepteurs, des sites d'interaction entre protéines ou entre protéines et acides nucléiques. Elle est utilisée pour découvrir de nouvelles molécules thérapeutiques.
related: récepteur
related: ligand

génome
type: ConceptConcept
type: Concept
creator: Commission d'enrichissement de la langue française, FranceTerme
date parution JO: 2006-11-23
equivalent EN: genome @en
equivalent EN: genome (en)
part of speech: nom masculin
definition: Ensemble du matériel héréditaire composé d'acides nucléiques (ADN ou ARN) d'un organite cellulaire, d'un organisme ou d'une espèce.
in scheme: Biologie
in scheme: concept-SD-biologie-biochimie-et-biologie-moleculaire
in scheme: concept-SD-biologie-genetique
in scheme: concepts
notation: AGRI1195
note: 1. Le génome des procaryotes et des eucaryotes est composé d'ADN, celui des virus est formé soit d'ADN, soit d'ARN. Chez les eucaryotes, l'ADN est contenu dans les chromosomes du noyau et dans les organites cellulaires (mitochondries et plastes) ; chez les procaryotes, dans le chromosome et dans les plasmides.
note: 2. Chez les eucaryotes, on définit le génome nucléaire de l'espèce par le lot haploïde de chromosomes que portent les gamètes.
related: carte d'identité moléculaire
related: plasmide
related: métagénome

génomique
type: ConceptConcept
type: Concept
creator: Commission d'enrichissement de la langue française, FranceTerme
date parution JO: 2006-11-23
equivalent EN: genomics @en
equivalent EN: genomics (en)
part of speech: nom féminin
definition: Branche de la génétique qui étudie les génomes.
in scheme: Biologie
in scheme: concept-SD-biologie-biochimie-et-biologie-moleculaire
in scheme: concept-SD-biologie-genetique
in scheme: concepts
notation: AGRI1196
note: 1. Les méthodes d'étude de la génomique appellent une approche pluridisciplinaire.
note: 2. Le terme « génomique » s'emploie aussi adjectivement.
related: génomique fonctionnelle
related: génomique structurale

génomique fonctionnelle
type: ConceptConcept
type: Concept
creator: Commission d'enrichissement de la langue française, FranceTerme
date parution JO: 2006-11-23
equivalent EN: functional genomics @en
equivalent EN: functional genomics (en)
definition: Partie de la génomique qui étudie la fonction des gènes, leur régulation et les interactions de leurs produits d'expression, ARN et protéines.
in scheme: Biologie
in scheme: concept-SD-biologie-biochimie-et-biologie-moleculaire
in scheme: concept-SD-biologie-genetique
in scheme: concepts
notation: AGRI1197
note: L'étude nécessite l'analyse simultanée du transcriptome et du protéome, dans diverses conditions physiologiques et sur divers génotypes sauvages et mutants ainsi que l'intégration des données obtenues.
related: génomique
related: protéome
related: transcriptome
related: annotation fonctionnelle

génomique structurale
type: ConceptConcept
type: Concept
creator: Commission d'enrichissement de la langue française, FranceTerme
date parution JO: 2006-11-23
equivalent EN: structural genomics @en
equivalent EN: structural genomics (en)
definition: Partie de la génomique qui étudie la structure physique et l'organisation du génome et du protéome.
in scheme: Biologie
in scheme: concept-SD-biologie-biochimie-et-biologie-moleculaire
in scheme: concept-SD-biologie-genetique
in scheme: concepts
notation: AGRI1198
note: Dans une acception restreinte, la génomique structurale désigne la détermination de la structure tridimensionnelle des protéines et la compréhension des propriétés physicochimiques et biologiques qui en résultent.
related: génomique
related: protéome
related: annotation structurale

hybridation soustractive sélective
type: ConceptConcept
type: Concept
creator: Commission d'enrichissement de la langue française, FranceTerme
abbreviation: HSS
abbreviation: SSH @en
date parution JO: 2006-11-23
equivalent EN: SSH @en
equivalent EN: SSH (en)
equivalent EN: suppression subtractive hybridization @en
equivalent EN: suppression subtractive hybridization (en)
definition: Technique de criblage différentiel utilisée pour comparer deux matériels donnés en déterminant les ARN messagers propres à chacun d'eux, par élimination de ceux qu'ils ont en commun.
in scheme: Biologie
in scheme: concept-SD-biologie-biochimie-et-biologie-moleculaire
in scheme: concept-SD-biologie-genetique
in scheme: concepts
notation: AGRI1199

ADN superenroulé
type: ConceptConcept
type: Concept
creator: Commission d'enrichissement de la langue française, FranceTerme
source: révision de l'arrêté du 14 septembre 1990
date parution JO: 2000-09-22
equivalent EN: supercoiled DNA @en
equivalent EN: supercoiled DNA (en)
alternative label: ADN superhélicoïdal
alternative label: ADN surenroulé
definition: ADN ayant une configuration en superhélice.
in scheme: Biologie
in scheme: concept-SD-biologie-genie-genetique
in scheme: concepts
notation: AGRI12

écoulement torrentiel
type: ConceptConcept
type: Concept
creator: Commission d'enrichissement de la langue française, FranceTerme
source: révision de l'arrêté du 7 avril 1987
date parution JO: 2000-09-22
equivalent EN: super critical flow @en
equivalent EN: super critical flow (en)
definition: Écoulement à surface libre dont le tirant d'eau est inférieur au tirant d'eau critique.
in scheme: Hydraulique
in scheme: concepts
notation: AGRI120
note: Le terme « écoulement turbulent » ne doit pas être utilisé dans ce sens.
related: écoulement de type fluvial
related: écoulement turbulent

protéome
type: ConceptConcept
type: Concept
creator: Commission d'enrichissement de la langue française, FranceTerme
date parution JO: 2006-11-23
equivalent EN: proteome @en
equivalent EN: proteome (en)
part of speech: nom masculin
definition: Ensemble des protéines codées par un génome, à un moment déterminé, et caractérisées par leur quantité et leur conformation.
in scheme: Biologie
in scheme: concept-SD-biologie-biochimie-et-biologie-moleculaire
in scheme: concept-SD-biologie-genetique
in scheme: concepts
notation: AGRI1200
related: génomique fonctionnelle
related: génomique structurale
related: carte d'identité moléculaire

protéomique
type: ConceptConcept
type: Concept
creator: Commission d'enrichissement de la langue française, FranceTerme
date parution JO: 2006-11-23
equivalent EN: proteomics @en
equivalent EN: proteomics (en)
part of speech: nom féminin
definition: Discipline qui identifie et caractérise les protéines d'une cellule ou de l'un de ses compartiments, et analyse leur expression, leur fonction et leurs interactions.
in scheme: Biologie
in scheme: concept-SD-biologie-biochimie-et-biologie-moleculaire
in scheme: concept-SD-biologie-genetique
in scheme: concepts
notation: AGRI1201

transcriptome
type: ConceptConcept
type: Concept
creator: Commission d'enrichissement de la langue française, FranceTerme
date parution JO: 2006-11-23
equivalent EN: transcriptome @en
equivalent EN: transcriptome (en)
part of speech: nom masculin
definition: Ensemble des ARN messagers traduisant l'expression génique totale d'une cellule, d'un tissu ou d'un organisme à un moment donné.
in scheme: Biologie
in scheme: concept-SD-biologie-biochimie-et-biologie-moleculaire
in scheme: concept-SD-biologie-genetique
in scheme: concepts
notation: AGRI1202
related: génomique fonctionnelle

transfert de protéines
type: ConceptConcept
type: Concept
creator: Commission d'enrichissement de la langue française, FranceTerme
date parution JO: 2006-11-23
equivalent EN: Western blot analysis @en
equivalent EN: Western blot analysis (en)
equivalent EN: Western blotting @en
equivalent EN: Western blotting (en)
alternative label: technique de Western
definition: Technique consistant à transférer des protéines d'un gel de polyacrylamide vers une membrane support, sur laquelle les molécules recherchées sont repérées à l'aide d'anticorps spécifiques marqués.
in scheme: Biologie
in scheme: concept-SD-biologie-biochimie-et-biologie-moleculaire
in scheme: concept-SD-biologie-genetique
in scheme: concepts
notation: AGRI1203
note: Le terme « technique de Western » repose sur un jeu de mots analogique avec le terme « technique de Southern », formé à partir du nom de l'inventeur de cette technique.
related: transfert d'ADN
related: transfert d'ARN

asperseur
type: ConceptConcept
type: Concept
creator: Commission d'enrichissement de la langue française, FranceTerme
date parution JO: 2007-09-07
equivalent EN: sprinkler @en
equivalent EN: sprinkler (en)
part of speech: nom masculin
definition: Élément d'une installation d'arrosage, qui permet de disperser en gouttelettes un jet d'eau d'une façon aussi uniforme que possible.
in scheme: Agriculture
in scheme: concept-SD-agriculture-materiel-agricole-et-forestier
in scheme: concepts
notation: AGRI1204

chisel
type: ConceptConcept
type: Concept
creator: Commission d'enrichissement de la langue française, FranceTerme
date parution JO: 2007-09-07
deconseille ou frequent: chisel plow
deconseille ou frequent: cultivator
equivalent EN: chisel plow (US) @en
equivalent EN: chisel plow (en-US)
equivalent EN: cultivator (GB) @en
equivalent EN: cultivator (en-GB)
part of speech: nom masculin
definition: Cultivateur lourd à dents, utilisé pour le déchaumage et pour le travail du sol sans retournement.
in scheme: Agriculture
in scheme: concept-SD-agriculture-materiel-agricole-et-forestier
in scheme: concepts
notation: AGRI1205

crib
type: ConceptConcept
type: Concept
creator: Commission d'enrichissement de la langue française, FranceTerme
date parution JO: 2007-09-07
equivalent EN: crib @en
equivalent EN: crib (en)
part of speech: nom masculin
definition: Cage grillagée de forme parallélépipédique, destinée au stockage et au séchage à l'air libre des épis de maïs.
in scheme: Agriculture
in scheme: concept-SD-agriculture-materiel-agricole-et-forestier
in scheme: concepts
notation: AGRI1206

crib
type: ConceptConcept
type: Concept
creator: Commission d'enrichissement de la langue française, FranceTerme
date parution JO: 2007-09-07
equivalent EN: crib @en
equivalent EN: crib (en)
part of speech: nom masculin
definition: Berceau grillagé rempli de pierres, que l'on place dans le lit d'un cours d'eau pour prévenir l'affouillement des berges.
in scheme: Environnement
in scheme: concepts
notation: AGRI1207

croskillette
type: ConceptConcept
type: Concept
creator: Commission d'enrichissement de la langue française, FranceTerme
date parution JO: 2007-09-07
equivalent EN: émietteuse
part of speech: nom féminin
alternative label: émietteuse
definition: Rouleau léger à disques dentés, servant à affiner et à tasser superficiellement le sol.
in scheme: Agriculture
in scheme: concept-SD-agriculture-materiel-agricole-et-forestier
in scheme: concepts
notation: AGRI1208
related: croskill

cueilleuse-égreneuse
type: ConceptConcept
type: Concept
creator: Commission d'enrichissement de la langue française, FranceTerme
date parution JO: 2007-09-07
equivalent EN: corn-sheller @en
equivalent EN: corn-sheller (en)
part of speech: nom féminin
alternative label: cueilleur-égreneur
definition: Machine qui cueille les épis de maïs et les bat pour les égrener.
in scheme: Agriculture
in scheme: concept-SD-agriculture-materiel-agricole-et-forestier
in scheme: concepts
notation: AGRI1209

écoulement transitoire
type: ConceptConcept
type: Concept
creator: Commission d'enrichissement de la langue française, FranceTerme
source: révision de l'arrêté du 7 avril 1987
date parution JO: 2000-09-22
equivalent EN: transient flow @en
equivalent EN: transient flow (en)
alternative label: écoulement variable
definition: Écoulement dont les caractéristiques hydrauliques sont sujettes à une variation dans le temps.
in scheme: Hydraulique
in scheme: concepts
notation: AGRI121

cueilleuse-épanouilleuse
type: ConceptConcept
type: Concept
creator: Commission d'enrichissement de la langue française, FranceTerme
date parution JO: 2007-09-07
equivalent EN: corn picker @en
equivalent EN: corn picker (en)
part of speech: nom féminin
definition: Machine qui cueille les épis de maïs et les dépouille de leurs bractées.
in scheme: Agriculture
in scheme: concept-SD-agriculture-materiel-agricole-et-forestier
in scheme: concepts
notation: AGRI1210

cultivateur-tasseur
type: ConceptConcept
type: Concept
creator: Commission d'enrichissement de la langue française, FranceTerme
date parution JO: 2007-09-07
deconseille ou frequent: cultipacker
equivalent EN: Tandem-Ringelwalze @de
equivalent EN: Tandem-Ringelwalze (de)
equivalent EN: cultipacker (GB) @en
equivalent EN: cultipacker (en-GB)
equivalent EN: land-packer @en
equivalent EN: land-packer (en)
equivalent EN: landpacker @en
equivalent EN: landpacker (en)
forme abregee: cultitasseur, n.m.
part of speech: nom masculin
definition: Outil constitué de deux rouleaux composés chacun de disques jointifs à arête vive, qu'on utilise pour affiner et tasser le sol.
in scheme: Agriculture
in scheme: concept-SD-agriculture-materiel-agricole-et-forestier
in scheme: concepts
notation: AGRI1211

découplage
type: ConceptConcept
type: Concept
creator: Commission d'enrichissement de la langue française, FranceTerme
date parution JO: 2007-09-07
equivalent EN: decoupling @en
equivalent EN: decoupling (en)
part of speech: nom masculin
definition: Suppression du lien entre la production et les aides attribuées aux agriculteurs.
in scheme: Agriculture
in scheme: concept-SD-agriculture-politique-agricole
in scheme: concepts
notation: AGRI1212

égreneuse sur pied
type: ConceptConcept
type: Concept
creator: Commission d'enrichissement de la langue française, FranceTerme
date parution JO: 2007-09-07
equivalent EN: stripper @en
equivalent EN: stripper (en)
definition: Machine de récolte équipée de peignes qui détachent les grains des épis sur pied.
in scheme: Agriculture
in scheme: concept-SD-agriculture-materiel-agricole-et-forestier
in scheme: concepts
notation: AGRI1213

ensileuse
type: ConceptConcept
type: Concept
creator: Commission d'enrichissement de la langue française, FranceTerme
date parution JO: 2007-09-07
deconseille ou frequent: hacheuse-chargeuse
equivalent EN: forage harvester @en
equivalent EN: forage harvester (en)
part of speech: nom féminin
alternative label: récolteuse-hacheuse-chargeuse
definition: Machine de récolte qui coupe du fourrage frais ou le ramasse s'il est déjà coupé, avant de le hacher et de le charger.
in scheme: Agriculture
in scheme: concept-SD-agriculture-materiel-agricole-et-forestier
in scheme: concepts
notation: AGRI1214
note: Le terme « ensileuse » désignait à l'origine une hacheuse-chargeuse à poste fixe.

innocuité des aliments
type: ConceptConcept
type: Concept
creator: Commission d'enrichissement de la langue française, FranceTerme
date parution JO: 2007-09-07
deconseille ou frequent: salubrité des aliments
deconseille ou frequent: suffisance alimentaire
deconseille ou frequent: sécurité alimentaire
deconseille ou frequent: sécurité qualitative de l'alimentation
deconseille ou frequent: sécurité sanitaire des aliments
equivalent EN: food safety @en
equivalent EN: food safety (en)
definition: Situation dans laquelle, grâce à des mesures appropriées, la consommation d'eau, d'autres boissons ou d'aliments ne présente aucun risque connu pour la population humaine ou animale.
in scheme: Agriculture
in scheme: Santé et médecine
in scheme: concept-SD-agriculture-politique-agricole
in scheme: concept-SD-sante-et-medecine-politique-agricole
in scheme: concepts
notation: AGRI1215
note: On trouve aussi, dans ce sens, les termes « salubrité des aliments », « sécurité qualitative de l'alimentation », « sécurité sanitaire des aliments ».
related: sécurité alimentaire
related: suffisance alimentaire
related: bonnes pratiques agricoles
related: compatibilité alimentaire
related: défense alimentaire

pulvériseur à attelage déporté
type: ConceptConcept
type: Concept
creator: Commission d'enrichissement de la langue française, FranceTerme
date parution JO: 2007-09-07
deconseille ou frequent: cover-crop
deconseille ou frequent: pulvérisateur
equivalent EN: offset disc harrow @en
equivalent EN: offset disc harrow (en)
forme abregee: pulvériseur déporté
alternative label: pulvériseur-déchaumeur
definition: Outil constitué de deux trains de disques lourds montés sur deux axes horizontaux formant un V d'axe oblique par rapport à la direction d'avancement du tracteur, et qui est utilisé pour le déchaumage et l'ameublissement du sol avant la reprise du labour.
in scheme: Agriculture
in scheme: concept-SD-agriculture-materiel-agricole-et-forestier
in scheme: concepts
notation: AGRI1216
note: 1. Il convient de distinguer le « pulvériseur », qui réduit une substance en poudre, du « pulvérisateur », qui dissémine les particules d'une poudre ou qui disperse un liquide en gouttelettes.
note: 2. L'emploi du mot cover-crop, emprunté de l'anglais, est à proscrire.

ramasseur
type: ConceptConcept
type: Concept
creator: Commission d'enrichissement de la langue française, FranceTerme
date parution JO: 2007-09-07
equivalent EN: pick-up @en
equivalent EN: pick-up (en)
equivalent EN: pick-up reel @en
equivalent EN: pick-up reel (en)
equivalent EN: rotary pick-up @en
equivalent EN: rotary pick-up (en)
part of speech: nom masculin
definition: Dispositif équipant des machines de récolte et servant à recueillir le fourrage ou la paille au sol.
in scheme: Agriculture
in scheme: concept-SD-agriculture-materiel-agricole-et-forestier
in scheme: concepts
notation: AGRI1217
related: ramasseuse-presse

ramasseuse-presse
type: ConceptConcept
type: Concept
creator: Commission d'enrichissement de la langue française, FranceTerme
date parution JO: 2007-09-07
equivalent EN: pick-up baler @en
equivalent EN: pick-up baler (en)
equivalent EN: round baler @en
equivalent EN: round baler (en) [Balles cylindriques]
part of speech: nom féminin
definition: Machine de récolte qui recueille le fourrage sec après la fenaison et confectionne des balles par compression et liage.
in scheme: Agriculture
in scheme: concept-SD-agriculture-materiel-agricole-et-forestier
in scheme: concepts
notation: AGRI1218
related: ramasseur

ripeur
type: ConceptConcept
type: Concept
creator: Commission d'enrichissement de la langue française, FranceTerme
date parution JO: 2007-09-07
equivalent EN: ripper @en
equivalent EN: ripper (en)
part of speech: nom masculin
alternative label: dessoucheuse à griffes
alternative label: défonceuse
definition: Outil lourd muni d'une ou de plusieurs griffes, utilisé pour défoncer le sol et pour arracher les racines et les souches.
in scheme: Agriculture
in scheme: Habitat et construction
in scheme: concept-SD-agriculture-materiel-agricole-et-forestier
in scheme: concept-SD-habitat-et-construction-materiel-agricole-et-forestier
in scheme: concepts
notation: AGRI1219
scope note: Cette publication annule et remplace celle du Journal officiel du 22 septembre 2000.

écoulement turbulent
type: ConceptConcept
type: Concept
creator: Commission d'enrichissement de la langue française, FranceTerme
source: révision de l'arrêté du 7 avril 1987
date parution JO: 2000-09-22
equivalent EN: turbulent flow @en
equivalent EN: turbulent flow (en)
definition: Mouvement d'un fluide dont la vitesse réelle est supérieure à la vitesse limite pour des conditions déterminées.
in scheme: Hydraulique
in scheme: concepts
notation: AGRI122
note: 1. La perte de charge hydraulique n'est pas directement proportionnelle au débit.
note: 2. « Écoulement turbulent » est l'antonyme d' « écoulement laminaire ».
related: écoulement torrentiel

sécurité alimentaire
type: ConceptConcept
type: Concept
creator: Commission d'enrichissement de la langue française, FranceTerme
date parution JO: 2007-09-07
deconseille ou frequent: innocuité des aliments
deconseille ou frequent: suffisance alimentaire
definition: Situation dans laquelle une population bénéficie à la fois de la suffisance alimentaire et de l'innocuité des aliments.
in scheme: Agriculture
in scheme: Santé et médecine
in scheme: concept-SD-agriculture-politique-agricole
in scheme: concept-SD-sante-et-medecine-politique-agricole
in scheme: concepts
notation: AGRI1220
related: innocuité des aliments
related: suffisance alimentaire
related: pic alimentaire

suffisance alimentaire
type: ConceptConcept
type: Concept
creator: Commission d'enrichissement de la langue française, FranceTerme
date parution JO: 2007-09-07
deconseille ou frequent: innocuité des aliments
deconseille ou frequent: sécurité alimentaire
deconseille ou frequent: sécurité alimentaire quantitative
equivalent EN: food security @en
equivalent EN: food security (en)
definition: Situation dans laquelle une population déterminée dispose de la quantité nécessaire d'aliments variés pour assurer durablement sa nourriture.
in scheme: Agriculture
in scheme: Santé et médecine
in scheme: concept-SD-agriculture-politique-agricole
in scheme: concept-SD-sante-et-medecine-politique-agricole
in scheme: concepts
notation: AGRI1221
note: On trouve aussi, dans ce sens, le terme « sécurité alimentaire quantitative ».
related: innocuité des aliments
related: sécurité alimentaire
related: pic alimentaire

croskill
type: ConceptConcept
type: Concept
creator: Commission d'enrichissement de la langue française, FranceTerme
date parution JO: 2007-09-07
equivalent EN: crosskill roller @en
equivalent EN: crosskill roller (en)
part of speech: nom masculin
alternative label: brise-mottes
in scheme: Agriculture
in scheme: concept-SD-agriculture-materiel-agricole-et-forestier
in scheme: concepts
notation: AGRI1222
related: croskillette

grippe aviaire
type: ConceptConcept
type: Concept
creator: Commission d'enrichissement de la langue française, FranceTerme
date parution JO: 2008-06-27
equivalent EN: avian flu @en
equivalent EN: avian flu (en)
equivalent EN: avian influenza @en
equivalent EN: avian influenza (en)
equivalent EN: bird flu @en
equivalent EN: bird flu (en)
definition: Maladie virale dont l'agent est un virus du genre Influenzavirus à transmission directe initialement responsable de l'influenza aviaire, qui résulte du passage de ce virus des oiseaux aux mammifères, y compris l'homme.
in scheme: Santé animale
in scheme: Santé et médecine
in scheme: concepts
notation: AGRI1223
note: Il convient de distinguer la « grippe aviaire » de l'« influenza aviaire ».
related: influenza aviaire
related: peste aviaire
related: concept-sante-animale

influenza aviaire
type: ConceptConcept
type: Concept
creator: Commission d'enrichissement de la langue française, FranceTerme
date parution JO: 2008-06-27
equivalent EN: avian flu @en
equivalent EN: avian flu (en)
equivalent EN: avian influenza @en
equivalent EN: avian influenza (en)
equivalent EN: bird flu @en
equivalent EN: bird flu (en)
definition: Maladie virale propre aux oiseaux, dont l'agent est un virus du genre Influenzavirus à transmission directe.
in scheme: Santé animale
in scheme: concepts
notation: AGRI1224
note: Dans certains cas, les virus contaminant les oiseaux peuvent passer directement à l'homme et l'on parle alors de « grippe aviaire », tandis que la grippe humaine saisonnière est causée par des souches de virus différentes, déjà adaptées à l'espèce humaine.
related: grippe aviaire
related: peste aviaire

peste aviaire
type: ConceptConcept
type: Concept
creator: Commission d'enrichissement de la langue française, FranceTerme
abbreviation: HPAI @en
date parution JO: 2008-06-27
equivalent EN: HPAI @en
equivalent EN: HPAI (en)
equivalent EN: fowl pest @en
equivalent EN: fowl pest (en)
equivalent EN: fowl plague @en
equivalent EN: fowl plague (en)
equivalent EN: highly pathogenic avian influenza @en
equivalent EN: highly pathogenic avian influenza (en)
definition: Maladie virale propre aux oiseaux et responsable de sévères épizooties, dont l'agent est un virus hautement pathogène du genre Influenzavirus à transmission directe.
in scheme: Santé animale
in scheme: concepts
notation: AGRI1225
note: Le mot « peste » est classiquement utilisé pour désigner des maladies dont le taux de létalité est élevé, quel que soit l'agent responsable (virus ou bactérie).
related: grippe aviaire
related: influenza aviaire
related: concept-sante-animale

maladie de la langue bleue
type: ConceptConcept
type: Concept
creator: Commission d'enrichissement de la langue française, FranceTerme
abbreviation: FCO
date parution JO: 2008-06-27
equivalent EN: blue tongue @en
equivalent EN: blue tongue (en)
equivalent EN: bluetongue @en
equivalent EN: bluetongue (en)
forme abregee: langue bleue
alternative label: fièvre catarrhale ovine
definition: Maladie virale dont l'agent est un virus du genre Orbivirus, touchant les ruminants domestiques et sauvages et transmise par certaines espèces de moucherons.
in scheme: Santé animale
in scheme: concepts
notation: AGRI1226
note: Les experts emploient le terme « fièvre catarrhale ovine », bien que cette maladie puisse toucher cliniquement d'autres espèces comme les bovins.

technique d'empreinte macromoléculaire
type: ConceptConcept
type: Concept
creator: Commission d'enrichissement de la langue française, FranceTerme
date parution JO: 2008-07-06
equivalent EN: molecular fingerprinting @en
equivalent EN: molecular fingerprinting (en)
forme abregee: empreinte macromoléculaire
definition: Caractérisation d'un individu ou d'une espèce à partir des produits du clivage enzymatique de ses protéines ou de son ADN.
in scheme: Biologie
in scheme: concept-SD-biologie-biochimie-et-biologie-moleculaire
in scheme: concept-SD-biologie-genetique
in scheme: concepts
notation: AGRI1228

allélopathie
type: ConceptConcept
type: Concept
creator: Commission d'enrichissement de la langue française, FranceTerme
date parution JO: 2008-07-06
equivalent EN: allelopathy @en
equivalent EN: allelopathy (en)
part of speech: nom féminin
definition: Capacité qu'ont certaines plantes de ralentir la croissance de plantes voisines d'espèces différentes, voire de les tuer si elles se développent trop près d'elles, en synthétisant et en diffusant certaines substances dans leur environnement.
in scheme: Biologie
in scheme: concept-SD-biologie-biologie-vegetale
in scheme: concepts
notation: AGRI1229
note: 1. Du grec allêlôn, « les uns et les autres », et pathos, « mal ».
note: 2. Les substances synthétisées sont des molécules des familles des terpènes et des phénols.
related: éliciteur
related: phytoalexine
related: métabolite secondaire

écoulement uniforme
type: ConceptConcept
type: Concept
creator: Commission d'enrichissement de la langue française, FranceTerme
source: révision de l'arrêté du 7 avril 1987
date parution JO: 2000-09-22
equivalent EN: uniform flow @en
equivalent EN: uniform flow (en)
definition: Écoulement permanent à section mouillée constante, tel qu'il serait réalisé dans un canal de section droite, de pente et de rugosité uniformes, et de longueur infinie.
in scheme: Hydraulique
in scheme: concepts
notation: AGRI123
related: écoulement varié

aneuploïde
type: ConceptConcept
type: Concept
creator: Commission d'enrichissement de la langue française, FranceTerme
date parution JO: 2008-07-06
equivalent EN: aneuploid @en
equivalent EN: aneuploid (en)
part of speech: adjectif
definition: Se dit d'un organisme, d'un organe, d'un tissu ou d'une cellule, dont le nombre de chromosomes n'est pas un multiple du nombre haploïde de l'espèce.
in scheme: Biologie
in scheme: concept-SD-biologie-biochimie-et-biologie-moleculaire
in scheme: concept-SD-biologie-genetique
in scheme: concepts
notation: AGRI1230
related: aneuploïdie

aneuploïdie
type: ConceptConcept
type: Concept
creator: Commission d'enrichissement de la langue française, FranceTerme
date parution JO: 2008-07-06
equivalent EN: aneuploidy @en
equivalent EN: aneuploidy (en)
part of speech: nom féminin
definition: État d'un organisme, d'un organe, d'un tissu ou d'une cellule, dont le nombre de chromosomes n'est pas un multiple du nombre haploïde de l'espèce.
in scheme: Biologie
in scheme: concept-SD-biologie-biochimie-et-biologie-moleculaire
in scheme: concept-SD-biologie-genetique
in scheme: concepts
notation: AGRI1231
note: 1. Du grec an, privatif, eu, « bien », et haplous, « simple ».
note: 2. La trisomie 21, caractérisée par un chromosome surnuméraire, est un exemple d'aneuploïdie.
related: aneuploïde

caractère quantitatif
type: ConceptConcept
type: Concept
creator: Commission d'enrichissement de la langue française, FranceTerme
date parution JO: 2008-07-06
equivalent EN: quantitative character @en
equivalent EN: quantitative character (en)
equivalent EN: quantitative trait @en
equivalent EN: quantitative trait (en)
definition: Caractère génétique mesurable, à variation continue, dont la valeur dépend de plusieurs gènes et de leurs interactions avec le milieu.
in scheme: Biologie
in scheme: concept-SD-biologie-biochimie-et-biologie-moleculaire
in scheme: concept-SD-biologie-genetique
in scheme: concepts
notation: AGRI1232
note: L'activité métabolique, le taux d'accroissement des arbres, la masse, les dimensions d'un organe sont des exemples de caractère quantitatif.
related: locus à caractère quantitatif

compétiteur
type: ConceptConcept
type: Concept
creator: Commission d'enrichissement de la langue française, FranceTerme
date parution JO: 2008-07-06
equivalent EN: competitor @en
equivalent EN: competitor (en)
part of speech: nom masculin
definition: Animal ou plante de la même espèce ou d'une espèce différente de celle de ses voisins, qui entre en concurrence avec eux pour l'exploitation d'une ou de plusieurs ressources de leur milieu.
in scheme: Agriculture
in scheme: Biologie
in scheme: concepts
notation: AGRI1233
related: métabolite secondaire
related: compétition

cultivar
type: ConceptConcept
type: Concept
creator: Commission d'enrichissement de la langue française, FranceTerme
date parution JO: 2008-07-06
equivalent EN: cultivar @en
equivalent EN: cultivar (en)
part of speech: nom masculin
definition: Ensemble des individus d'une espèce de plante cultivée, qui résulte d'une sélection et qui peut être génétiquement reproduit à l'identique.
in scheme: Agriculture
in scheme: concept-SD-agriculture-agronomie
in scheme: concepts
notation: AGRI1234
note: La capacité de reproduire à l'identique un cultivar permet d'obtenir son inscription au catalogue des variétés de l'espèce donnée ainsi que la protection de sa propriété intellectuelle.

éliciteur
type: ConceptConcept
type: Concept
creator: Commission d'enrichissement de la langue française, FranceTerme
date parution JO: 2008-07-06
equivalent EN: elicitor @en
equivalent EN: elicitor (en)
part of speech: nom masculin
definition: Molécule spécifique, appartenant à des familles chimiques variées, produite par un microorganisme phytopathogène ou une plante parasite et déclenchant des réactions de défense de la part des cellules de la plante attaquée.
in scheme: Biologie
in scheme: concept-SD-biologie-biologie-vegetale
in scheme: concepts
notation: AGRI1235
related: allélopathie
related: phytoalexine
related: produit de protection biologique des cultures
related: phytostimulant
related: technique agricole de pointe

hybride cytoplasmique
type: ConceptConcept
type: Concept
creator: Commission d'enrichissement de la langue française, FranceTerme
date parution JO: 2008-07-06
equivalent EN: cybrid @en
equivalent EN: cybrid (en)
alternative label: cybride
definition: Individu hybride, provenant de la fusion de deux protoplastes génétiquement différents, porteur du noyau de l'un d'entre eux et d'une information génétique cytoplasmique dérivée des deux parents.
in scheme: Biologie
in scheme: concept-SD-biologie-biochimie-et-biologie-moleculaire
in scheme: concept-SD-biologie-genetique
in scheme: concepts
notation: AGRI1236
note: Le synonyme « cybride » est formé à partir de « cytoplasme » et d'« hybride ».
related: embryon cybride homme-animal
scope note: Cette publication annule et remplace celle du terme « cybride » au Journal officiel du 22 septembre 2000.

locus à caractère quantitatif
type: ConceptConcept
type: Concept
creator: Commission d'enrichissement de la langue française, FranceTerme
abbreviation: QTL @en
date parution JO: 2008-07-06
equivalent EN: QTL @en
equivalent EN: QTL (en)
equivalent EN: quantitative trait locus @en
equivalent EN: quantitative trait locus (en)
definition: Locus dont les allèles ont des effets différents et mesurables sur un caractère quantitatif.
in scheme: Biologie
in scheme: concept-SD-biologie-biochimie-et-biologie-moleculaire
in scheme: concept-SD-biologie-genetique
in scheme: concepts
notation: AGRI1237
related: caractère quantitatif
related: microsatellite

micro-réseau à ADN
type: ConceptConcept
type: Concept
creator: Commission d'enrichissement de la langue française, FranceTerme
date parution JO: 2008-07-06
equivalent EN: DNA microarray @en
equivalent EN: DNA microarray (en)
definition: Ensemble ordonné de plusieurs milliers d'espèces moléculaires d'ADN, éventuellement obtenues par synthèse, et immobilisées sur une puce à ADN de manière à former un réseau de microdépôts calibrés.
in scheme: Biologie
in scheme: concept-SD-biologie-biochimie-et-biologie-moleculaire
in scheme: concept-SD-biologie-genetique
in scheme: concepts
notation: AGRI1238
note: Les espèces moléculaires d'ADN sont utilisées comme sondes au cours d'hybridations moléculaires avec d'autres acides nucléiques.
related: puce à ADN

microsatellite
type: ConceptConcept
type: Concept
creator: Commission d'enrichissement de la langue française, FranceTerme
abbreviation: SSR @en
date parution JO: 2008-07-06
equivalent EN: SSR @en
equivalent EN: SSR (en)
equivalent EN: simple sequence repeat @en
equivalent EN: simple sequence repeat (en)
part of speech: nom masculin
definition: Ensemble constitué par la répétition dans le même sens d'un motif simple d'ADN de 1 à 4 nucléotides, et qui peut aller jusqu'à quelques dizaines de copies.
in scheme: Biologie
in scheme: concept-SD-biologie-biochimie-et-biologie-moleculaire
in scheme: concept-SD-biologie-genetique
in scheme: concepts
notation: AGRI1239
note: Les microsatellites servent à la recherche du polymorphisme entre individus.
related: locus à caractère quantitatif
related: minisatellite

écoulement varié
type: ConceptConcept
type: Concept
creator: Commission d'enrichissement de la langue française, FranceTerme
source: révision de l'arrêté du 7 avril 1987
date parution JO: 2000-09-22
equivalent EN: non uniform flow @en
equivalent EN: non uniform flow (en)
equivalent EN: varied flow @en
equivalent EN: varied flow (en)
alternative label: écoulement non uniforme
definition: Écoulement permanent de type non uniforme, c'est-à-dire dont les caractéristiques varient d'une section à l'autre.
in scheme: Hydraulique
in scheme: concepts
notation: AGRI124
related: écoulement uniforme

minisatellite
type: ConceptConcept
type: Concept
creator: Commission d'enrichissement de la langue française, FranceTerme
abbreviation: VNTR @en
date parution JO: 2008-07-06
equivalent EN: VNTR @en
equivalent EN: VNTR (en)
equivalent EN: variable number tandem repeat @en
equivalent EN: variable number tandem repeat (en)
part of speech: nom masculin
definition: Ensemble constitué par la répétition dans le même sens d'un motif d'ADN pouvant comporter jusqu'à 100 nucléotides, de quelques dizaines à plusieurs milliers de copies.
in scheme: Biologie
in scheme: concept-SD-biologie-biochimie-et-biologie-moleculaire
in scheme: concept-SD-biologie-genetique
in scheme: concepts
notation: AGRI1240
note: Les minisatellites peuvent servir à l'identification génétique d'un individu.
related: microsatellite

organe-puits
type: ConceptConcept
type: Concept
creator: Commission d'enrichissement de la langue française, FranceTerme
date parution JO: 2008-07-06
equivalent EN: sink organ @en
equivalent EN: sink organ (en)
part of speech: nom masculin
definition: Organe ou partie d'un végétal qui utilise une substance provenant d'un ou de plusieurs autres organes appelés organes-sources.
in scheme: Biologie
in scheme: concept-SD-biologie-biologie-vegetale
in scheme: concepts
notation: AGRI1241
related: organe-source

organe-source
type: ConceptConcept
type: Concept
creator: Commission d'enrichissement de la langue française, FranceTerme
date parution JO: 2008-07-06
equivalent EN: source organ @en
equivalent EN: source organ (en)
part of speech: nom masculin
definition: Organe ou partie d'un végétal qui produit une substance diffusée vers un ou plusieurs autres organes appelés organes-puits.
in scheme: Biologie
in scheme: concept-SD-biologie-biologie-vegetale
in scheme: concepts
notation: AGRI1242
related: organe-puits

phytoalexine
type: ConceptConcept
type: Concept
creator: Commission d'enrichissement de la langue française, FranceTerme
date parution JO: 2008-07-06
equivalent EN: phytoalexin @en
equivalent EN: phytoalexin (en)
part of speech: nom féminin
definition: Substance que synthétise une plante dès qu'elle est attaquée par une autre plante parasite ou par un microorganisme pathogène, champignon ou bactérie.
in scheme: Biologie
in scheme: concept-SD-biologie-biologie-vegetale
in scheme: concepts
notation: AGRI1243
note: 1. Du grec phyton, « plante », et alexein, « protéger ».
note: 2. La production de phytoalexine chez la plante attaquée peut être provoquée par un éliciteur.
related: allélopathie
related: éliciteur
related: métabolite secondaire
related: résistance systémique acquise

puce à ADN
type: ConceptConcept
type: Concept
creator: Commission d'enrichissement de la langue française, FranceTerme
date parution JO: 2008-07-06
equivalent EN: DNA chip @en
equivalent EN: DNA chip (en)
alternative label: biopuce à ADN
definition: Support miniaturisé de verre ou d'une autre matière appropriée, où sont fixés des microdépôts d'ADN formant un réseau.
in scheme: Biologie
in scheme: concept-SD-biologie-biochimie-et-biologie-moleculaire
in scheme: concept-SD-biologie-genetique
in scheme: concepts
notation: AGRI1244
note: Les puces à ADN sont utilisées en particulier pour étudier simultanément le niveau d'expression de gènes au sein de cellules, de tissus ou d'organes, dans diverses conditions physiologiques ; elles permettent également de détecter la présence de microorganismes, de repérer des mutations qui peuvent être responsables de maladies, ou de déterminer la séquence d'une molécule d'ADN.
related: micro-réseau à ADN

puce à protéines
type: ConceptConcept
type: Concept
creator: Commission d'enrichissement de la langue française, FranceTerme
abbreviation: protein chip @en
date parution JO: 2008-07-06
equivalent EN: protein chip @en
equivalent EN: protein chip (en)
equivalent EN: protein chip array @en
equivalent EN: protein chip array (en)
alternative label: biopuce à protéines
definition: Support de métal ou d'une autre matière appropriée, à la surface duquel sont immobilisés des microdépôts calibrés de protéines formant un réseau.
in scheme: Biologie
in scheme: concept-SD-biologie-biochimie-et-biologie-moleculaire
in scheme: concept-SD-biologie-genetique
in scheme: concepts
notation: AGRI1245
note: 1. Les puces à protéines sont utilisées pour reconnaître des ligands, des anticorps, des récepteurs ou des acides nucléiques qui établissent des interactions moléculaires avec les protéines déposées.
note: 2. Les microdépôts, qui sont de l'ordre de la femtomole (10-15 mol), doivent respecter une orientation uniforme de protéines repliées correctement et espacées de façon optimale pour que les interactions moléculaires puissent être mises en évidence.
related: récepteur
related: ligand

effet de position
type: ConceptConcept
type: Concept
creator: Commission d'enrichissement de la langue française, FranceTerme
source: révision de l'arrêté du 14 septembre 1990
date parution JO: 2000-09-22
equivalent EN: position effect @en
equivalent EN: position effect (en)
definition: Effet que peut avoir sur l'expression d'un gène son changement de position dans le génome.
in scheme: Biologie
in scheme: concept-SD-biologie-genie-genetique
in scheme: concepts
notation: AGRI125

carte d'identité moléculaire
type: ConceptConcept
type: Concept
creator: Commission d'enrichissement de la langue française, FranceTerme
date parution JO: 2012-05-13
definition: Ensemble de données moléculaires propres à un individu, qui le distingue des autres.
in scheme: Biologie
in scheme: concept-SD-biologie-biochimie-et-biologie-moleculaire
in scheme: concepts
notation: AGRI1256
note: Les données moléculaires peuvent relever du métabolome, du protéome ou du génome.
related: génome
related: protéome
related: métabolome

sélection génétique
type: ConceptConcept
type: Concept
creator: Commission d'enrichissement de la langue française, FranceTerme
date parution JO: 2012-05-13
equivalent EN: genetic selection @en
equivalent EN: genetic selection (en)
definition: Sélection, naturelle ou artificielle, dans une population, qui conduit à une variation de la fréquence de certains gènes ou de certains allèles d'une génération à l'autre.
in scheme: Biologie
in scheme: concept-SD-biologie-genetique
in scheme: concepts
notation: AGRI1257
note: La sélection génétique s'applique à tout type d'êtres vivants, depuis les virus jusqu'aux êtres les plus complexes.
related: sélection généalogique
related: sélection massale

sélection généalogique
type: ConceptConcept
type: Concept
creator: Commission d'enrichissement de la langue française, FranceTerme
date parution JO: 2012-05-13
deconseille ou frequent: sélection pedigree
equivalent EN: pedigree selection @en
equivalent EN: pedigree selection (en)
definition: Méthode de sélection génétique opérée par l'homme dans une espèce végétale ou animale, qui consiste à retenir, dans une population ou à partir d'un croisement, de génération en génération, tout ou partie des meilleures descendances en identifiant les filiations correspondantes.
in scheme: Biologie
in scheme: concept-SD-biologie-genetique
in scheme: concepts
notation: AGRI1258
note: La sélection généalogique a été imaginée au XIXe siècle pour la sélection des plantes cultivées. Aujourd'hui, l'emploi de ce terme est réservé à la sélection de lignées végétales à partir d'un croisement ainsi qu'à celle des poissons d'élevage.
related: sélection génétique
related: sélection massale

sélection massale
type: ConceptConcept
type: Concept
creator: Commission d'enrichissement de la langue française, FranceTerme
date parution JO: 2012-05-13
equivalent EN: mass selection @en
equivalent EN: mass selection (en)
definition: Méthode de sélection génétique opérée par l'homme dans une espèce végétale ou animale, qui consiste à choisir les reproducteurs en fonction de leurs performances propres et non de celles de leurs descendances.
in scheme: Biologie
in scheme: concept-SD-biologie-genetique
in scheme: concepts
notation: AGRI1259
related: sélection génétique
related: sélection généalogique

efflorescence
type: ConceptConcept
type: Concept
creator: Commission d'enrichissement de la langue française, FranceTerme
source: révision de l'arrêté du 7 avril 1987
date parution JO: 2000-09-22
equivalent EN: bloom @en
equivalent EN: bloom (en)
part of speech: nom féminin
definition: Prolifération dans le milieu marin de microorganismes végétaux dans des conditions hydroclimatiques favorables.
in scheme: Pêche et aquaculture
in scheme: concept-SD-peche-et-aquaculture-peche-maritime
in scheme: concepts
notation: AGRI126

moléculture
type: ConceptConcept
type: Concept
creator: Commission d'enrichissement de la langue française, FranceTerme
date parution JO: 2013-12-15
equivalent EN: biopharming @en
equivalent EN: biopharming (en)
equivalent EN: gene pharming @en
equivalent EN: gene pharming (en)
equivalent EN: molecular farming @en
equivalent EN: molecular farming (en)
equivalent EN: molecular pharming @en
equivalent EN: molecular pharming (en)
part of speech: nom féminin
definition: Production de molécules d’intérêt pharmaceutique, industriel ou alimentaire à partir d'animaux d'élevage ou de plantes cultivées qui ont été génétiquement modifiés à cette fin.
in scheme: Agriculture
in scheme: Biologie
in scheme: concept-SD-agriculture-biochimie-et-biologie-moleculaire
in scheme: concept-SD-biologie-biochimie-et-biologie-moleculaire
in scheme: concepts
notation: AGRI1260
related: moléculture végétale
related: moléculture animale

pêche aux ailerons
type: ConceptConcept
type: Concept
creator: Commission d'enrichissement de la langue française, FranceTerme
date parution JO: 2012-05-13
equivalent EN: shark finning @en
equivalent EN: shark finning (en)
alternative label: amputation des ailerons de requin
definition: Pratique consistant à capturer des requins pour leur couper les ailerons et la nageoire caudale puis à les rejeter mutilés à la mer.
in scheme: Pêche et aquaculture
in scheme: concept-SD-peche-et-aquaculture-peche-maritime
in scheme: concepts
notation: AGRI1261
related: concept-peche-et-aquaculture

panic érigé
type: ConceptConcept
type: Concept
creator: Commission d'enrichissement de la langue française, FranceTerme
date parution JO: 2012-05-13
equivalent EN: switchgrass @en
equivalent EN: switchgrass (en)
alternative label: panic raide
definition: Graminée du genre Panicum, cultivée notamment pour servir de biocombustible ou pour la fabrication d'éthanol.
in scheme: Agriculture
in scheme: concepts
notation: AGRI1262
related: concept-PETR219

paillis
type: ConceptConcept
type: Concept
creator: Commission d'enrichissement de la langue française, FranceTerme
date parution JO: 2012-05-13
equivalent EN: mulch @en
equivalent EN: mulch (en)
part of speech: nom masculin
definition: Matériau qui, épandu à la surface du sol, conserve l'humidité et limite l'érosion ainsi que le développement des espèces végétales concurrentes.
in scheme: Agriculture
in scheme: Forêt
in scheme: concept-SD-agriculture-sylviculture
in scheme: concept-SD-foret-sylviculture
in scheme: concepts
notation: AGRI1264
note: Le paillis peut être organique, naturel (feuilles, écorce et sciure de bois, paille, résidus d'exploitation... broyés) ou synthétique (plastique), rarement minéral (laine de verre).
related: paillage

paillage
type: ConceptConcept
type: Concept
creator: Commission d'enrichissement de la langue française, FranceTerme
date parution JO: 2012-05-13
equivalent EN: mulching @en
equivalent EN: mulching (en)
part of speech: nom masculin
definition: Épandage de paille ou de paillis sur un sol cultivé ou forestier.
in scheme: Agriculture
in scheme: Forêt
in scheme: concept-SD-agriculture-sylviculture
in scheme: concept-SD-foret-sylviculture
in scheme: concepts
notation: AGRI1265
related: paillis

bientraitance animale
type: ConceptConcept
type: Concept
creator: Commission d'enrichissement de la langue française, FranceTerme
date parution JO: 2012-05-13
equivalent EN: animal welfare @en
equivalent EN: animal welfare (en)
definition: Ensemble des dispositions visant à fournir à un animal des conditions d'environnement propres à assurer son bien-être.
in scheme: Agriculture
in scheme: Santé animale
in scheme: concept-SD-agriculture-elevage
in scheme: concept-SD-sante-animale-elevage
in scheme: concepts
notation: AGRI1269
related: concept-sante-animale

électroporation
type: ConceptConcept
type: Concept
creator: Commission d'enrichissement de la langue française, FranceTerme
source: révision de l'arrêté du 14 septembre 1990
date parution JO: 2000-09-22
equivalent EN: electroporation @en
equivalent EN: electroporation (en)
part of speech: nom féminin
definition: Technique permettant de faire pénétrer l'ADN dans des cellules, fondée sur l'utilisation d'impulsions électriques qui augmentent la perméabilité membranaire.
in scheme: Biologie
in scheme: concept-SD-biologie-genie-genetique
in scheme: concepts
notation: AGRI127

agriculture durable
type: ConceptConcept
type: Concept
creator: Commission d'enrichissement de la langue française, FranceTerme
date parution JO: 2012-05-13
equivalent EN: sustainable agriculture @en
equivalent EN: sustainable agriculture (en)
broader: concept-agriculture
definition: Agriculture conforme aux principes de développement durable.
in scheme: Agriculture
in scheme: concept-SD-agriculture-economie-agricole
in scheme: concept-SD-agriculture-politique-agricole
in scheme: concepts
notation: AGRI1270
related: agriculture biologique
related: agro-écologie
related: permaculture
related: agriculture naturelle
related: agriculture de conservation des sols
related: agriculture climato-compatible
related: développement durable

bonnes pratiques agricoles
type: ConceptConcept
type: Concept
creator: Commission d'enrichissement de la langue française, FranceTerme
abbreviation: BPA
date parution JO: 2012-05-13
deconseille ou frequent: bonne pratique agricole
equivalent EN: good farming practices @en
equivalent EN: good farming practices (en)
definition: Pratiques de culture et d'élevage conformes à des règles qui permettent à la fois l'amélioration de la production agricole et la réduction des risques pour l'homme et pour l'environnement.
in scheme: Agriculture
in scheme: concept-SD-agriculture-economie-agricole
in scheme: concept-SD-agriculture-politique-agricole
in scheme: concepts
notation: AGRI1273
note: 1. Les bonnes pratiques agricoles obéissent à des règles imposées par un cahier des charges, la coutume ou la pression sociale.
note: 2. Les risques peuvent concerner l'innocuité des aliments ou l'intégrité de l'environnement. Ils peuvent se traduire par des pollutions, de l'érosion, des atteintes à la biodiversité ou au paysage.
related: innocuité des aliments
related: concept-agriculture

pluriactivité
type: ConceptConcept
type: Concept
creator: Commission d'enrichissement de la langue française, FranceTerme
date parution JO: 2012-05-13
deconseille ou frequent: ménage agricole pluriactif
deconseille ou frequent: pluriactivité de l'exploitation
equivalent EN: multiple job holding of farmers @en
equivalent EN: multiple job holding of farmers (en)
part of speech: nom féminin
definition: Fait, pour un agriculteur, d'exercer de manière régulière une ou plusieurs autres activités professionnelles liées ou non à son exploitation.
in scheme: Agriculture
in scheme: concept-SD-agriculture-economie-agricole
in scheme: concepts
notation: AGRI1275
note: On parle également de « ménage agricole pluriactif ».

agriculture biologique
type: ConceptConcept
type: Concept
creator: Commission d'enrichissement de la langue française, FranceTerme
date parution JO: 2012-05-13
equivalent EN: organic farming @en
equivalent EN: organic farming (en)
broader: concept-agriculture
definition: Mode de production agricole excluant l'emploi de substances de synthèse, tels que les pesticides, les médicaments ou les engrais de synthèse, et d'organismes génétiquement modifiés.
in scheme: Agriculture
in scheme: concept-SD-agriculture-economie-agricole
in scheme: concept-SD-agriculture-politique-agricole
in scheme: concepts
notation: AGRI1278
note: Les procédés et les produits de l'agriculture biologique font l'objet d'une certification.
related: agriculture durable
related: volontariat agrobio
related: volontaire agrobio
related: agro-écologie
related: permaculture
related: agriculture naturelle
related: agriculture de conservation des sols

cosmide
type: ConceptConcept
type: Concept
creator: Commission d'enrichissement de la langue française, FranceTerme
source: révision de l'arrêté du 14 septembre 1990
date parution JO: 2000-09-22
equivalent EN: cosmid @en
equivalent EN: cosmid (en)
part of speech: nom masculin
definition: Plasmide possédant le site COS du bactériophage lambda nécessaire à l'encapsidation.
in scheme: Biologie
in scheme: concept-SD-biologie-genie-genetique
in scheme: concept-SD-biologie-virologie
in scheme: concepts
notation: AGRI1280
note: Un cosmide ne permet de cloner que des fragments d'ADN de grande taille.
related: encapsidation
related: plasmide
related: site COS
related: bactériophage

tonte de présentation
type: ConceptConcept
type: Concept
creator: Commission d'enrichissement de la langue française, FranceTerme
date parution JO: 2013-12-15
deconseille ou frequent: clippage
deconseille ou frequent: tonte de concours
equivalent EN: clipping @en
equivalent EN: clipping (en)
alternative label: tonte rase
definition: Tonte à ras d'un animal effectuée pour le mettre en valeur, notamment lors de sa présentation à un concours.
in scheme: Agriculture
in scheme: concept-SD-agriculture-elevage
in scheme: concepts
notation: AGRI1281
note: 1. Dans le cadre d’un concours, on trouve aussi le terme « tonte de concours ».
note: 2. On trouve aussi, dans le langage professionnel, le terme « clippage », qui est déconseillé.
note: 3. La tonte de présentation est la tonte la plus utilisée pour les animaux autres que les animaux à laine.

volontariat agrobio
type: ConceptConcept
type: Concept
creator: Commission d'enrichissement de la langue française, FranceTerme
abbreviation: VAB
date parution JO: 2013-12-15
equivalent EN: wwoofing @en
equivalent EN: wwoofing (en)
definition: Participation volontaire aux activités d'une ferme biologique, en échange du gîte et du couvert.
definition: Voluntary participation in the activities of a biological farm, in exchange for board and lodging. @en
in scheme: Agriculture
in scheme: concept-SD-agriculture-economie-agricole
in scheme: concepts
notation: AGRI1282
preferred label: wwoofing @en
related: agriculture biologique
related: volontaire agrobio

moléculture végétale
type: ConceptConcept
type: Concept
creator: Commission d'enrichissement de la langue française, FranceTerme
date parution JO: 2013-12-15
equivalent EN: biopharming @en
equivalent EN: biopharming (en)
equivalent EN: molecular farming @en
equivalent EN: molecular farming (en)
equivalent EN: molecular pharming @en
equivalent EN: molecular pharming (en)
definition: Moléculture réalisée à partir de plantes cultivées génétiquement modifiées à cette fin.
in scheme: Agriculture
in scheme: Biologie
in scheme: concept-SD-agriculture-biochimie-et-biologie-moleculaire
in scheme: concept-SD-biologie-biochimie-et-biologie-moleculaire
in scheme: concepts
notation: AGRI1283
related: moléculture
related: moléculture animale

moléculture animale
type: ConceptConcept
type: Concept
creator: Commission d'enrichissement de la langue française, FranceTerme
date parution JO: 2013-12-15
equivalent EN: gene pharming @en
equivalent EN: gene pharming (en)
definition: Moléculture réalisée à partir d'animaux d'élevage génétiquement modifiés à cette fin.
in scheme: Agriculture
in scheme: Biologie
in scheme: concept-SD-agriculture-biochimie-et-biologie-moleculaire
in scheme: concept-SD-biologie-biochimie-et-biologie-moleculaire
in scheme: concepts
notation: AGRI1284
note: Des molécules d'intérêt pharmaceutique peuvent, par exemple, être produites à partir de lait, de blanc d’œuf ou de sang, après extraction et purification.
related: moléculture
related: moléculture végétale

rejet immédiat
type: ConceptConcept
type: Concept
creator: Commission d'enrichissement de la langue française, FranceTerme
date parution JO: 2013-12-15
equivalent EN: slipping @en
equivalent EN: slipping (en)
definition: Pratique consistant, pour des raisons règlementaires ou commerciales, à rejeter à la mer l’ensemble des captures avant la remontée complète des filets à bord du navire.
in scheme: Pêche et aquaculture
in scheme: concept-SD-peche-et-aquaculture-peche-maritime
in scheme: concepts
notation: AGRI1285
note: Le rejet immédiat est une pratique de pêche à la senne.

pantalon-bottes
type: ConceptConcept
type: Concept
creator: Commission d'enrichissement de la langue française, FranceTerme
date parution JO: 2013-12-15
equivalent EN: chest waders @en
equivalent EN: chest waders (en)
equivalent EN: waders @en
equivalent EN: waders (en)
part of speech: nom masculin
definition: Vêtement étanche d'un seul tenant, constitué d'un pantalon montant ou d'une salopette et de bottes.
in scheme: Loisirs
in scheme: Pêche et aquaculture
in scheme: concepts
notation: AGRI1286
related: pêche à gué

volontaire agrobio
type: ConceptConcept
type: Concept
creator: Commission d'enrichissement de la langue française, FranceTerme
abbreviation: VAB
date parution JO: 2013-12-15
equivalent EN: wwoofer @en
equivalent EN: wwoofer (en)
definition: Personne qui participe aux activités d’une ferme biologique, en échange du gîte et du couvert.
in scheme: Agriculture
in scheme: concept-SD-agriculture-economie-agricole
in scheme: concepts
notation: AGRI1289
related: agriculture biologique
related: volontariat agrobio

empreinte à la nucléase
type: ConceptConcept
type: Concept
creator: Commission d'enrichissement de la langue française, FranceTerme
source: révision de l'arrêté du 14 septembre 1990
date parution JO: 2000-09-22
equivalent EN: nuclease footprinting @en
equivalent EN: nuclease footprinting (en)
definition: Visualisation d'une région de l'ADN spécifiquement liée à une protéine qui la protège contre l'action d'une nucléase.
in scheme: Biologie
in scheme: concept-SD-biologie-genie-genetique
in scheme: concepts
notation: AGRI129

agro-écologie
type: ConceptConcept
type: Concept
creator: Commission d'enrichissement de la langue française, FranceTerme
date parution JO: 2015-08-19
deconseille ou frequent: agro-ecology
deconseille ou frequent: agroécologie
equivalent EN: agroecology @en
equivalent EN: agroecology (en)
part of speech: nom féminin
definition: Application de la science écologique à l’étude, à la conception et à la gestion d’agrosystèmes durables.
in scheme: Agriculture
in scheme: Environnement
in scheme: concepts
notation: AGRI1291
related: agriculture durable

agro-écologie
type: ConceptConcept
type: Concept
creator: Commission d'enrichissement de la langue française, FranceTerme
date parution JO: 2015-08-19
deconseille ou frequent: agro-ecology
deconseille ou frequent: agroécologie
equivalent EN: agroecology @en
equivalent EN: agroecology (en)
part of speech: nom féminin
broader: concept-agriculture
definition: Ensemble de pratiques agricoles privilégiant les interactions biologiques et visant à une utilisation optimale des possibilités offertes par les agrosystèmes.
in scheme: Agriculture
in scheme: Environnement
in scheme: concepts
notation: AGRI1292
note: L’agro-écologie tend notamment à combiner une production agricole compétitive avec une exploitation raisonnée des ressources naturelles.
related: agriculture biologique
related: agroforesterie
related: répulsion-attraction
related: sylvopastoralisme
related: permaculture
related: agriculture naturelle
related: agriculture de conservation des sols
related: agriculture climato-compatible

agroforesterie
type: ConceptConcept
type: Concept
creator: Commission d'enrichissement de la langue française, FranceTerme
date parution JO: 2015-08-19
deconseille ou frequent: agro-foresterie
deconseille ou frequent: agro-forestry
equivalent EN: agroforestry @en
equivalent EN: agroforestry (en)
part of speech: nom féminin
broader: concept-agriculture
definition: Mode de production agricole associant sur une même parcelle des plantations d’arbres à d’autres cultures, dans la perspective d’effets bénéfiques réciproques.
in scheme: Agriculture
in scheme: Forêt
in scheme: concepts
notation: AGRI1293
note: 1. Les arbres plantés peuvent appartenir à des essences autres que forestières, notamment fruitières.
note: 2. L’agroforesterie est une des pratiques recommandées en agro-écologie.
related: agro-écologie
related: sylvopastoralisme

végétalisme intégral
type: ConceptConcept
type: Concept
creator: Commission d'enrichissement de la langue française, FranceTerme
date parution JO: 2015-08-19
deconseille ou frequent: véganisme
equivalent EN: veganism @en
equivalent EN: veganism (en)
definition: Mode de vie refusant l’utilisation des animaux au profit de l’homme et excluant en conséquence la consommation, directe ou sous forme de produits transformés, d’animaux et de produits d’origine animale.
in scheme: Tous domaines
in scheme: concepts
notation: AGRI1295
note: On trouve aussi le terme « véganisme », qui n’est pas recommandé.
related: végétalien, -ienne intégral, -e

végétalien, -ienne intégral, -e
type: ConceptConcept
type: Concept
creator: Commission d'enrichissement de la langue française, FranceTerme
date parution JO: 2015-08-19
deconseille ou frequent: végane
equivalent EN: vegan @en
equivalent EN: vegan (en)
definition: Adepte du végétalisme intégral.
in scheme: Tous domaines
in scheme: concepts
notation: AGRI1296
note: On trouve aussi le terme « végane », qui n’est pas recommandé.
related: végétalisme intégral

livre généalogique équin
type: ConceptConcept
type: Concept
creator: Commission d'enrichissement de la langue française, FranceTerme
date parution JO: 2015-08-19
deconseille ou frequent: studbook
equivalent EN: stud-book @en
equivalent EN: stud-book (en)
definition: Livre généalogique des races de chevaux et, par extension, des races d’ânes.
in scheme: Agriculture
in scheme: concept-SD-agriculture-elevage
in scheme: concepts
notation: AGRI1299
related: livre généalogique

acide ribonucléique
type: ConceptConcept
type: Concept
creator: Commission d'enrichissement de la langue française, FranceTerme
source: révision de l'arrêté du 14 septembre 1990
abbreviation: ARN
abbreviation: RNA @en
date parution JO: 2000-09-22
equivalent EN: RNA @en
equivalent EN: RNA (en)
equivalent EN: ribonucleic acid @en
equivalent EN: ribonucleic acid (en)
definition: Macromolécule formée de ribonucléotides résultant de la transcription de l'ADN, présente dans les cellules eucaryotes, les cellules procaryotes, ainsi que dans certains virus.
in scheme: Biologie
in scheme: concept-SD-biologie-genie-genetique
in scheme: concepts
notation: AGRI13
related: acide désoxyribonucléique

empreinte génétique
type: ConceptConcept
type: Concept
creator: Commission d'enrichissement de la langue française, FranceTerme
source: révision de l'arrêté du 14 septembre 1990
date parution JO: 2000-09-22
equivalent EN: DNA fingerprint @en
equivalent EN: DNA fingerprint (en)
equivalent EN: genetic footprint @en
equivalent EN: genetic footprint (en)
alternative label: trace génétique
definition: Caractéristique structurale fine d'une région spécifique de l'ADN permettant d'identifier une cellule et sa filiation.
in scheme: Biologie
in scheme: concept-SD-biologie-genie-genetique
in scheme: concepts
notation: AGRI130

livre généalogique
type: ConceptConcept
type: Concept
creator: Commission d'enrichissement de la langue française, FranceTerme
date parution JO: 2015-08-19
deconseille ou frequent: herdbook
equivalent EN: breed registry @en
equivalent EN: breed registry (en)
equivalent EN: herd-book @en
equivalent EN: herd-book (en)
definition: Registre dans lequel sont inscrits les reproducteurs d’une race déterminée d’animaux domestiques, avec, éventuellement, leurs descendants et, dans certains cas, leurs performances.
in scheme: Agriculture
in scheme: concept-SD-agriculture-elevage
in scheme: concepts
notation: AGRI1300
related: livre généalogique équin
related: livre généalogique bovin
related: livre généalogique ovin

livre généalogique bovin
type: ConceptConcept
type: Concept
creator: Commission d'enrichissement de la langue française, FranceTerme
date parution JO: 2015-08-19
deconseille ou frequent: herdbook
equivalent EN: herd-book @en
equivalent EN: herd-book (en)
definition: Livre généalogique des races de bovins.
in scheme: Agriculture
in scheme: concept-SD-agriculture-elevage
in scheme: concepts
notation: AGRI1301
related: livre généalogique

livre généalogique ovin
type: ConceptConcept
type: Concept
creator: Commission d'enrichissement de la langue française, FranceTerme
date parution JO: 2015-08-19
deconseille ou frequent: flockbook
equivalent EN: flock-book @en
equivalent EN: flock-book (en)
definition: Livre généalogique des races de moutons.
in scheme: Agriculture
in scheme: concept-SD-agriculture-elevage
in scheme: concepts
notation: AGRI1302
related: livre généalogique

granulé de bois
type: ConceptConcept
type: Concept
creator: Commission d'enrichissement de la langue française, FranceTerme
date parution JO: 2015-08-19
deconseille ou frequent: wood pellet
equivalent EN: wood-pellet @en
equivalent EN: wood-pellet (en)
definition: Bâtonnet constitué de sciure et de copeaux de bois compactés, utilisé essentiellement comme source d’énergie.
in scheme: Énergie
in scheme: Forêt
in scheme: concepts
notation: AGRI1303

pêche à gué
type: ConceptConcept
type: Concept
creator: Commission d'enrichissement de la langue française, FranceTerme
date parution JO: 2015-08-19
equivalent EN: wading @en
equivalent EN: wading (en)
broader: concept-loisirs
definition: Pêche à la ligne que l’on pratique dans un cours d’eau en se tenant debout immergé jusqu’à la ceinture.
in scheme: Loisirs
in scheme: Pêche et aquaculture
in scheme: concepts
notation: AGRI1305
related: pantalon-bottes
related: concept-peche-et-aquaculture

pêche minotière
type: ConceptConcept
type: Concept
creator: Commission d'enrichissement de la langue française, FranceTerme
date parution JO: 2015-08-19
equivalent EN: fish meal fishery @en
equivalent EN: fish meal fishery (en)
equivalent EN: industrial fishery @en
equivalent EN: industrial fishery (en)
equivalent EN: reduction fishery @en
equivalent EN: reduction fishery (en)
definition: Pêche dont les captures sont destinées à la production industrielle de farines et d’huiles de poisson.
in scheme: Pêche et aquaculture
in scheme: concept-SD-peche-et-aquaculture-peche-maritime
in scheme: concepts
notation: AGRI1306
note: La pêche minotière se pratique avec des filets à petites mailles qui capturent de grandes quantités de poissons, principalement de petits pélagiques ; elle n’est pas sélective.
related: pêche sélective
related: concept-peche-et-aquaculture

fileyeur
type: ConceptConcept
type: Concept
creator: Commission d'enrichissement de la langue française, FranceTerme
date parution JO: 2015-08-19
deconseille ou frequent: chalutier
equivalent EN: netter @en
equivalent EN: netter (en)
part of speech: nom masculin
definition: Navire de pêche utilisant des filets qu’il dépose sur le fond ou laisse aller à la dérive entre deux eaux.
in scheme: Pêche et aquaculture
in scheme: concept-SD-peche-et-aquaculture-peche-maritime
in scheme: concepts
notation: AGRI1307
note: Il convient de distinguer le fileyeur du chalutier.
related: fileyeur, -euse

fileyeur, -euse
type: ConceptConcept
type: Concept
creator: Commission d'enrichissement de la langue française, FranceTerme
date parution JO: 2015-08-19
part of speech: nom
definition: Marin-pêcheur employé sur un fileyeur.
in scheme: Pêche et aquaculture
in scheme: concept-SD-peche-et-aquaculture-peche-maritime
in scheme: concepts
notation: AGRI1308
related: fileyeur

pic alimentaire
type: ConceptConcept
type: Concept
creator: Commission d'enrichissement de la langue française, FranceTerme
date parution JO: 2017-06-18
equivalent EN: peak food @en
equivalent EN: peak food (en)
definition: Maximum atteint par la production alimentaire mondiale, au-delà duquel celle-ci décroîtrait, en raison notamment de la raréfaction des terres disponibles et du manque d’eau.
in scheme: Agriculture
in scheme: Alimentation
in scheme: concepts
notation: AGRI1309
related: sécurité alimentaire
related: suffisance alimentaire

encapsidation
type: ConceptConcept
type: Concept
creator: Commission d'enrichissement de la langue française, FranceTerme
source: révision de l'arrêté du 14 septembre 1990
date parution JO: 2000-09-22
equivalent EN: packaging @en
equivalent EN: packaging (en)
part of speech: nom féminin
definition: Empaquetage de matériel génétique à l'intérieur d'une capside virale.
in scheme: Biologie
in scheme: concept-SD-biologie-genie-genetique
in scheme: concept-SD-biologie-virologie
in scheme: concepts
notation: AGRI131
related: cosmide
related: ARN satellite

reprogrammation de moteur
type: ConceptConcept
type: Concept
creator: Commission d'enrichissement de la langue française, FranceTerme
date parution JO: 2017-06-18
deconseille ou frequent: reprogrammation du moteur
equivalent EN: chip tuning @en
equivalent EN: chip tuning (en)
equivalent EN: chiptuning @en
equivalent EN: chiptuning (en)
definition: Modification des paramètres de commande d’un moteur thermique, destinée notamment à en augmenter la puissance ou le couple, ou encore à réduire la consommation de carburant et l’émission de polluants.
in scheme: Agriculture
in scheme: Automobile
in scheme: concept-SD-agriculture-materiel-agricole-et-forestier
in scheme: concept-SD-automobile-materiel-agricole-et-forestier
in scheme: concepts
notation: AGRI1310
note: Les moteurs modernes sont pilotés en temps réel par un ordinateur. La reprogrammation de moteur consiste à modifier le logiciel embarqué ou à insérer des dispositifs électroniques de substitution.

bioenrichissement agronomique
type: ConceptConcept
type: Concept
creator: Commission d'enrichissement de la langue française, FranceTerme
date parution JO: 2017-06-18
deconseille ou frequent: biofortification agronomique
equivalent EN: agronomic biofortification @en
equivalent EN: agronomic biofortification (en)
definition: Amélioration de la richesse nutritionnelle des plantes alimentaires par des pratiques culturales appropriées.
in scheme: Agriculture
in scheme: Alimentation
in scheme: concepts
notation: AGRI1311
note: Le bioenrichissement agronomique permet d’augmenter la teneur des plantes en minéraux, en vitamines ou en provitamines, en acides gras et en acides aminés essentiels, ainsi que leur biodisponibilité.

protection biologique des cultures
type: ConceptConcept
type: Concept
creator: Commission d'enrichissement de la langue française, FranceTerme
date parution JO: 2018-09-07
deconseille ou frequent: biocontrôle
equivalent EN: biocontrol @en
equivalent EN: biocontrol (en)
equivalent EN: biological control @en
equivalent EN: biological control (en)
forme abregee: protection biologique
alternative label: bioprotection
definition: Ensemble de méthodes préventives et curatives protégeant les plantes cultivées ou les récoltes contre les bioagresseurs, qui sont fondées sur l'utilisation des processus naturels à l'œuvre dans les écosystèmes.
in scheme: Agriculture
in scheme: Forêt
in scheme: concepts
notation: AGRI1312
note: 1. La protection biologique des cultures cherche à maintenir les populations de bioagresseurs à des niveaux acceptables, n'entraînant pas de dommages significatifs sur les cultures. Elle consiste par exemple à introduire des prédateurs, des parasitoïdes, des parasites, des pathogènes ou des concurrents des bioagresseurs et à favoriser ceux qui sont déjà naturellement présents. Elle peut aussi consister à pulvériser des substances naturelles, telles que des médiateurs chimiques, ou des microorganismes, reconnus par les plantes comme des bioagresseurs, pour stimuler leurs mécanismes naturels de défense.
note: 2. Des méthodes analogues à la protection biologique des cultures sont employées pour protéger les animaux d’élevage.
note: 3. On trouve aussi, dans le langage professionnel, le terme « biocontrôle ».
related: produit de protection biologique des cultures
related: bioagresseur des cultures
related: serre écologique

produit de protection biologique des cultures
type: ConceptConcept
type: Concept
creator: Commission d'enrichissement de la langue française, FranceTerme
date parution JO: 2018-09-07
deconseille ou frequent: biopesticide
deconseille ou frequent: produit de biocontrôle
equivalent EN: biocontrol agent @en
equivalent EN: biocontrol agent (en)
equivalent EN: biopesticide @en
equivalent EN: biopesticide (en)
equivalent EN: bioprotectant @en
equivalent EN: bioprotectant (en)
forme abregee: produit de protection biologique
alternative label: bioprotecteur des cultures
alternative label: produit de bioprotection
definition: Produit contenant des auxiliaires des cultures, tels que des invertébrés ou des microorganismes, ou des substances naturelles, telles que des médiateurs chimiques, qui sont conditionnés pour être utilisés dans la protection biologique des cultures.
in scheme: Agriculture
in scheme: Forêt
in scheme: concepts
notation: AGRI1313
note: On trouve aussi, dans le langage professionnel, le terme « produit de biocontrôle », ainsi que le terme « biopesticide » qui est déconseillé.
related: éliciteur
related: protection biologique des cultures
related: bioagresseur des cultures
related: auxiliaire des cultures

phytoprotecteur
type: ConceptConcept
type: Concept
creator: Commission d'enrichissement de la langue française, FranceTerme
date parution JO: 2017-06-18
deconseille ou frequent: safeneur
equivalent EN: herbicide safener @en
equivalent EN: herbicide safener (en)
equivalent EN: safener @en
equivalent EN: safener (en)
part of speech: nom masculin
definition: Substance capable de protéger une plante cultivée contre l’action toxique d’un produit phytopharmaceutique.
in scheme: Agriculture
in scheme: concepts
notation: AGRI1314
note: 1. Les phytoprotecteurs sont le plus souvent inclus dans les préparations herbicides.
note: 2. Le terme « safeneur » est à proscrire.

sécurité biologique
type: ConceptConcept
type: Concept
creator: Commission d'enrichissement de la langue française, FranceTerme
date parution JO: 2017-06-18
equivalent EN: biological safety @en
equivalent EN: biological safety (en)
equivalent EN: biosafety @en
equivalent EN: biosafety (en)
alternative label: biosécurité
definition: Ensemble des mesures et des pratiques qui sont relatives à la gestion des risques biologiques susceptibles de menacer la vie et la santé des personnes, des animaux et des végétaux et de porter atteinte à l’environnement ; par extension, état résultant de ces mesures et de ces pratiques.
in scheme: Agriculture
in scheme: Recherche
in scheme: concepts
notation: AGRI1315
note: Les mesures de sécurité biologique sont mises en œuvre notamment au sein des laboratoires, des élevages et des établissements agroalimentaires.
related: sûreté biologique

sûreté biologique
type: ConceptConcept
type: Concept
creator: Commission d'enrichissement de la langue française, FranceTerme
date parution JO: 2017-06-18
equivalent EN: biological security @en
equivalent EN: biological security (en)
equivalent EN: biosecurity @en
equivalent EN: biosecurity (en)
alternative label: biosûreté
definition: Composante de la sécurité biologique qui traite des risques biologiques liés aux négligences ou aux actes de malveillance.
in scheme: Agriculture
in scheme: Recherche
in scheme: concepts
notation: AGRI1316
related: sécurité biologique
related: défense alimentaire

compatibilité alimentaire
type: ConceptConcept
type: Concept
creator: Commission d'enrichissement de la langue française, FranceTerme
date parution JO: 2017-06-18
deconseille ou frequent: alimentarité
equivalent EN: food compatibility @en
equivalent EN: food compatibility (en)
definition: Capacité d’un matériau à être mis en contact avec un aliment sans transfert de molécules dommageable à la qualité et à l’innocuité de l’aliment.
in scheme: Alimentation
in scheme: Matériaux
in scheme: concepts
notation: AGRI1317
note: 1. La compatibilité alimentaire d’un matériau dépend de ses qualités intrinsèques, de ses conditions d’utilisation, ainsi que de l’aliment qui est à son contact.
note: 2. On trouve aussi, dans le langage professionnel, le terme « alimentarité ».
related: innocuité des aliments
related: test d'alimentarité

agrotourisme
type: ConceptConcept
type: Concept
creator: Commission d'enrichissement de la langue française, FranceTerme
date parution JO: 2017-06-18
deconseille ou frequent: agri-tourisme
deconseille ou frequent: agritourisme
deconseille ou frequent: agro-tourisme
equivalent EN: agrotourism @en
equivalent EN: agrotourism (en)
equivalent EN: farm tourism @en
equivalent EN: farm tourism (en)
part of speech: nom masculin
alternative label: tourisme à la ferme
definition: Ensemble des activités touristiques pratiquées dans une exploitation agricole, qui permettent à des personnes de découvrir les métiers de l’agriculture et les modes de vie ruraux et de consommer les produits de la ferme, l’hébergement sur place étant souvent possible.
in scheme: Agriculture
in scheme: Tourisme
in scheme: concepts
notation: AGRI1318
note: On trouve aussi le terme « agritourisme ».

engorgement d'un sol
type: ConceptConcept
type: Concept
creator: Commission d'enrichissement de la langue française, FranceTerme
source: révision de l'arrêté du 7 avril 1987
date parution JO: 2000-09-22
equivalent EN: waterlogging @en
equivalent EN: waterlogging (en)
forme abregee: engorgement, n.m.
definition: Saturation temporaire ou permanente d'un sol par l'eau, du fait d'un drainage naturel déficient.
in scheme: Hydraulique
in scheme: concept-SD-hydraulique-drainage-agricole
in scheme: concepts
notation: AGRI132
note: Ce terme ne doit pas être confondu avec le terme « hydromorphie ».
related: hydromorphie

bioagresseur des cultures
type: ConceptConcept
type: Concept
creator: Commission d'enrichissement de la langue française, FranceTerme
date parution JO: 2018-09-07
deconseille ou frequent: ennemi des cultures
equivalent EN: pest @en
equivalent EN: pest (en)
forme abregee: bioagresseur, n.m.
definition: Organisme vivant qui cause des dommages aux plantes cultivées ou aux récoltes.
in scheme: Agriculture
in scheme: Forêt
in scheme: concepts
notation: AGRI1320
note: 1. Les bioagresseurs des cultures peuvent être des ravageurs, des agents phytopathogènes ou des plantes adventices.
note: 2. On trouve aussi, parfois employé dans ce sens, le terme « ennemi des cultures ».
related: protection biologique des cultures
related: produit de protection biologique des cultures
related: auxiliaire des cultures

phytostimulant
type: ConceptConcept
type: Concept
creator: Commission d'enrichissement de la langue française, FranceTerme
date parution JO: 2018-09-07
deconseille ou frequent: additif agronomique
equivalent EN: plant biostimulant @en
equivalent EN: plant biostimulant (en)
part of speech: nom masculin
alternative label: biostimulant des plantes
definition: Produit qui est utilisé pour stimuler l’absorption des nutriments et permettre une meilleure utilisation de ceux-ci par les plantes cultivées, pour renforcer la résistance de ces plantes aux agressions abiotiques, ou pour améliorer la qualité des récoltes.
in scheme: Agriculture
in scheme: Forêt
in scheme: concepts
notation: AGRI1321
note: 1. Un phytostimulant peut contenir un organisme vivant tel qu'une bactérie ou un champignon, une substance naturelle ou synthétique.
note: 2. Les températures extrêmes, la sécheresse, l’excès d’eau, le vent ou la salinité des sols peuvent constituer des agressions abiotiques.
note: 3. La valeur nutritionnelle, la durée de conservation, la pigmentation des fleurs sont des exemples de qualité des récoltes.
note: 4. On trouve aussi, dans le langage professionnel, le terme « additif agronomique ».
related: éliciteur
related: technique agricole de pointe

auxiliaire des cultures
type: ConceptConcept
type: Concept
creator: Commission d'enrichissement de la langue française, FranceTerme
date parution JO: 2018-09-07
equivalent EN: beneficial @en
equivalent EN: beneficial (en)
equivalent EN: beneficial organism @en
equivalent EN: beneficial organism (en)
forme abregee: auxiliaire, n.m.
definition: Organisme utile aux plantes cultivées, soit en tant que prédateur ou parasite des bioagresseurs des cultures, soit en tant que pollinisateur indispensable à la fécondation de nombreuses espèces.
in scheme: Agriculture
in scheme: Forêt
in scheme: concepts
notation: AGRI1322
note: Les auxiliaires des cultures sont généralement des animaux, mais ils peuvent aussi être des microorganismes, par exemple des agents pathogènes de bioagresseurs, voire des plantes.
related: produit de protection biologique des cultures
related: bioagresseur des cultures

répulsion-attraction
type: ConceptConcept
type: Concept
creator: Commission d'enrichissement de la langue française, FranceTerme
date parution JO: 2018-09-07
deconseille ou frequent: chasser-charmer
equivalent EN: push-pull @en
equivalent EN: push-pull (en)
part of speech: nom féminin
definition: Pratique agro-écologique associant à la culture principale, sur une même parcelle, une culture qui éloigne les ravageurs ou étouffe les plantes adventices, ainsi qu'une culture qui attire et piège les ravageurs.
in scheme: Agriculture
in scheme: concepts
notation: AGRI1323
note: La répulsion-attraction, largement répandue en Afrique de l’Est, fait l'objet d'expérimentations en zone tempérée.
related: agro-écologie

défense alimentaire
type: ConceptConcept
type: Concept
creator: Commission d'enrichissement de la langue française, FranceTerme
date parution JO: 2018-09-07
deconseille ou frequent: défense de la chaîne alimentaire
deconseille ou frequent: protection de la chaîne alimentaire
equivalent EN: food defence @en
equivalent EN: food defence (en)
equivalent EN: food defense @en
equivalent EN: food defense (en)
definition: Ensemble des mesures qui sont prises pour protéger la chaîne de production, de transformation et de distribution des aliments contre les actes malveillants, criminels ou terroristes.
in scheme: Alimentation
in scheme: concepts
notation: AGRI1324
note: On trouve aussi le terme « protection de la chaîne alimentaire ».
related: innocuité des aliments
related: sûreté biologique

sylvopastoralisme
type: ConceptConcept
type: Concept
creator: Commission d'enrichissement de la langue française, FranceTerme
date parution JO: 2018-09-07
equivalent EN: silvopastoral agroforestry @en
equivalent EN: silvopastoral agroforestry (en)
equivalent EN: silvopasture @en
equivalent EN: silvopasture (en)
part of speech: nom masculin
definition: Mode de production agro-écologique qui associe, sur un même territoire, l'élevage, essentiellement de ruminants, et la production sylvicole.
in scheme: Agriculture
in scheme: Forêt
in scheme: concepts
notation: AGRI1325
related: agro-écologie
related: agroforesterie

flexivégétarien, -ienne
type: ConceptConcept
type: Concept
creator: Commission d'enrichissement de la langue française, FranceTerme
date parution JO: 2018-09-07
deconseille ou frequent: flexitarien
deconseille ou frequent: flexitarienne
deconseille ou frequent: semivégétarien
deconseille ou frequent: semivégétarienne
equivalent EN: flexitarian @en
equivalent EN: flexitarian (en)
part of speech: nom
definition: Adepte du flexivégétarisme.
in scheme: Alimentation
in scheme: concepts
notation: AGRI1326
note: On trouve aussi le terme « flexitarien, -ienne », qui n’est pas recommandé.
related: flexivégétarisme

flexivégétarisme
type: ConceptConcept
type: Concept
creator: Commission d'enrichissement de la langue française, FranceTerme
date parution JO: 2018-09-07
deconseille ou frequent: flexitarisme
deconseille ou frequent: semivégétarisme
equivalent EN: flexitarianism @en
equivalent EN: flexitarianism (en)
equivalent EN: semi-vegetarianism @en
equivalent EN: semi-vegetarianism (en)
part of speech: nom masculin
definition: Pratique alimentaire qui privilégie un régime végétarien sans exclure la consommation occasionnelle de produits carnés.
in scheme: Alimentation
in scheme: concepts
notation: AGRI1327
note: On trouve aussi le terme « flexitarisme », qui n’est pas recommandé.
related: flexivégétarien, -ienne

syndrome de Noé
type: ConceptConcept
type: Concept
creator: Commission d'enrichissement de la langue française, FranceTerme
date parution JO: 2018-09-07
equivalent EN: animal hoarding @en
equivalent EN: animal hoarding (en)
definition: Comportement pathologique consistant à héberger un grand nombre d’animaux, généralement de compagnie, dans des conditions de vie et d’hygiène inadaptées, susceptibles d’altérer leur santé.
in scheme: Santé animale
in scheme: Santé et médecine
in scheme: concept-SD-sante-animale-psychiatrie
in scheme: concept-SD-sante-et-medecine-psychiatrie
in scheme: concepts
notation: AGRI1328

permaculture
type: ConceptConcept
type: Concept
creator: Commission d'enrichissement de la langue française, FranceTerme
date parution JO: 2021-05-27
deconseille ou frequent: agriculture permanente
deconseille ou frequent: culture permanente
equivalent EN: permaculture @en
equivalent EN: permaculture (en)
part of speech: nom féminin
definition: Forme d’agriculture durable économe en ressources et respectueuse de la biodiversité, qui est pratiquée à l’échelle locale par des individus ou des groupes recherchant une certaine autonomie, notamment alimentaire.
in scheme: Agriculture
in scheme: Environnement
in scheme: concepts
notation: AGRI1329
note: 1. La permaculture accorde une importance particulière à l’organisation et à l’aménagement de l’espace.
note: 2. La permaculture s’inspire largement de l’agriculture naturelle.
related: agriculture durable
related: agriculture biologique
related: agro-écologie
related: agriculture naturelle
related: agriculture de conservation des sols
related: biodiversité
related: développement durable

épisode de drainage
type: ConceptConcept
type: Concept
creator: Commission d'enrichissement de la langue française, FranceTerme
source: révision de l'arrêté du 7 avril 1987
date parution JO: 2000-09-22
equivalent EN: drainage hydrograph @en
equivalent EN: drainage hydrograph (en)
definition: Période pendant laquelle s'effectue la réponse complète d'un réseau à une pluie ou une série de pluies.
in scheme: Hydraulique
in scheme: concept-SD-hydraulique-drainage-agricole
in scheme: concepts
notation: AGRI133
note: Un épisode de drainage comporte deux phases successives, le régime influencé et le régime non influencé par les pluies.

agriculture naturelle
type: ConceptConcept
type: Concept
creator: Commission d'enrichissement de la langue française, FranceTerme
date parution JO: 2021-05-27
equivalent EN: natural farming @en
equivalent EN: natural farming (en)
equivalent EN: wild farming @en
equivalent EN: wild farming (en)
alternative label: agriculture sauvage
definition: Forme d’agriculture qui repose sur les processus naturels et limite les interventions humaines aux seuls ensemencements et récoltes.
in scheme: Agriculture
in scheme: concepts
notation: AGRI1330
note: L’agriculture naturelle est une forme extrême d’agro-écologie.
related: agriculture durable
related: agriculture biologique
related: agro-écologie
related: permaculture

agriculture de conservation des sols
type: ConceptConcept
type: Concept
creator: Commission d'enrichissement de la langue française, FranceTerme
date parution JO: 2021-05-27
deconseille ou frequent: agriculture de restauration
equivalent EN: conservation agriculture @en
equivalent EN: conservation agriculture (en)
equivalent EN: conservation farming @en
equivalent EN: conservation farming (en)
forme abregee: agriculture de conservation
definition: Ensemble de pratiques agricoles qui visent à restaurer, à maintenir ou à améliorer la qualité des sols en utilisant une grande diversité d’espèces et en allongeant le rythme de rotation des cultures, en réduisant les labours, voire en les supprimant, et en assurant la couverture permanente des sols.
in scheme: Agriculture
in scheme: concepts
notation: AGRI1331
note: L'agriculture de conservation relève de l'agro-écologie.
related: agriculture durable
related: agriculture biologique
related: agro-écologie
related: permaculture

technique agricole de pointe
type: ConceptConcept
type: Concept
creator: Commission d'enrichissement de la langue française, FranceTerme
date parution JO: 2021-05-27
deconseille ou frequent: agri-tech
deconseille ou frequent: technologie agricole de pointe
deconseille ou frequent: technologie de pointe
deconseille ou frequent: technologie de pointe agricole
equivalent EN: ag-tech @en
equivalent EN: ag-tech (en)
equivalent EN: agricultural technology @en
equivalent EN: agricultural technology (en)
equivalent EN: agritech @en
equivalent EN: agritech (en)
equivalent EN: agtech @en
equivalent EN: agtech (en)
definition: Technique agricole faisant appel aux outils numériques ou aux découvertes scientifiques récentes.
in scheme: Agriculture
in scheme: concepts
notation: AGRI1332
note: L’utilisation d’éliciteurs ou de phytostimulants, la cueillette des fruits par des robots, le guidage des machines agricoles par géolocalisation par satellite, le rationnement individuel automatisé des animaux, l’aéroponie ou la gestion collaborative des assolements de plusieurs exploitations voisines sont des exemples de techniques agricoles de pointe.
related: éliciteur
related: phytostimulant
related: agriculture de pointe
related: technique agroalimentaire de pointe
related: agriculture de précision
related: élevage de précision
related: serre écologique

agriculture de pointe
type: ConceptConcept
type: Concept
creator: Commission d'enrichissement de la langue française, FranceTerme
date parution JO: 2021-05-27
deconseille ou frequent: agri-tech
deconseille ou frequent: agriculture connectée
deconseille ou frequent: agriculture digitale
deconseille ou frequent: agriculture intelligente
deconseille ou frequent: agriculture numérique
equivalent EN: ag-tech @en
equivalent EN: ag-tech (en)
equivalent EN: agritech @en
equivalent EN: agritech (en)
equivalent EN: agtech @en
equivalent EN: agtech (en)
equivalent EN: digital agriculture @en
equivalent EN: digital agriculture (en)
equivalent EN: smart farming @en
equivalent EN: smart farming (en)
definition: Modèle d’agriculture qui utilise les techniques agricoles de pointe ; par extension, ensemble des entreprises de la filière agricole, notamment les jeunes pousses, qui recourent à ces techniques.
in scheme: Agriculture
in scheme: concepts
notation: AGRI1333
note: On trouve aussi le terme « agriculture numérique ».
related: technique agricole de pointe
related: technique agroalimentaire de pointe
related: agriculture de précision
related: élevage de précision
related: jeune pousse

technique agroalimentaire de pointe
type: ConceptConcept
type: Concept
creator: Commission d'enrichissement de la langue française, FranceTerme
date parution JO: 2021-05-27
deconseille ou frequent: technologie agro-alimentaire de pointe
deconseille ou frequent: technologie agroalimentaire de pointe
deconseille ou frequent: technologie alimentaire de pointe
deconseille ou frequent: technologie de pointe
deconseille ou frequent: technologie de pointe agroalimentaire
deconseille ou frequent: technologie de pointe alimentaire
equivalent EN: food tech @en
equivalent EN: food tech (en)
equivalent EN: food technology @en
equivalent EN: food technology (en)
equivalent EN: food-tech @en
equivalent EN: food-tech (en)
equivalent EN: foodtech @en
equivalent EN: foodtech (en)
definition: Technique agroalimentaire faisant appel aux outils numériques ou aux découvertes scientifiques récentes.
in scheme: Agriculture
in scheme: Alimentation
in scheme: concepts
notation: AGRI1334
note: La fabrication à partir de matières premières végétales de produits imitant les produits animaux, le traçage des produits alimentaires, la mise en relation des consommateurs avec les producteurs grâce à des plateformes numériques, ou les services de distribution de repas à domicile sont des exemples de techniques agroalimentaires de pointe.
related: technique agricole de pointe
related: agriculture de pointe
related: filière agroalimentaire de pointe

filière agroalimentaire de pointe
type: ConceptConcept
type: Concept
creator: Commission d'enrichissement de la langue française, FranceTerme
date parution JO: 2021-05-27
deconseille ou frequent: filière agro-alimentaire de pointe
deconseille ou frequent: filière alimentaire de pointe
deconseille ou frequent: filière de pointe
deconseille ou frequent: filière de pointe agroalimentaire
equivalent EN: food tech @en
equivalent EN: food tech (en)
equivalent EN: food-tech @en
equivalent EN: food-tech (en)
equivalent EN: foodtech @en
equivalent EN: foodtech (en)
forme abregee: agroalimentaire de pointe
definition: Partie de la filière agroalimentaire, constituée notamment de jeunes pousses, qui utilise les techniques agroalimentaires de pointe.
in scheme: Agriculture
in scheme: Alimentation
in scheme: concepts
notation: AGRI1335
related: technique agroalimentaire de pointe
related: jeune pousse

agriculture de précision
type: ConceptConcept
type: Concept
creator: Commission d'enrichissement de la langue française, FranceTerme
date parution JO: 2021-05-27
equivalent EN: precision agriculture @en
equivalent EN: precision agriculture (en)
equivalent EN: precision farming @en
equivalent EN: precision farming (en)
alternative label: culture de précision
definition: Ensemble des pratiques agricoles qui, grâce aux techniques agricoles de pointe, prennent en compte les caractéristiques de chaque parcelle et ajustent ainsi dans l’espace et dans le temps les interventions des machines et les applications d’intrants.
in scheme: Agriculture
in scheme: concepts
notation: AGRI1336
related: technique agricole de pointe
related: agriculture de pointe
related: élevage de précision

élevage de précision
type: ConceptConcept
type: Concept
creator: Commission d'enrichissement de la langue française, FranceTerme
date parution JO: 2021-05-27
deconseille ou frequent: precision livestock farming
equivalent EN: dairy precision farming @en
equivalent EN: dairy precision farming (en)
equivalent EN: precision farming @en
equivalent EN: precision farming (en)
definition: Ensemble des pratiques d’élevage recourant aux techniques agricoles de pointe, qui s’adaptent à l’état et aux besoins de chaque animal.
in scheme: Agriculture
in scheme: concept-SD-agriculture-elevage
in scheme: concepts
notation: AGRI1337
note: L’élevage de précision est principalement utilisé dans des exploitations de grande taille.
related: technique agricole de pointe
related: agriculture de pointe
related: agriculture de précision

agriculture climato-compatible
type: ConceptConcept
type: Concept
creator: Commission d'enrichissement de la langue française, FranceTerme
date parution JO: 2021-05-27
deconseille ou frequent: agriculture adaptée au climat
deconseille ou frequent: agriculture climato-intelligente
deconseille ou frequent: agriculture climatocompatible
deconseille ou frequent: agriculture intelligente face au climat
equivalent EN: CSA @en
equivalent EN: CSA (en)
equivalent EN: climate-smart agriculture @en
equivalent EN: climate-smart agriculture (en)
equivalent EN: climate-smart farming @en
equivalent EN: climate-smart farming (en)
alternative label: agriculture adaptée au changement climatique
definition: Modèle d’agriculture qui vise à s’adapter au changement climatique pour maintenir la productivité et les revenus agricoles, tout en s’efforçant de réduire les émissions de gaz à effet de serre.
in scheme: Agriculture
in scheme: Environnement
in scheme: concepts
notation: AGRI1338
note: 1. L’agriculture climato-compatible préconise, par exemple, le choix d’espèces ou de variétés végétales résistant aux températures élevées, aux chocs thermiques ou à la sécheresse, ou des méthodes d’élevage des ruminants réduisant leurs émissions de méthane.
note: 2. On trouve aussi le terme « agriculture intelligente face au climat », qui n’est pas recommandé.
related: agriculture durable
related: agro-écologie
related: résistant, -e au changement climatique

agriculture collaborative
type: ConceptConcept
type: Concept
creator: Commission d'enrichissement de la langue française, FranceTerme
date parution JO: 2021-05-27
deconseille ou frequent: agriculture en réseau
deconseille ou frequent: entraide agricole
deconseille ou frequent: entraide agricole en réseau
equivalent EN: co-farming @en
equivalent EN: co-farming (en)
equivalent EN: cofarming @en
equivalent EN: cofarming (en)
equivalent EN: collaborative farming @en
equivalent EN: collaborative farming (en)
definition: Mode d’exercice de l’agriculture dans lequel cultivateurs et éleveurs, grâce à l’internet et aux outils numériques, échangent des informations et partagent du matériel, de la main d’œuvre ou divers services.
in scheme: Agriculture
in scheme: concepts
notation: AGRI1339
note: 1. L’agriculture collaborative permet, par exemple, de mettre en relation des producteurs de fourrages et des éleveurs grâce à des plateformes numériques.
note: 2. L’agriculture collaborative s’inscrit dans la continuité de l’entraide agricole.

épisome
type: ConceptConcept
type: Concept
creator: Commission d'enrichissement de la langue française, FranceTerme
source: révision de l'arrêté du 14 septembre 1990
date parution JO: 2000-09-22
equivalent EN: episome @en
equivalent EN: episome (en)
part of speech: nom masculin
definition: Molécule circulaire d'ADN qui peut soit se répliquer de façon autonome (forme libre), soit être intégrée dans un chromosome cellulaire (forme intégrée).
in scheme: Biologie
in scheme: concept-SD-biologie-genie-genetique
in scheme: concepts
notation: AGRI134
related: facteur de fertilité

aquaculture hydroponique
type: ConceptConcept
type: Concept
creator: Commission d'enrichissement de la langue française, FranceTerme
date parution JO: 2021-05-27
deconseille ou frequent: culture aquaponique
deconseille ou frequent: hydroponic aquaculture
equivalent EN: aquaponics @en
equivalent EN: aquaponics (en)
alternative label: aquaponie
definition: Association, dans un même lieu, d’un élevage de poissons ou de crustacés et d’une culture hydroponique, qui permet des échanges à bénéfices réciproques.
in scheme: Agriculture
in scheme: Pêche et aquaculture
in scheme: concepts
notation: AGRI1340
note: Dans l’aquaculture hydroponique, les plantes purifient l’eau des bassins séparés où sont parqués poissons et crustacés, tandis que ces derniers apportent, par leurs déjections, les fertilisants nécessaires aux plantes.

serre écologique
type: ConceptConcept
type: Concept
creator: Commission d'enrichissement de la langue française, FranceTerme
date parution JO: 2021-05-27
deconseille ou frequent: eco greenhouse
deconseille ou frequent: écoserre
equivalent EN: ecological greenhouse @en
equivalent EN: ecological greenhouse (en)
definition: Serre fermée qui utilise des énergies d’origine renouvelable ou de récupération, emploie des méthodes de protection biologique et recycle l’eau.
in scheme: Agriculture
in scheme: concepts
notation: AGRI1341
note: Le terme « Écoserre » est une marque déposée.
related: protection biologique des cultures
related: technique agricole de pointe

pescatourisme
type: ConceptConcept
type: Concept
creator: Commission d'enrichissement de la langue française, FranceTerme
date parution JO: 2021-05-27
deconseille ou frequent: tourisme de la pêche
equivalent EN: fishing-tourism @en
equivalent EN: fishing-tourism (en)
equivalent EN: pescaturismo @it
equivalent EN: pescaturismo (it)
part of speech: nom masculin
alternative label: tourisme halieutique
definition: Activité touristique qui consiste à découvrir le milieu marin et les pratiques professionnelles de la pêche ou de l’aquaculture, à bord d’un bateau de pêche ou d’un navire aquacole.
in scheme: Pêche et aquaculture
in scheme: Tourisme
in scheme: concepts
notation: AGRI1342

répulsif acoustique de cétacés
type: ConceptConcept
type: Concept
creator: Commission d'enrichissement de la langue française, FranceTerme
date parution JO: 2021-05-27
deconseille ou frequent: alarme acoustique
deconseille ou frequent: balise acoustique
deconseille ou frequent: répulsif de cétacé
equivalent EN: pinger @en
equivalent EN: pinger (en)
alternative label: répulsif acoustique
definition: Petit appareil étanche qui émet des signaux acoustiques éloignant les cétacés des engins de pêche, notamment des chaluts, évitant ainsi leur capture accidentelle.
in scheme: Pêche et aquaculture
in scheme: concepts
notation: AGRI1343
note: Les sons émis par impulsion dans une bande de fréquences élevée allant de 30 à 150 kHz sont inaudibles pour l’homme et les poissons, mais perceptibles par les cétacés, qui les fuient.

agriculture urbaine
type: ConceptConcept
type: Concept
creator: Commission d'enrichissement de la langue française, FranceTerme
date parution JO: 2021-05-27
deconseille ou frequent: agriculture de ville
deconseille ou frequent: agriculture en ville
equivalent EN: urban agriculture @en
equivalent EN: urban agriculture (en)
definition: Culture ou élevage pratiqués en zone urbaine.
in scheme: Agriculture
in scheme: Environnement
in scheme: concepts
notation: AGRI1344
note: 1. L’agriculture urbaine se pratique au niveau du sol, dans des bâtiments, y compris en sous-sol, ou sur des toits-terrasses.
note: 2. L’agriculture urbaine présente de multiples intérêts tels que la production d’aliments, le bénéfice d’aménités environnementales et le partage de connaissances.

bétuliculteur, -trice
type: ConceptConcept
type: Concept
creator: Commission d'enrichissement de la langue française, FranceTerme
date parution JO: 2021-05-27
deconseille ou frequent: producteur de sève de bouleau
deconseille ou frequent: productrice de sève de bouleau
equivalent EN: birch syrup producer @en
equivalent EN: birch syrup producer (en)
part of speech: nom
definition: Exploitant d’un bois de bouleaux qui récolte et, le cas échéant, transforme la sève des arbres.
in scheme: Agriculture
in scheme: Forêt
in scheme: concepts
notation: AGRI1345

boucle
type: ConceptConcept
type: Concept
creator: Commission d'enrichissement de la langue française, FranceTerme
source: révision de l'arrêté du 14 septembre 1990
date parution JO: 2000-09-22
equivalent EN: loop @en
equivalent EN: loop (en)
part of speech: nom féminin
definition: Séquence simple brin correspondant à une séquence non homologue, lors de l'hybridation de deux brins issus de deux molécules différentes.
in scheme: Biologie
in scheme: concept-SD-biologie-genie-genetique
in scheme: concepts
notation: AGRI1346
related: boucle

exutoire
type: ConceptConcept
type: Concept
creator: Commission d'enrichissement de la langue française, FranceTerme
source: révision de l'arrêté du 7 avril 1987
date parution JO: 2000-09-22
equivalent EN: outlet @en
equivalent EN: outlet (en)
part of speech: nom masculin
definition: Ouvrage recevant l'eau du collecteur.
in scheme: Hydraulique
in scheme: concept-SD-hydraulique-drainage-agricole
in scheme: concepts
notation: AGRI1347
related: exutoire
related: collecteur

espaceur
type: ConceptConcept
type: Concept
creator: Commission d'enrichissement de la langue française, FranceTerme
source: révision de l'arrêté du 14 septembre 1990
abbreviation: spacer @en
date parution JO: 2000-09-22
equivalent EN: spacer @en
equivalent EN: spacer (en)
equivalent EN: spacer DNA @en
equivalent EN: spacer DNA (en)
part of speech: nom masculin
definition: Séquence d'ADN non transcrit, séparant les gènes à l'intérieur des unités répétées.
in scheme: Biologie
in scheme: concept-SD-biologie-genie-genetique
in scheme: concepts
notation: AGRI136

étiquetage génétique
type: ConceptConcept
type: Concept
creator: Commission d'enrichissement de la langue française, FranceTerme
source: révision de l'arrêté du 14 septembre 1990
date parution JO: 2000-09-22
equivalent EN: gene tagging @en
equivalent EN: gene tagging (en)
definition: Insertion d'un marqueur génétique dans ou au voisinage d'un gène.
in scheme: Biologie
in scheme: concept-SD-biologie-genie-genetique
in scheme: concepts
notation: AGRI137

expression transitoire
type: ConceptConcept
type: Concept
creator: Commission d'enrichissement de la langue française, FranceTerme
source: révision de l'arrêté du 14 septembre 1990
date parution JO: 2000-09-22
equivalent EN: transient expression @en
equivalent EN: transient expression (en)
definition: Expression d'un gène nouvellement introduit dans une cellule et non intégré dans le génome.
in scheme: Biologie
in scheme: concept-SD-biologie-genie-genetique
in scheme: concepts
notation: AGRI138

extension homopolymérique
type: ConceptConcept
type: Concept
creator: Commission d'enrichissement de la langue française, FranceTerme
source: révision de l'arrêté du 14 septembre 1990
date parution JO: 2000-09-22
equivalent EN: tailing @en
equivalent EN: tailing (en)
definition: Addition d'un petit nombre de nucléotides identiques sur l'un des brins d'un fragment d'ADN.
in scheme: Biologie
in scheme: concept-SD-biologie-genie-genetique
in scheme: concepts
notation: AGRI139

ARN antisens
type: ConceptConcept
type: Concept
creator: Commission d'enrichissement de la langue française, FranceTerme
source: révision de l'arrêté du 14 septembre 1990
date parution JO: 2000-09-22
equivalent EN: antisense RNA @en
equivalent EN: antisense RNA (en)
definition: ARN complémentaire d'une portion d'un autre ARN et inhibant sa fonction.
in scheme: Biologie
in scheme: concept-SD-biologie-genie-genetique
in scheme: concepts
notation: AGRI14
note: Les ARN antisens peuvent être des éléments naturels de régulation (exemple : les ARN MIC). Ils peuvent être également obtenus par génie génétique.
related: ARN MIC

extrémités cohésives
type: ConceptConcept
type: Concept
creator: Commission d'enrichissement de la langue française, FranceTerme
source: révision de l'arrêté du 14 septembre 1990
date parution JO: 2000-09-22
equivalent EN: cohesive ends @en
equivalent EN: cohesive ends (en)
equivalent EN: sticky ends @en
equivalent EN: sticky ends (en)
alternative label: extrémités collantes
definition: Extrémités simple brin complémentaires appartenant à un acide nucléique double brin.
in scheme: Biologie
in scheme: concept-SD-biologie-genie-genetique
in scheme: concepts
notation: AGRI140
note: Les extrémités cohésives peuvent s'apparier et être ressoudées par une ligase.

extrémités franches
type: ConceptConcept
type: Concept
creator: Commission d'enrichissement de la langue française, FranceTerme
source: révision de l'arrêté du 14 septembre 1990
date parution JO: 2000-09-22
equivalent EN: blunt ends @en
equivalent EN: blunt ends (en)
definition: Extrémités de fragments d'acides nucléiques en double brin ne portant pas de prolongements simple brin.
in scheme: Biologie
in scheme: concept-SD-biologie-genie-genetique
in scheme: concepts
notation: AGRI141

exutoire
type: ConceptConcept
type: Concept
creator: Commission d'enrichissement de la langue française, FranceTerme
source: révision de l'arrêté du 7 avril 1987
date parution JO: 2000-09-22
equivalent EN: outlet @en
equivalent EN: outlet (en)
part of speech: nom masculin
definition: Toute issue par laquelle l'eau d'un cours d'eau, d'un lac, d'une nappe, s'écoule par gravité.
in scheme: Hydraulique
in scheme: concepts
notation: AGRI142
related: exutoire
related: collecteur

facteur d'antiterminaison
type: ConceptConcept
type: Concept
creator: Commission d'enrichissement de la langue française, FranceTerme
source: révision de l'arrêté du 14 septembre 1990
date parution JO: 2000-09-22
equivalent EN: antitermination factor @en
equivalent EN: antitermination factor (en)
definition: Signal moléculaire spécifique qui permet à l'ARN polymérase de poursuivre la transcription au-delà des sites normaux de terminaison.
in scheme: Biologie
in scheme: concept-SD-biologie-genie-genetique
in scheme: concepts
notation: AGRI143
related: facteur de terminaison
related: ARN polymérase
related: transcription ininterrompue

facteur de fertilité
type: ConceptConcept
type: Concept
creator: Commission d'enrichissement de la langue française, FranceTerme
source: révision de l'arrêté du 14 septembre 1990
date parution JO: 2000-09-22
equivalent EN: F agent @en
equivalent EN: F agent (en)
equivalent EN: F element @en
equivalent EN: F element (en)
equivalent EN: F episome @en
equivalent EN: F episome (en)
equivalent EN: F factor @en
equivalent EN: F factor (en)
equivalent EN: F plasmid @en
equivalent EN: F plasmid (en)
equivalent EN: fertility factor @en
equivalent EN: fertility factor (en)
forme abregee: facteur F
alternative label: épisome F
definition: Épisome capable d'effectuer son propre transfert par conjugaison vers une bactérie receveuse.
in scheme: Biologie
in scheme: concept-SD-biologie-bacteriologie
in scheme: concept-SD-biologie-genie-genetique
in scheme: concepts
notation: AGRI144
note: 1. Intégré au chromosome bactérien, le facteur de fertilité est capable d'en promouvoir le transfert.
note: 2. Découvert chez le colibacille, le facteur de fertilité est fonctionnel chez d'autres entérobactéries.
related: épisome
related: conjugaison

facteur de terminaison
type: ConceptConcept
type: Concept
creator: Commission d'enrichissement de la langue française, FranceTerme
source: révision de l'arrêté du 14 septembre 1990
date parution JO: 2000-09-22
equivalent EN: terminator @en
equivalent EN: terminator (en)
definition: Séquence d'ADN favorisant l'arrêt de la transcription.
in scheme: Biologie
in scheme: concept-SD-biologie-bacteriologie
in scheme: concept-SD-biologie-genie-genetique
in scheme: concepts
notation: AGRI146
related: facteur d'antiterminaison
related: transcription ininterrompue

facteur sigma
type: ConceptConcept
type: Concept
creator: Commission d'enrichissement de la langue française, FranceTerme
source: révision de l'arrêté du 14 septembre 1990
date parution JO: 2000-09-22
equivalent EN: sigma factor @en
equivalent EN: sigma factor (en)
equivalent EN: sigma subunit @en
equivalent EN: sigma subunit (en)
definition: Sous-unité de l'ARN polymérase bactérienne nécessaire à l'initiation de la transcription et jouant un rôle déterminant dans la sélection des sites de fixation de l'enzyme.
in scheme: Biologie
in scheme: concept-SD-biologie-genie-genetique
in scheme: concepts
notation: AGRI147
related: ARN polymérase
related: concept-SANT65

famille de gènes
type: ConceptConcept
type: Concept
creator: Commission d'enrichissement de la langue française, FranceTerme
source: révision de l'arrêté du 14 septembre 1990
date parution JO: 2000-09-22
equivalent EN: gene family @en
equivalent EN: gene family (en)
equivalent EN: multiple genes @en
equivalent EN: multiple genes (en)
alternative label: famille multigénique
definition: Ensemble de gènes ayant de grandes ressemblances fonctionnelles et structurelles.
in scheme: Biologie
in scheme: concept-SD-biologie-genie-genetique
in scheme: concepts
notation: AGRI148
related: famille de protéines

filtration
type: ConceptConcept
type: Concept
creator: Commission d'enrichissement de la langue française, FranceTerme
source: révision de l'arrêté du 7 avril 1987
date parution JO: 2000-09-22
equivalent EN: seepage @en
equivalent EN: seepage (en)
part of speech: nom féminin
definition: Mouvement d'un fluide, notamment de l'eau, dans un milieu poreux saturé.
in scheme: Hydraulique
in scheme: concept-SD-hydraulique-drainage-agricole
in scheme: concepts
notation: AGRI149

ARN messager
type: ConceptConcept
type: Concept
creator: Commission d'enrichissement de la langue française, FranceTerme
source: révision de l'arrêté du 14 septembre 1990
abbreviation: ARNm
abbreviation: mRNA @en
date parution JO: 2000-09-22
equivalent EN: mRNA @en
equivalent EN: mRNA (en)
equivalent EN: messenger RNA @en
equivalent EN: messenger RNA (en)
definition: Produit de la transcription des gènes de structure des protéines.
in scheme: Biologie
in scheme: concept-SD-biologie-genie-genetique
in scheme: concepts
notation: AGRI15
related: analyse en série de l'expression des gènes
related: étiquette de séquence transcrite
related: ARN MIC
related: gène de structure
related: ARN prémessager
related: séquence de Shine Dalgarno
related: traduction ininterrompue
related: anticodon
related: cistron
related: codon d'arrêt
related: codon d'initiation
related: coiffe
related: aptamère de riborégulateur bactérien
related: complexe de blocage transcriptionnel par des ARN
related: criblage différentiel
related: interférence par ARN
related: exportine
related: précurseur de petits ARN interférents
related: petit ARN interférent
related: polycistronique
related: acide peptidonucléique
related: concept-SANT249

filtration
type: ConceptConcept
type: Concept
creator: Commission d'enrichissement de la langue française, FranceTerme
source: révision de l'arrêté du 7 avril 1987
date parution JO: 2000-09-22
equivalent EN: filtration @en
equivalent EN: filtration (en)
part of speech: nom féminin
definition: Action de passage d'un fluide, notamment de l'eau, à travers un filtre, corps poreux à la traversée duquel le fluide est débarrassé des particules solides qui s'y trouvent en suspension.
in scheme: Sciences de la Terre
in scheme: concept-SD-sciences-de-la-terre-hydrologie
in scheme: concepts
notation: AGRI150

filtre d'enrobage
type: ConceptConcept
type: Concept
creator: Commission d'enrichissement de la langue française, FranceTerme
source: révision de l'arrêté du 7 avril 1987
date parution JO: 2000-09-22
equivalent EN: enveloppe @en
equivalent EN: enveloppe (en)
forme abregee: enrobage, n.m.
definition: Matériau filtrant disposé autour du drain en vue de prévenir certains types de colmatage et d'améliorer les conditions d'accès de l'eau au drain.
in scheme: Hydraulique
in scheme: concept-SD-hydraulique-drainage-agricole
in scheme: concepts
notation: AGRI151

fourche de réplication
type: ConceptConcept
type: Concept
creator: Commission d'enrichissement de la langue française, FranceTerme
source: révision de l'arrêté du 14 septembre 1990
date parution JO: 2000-09-22
equivalent EN: replication fork @en
equivalent EN: replication fork (en)
definition: Région où les deux brins de l'ADN parental se séparent pour former une fourche, permettant ainsi leur réplication.
in scheme: Biologie
in scheme: concept-SD-biologie-genie-genetique
in scheme: concepts
notation: AGRI152
related: protéine de liaison avec l'ADN simple brin
related: origine de réplication

fragment de restriction
type: ConceptConcept
type: Concept
creator: Commission d'enrichissement de la langue française, FranceTerme
source: révision de l'arrêté du 14 septembre 1990
date parution JO: 2000-09-22
equivalent EN: restriction fragment @en
equivalent EN: restriction fragment (en)
definition: Polynucléotide produit par digestion d'un ADN à l'aide d'une enzyme de restriction.
in scheme: Biologie
in scheme: concept-SD-biologie-genie-genetique
in scheme: concepts
notation: AGRI153
related: restriction

frange capillaire
type: ConceptConcept
type: Concept
creator: Commission d'enrichissement de la langue française, FranceTerme
source: révision de l'arrêté du 7 avril 1987
date parution JO: 2000-09-22
equivalent EN: capillary fringe @en
equivalent EN: capillary fringe (en)
alternative label: zone d'ascension capillaire
definition: Zone saturée ou quasi saturée au-dessus de la surface libre d'une nappe d'un milieu poreux et en équilibre de potentiel hydrique total avec elle, dans laquelle la pression de l'eau est inférieure à la pression atmosphérique.
in scheme: Hydraulique
in scheme: Sciences de la Terre
in scheme: concept-SD-hydraulique-physique-du-sol
in scheme: concept-SD-sciences-de-la-terre-physique-du-sol
in scheme: concepts
notation: AGRI154

fusion de gènes
type: ConceptConcept
type: Concept
creator: Commission d'enrichissement de la langue française, FranceTerme
source: révision de l'arrêté du 14 septembre 1990
date parution JO: 2000-09-22
equivalent EN: gene fusion @en
equivalent EN: gene fusion (en)
definition: Association de fragments de gènes conduisant à la formation d'un gène chimère.
in scheme: Biologie
in scheme: concept-SD-biologie-genie-genetique
in scheme: concepts
notation: AGRI155
related: gène chimère

fusion traductionnelle
type: ConceptConcept
type: Concept
creator: Commission d'enrichissement de la langue française, FranceTerme
source: révision de l'arrêté du 14 septembre 1990
date parution JO: 2000-09-22
equivalent EN: translational fusion @en
equivalent EN: translational fusion (en)
definition: Fusion de gènes effectuée dans leur partie codante et respectant les cadres de lecture.
in scheme: Biologie
in scheme: concept-SD-biologie-genie-genetique
in scheme: concepts
notation: AGRI156
note: Le produit du gène est alors une protéine chimère.
related: cadre de lecture

fusion transcriptionnelle
type: ConceptConcept
type: Concept
creator: Commission d'enrichissement de la langue française, FranceTerme
source: révision de l'arrêté du 14 septembre 1990
date parution JO: 2000-09-22
equivalent EN: transcriptional fusion @en
equivalent EN: transcriptional fusion (en)
definition: Fusion de gènes intervenant dans la région transcrite mais non traduite.
in scheme: Biologie
in scheme: concept-SD-biologie-genie-genetique
in scheme: concepts
notation: AGRI157

gène artificiel
type: ConceptConcept
type: Concept
creator: Commission d'enrichissement de la langue française, FranceTerme
source: révision de l'arrêté du 14 septembre 1990
date parution JO: 2000-09-22
equivalent EN: synthetic gene @en
equivalent EN: synthetic gene (en)
alternative label: gène de synthèse
alternative label: gène synthétique
definition: Gène créé par assemblage d'oligonucléotides, résultant d'une synthèse chimique in vitro.
in scheme: Biologie
in scheme: concept-SD-biologie-genie-genetique
in scheme: concepts
notation: AGRI158

gène chimère
type: ConceptConcept
type: Concept
creator: Commission d'enrichissement de la langue française, FranceTerme
source: révision de l'arrêté du 14 septembre 1990
date parution JO: 2000-09-22
equivalent EN: chimaera gene @en
equivalent EN: chimaera gene (en)
equivalent EN: chimeric gene @en
equivalent EN: chimeric gene (en)
equivalent EN: gene construct @en
equivalent EN: gene construct (en)
equivalent EN: hybrid gene @en
equivalent EN: hybrid gene (en)
alternative label: gène hybride
definition: Gène formé de fragments d'ADN d'origines diverses.
in scheme: Biologie
in scheme: concept-SD-biologie-genie-genetique
in scheme: concepts
notation: AGRI159
related: fusion de gènes

ARN MIC
type: ConceptConcept
type: Concept
creator: Commission d'enrichissement de la langue française, FranceTerme
source: révision de l'arrêté du 14 septembre 1990
abbreviation: messenger interfering complementary RNA @en
date parution JO: 2000-09-22
equivalent EN: MIC RNA @en
equivalent EN: MIC RNA (en)
equivalent EN: messenger interfering complementary RNA @en
equivalent EN: messenger interfering complementary RNA (en)
definition: Classe particulière d'ARN antisens, complémentaire de l'extrémité 5 d'un ARNm.
in scheme: Biologie
in scheme: concept-SD-biologie-genie-genetique
in scheme: concepts
notation: AGRI16
related: ARN antisens
related: ARN messager

gène constitutif
type: ConceptConcept
type: Concept
creator: Commission d'enrichissement de la langue française, FranceTerme
source: révision de l'arrêté du 14 septembre 1990
date parution JO: 2000-09-22
equivalent EN: constitutive gene @en
equivalent EN: constitutive gene (en)
definition: Gène exprimé sans régulation particulière.
in scheme: Biologie
in scheme: concept-SD-biologie-genie-genetique
in scheme: concepts
notation: AGRI160

gène continu
type: ConceptConcept
type: Concept
creator: Commission d'enrichissement de la langue française, FranceTerme
source: révision de l'arrêté du 14 septembre 1990
date parution JO: 2000-09-22
equivalent EN: continuous gene @en
equivalent EN: continuous gene (en)
definition: Gène dépourvu d'introns.
in scheme: Biologie
in scheme: concept-SD-biologie-genie-genetique
in scheme: concepts
notation: AGRI161
related: intron

gène de régulation
type: ConceptConcept
type: Concept
creator: Commission d'enrichissement de la langue française, FranceTerme
source: révision de l'arrêté du 14 septembre 1990
date parution JO: 2000-09-22
equivalent EN: regulatory gene @en
equivalent EN: regulatory gene (en)
alternative label: gène de contrôle
definition: Gène dont la fonction essentielle est de contrôler le taux d'expression d'un ou de plusieurs autres gènes.
in scheme: Biologie
in scheme: concept-SD-biologie-genie-genetique
in scheme: concepts
notation: AGRI162
related: régulation négative de la transcription
related: régulation positive de la transcription

gène de structure
type: ConceptConcept
type: Concept
creator: Commission d'enrichissement de la langue française, FranceTerme
source: révision de l'arrêté du 14 septembre 1990
date parution JO: 2000-09-22
equivalent EN: structural gene @en
equivalent EN: structural gene (en)
definition: Gène dont le produit est, selon les cas, un ARN, un ARNm ou une protéine.
in scheme: Biologie
in scheme: concept-SD-biologie-genie-genetique
in scheme: concepts
notation: AGRI163
related: ARN messager

gène domestique
type: ConceptConcept
type: Concept
creator: Commission d'enrichissement de la langue française, FranceTerme
source: révision de l'arrêté du 14 septembre 1990
date parution JO: 2000-09-22
equivalent EN: housekeeping gene @en
equivalent EN: housekeeping gene (en)
definition: Gène qui assure les fonctions indispensables à la vie de tous les types de cellules.
in scheme: Biologie
in scheme: concept-SD-biologie-genie-genetique
in scheme: concepts
notation: AGRI164

gène extrachromosomique
type: ConceptConcept
type: Concept
creator: Commission d'enrichissement de la langue française, FranceTerme
source: révision de l'arrêté du 14 septembre 1990
date parution JO: 2000-09-22
equivalent EN: extrachromosomal gene @en
equivalent EN: extrachromosomal gene (en)
definition: Gène qui n'est pas localisé dans un chromosome, mais sur un réplicon indépendant.
in scheme: Biologie
in scheme: concept-SD-biologie-genie-genetique
in scheme: concepts
notation: AGRI165
note: Chez les eucaryotes, les gènes extrachromosomiques peuvent être nucléaires ou cytoplasmiques (dans les chloroplastes ou les mitochondries).

gène fragmenté
type: ConceptConcept
type: Concept
creator: Commission d'enrichissement de la langue française, FranceTerme
source: révision de l'arrêté du 14 septembre 1990
date parution JO: 2000-09-22
equivalent EN: discontinuous gene @en
equivalent EN: discontinuous gene (en)
equivalent EN: split gene @en
equivalent EN: split gene (en)
definition: Gène pourvu d'un ou plusieurs introns.
in scheme: Biologie
in scheme: concept-SD-biologie-genie-genetique
in scheme: concepts
notation: AGRI166
note: Les introns de l'ARN sont éliminés au cours de l'épissage.
related: intron

gène précoce
type: ConceptConcept
type: Concept
creator: Commission d'enrichissement de la langue française, FranceTerme
source: révision de l'arrêté du 14 septembre 1990
date parution JO: 2000-09-22
equivalent EN: early gene @en
equivalent EN: early gene (en)
definition: Gène viral transcrit au début de l'infection cellulaire.
in scheme: Biologie
in scheme: concept-SD-biologie-genie-genetique
in scheme: concept-SD-biologie-virologie
in scheme: concepts
notation: AGRI167
related: gène tardif

gène silencieux
type: ConceptConcept
type: Concept
creator: Commission d'enrichissement de la langue française, FranceTerme
source: révision de l'arrêté du 14 septembre 1990
date parution JO: 2000-09-22
equivalent EN: pseudogene @en
equivalent EN: pseudogene (en)
alternative label: pseudogène
definition: Gène dont la séquence est voisine des gènes de structure fonctionnels, mais qui ne s'exprime pas.
in scheme: Biologie
in scheme: concept-SD-biologie-genie-genetique
in scheme: concepts
notation: AGRI168

ARN monocistronique
type: ConceptConcept
type: Concept
creator: Commission d'enrichissement de la langue française, FranceTerme
source: révision de l'arrêté du 14 septembre 1990
date parution JO: 2000-09-22
equivalent EN: monocistronic RNA @en
equivalent EN: monocistronic RNA (en)
definition: ARN ne comportant qu'une seule information génétique.
in scheme: Biologie
in scheme: concept-SD-biologie-genie-genetique
in scheme: concepts
notation: AGRI17
related: ARN polycistronique
related: monocistronique
related: cistron

gène tardif
type: ConceptConcept
type: Concept
creator: Commission d'enrichissement de la langue française, FranceTerme
source: révision de l'arrêté du 14 septembre 1990
date parution JO: 2000-09-22
equivalent EN: late gene @en
equivalent EN: late gene (en)
definition: Gène viral transcrit à la fin de l'infection cellulaire.
in scheme: Biologie
in scheme: concept-SD-biologie-genie-genetique
in scheme: concept-SD-biologie-virologie
in scheme: concepts
notation: AGRI170
related: gène précoce

gradient hydraulique
type: ConceptConcept
type: Concept
creator: Commission d'enrichissement de la langue française, FranceTerme
source: révision de l'arrêté du 7 avril 1987
date parution JO: 2000-09-22
equivalent EN: hydraulic gradient @en
equivalent EN: hydraulic gradient (en)
alternative label: gradient de charge
alternative label: gradient de potentiel
alternative label: gradient hydrodynamique
definition: Quotient de la différence de charge hydraulique entre deux points d'un milieu poreux saturé, sur une même ligne de courant, par la distance les séparant sur cette ligne de courant.
in scheme: Hydraulique
in scheme: concepts
notation: AGRI171
related: charge hydraulique

groupe de liaison
type: ConceptConcept
type: Concept
creator: Commission d'enrichissement de la langue française, FranceTerme
source: révision de l'arrêté du 14 septembre 1990
date parution JO: 2000-09-22
equivalent EN: linkage group @en
equivalent EN: linkage group (en)
definition: Ensemble de gènes dont les locus sont situés sur un même chromosome.
in scheme: Biologie
in scheme: concept-SD-biologie-genie-genetique
in scheme: concepts
notation: AGRI172

hauteur piézométrique
type: ConceptConcept
type: Concept
creator: Commission d'enrichissement de la langue française, FranceTerme
source: révision de l'arrêté du 7 avril 1987
date parution JO: 2000-09-22
equivalent EN: piezometric head @en
equivalent EN: piezometric head (en)
definition: Hauteur mesurée à partir d'un plan de référence, de la colonne liquide statique qui s'établit dans un tube installé en sol saturé, dont la partie inférieure est en communication avec un point de ce sol.
in scheme: Hydraulique
in scheme: concepts
notation: AGRI173

hétéroduplex
type: ConceptConcept
type: Concept
creator: Commission d'enrichissement de la langue française, FranceTerme
source: révision de l'arrêté du 14 septembre 1990
date parution JO: 2000-09-22
equivalent EN: heteroduplex @en
equivalent EN: heteroduplex (en)
part of speech: nom masculin
definition: Acide nucléique bicaténaire dans lequel les deux brins ne possèdent pas uniquement des séquences rigoureusement complémentaires.
in scheme: Biologie
in scheme: concept-SD-biologie-genie-genetique
in scheme: concepts
notation: AGRI174
related: homoduplex
related: ciblage de lésions locales dans les génomes
related: analyse d'hétéroduplex

histone
type: ConceptConcept
type: Concept
creator: Commission d'enrichissement de la langue française, FranceTerme
source: révision de l'arrêté du 14 septembre 1990
date parution JO: 2000-09-22
equivalent EN: histone @en
equivalent EN: histone (en)
part of speech: nom féminin
definition: Protéine basique, constituant majeur du nucléosome.
in scheme: Biologie
in scheme: concept-SD-biologie-genie-genetique
in scheme: concepts
notation: AGRI175

homoduplex
type: ConceptConcept
type: Concept
creator: Commission d'enrichissement de la langue française, FranceTerme
source: révision de l'arrêté du 14 septembre 1990
date parution JO: 2000-09-22
equivalent EN: homoduplex @en
equivalent EN: homoduplex (en)
part of speech: nom masculin
definition: Acide nucléique bicaténaire dont toutes les bases sont appariées.
in scheme: Biologie
in scheme: concept-SD-biologie-genie-genetique
in scheme: concepts
notation: AGRI176
related: hétéroduplex

hybridation in situ
type: ConceptConcept
type: Concept
creator: Commission d'enrichissement de la langue française, FranceTerme
source: révision de l'arrêté du 14 septembre 1990
date parution JO: 2000-09-22
equivalent EN: in situ hybridization @en
equivalent EN: in situ hybridization (en)
definition: Hybridation d'une sonde d'ADN ou d'ARN spécifique marquée avec l'ADN ou l'ARN cellulaire, sur une coupe de tissu ou des cellules fixées.
in scheme: Biologie
in scheme: concept-SD-biologie-genie-genetique
in scheme: concepts
notation: AGRI177
related: hybridation sur colonie
related: hybridation fluorescente in situ

hybridation moléculaire
type: ConceptConcept
type: Concept
creator: Commission d'enrichissement de la langue française, FranceTerme
source: révision de l'arrêté du 14 septembre 1990
date parution JO: 2000-09-22
equivalent EN: nucleic acid hybridization @en
equivalent EN: nucleic acid hybridization (en)
definition: Association de chaînes d'acides nucléiques simple brin pour former des doubles brins.
in scheme: Biologie
in scheme: concept-SD-biologie-genie-genetique
in scheme: concepts
notation: AGRI178
note: La formation de régions doubles brins est l'indication d'une complémentarité de séquences.

hybridation sur colonie
type: ConceptConcept
type: Concept
creator: Commission d'enrichissement de la langue française, FranceTerme
source: révision de l'arrêté du 14 septembre 1990
date parution JO: 2000-09-22
equivalent EN: Grunstein-Hogness procedure @en
equivalent EN: Grunstein-Hogness procedure (en)
equivalent EN: colony hybridization @en
equivalent EN: colony hybridization (en)
definition: Hybridation in situ permettant d'identifier les bactéries possédant une séquence d'ADN particulière.
in scheme: Biologie
in scheme: concept-SD-biologie-genie-genetique
in scheme: concepts
notation: AGRI179
note: Cette hybridation se fait à l'aide d'une sonde d'acide nucléique complémentaire.
related: hybridation in situ
related: sonde nucléique

ARNm polycistronique
type: ConceptConcept
type: Concept
creator: Commission d'enrichissement de la langue française, FranceTerme
source: révision de l'arrêté du 14 septembre 1990
date parution JO: 2000-09-22
equivalent EN: polycistronic mRNA @en
equivalent EN: polycistronic mRNA (en)
equivalent EN: polycistronic messenger RNA @en
equivalent EN: polycistronic messenger RNA (en)
definition: ARN messager contenant plusieurs cistrons, et donc codant plusieurs chaînes polypeptidiques distinctes.
in scheme: Biologie
in scheme: concept-SD-biologie-genie-genetique
in scheme: concepts
notation: AGRI18
related: cistron
related: régulation coordonnée

hybridation sur filtre
type: ConceptConcept
type: Concept
creator: Commission d'enrichissement de la langue française, FranceTerme
source: révision de l'arrêté du 14 septembre 1990
date parution JO: 2000-09-22
equivalent EN: filter hybridization @en
equivalent EN: filter hybridization (en)
definition: Hybridation d'une préparation d'acide nucléique dénaturée et immobilisée sur un filtre avec une solution d'ADN ou d'ARN dénaturé et marqué.
in scheme: Biologie
in scheme: concept-SD-biologie-genie-genetique
in scheme: concepts
notation: AGRI180
note: Cette hybridation est réalisée par incubation dans des conditions renaturantes.

hybridation sur plages
type: ConceptConcept
type: Concept
creator: Commission d'enrichissement de la langue française, FranceTerme
source: révision de l'arrêté du 14 septembre 1990
date parution JO: 2000-09-22
equivalent EN: plaque hybridization @en
equivalent EN: plaque hybridization (en)
definition: Hybridation in situ permettant d'identifier les phages porteurs d'un ADN particulier.
in scheme: Biologie
in scheme: concept-SD-biologie-genie-genetique
in scheme: concepts
notation: AGRI181
related: transfert de plages

hybride ADN-ARN
type: ConceptConcept
type: Concept
creator: Commission d'enrichissement de la langue française, FranceTerme
source: révision de l'arrêté du 14 septembre 1990
date parution JO: 2000-09-22
equivalent EN: DNA RNA hybrid @en
equivalent EN: DNA RNA hybrid (en)
definition: Molécule double brin formée par une chaîne d'ADN et une chaîne d'ARN complémentaires.
in scheme: Biologie
in scheme: concept-SD-biologie-genie-genetique
in scheme: concepts
notation: AGRI182

hybridome
type: ConceptConcept
type: Concept
creator: Commission d'enrichissement de la langue française, FranceTerme
source: révision de l'arrêté du 14 septembre 1990
date parution JO: 2000-09-22
equivalent EN: hybridoma @en
equivalent EN: hybridoma (en)
part of speech: nom masculin
definition: Cellule qui provient de l'hybridation entre des cellules lymphoïdes normales de mammifères et des cellules myélomateuses de tumeurs malignes du système immunitaire.
in scheme: Biologie
in scheme: concept-SD-biologie-genie-genetique
in scheme: concepts
notation: AGRI183
note: Les hybridomes donnent des lignées immortalisées stables productrices d'anticorps.
related: anticorps monoclonal

hydrodynamique
type: ConceptConcept
type: Concept
creator: Commission d'enrichissement de la langue française, FranceTerme
source: révision de l'arrêté du 7 avril 1987
date parution JO: 2000-09-22
equivalent EN: hydrodynamics @en
equivalent EN: hydrodynamics (en)
part of speech: nom féminin
definition: Discipline constituant une partie de l'hydraulique souterraine, qui étudie les mouvements de l'eau dans le sol.
in scheme: Hydraulique
in scheme: concepts
notation: AGRI184

hydrodynamique
type: ConceptConcept
type: Concept
creator: Commission d'enrichissement de la langue française, FranceTerme
source: révision de l'arrêté du 7 avril 1987
date parution JO: 2000-09-22
equivalent EN: hydrodynamic @en
equivalent EN: hydrodynamic (en)
part of speech: adjectif
definition: Qualifie des concepts utilisés en hydraulique souterraine.
in scheme: Hydraulique
in scheme: concepts
notation: AGRI185

hydrogramme
type: ConceptConcept
type: Concept
creator: Commission d'enrichissement de la langue française, FranceTerme
source: révision de l'arrêté du 7 avril 1987
date parution JO: 2000-09-22
equivalent EN: hydrograph @en
equivalent EN: hydrograph (en)
part of speech: nom masculin
definition: Courbe représentant un débit en fonction du temps.
in scheme: Hydraulique
in scheme: concepts
notation: AGRI186

hydromorphie
type: ConceptConcept
type: Concept
creator: Commission d'enrichissement de la langue française, FranceTerme
source: révision de l'arrêté du 7 avril 1987
date parution JO: 2000-09-22
equivalent EN: hydromorphy @en
equivalent EN: hydromorphy (en)
part of speech: nom féminin
definition: Processus de formation ou d'évolution d'une classe de sols en présence d'un excès d'eau prolongé ; par extension, résultat visible de l'engorgement antérieur d'un sol.
in scheme: Sciences de la Terre
in scheme: concept-SD-sciences-de-la-terre-pedologie
in scheme: concepts
notation: AGRI187
note: Ce terme ne doit pas être confondu avec le terme « engorgement d'un sol ».
related: engorgement d'un sol
related: sol hydromorphe

incompatibilité plasmidique
type: ConceptConcept
type: Concept
creator: Commission d'enrichissement de la langue française, FranceTerme
source: révision de l'arrêté du 14 septembre 1990
date parution JO: 2000-09-22
equivalent EN: plasmid incompatibility @en
equivalent EN: plasmid incompatibility (en)
definition: Impossibilité pour deux plasmides de coexister dans la même cellule hôte.
in scheme: Biologie
in scheme: concept-SD-biologie-genie-genetique
in scheme: concepts
notation: AGRI189
note: Les plasmides bactériens sont classés en groupes d'incompatibilité : IncA, IncF, IncP, etc.

ARN nucléaire de grande taille
type: ConceptConcept
type: Concept
creator: Commission d'enrichissement de la langue française, FranceTerme
source: révision de l'arrêté du 14 septembre 1990
abbreviation: hn RNA @en
date parution JO: 2000-09-22
equivalent EN: heterogenous nuclear RNA @en
equivalent EN: heterogenous nuclear RNA (en)
equivalent EN: hn RNA @en
equivalent EN: hn RNA (en)
alternative label: ARN nucléaire hétérogène
definition: ARN nucléaire résultant d'une transcription par la polymérase II.
in scheme: Biologie
in scheme: concept-SD-biologie-genie-genetique
in scheme: concepts
notation: AGRI19
note: Ces ARN sont hétérogènes en taille et peu stables.

induction
type: ConceptConcept
type: Concept
creator: Commission d'enrichissement de la langue française, FranceTerme
source: révision de l'arrêté du 14 septembre 1990
date parution JO: 2000-09-22
equivalent EN: induction @en
equivalent EN: induction (en)
part of speech: nom féminin
definition: Ensemble des mécanismes cellulaires et moléculaires, conduisant au déclenchement de l'expression d'un gène spécifique.
in scheme: Biologie
in scheme: concept-SD-biologie-genie-genetique
in scheme: concepts
notation: AGRI191
note: Cette régulation porte le plus souvent sur la transcription.

infiltration efficace
type: ConceptConcept
type: Concept
creator: Commission d'enrichissement de la langue française, FranceTerme
source: révision de l'arrêté du 7 avril 1987
date parution JO: 2000-09-22
equivalent EN: effective infiltration @en
equivalent EN: effective infiltration (en)
definition: Fraction de la quantité d'eau infiltrée depuis la surface du sol, qui traverse la zone non saturée et parvient à la zone saturée.
in scheme: Hydraulique
in scheme: concepts
notation: AGRI192
related: coefficient d'infiltration efficace

insert
type: ConceptConcept
type: Concept
creator: Commission d'enrichissement de la langue française, FranceTerme
source: révision de l'arrêté du 14 septembre 1990
date parution JO: 2000-09-22
equivalent EN: insert @en
equivalent EN: insert (en)
part of speech: nom masculin
definition: Séquence d'ADN étranger introduite dans une molécule d'ADN donnée.
in scheme: Biologie
in scheme: concept-SD-biologie-genie-genetique
in scheme: concepts
notation: AGRI193

insertion
type: ConceptConcept
type: Concept
creator: Commission d'enrichissement de la langue française, FranceTerme
source: révision de l'arrêté du 14 septembre 1990
date parution JO: 2000-09-22
equivalent EN: insertion @en
equivalent EN: insertion (en)
part of speech: nom féminin
definition: Addition d'une séquence d'ADN étranger dans une molécule d'ADN donnée.
in scheme: Biologie
in scheme: concept-SD-biologie-genie-genetique
in scheme: concepts
notation: AGRI194
related: décalage du cadre de lecture

intégration
type: ConceptConcept
type: Concept
creator: Commission d'enrichissement de la langue française, FranceTerme
source: révision de l'arrêté du 14 septembre 1990
date parution JO: 2000-09-22
equivalent EN: integration @en
equivalent EN: integration (en)
part of speech: nom féminin
definition: Processus de recombinaison qui insère une molécule d'ADN dans une autre.
in scheme: Biologie
in scheme: concept-SD-biologie-genie-genetique
in scheme: concepts
notation: AGRI195

inversion
type: ConceptConcept
type: Concept
creator: Commission d'enrichissement de la langue française, FranceTerme
source: révision de l'arrêté du 14 septembre 1990
date parution JO: 2000-09-22
equivalent EN: inversion @en
equivalent EN: inversion (en)
part of speech: nom féminin
definition: Processus conduisant à un changement d'orientation d'un fragment d'ADN par rapport à son orientation de référence.
in scheme: Biologie
in scheme: concept-SD-biologie-genie-genetique
in scheme: concepts
notation: AGRI197
note: Les inversions peuvent bloquer l'appariement entre chromosomes homologues.
related: empilage

isoschizomère
type: ConceptConcept
type: Concept
creator: Commission d'enrichissement de la langue française, FranceTerme
source: révision de l'arrêté du 14 septembre 1990
date parution JO: 2000-09-22
equivalent EN: isoschizomere @en
equivalent EN: isoschizomere (en)
part of speech: nom masculin
definition: Enzyme de restriction reconnaissant la même séquence cible qu'une autre enzyme de restriction.
in scheme: Biologie
in scheme: concept-SD-biologie-genie-genetique
in scheme: concepts
notation: AGRI198
related: restriction

kilobase
type: ConceptConcept
type: Concept
creator: Commission d'enrichissement de la langue française, FranceTerme
source: révision de l'arrêté du 14 septembre 1990
abbreviation: kb @en
date parution JO: 2000-09-22
deconseille ou frequent: kbp
deconseille ou frequent: kilopaires de bases
equivalent EN: kb @en
equivalent EN: kb (en)
equivalent EN: kilobase @en
equivalent EN: kilobase (en)
part of speech: nom féminin
definition: Unité correspondant à 1 000 bases d'un acide nucléique monocaténaire ; par extension, unité correspondant à 1 000 paires de bases d'ADN bicaténaire.
in scheme: Biologie
in scheme: concept-SD-biologie-genie-genetique
in scheme: concepts
notation: AGRI199
note: Dans la seconde acception, « kilobase » est un synonyme de « kilopaires de bases » (kbp).
related: chromosome artificiel de bactérie
related: chromosome artificiel de levure
related: paire de bases

ADN chimère
type: ConceptConcept
type: Concept
creator: Commission d'enrichissement de la langue française, FranceTerme
source: révision de l'arrêté du 14 septembre 1990
date parution JO: 2000-09-22
equivalent EN: chimeric DNA @en
equivalent EN: chimeric DNA (en)
definition: ADN recombiné formé de fragments d'origines diverses.
in scheme: Biologie
in scheme: concept-SD-biologie-genie-genetique
in scheme: concepts
notation: AGRI2

ARN polycistronique
type: ConceptConcept
type: Concept
creator: Commission d'enrichissement de la langue française, FranceTerme
source: révision de l'arrêté du 14 septembre 1990
date parution JO: 2000-09-22
equivalent EN: polycistronic RNA @en
equivalent EN: polycistronic RNA (en)
definition: ARN comportant plusieurs informations génétiques.
in scheme: Biologie
in scheme: concept-SD-biologie-genie-genetique
in scheme: concepts
notation: AGRI20
related: ARN monocistronique
related: cistron

lasso
type: ConceptConcept
type: Concept
creator: Commission d'enrichissement de la langue française, FranceTerme
source: révision de l'arrêté du 14 septembre 1990
date parution JO: 2000-09-22
equivalent EN: lariat @en
equivalent EN: lariat (en)
part of speech: nom masculin
definition: Structure intermédiaire formée lors de l'épissage de certains introns.
in scheme: Biologie
in scheme: concept-SD-biologie-genie-genetique
in scheme: concepts
notation: AGRI200
related: épissage
related: intron

ligature
type: ConceptConcept
type: Concept
creator: Commission d'enrichissement de la langue française, FranceTerme
source: révision de l'arrêté du 14 septembre 1990
date parution JO: 2000-09-22
equivalent EN: ligation @en
equivalent EN: ligation (en)
part of speech: nom féminin
definition: Formation d'une liaison phosphodiester entre deux polynucléotides.
in scheme: Biologie
in scheme: concept-SD-biologie-genie-genetique
in scheme: concepts
notation: AGRI201
note: Cette réaction est catalysée par une ligase.

ligaturer
type: ConceptConcept
type: Concept
creator: Commission d'enrichissement de la langue française, FranceTerme
source: révision de l'arrêté du 14 septembre 1990
date parution JO: 2000-09-22
deconseille ou frequent: liguer
deconseille ou frequent: to ligate
equivalent EN: ligate @en
equivalent EN: ligate (en)
part of speech: verbe
definition: Action de former une liaison phosphodiester entre deux polynucléotides.
in scheme: Biologie
in scheme: concept-SD-biologie-genie-genetique
in scheme: concepts
notation: AGRI202
note: Le terme « liguer » ne doit pas être utilisé dans ce sens.

ligne de charge constante
type: ConceptConcept
type: Concept
creator: Commission d'enrichissement de la langue française, FranceTerme
source: révision de l'arrêté du 7 avril 1987
date parution JO: 2000-09-22
deconseille ou frequent: courbe équipotentielle
deconseille ou frequent: ligne équipotentielle
equivalent EN: equipotential line @en
equivalent EN: equipotential line (en)
definition: Ligne de points d'égal potentiel ou d'égale charge hydraulique dans un milieu bidimensionnel ou tridimensionnel.
in scheme: Hydraulique
in scheme: concepts
notation: AGRI203
note: On trouve, dans une acception voisine, « ligne équipotentielle » et « courbe équipotentielle ».

ligne de courant
type: ConceptConcept
type: Concept
creator: Commission d'enrichissement de la langue française, FranceTerme
source: révision de l'arrêté du 7 avril 1987
date parution JO: 2000-09-22
equivalent EN: stream line @en
equivalent EN: stream line (en)
definition: Ligne idéale qui représente la trajectoire théorique d'une particule d'eau en mouvement dans un aquifère lorsque l'écoulement est permanent.
in scheme: Hydraulique
in scheme: concepts
notation: AGRI204

lysogénie
type: ConceptConcept
type: Concept
creator: Commission d'enrichissement de la langue française, FranceTerme
source: révision de l'arrêté du 14 septembre 1990
date parution JO: 2000-09-22
deconseille ou frequent: lysogène
equivalent EN: lysogenecity @en
equivalent EN: lysogenecity (en)
part of speech: nom féminin
definition: État d'une cellule bactérienne porteuse d'un génome viral sous forme de prophage.
in scheme: Biologie
in scheme: concept-SD-biologie-genie-genetique
in scheme: concept-SD-biologie-virologie
in scheme: concepts
notation: AGRI205
note: La bactérie est alors dite « lysogène ».
related: phage tempéré
related: bactérie lysogène

marquage
type: ConceptConcept
type: Concept
creator: Commission d'enrichissement de la langue française, FranceTerme
source: révision de l'arrêté du 14 septembre 1990
date parution JO: 2000-09-22
equivalent EN: labelling @en
equivalent EN: labelling (en)
part of speech: nom masculin
definition: Introduction de nucléotides modifiés, ou modification chimique de certains nucléotides d'un acide nucléique afin de pouvoir le repérer.
in scheme: Biologie
in scheme: concept-SD-biologie-genie-genetique
in scheme: concepts
notation: AGRI206
note: 1. Le marquage peut être radioactif (32P, 35S).
note: 2. Il peut servir à réaliser des sondes.

marqueur génétique
type: ConceptConcept
type: Concept
creator: Commission d'enrichissement de la langue française, FranceTerme
source: révision de l'arrêté du 14 septembre 1990
date parution JO: 2000-09-22
equivalent EN: genetic marker @en
equivalent EN: genetic marker (en)
definition: Séquence d'ADN repérable spécifiquement.
in scheme: Biologie
in scheme: concept-SD-biologie-genie-genetique
in scheme: concepts
notation: AGRI207
note: La détection d'un marqueur génétique peut s'effectuer par hybridation avec une sonde complémentaire, ou par son expression phénotypique.

matrice
type: ConceptConcept
type: Concept
creator: Commission d'enrichissement de la langue française, FranceTerme
source: révision de l'arrêté du 14 septembre 1990
date parution JO: 2000-09-22
equivalent EN: template @en
equivalent EN: template (en)
part of speech: nom féminin
definition: Brin d'acide nucléique copié lors de la réplication ou de la transcription par les polymérases adéquates.
in scheme: Biologie
in scheme: concept-SD-biologie-genie-genetique
in scheme: concepts
notation: AGRI208
related: réplication en cercle roulant
related: réécriture par matrice d'ARN

maturase
type: ConceptConcept
type: Concept
creator: Commission d'enrichissement de la langue française, FranceTerme
source: révision de l'arrêté du 14 septembre 1990
date parution JO: 2000-09-22
equivalent EN: maturase @en
equivalent EN: maturase (en)
part of speech: nom féminin
definition: Enzyme intervenant dans la maturation de l'ARN prémessager.
in scheme: Biologie
in scheme: concept-SD-biologie-genie-genetique
in scheme: concepts
notation: AGRI209
note: 1. La première maturase a été découverte dans les mitochondries de levures.
note: 2. Elle est en partie codée par un intron.
related: ARN prémessager
related: intron

ARN polymérase
type: ConceptConcept
type: Concept
creator: Commission d'enrichissement de la langue française, FranceTerme
source: révision de l'arrêté du 14 septembre 1990
date parution JO: 2000-09-22
equivalent EN: RNA polymerase @en
equivalent EN: RNA polymerase (en)
definition: Enzyme catalysant la synthèse d'ARN à partir d'ADN ou d'ARN.
in scheme: Biologie
in scheme: concept-SD-biologie-genie-genetique
in scheme: concepts
notation: AGRI21
related: facteur d'antiterminaison
related: facteur sigma
related: brin antisens
related: concept-SANT65

maturation moléculaire
type: ConceptConcept
type: Concept
creator: Commission d'enrichissement de la langue française, FranceTerme
source: révision de l'arrêté du 14 septembre 1990
date parution JO: 2000-09-22
equivalent EN: processing @en
equivalent EN: processing (en)
definition: Ensemble des évènements biochimiques qui permettent de passer d'un précurseur à une molécule active finale.
in scheme: Biologie
in scheme: concept-SD-biologie-genie-genetique
in scheme: concepts
notation: AGRI210
note: Par exemple, épissage d'un ARN précurseur ou clivage du peptide signal d'une protéine.
related: ARN précurseur
related: peptide signal
related: épissage

mésappariement
type: ConceptConcept
type: Concept
creator: Commission d'enrichissement de la langue française, FranceTerme
source: révision de l'arrêté du 14 septembre 1990
date parution JO: 2000-09-22
equivalent EN: mismatch @en
equivalent EN: mismatch (en)
part of speech: nom masculin
definition: Non-appariement d'une zone à l'intérieur d'un fragment d'acide nucléique double brin.
in scheme: Biologie
in scheme: concept-SD-biologie-genie-genetique
in scheme: concepts
notation: AGRI211

minicellule
type: ConceptConcept
type: Concept
creator: Commission d'enrichissement de la langue française, FranceTerme
source: révision de l'arrêté du 14 septembre 1990
date parution JO: 2000-09-22
equivalent EN: minicell @en
equivalent EN: minicell (en)
part of speech: nom féminin
definition: Cellule bactérienne de taille réduite ayant perdu son ADN chromosomique.
in scheme: Biologie
in scheme: concept-SD-biologie-genie-genetique
in scheme: concepts
notation: AGRI216

minichromosome
type: ConceptConcept
type: Concept
creator: Commission d'enrichissement de la langue française, FranceTerme
source: révision de l'arrêté du 14 septembre 1990
date parution JO: 2000-09-22
equivalent EN: minichromosome @en
equivalent EN: minichromosome (en)
part of speech: nom masculin
definition: Chromosome de petite taille qui se réplique en suivant le cycle mitotique.
in scheme: Biologie
in scheme: concept-SD-biologie-genie-genetique
in scheme: concepts
notation: AGRI217
note: Un minichromosome n'est généralement présent qu'en une seule copie.

minigène
type: ConceptConcept
type: Concept
creator: Commission d'enrichissement de la langue française, FranceTerme
source: révision de l'arrêté du 14 septembre 1990
date parution JO: 2000-09-22
equivalent EN: minigene @en
equivalent EN: minigene (en)
part of speech: nom masculin
definition: Gène reconstruit à des fins expérimentales à partir de ses séquences régulatrices et de l'ADNc double brin de l'ARNm correspondant.
in scheme: Biologie
in scheme: concept-SD-biologie-genie-genetique
in scheme: concepts
notation: AGRI218
note: Un minigène code donc directement pour la forme mature de l'ARNm.

miniphage
type: ConceptConcept
type: Concept
creator: Commission d'enrichissement de la langue française, FranceTerme
source: révision de l'arrêté du 14 septembre 1990
date parution JO: 2000-09-22
deconseille ou frequent: phage minimu
equivalent EN: miniphage @en
equivalent EN: miniphage (en)
part of speech: nom masculin
definition: Phage reconstruit à des fins expérimentales, n'ayant gardé qu'une partie de ses fonctions.
in scheme: Biologie
in scheme: concept-SD-biologie-genie-genetique
in scheme: concepts
notation: AGRI219
note: On peut citer comme exemple les phages minimu.

ARN précurseur
type: ConceptConcept
type: Concept
creator: Commission d'enrichissement de la langue française, FranceTerme
source: révision de l'arrêté du 14 septembre 1990
date parution JO: 2000-09-22
equivalent EN: precursor RNA @en
equivalent EN: precursor RNA (en)
definition: ARN représentant le produit de transcription primaire d'un gène.
in scheme: Biologie
in scheme: concept-SD-biologie-genie-genetique
in scheme: concepts
notation: AGRI22
note: Les ARN précurseurs transcrits à partir de la plupart des gènes eucaryotes et de certaines archéobactéries contiennent des introns qui seront éliminés lors de la maturation.
related: maturation moléculaire
related: ARN guide

miniplasmide
type: ConceptConcept
type: Concept
creator: Commission d'enrichissement de la langue française, FranceTerme
source: révision de l'arrêté du 14 septembre 1990
date parution JO: 2000-09-22
equivalent EN: miniplasmid @en
equivalent EN: miniplasmid (en)
part of speech: nom masculin
definition: Plasmide reconstruit à des fins expérimentales, n'ayant gardé qu'une partie de ses fonctions.
in scheme: Biologie
in scheme: concept-SD-biologie-genie-genetique
in scheme: concepts
notation: AGRI220
note: Par exemple, un miniplasmide Ti possède la région d'ADN transférable aux cellules végétales, mais ce transfert nécessite l'expression des fonctions de virulence portées par un plasmide assistant.

monocistronique
type: ConceptConcept
type: Concept
creator: Commission d'enrichissement de la langue française, FranceTerme
source: révision de l'arrêté du 14 septembre 1990
date parution JO: 2000-09-22
equivalent EN: monocistronic @en
equivalent EN: monocistronic (en)
part of speech: adjectif
definition: Se dit d'un ARNm ne possédant qu'un seul cistron et qui donc code une seule chaîne polypeptidique.
in scheme: Biologie
in scheme: concept-SD-biologie-genie-genetique
in scheme: concepts
notation: AGRI221
related: ARN monocistronique
related: polycistronique

mouillère
type: ConceptConcept
type: Concept
creator: Commission d'enrichissement de la langue française, FranceTerme
source: révision de l'arrêté du 7 avril 1987
date parution JO: 2000-09-22
equivalent EN: spring @en
equivalent EN: spring (en)
part of speech: nom féminin
definition: Zone de faible étendue affectée par un apport d'eau extérieur et de durée variable selon son origine.
in scheme: Hydraulique
in scheme: concept-SD-hydraulique-drainage-agricole
in scheme: concepts
notation: AGRI222

mutagénèse localisée
type: ConceptConcept
type: Concept
creator: Commission d'enrichissement de la langue française, FranceTerme
source: révision de l'arrêté du 14 septembre 1990
date parution JO: 2000-09-22
equivalent EN: localized mutagenesis @en
equivalent EN: localized mutagenesis (en)
definition: Introduction de mutations au hasard dans un fragment d'ADN cloné, suivie de la réinsertion de la séquence mutée dans le gène original en remplacement de l'ADN sauvage correspondant.
in scheme: Biologie
in scheme: concept-SD-biologie-genie-genetique
in scheme: concepts
notation: AGRI224
note: On trouve aussi « mutagenèse localisée ».

mutagénèse par insertion
type: ConceptConcept
type: Concept
creator: Commission d'enrichissement de la langue française, FranceTerme
source: révision de l'arrêté du 14 septembre 1990
date parution JO: 2000-09-22
equivalent EN: insertion mutagenesis @en
equivalent EN: insertion mutagenesis (en)
definition: Introduction de mutations dans une séquence d'ADN clonée ou non, par insertion d'un fragment étranger d'ADN.
definition: Introduction of mutations in a cloned or not DNA sequence by inserting a foreign DNA fragment. @en
in scheme: Biologie
in scheme: concept-SD-biologie-genie-genetique
in scheme: concepts
notation: AGRI225
note: 1. Cette introduction est le plus souvent effectuée in vivo par insertion d'un élément transposable qui permet le repérage du gène ainsi muté.
note: 2. On trouve aussi « mutagenèse par insertion ».
note: The introduction is often done in vivo by the insertion of a transposable element which facilitates the identification of the mutated gene. @en
preferred label: insertion mutagenesis @en

mutation
type: ConceptConcept
type: Concept
creator: Commission d'enrichissement de la langue française, FranceTerme
source: révision de l'arrêté du 14 septembre 1990
date parution JO: 2000-09-22
equivalent EN: mutation @en
equivalent EN: mutation (en)
part of speech: nom féminin
definition: Modification spontanée ou provoquée, le plus souvent héréditaire, du génome d'une cellule, d'un tissu ou d'un organisme ; par extension, le résultat de cette modification.
in scheme: Biologie
in scheme: concept-SD-biologie-genie-genetique
in scheme: concepts
notation: AGRI226
related: proto-oncogène
related: criblage de mutants
related: mosaïque génétique
related: mutagénèse dirigée
related: réparosome
related: analyse d'hétéroduplex
related: point chaud de mutation

mutation à effet polaire
type: ConceptConcept
type: Concept
creator: Commission d'enrichissement de la langue française, FranceTerme
source: révision de l'arrêté du 14 septembre 1990
date parution JO: 2000-09-22
equivalent EN: polar mutation @en
equivalent EN: polar mutation (en)
forme abregee: mutation polaire
definition: Mutation non-sens localisée dans un des premiers cistrons d'un opéron et provoquant un arrêt ou une diminution de la transcription.
in scheme: Biologie
in scheme: concept-SD-biologie-genie-genetique
in scheme: concepts
notation: AGRI228
note: L'effet est dit « polaire » car les cistrons situés en aval ne sont plus exprimés.
related: mutation non-sens
related: opéron
related: cistron

mutation conditionnelle
type: ConceptConcept
type: Concept
creator: Commission d'enrichissement de la langue française, FranceTerme
source: révision de l'arrêté du 14 septembre 1990
date parution JO: 2000-09-22
equivalent EN: conditional mutation @en
equivalent EN: conditional mutation (en)
definition: Mutation ne s'exprimant que sous certaines conditions.
in scheme: Biologie
in scheme: concept-SD-biologie-genie-genetique
in scheme: concepts
notation: AGRI229
note: Les mutations létales ne peuvent exister à l'état homozygote dans une cellule que sous forme conditionnelle, par exemple, si elles ne s'expriment qu'à certaines températures.

ARN prémessager
type: ConceptConcept
type: Concept
creator: Commission d'enrichissement de la langue française, FranceTerme
source: révision de l'arrêté du 14 septembre 1990
abbreviation: pre-mRNA @en
date parution JO: 2000-09-22
deconseille ou frequent: messager pré-ARN
deconseille ou frequent: pré-ARN messager
equivalent EN: pre-mRNA @en
equivalent EN: pre-mRNA (en)
equivalent EN: premessenger RNA @en
equivalent EN: premessenger RNA (en)
definition: ARN précurseur des ARNm.
in scheme: Biologie
in scheme: concept-SD-biologie-genie-genetique
in scheme: concepts
notation: AGRI23
note: On trouve aussi les termes « pré-ARN messager » et « messager pré-ARN ».
related: ARN messager
related: maturase
related: site de branchement

mutation constitutive
type: ConceptConcept
type: Concept
creator: Commission d'enrichissement de la langue française, FranceTerme
source: révision de l'arrêté du 14 septembre 1990
date parution JO: 2000-09-22
equivalent EN: constitutive mutation @en
equivalent EN: constitutive mutation (en)
definition: Mutation qui abolit la régulation normale d'un gène, rendant son expression indépendante des conditions environnantes.
in scheme: Biologie
in scheme: concept-SD-biologie-genie-genetique
in scheme: concepts
notation: AGRI230

mutation de régulation
type: ConceptConcept
type: Concept
creator: Commission d'enrichissement de la langue française, FranceTerme
source: révision de l'arrêté du 14 septembre 1990
date parution JO: 2000-09-22
equivalent EN: regulation mutation @en
equivalent EN: regulation mutation (en)
definition: Mutation affectant l'expression d'un ou plusieurs gènes, sans en altérer la partie codante.
in scheme: Biologie
in scheme: concept-SD-biologie-genie-genetique
in scheme: concepts
notation: AGRI231

mutation faux-sens
type: ConceptConcept
type: Concept
creator: Commission d'enrichissement de la langue française, FranceTerme
source: révision de l'arrêté du 14 septembre 1990
date parution JO: 2000-09-22
equivalent EN: missense mutation @en
equivalent EN: missense mutation (en)
definition: Mutation qui remplace un codon spécifiant un acide aminé par un codon qui en spécifie un autre.
in scheme: Biologie
in scheme: concept-SD-biologie-genie-genetique
in scheme: concepts
notation: AGRI232

mutation inapparente
type: ConceptConcept
type: Concept
creator: Commission d'enrichissement de la langue française, FranceTerme
source: révision de l'arrêté du 14 septembre 1990
date parution JO: 2000-09-22
deconseille ou frequent: mutation silencieuse
equivalent EN: silent mutation @en
equivalent EN: silent mutation (en)
definition: Mutation qui ne provoque aucune modification apparente du produit du gène.
in scheme: Biologie
in scheme: concept-SD-biologie-genie-genetique
in scheme: concepts
notation: AGRI233
note: On trouve aussi « mutation silencieuse ».

mutation inverse
type: ConceptConcept
type: Concept
creator: Commission d'enrichissement de la langue française, FranceTerme
source: révision de l'arrêté du 14 septembre 1990
date parution JO: 2000-09-22
equivalent EN: reverse mutation @en
equivalent EN: reverse mutation (en)
definition: Mutation qui restaure une fonction annulée par une première mutation.
in scheme: Biologie
in scheme: concept-SD-biologie-genie-genetique
in scheme: concepts
notation: AGRI234
note: La mutation inverse peut résulter d'une réversion vraie ou d'une suppression intragénique ou extragénique.
related: suppression extragénique
related: suppression intragénique

mutation non-sens
type: ConceptConcept
type: Concept
creator: Commission d'enrichissement de la langue française, FranceTerme
source: révision de l'arrêté du 14 septembre 1990
date parution JO: 2000-09-22
equivalent EN: nonsense mutation @en
equivalent EN: nonsense mutation (en)
definition: Mutation qui remplace un codon spécifiant un acide aminé par un codon d'arrêt.
in scheme: Biologie
in scheme: concept-SD-biologie-genie-genetique
in scheme: concepts
notation: AGRI235
related: mutation à effet polaire
related: codon d'arrêt

mutation ponctuelle
type: ConceptConcept
type: Concept
creator: Commission d'enrichissement de la langue française, FranceTerme
source: révision de l'arrêté du 14 septembre 1990
date parution JO: 2000-09-22
equivalent EN: point mutation @en
equivalent EN: point mutation (en)
equivalent EN: single site mutation @en
equivalent EN: single site mutation (en)
definition: Mutation portant sur une seule base (substitution, addition ou délétion).
in scheme: Biologie
in scheme: concept-SD-biologie-genie-genetique
in scheme: concepts
notation: AGRI236
note: 1. On distingue deux classes de mutations ponctuelles : celles ne modifiant qu'un seul codon et celles modifiant le cadre de lecture.
note: 2. Ce type de mutation est réversible.
related: délétion
related: cadre de lecture

mutation somatique
type: ConceptConcept
type: Concept
creator: Commission d'enrichissement de la langue française, FranceTerme
source: révision de l'arrêté du 14 septembre 1990
date parution JO: 2000-09-22
equivalent EN: somatic mutation @en
equivalent EN: somatic mutation (en)
definition: Mutation survenant dans une cellule non germinale.
in scheme: Biologie
in scheme: concept-SD-biologie-genie-genetique
in scheme: concepts
notation: AGRI237

mutation suppressive
type: ConceptConcept
type: Concept
creator: Commission d'enrichissement de la langue française, FranceTerme
source: révision de l'arrêté du 14 septembre 1990
date parution JO: 2000-09-22
equivalent EN: suppressor mutation @en
equivalent EN: suppressor mutation (en)
definition: Mutation qui, associée à une première mutation, en compense les effets phénotypiques.
in scheme: Biologie
in scheme: concept-SD-biologie-genie-genetique
in scheme: concepts
notation: AGRI238

nappe
type: ConceptConcept
type: Concept
creator: Commission d'enrichissement de la langue française, FranceTerme
source: révision de l'arrêté du 7 avril 1987
date parution JO: 2000-09-22
equivalent EN: ground water @en
equivalent EN: ground water (en)
part of speech: nom féminin
definition: Ensemble des eaux comprises dans la zone saturée d'un horizon du sol ou d'un aquifère.
in scheme: Sciences de la Terre
in scheme: concept-SD-sciences-de-la-terre-hydrogeologie
in scheme: concepts
notation: AGRI239
note: Le terme « nappe » s'applique à des zones saturées dont la productivité, lors d'un pompage, est importante.
related: zone saturée
related: aquifère

ARN recombinant
type: ConceptConcept
type: Concept
creator: Commission d'enrichissement de la langue française, FranceTerme
source: révision de l'arrêté du 14 septembre 1990
date parution JO: 2000-09-22
equivalent EN: recombinant RNA @en
equivalent EN: recombinant RNA (en)
definition: Molécule d'ARN composée de fragments d'origines distinctes réunis in vitro par une ARN ligase.
in scheme: Biologie
in scheme: concept-SD-biologie-genie-genetique
in scheme: concepts
notation: AGRI24

nappe en charge
type: ConceptConcept
type: Concept
creator: Commission d'enrichissement de la langue française, FranceTerme
source: révision de l'arrêté du 7 avril 1987
date parution JO: 2000-09-22
equivalent EN: confined water @en
equivalent EN: confined water (en)
alternative label: nappe captive
definition: Nappe ou partie d'une nappe sans surface libre.
in scheme: Sciences de la Terre
in scheme: concept-SD-sciences-de-la-terre-hydrogeologie
in scheme: concepts
notation: AGRI240
note: Une nappe en charge est soumise en tout point à une pression supérieure à la pression atmosphérique et sa surface piézométrique est plus haute que le toit de l'aquifère, qui se trouve alors entièrement en zone saturée.
related: surface piézométrique
related: zone saturée

nappe libre
type: ConceptConcept
type: Concept
creator: Commission d'enrichissement de la langue française, FranceTerme
source: révision de l'arrêté du 7 avril 1987
date parution JO: 2000-09-22
deconseille ou frequent: nappe phréatique
equivalent EN: unconfined water @en
equivalent EN: unconfined water (en)
definition: Nappe à surface libre, comprise dans un aquifère comprenant une zone non saturée surmontant la zone saturée caractérisant la nappe.
in scheme: Sciences de la Terre
in scheme: concept-SD-sciences-de-la-terre-hydrogeologie
in scheme: concepts
notation: AGRI241
note: L'emploi du synonyme « nappe phréatique », terme imprécis, est à éviter.

niveau piézométrique
type: ConceptConcept
type: Concept
creator: Commission d'enrichissement de la langue française, FranceTerme
source: révision de l'arrêté du 7 avril 1987
date parution JO: 2000-09-22
equivalent EN: piezometric level @en
equivalent EN: piezometric level (en)
definition: En un point d'un milieu poreux, niveau supérieur de la colonne liquide statique qui équilibre la pression hydrostatique en ce point.
in scheme: Hydraulique
in scheme: concepts
notation: AGRI243

oncogène
type: ConceptConcept
type: Concept
creator: Commission d'enrichissement de la langue française, FranceTerme
source: révision de l'arrêté du 14 septembre 1990
date parution JO: 2000-09-22
deconseille ou frequent: onc-c
deconseille ou frequent: onc-v
equivalent EN: oncogene @en
equivalent EN: oncogene (en)
part of speech: nom masculin
definition: Gène qui provoque ou favorise l'apparition de tumeurs.
in scheme: Biologie
in scheme: concept-SD-biologie-genie-genetique
in scheme: concepts
notation: AGRI244
note: Ces gènes peuvent être apportés par des virus cancérigènes (oncogènes viraux, ou « onc-v »), ou préexister dans des génomes cellulaires (oncogènes cellulaires ou « onc-c »).
related: oncogène
related: transformation tumorale
related: oncoprotéine

oncogène
type: ConceptConcept
type: Concept
creator: Commission d'enrichissement de la langue française, FranceTerme
source: révision de l'arrêté du 14 septembre 1990
date parution JO: 2000-09-22
equivalent EN: oncogene @en
equivalent EN: oncogene (en)
part of speech: adjectif
definition: Se dit d'un gène qui provoque ou favorise l'apparition de tumeurs.
in scheme: Biologie
in scheme: concept-SD-biologie-genie-genetique
in scheme: concepts
notation: AGRI245
related: oncogène

opérateur
type: ConceptConcept
type: Concept
creator: Commission d'enrichissement de la langue française, FranceTerme
source: révision de l'arrêté du 14 septembre 1990
date parution JO: 2000-09-22
equivalent EN: operator @en
equivalent EN: operator (en)
part of speech: nom masculin
definition: Site de l'ADN auquel un répresseur se lie, pour empêcher le déclenchement de la transcription au niveau du promoteur adjacent.
in scheme: Biologie
in scheme: concept-SD-biologie-genie-genetique
in scheme: concepts
notation: AGRI246

opéron
type: ConceptConcept
type: Concept
creator: Commission d'enrichissement de la langue française, FranceTerme
source: révision de l'arrêté du 14 septembre 1990
date parution JO: 2000-09-22
equivalent EN: operon @en
equivalent EN: operon (en)
part of speech: nom masculin
definition: Unité de transcription constituée par un promoteur, un opérateur et un ou plusieurs gènes de structure.
in scheme: Biologie
in scheme: concept-SD-biologie-genie-genetique
in scheme: concepts
notation: AGRI247
note: Dans le cas où l'unité comporte plusieurs gènes de structure, l'ARN messager ainsi produit est polycistronique.
related: mutation à effet polaire
related: atténuation
related: régulation coordonnée
related: polycistronique

pacage marin
type: ConceptConcept
type: Concept
creator: Commission d'enrichissement de la langue française, FranceTerme
source: révision de l'arrêté du 28 novembre 1985
date parution JO: 2000-09-22
equivalent EN: sea ranching @en
equivalent EN: sea ranching (en)
definition: Méthode qui consiste à lâcher dans le milieu naturel, après élevage, des juvéniles d'espèces migratrices ou sédentaires afin de les capturer ultérieurement en des points de concentration naturels ou artificiels proches du lieu de lâcher.
in scheme: Pêche et aquaculture
in scheme: concept-SD-peche-et-aquaculture-peche-maritime
in scheme: concepts
notation: AGRI248

paiement compensatoire
type: ConceptConcept
type: Concept
creator: Commission d'enrichissement de la langue française, FranceTerme
source: révision de l'arrêté du 20 septembre 1993
date parution JO: 2000-09-22
equivalent EN: deficiency payment @en
equivalent EN: deficiency payment (en)
definition: Méthode de garantie de prix selon laquelle, lorsque le prix de marché d'un produit devient inférieur au prix fixé, l'État prend la différence à sa charge et en verse le montant aux producteurs.
in scheme: Agriculture
in scheme: Économie générale
in scheme: concept-SD-agriculture-economie-agricole
in scheme: concept-SD-economie-generale-economie-agricole
in scheme: concepts
notation: AGRI249

ARN satellite
type: ConceptConcept
type: Concept
creator: Commission d'enrichissement de la langue française, FranceTerme
source: révision de l'arrêté du 14 septembre 1990
date parution JO: 2000-09-22
equivalent EN: satellite RNA @en
equivalent EN: satellite RNA (en)
definition: ARN qui peut accompagner certains virus.
in scheme: Biologie
in scheme: concept-SD-biologie-genie-genetique
in scheme: concepts
notation: AGRI25
note: L'ARN satellite, encapsidé, est spécifique de chaque virus, et ne peut se répliquer sans lui.
related: encapsidation

parité des revenus
type: ConceptConcept
type: Concept
creator: Commission d'enrichissement de la langue française, FranceTerme
source: révision de l'arrêté du 20 septembre 1993
date parution JO: 2000-09-22
equivalent EN: income parity @en
equivalent EN: income parity (en)
definition: Forme d'égalité entre des revenus agricoles et non agricoles.
in scheme: Agriculture
in scheme: concept-SD-agriculture-economie-agricole
in scheme: concepts
notation: AGRI250

peptide signal
type: ConceptConcept
type: Concept
creator: Commission d'enrichissement de la langue française, FranceTerme
source: révision de l'arrêté du 14 septembre 1990
date parution JO: 2000-09-22
equivalent EN: signal peptide @en
equivalent EN: signal peptide (en)
equivalent EN: signal sequence @en
equivalent EN: signal sequence (en)
alternative label: séquence signal
definition: Segment de 15 à 30 acides aminés présent à la partie N-terminale d'une protéine, et qui indique à la machinerie cellulaire que cette protéine doit être exportée ou sécrétée.
in scheme: Biologie
in scheme: concept-SD-biologie-genie-genetique
in scheme: concepts
notation: AGRI251
note: Ce peptide signal, qui permet le passage de la protéine à travers une membrane, est généralement clivé au cours du processus de sécrétion ou d'exportation par une protéase spécifique. Il n'est donc pas présent dans la protéine mature.
related: maturation moléculaire

phage défectif
type: ConceptConcept
type: Concept
creator: Commission d'enrichissement de la langue française, FranceTerme
source: révision de l'arrêté du 14 septembre 1990
date parution JO: 2000-09-22
equivalent EN: defective phage @en
equivalent EN: defective phage (en)
definition: Phage muté qui nécessite pour sa multiplication les fonctions d'un phage assistant.
in scheme: Biologie
in scheme: concept-SD-biologie-genie-genetique
in scheme: concept-SD-biologie-virologie
in scheme: concepts
notation: AGRI252
related: défectif, -ive
related: bactériophage

phage tempéré
type: ConceptConcept
type: Concept
creator: Commission d'enrichissement de la langue française, FranceTerme
source: révision de l'arrêté du 14 septembre 1990
date parution JO: 2000-09-22
deconseille ou frequent: prophage
equivalent EN: lysogenic phage @en
equivalent EN: lysogenic phage (en)
equivalent EN: temperate phage @en
equivalent EN: temperate phage (en)
alternative label: phage lysogénique
definition: Phage dont le génome peut s'intégrer dans l'ADN de la cellule hôte et en transformer les propriétés.
in scheme: Biologie
in scheme: concept-SD-biologie-genie-genetique
in scheme: concept-SD-biologie-virologie
in scheme: concepts
notation: AGRI253
note: 1. Lorsqu'il est intégré au génome de la cellule hôte, le phage prend le nom de « prophage ».
note: 2. Le phage tempéré est capable de lysogéniser les bactéries qu'il infecte.
related: lysogénie
related: bactérie lysogène

phage transducteur
type: ConceptConcept
type: Concept
creator: Commission d'enrichissement de la langue française, FranceTerme
source: révision de l'arrêté du 14 septembre 1990
date parution JO: 2000-09-22
equivalent EN: transducing particule @en
equivalent EN: transducing particule (en)
equivalent EN: transducing phage @en
equivalent EN: transducing phage (en)
alternative label: phage de transfert
definition: Phage capable de transmettre une partie du génome d'une cellule hôte à une autre.
in scheme: Biologie
in scheme: concept-SD-biologie-genie-genetique
in scheme: concepts
notation: AGRI254

phage virulent
type: ConceptConcept
type: Concept
creator: Commission d'enrichissement de la langue française, FranceTerme
source: révision de l'arrêté du 14 septembre 1990
date parution JO: 2000-09-22
equivalent EN: virulent phage @en
equivalent EN: virulent phage (en)
definition: Phage produisant dans la bactérie une infection conduisant au cycle lytique.
in scheme: Biologie
in scheme: concept-SD-biologie-genie-genetique
in scheme: concept-SD-biologie-virologie
in scheme: concepts
notation: AGRI255
note: La bactérie est lysée et les particules virales nouvellement synthétisées sont libérées.

phasmide
type: ConceptConcept
type: Concept
creator: Commission d'enrichissement de la langue française, FranceTerme
source: révision de l'arrêté du 14 septembre 1990
date parution JO: 2000-09-22
equivalent EN: phasmid @en
equivalent EN: phasmid (en)
part of speech: nom masculin
definition: Plasmide vecteur qui porte l'origine de réplication d'un phage.
in scheme: Biologie
in scheme: concept-SD-biologie-genie-genetique
in scheme: concepts
notation: AGRI256
note: Le phasmide peut être propagé soit sous forme d'ADN double brin phasmidique, soit sous forme d'ADN phagique encapsidé grâce à un phage assistant.
related: origine de réplication

plage de lyse
type: ConceptConcept
type: Concept
creator: Commission d'enrichissement de la langue française, FranceTerme
source: révision de l'arrêté du 14 septembre 1990
date parution JO: 2000-09-22
equivalent EN: lysis plaque @en
equivalent EN: lysis plaque (en)
equivalent EN: phage plaque @en
equivalent EN: phage plaque (en)
alternative label: plaque de lyse
definition: Trou formé dans une couche de bactéries, à la suite d'une infection lytique provoquée par un bactériophage.
in scheme: Biologie
in scheme: concept-SD-biologie-genie-genetique
in scheme: concept-SD-biologie-virologie
in scheme: concepts
notation: AGRI257
note: Les caractères des plages (vitesse de formation, dimension, aspect, etc.) sont souvent utilisés pour définir un type donné de phage.
related: transfert de plages

plasmide
type: ConceptConcept
type: Concept
creator: Commission d'enrichissement de la langue française, FranceTerme
source: révision de l'arrêté du 14 septembre 1990
date parution JO: 2000-09-22
equivalent EN: plasmid @en
equivalent EN: plasmid (en)
part of speech: nom masculin
definition: Molécule d'ADN extrachromosomique capable de se répliquer indépendamment et portant des caractères génétiques non essentiels à la cellule hôte.
in scheme: Biologie
in scheme: concept-SD-biologie-genie-genetique
in scheme: concepts
notation: AGRI258
note: Certains plasmides sont utilisés comme vecteurs de clonage.
related: génome
related: cosmide
related: cellule hôte
related: coïntégration
related: compatibilité
related: phagémide
related: banque d'ADN complémentaire
related: banque génomique

plasmide amplifiable
type: ConceptConcept
type: Concept
creator: Commission d'enrichissement de la langue française, FranceTerme
source: révision de l'arrêté du 14 septembre 1990
date parution JO: 2000-09-22
equivalent EN: amplifiable plasmid @en
equivalent EN: amplifiable plasmid (en)
definition: Plasmide qui peut continuer à se répliquer quand la multiplication de la cellule hôte est bloquée.
in scheme: Biologie
in scheme: concept-SD-biologie-genie-genetique
in scheme: concepts
notation: AGRI259

adaptateur
type: ConceptConcept
type: Concept
creator: Commission d'enrichissement de la langue française, FranceTerme
source: révision de l'arrêté du 14 septembre 1990
date parution JO: 2000-09-22
equivalent EN: adaptor @en
equivalent EN: adaptor (en)
part of speech: nom masculin
definition: Courte séquence nucléotidique capable de réaliser le pontage entre deux fragments d'ADN terminés par des séquences non complémentaires.
in scheme: Biologie
in scheme: concept-SD-biologie-genie-genetique
in scheme: concepts
notation: AGRI26

plasmide autoamplifiable
type: ConceptConcept
type: Concept
creator: Commission d'enrichissement de la langue française, FranceTerme
source: révision de l'arrêté du 14 septembre 1990
date parution JO: 2000-09-22
equivalent EN: runaway plasmid @en
equivalent EN: runaway plasmid (en)
definition: Plasmide mutant ayant perdu son mécanisme de contrôle de la réplication.
in scheme: Biologie
in scheme: concept-SD-biologie-genie-genetique
in scheme: concepts
notation: AGRI260
note: Chez certains de ces plasmides, le contrôle de la réplication est thermosensible.

plasmide mobilisable
type: ConceptConcept
type: Concept
creator: Commission d'enrichissement de la langue française, FranceTerme
source: révision de l'arrêté du 14 septembre 1990
date parution JO: 2000-09-22
equivalent EN: mobilisable plasmid @en
equivalent EN: mobilisable plasmid (en)
definition: Plasmide qui n'est pas autotransférable, mais qui peut être transféré d'une cellule bactérienne à une autre grâce à un plasmide assistant.
in scheme: Biologie
in scheme: concept-SD-biologie-genie-genetique
in scheme: concepts
notation: AGRI261

plasmide multicopie
type: ConceptConcept
type: Concept
creator: Commission d'enrichissement de la langue française, FranceTerme
source: révision de l'arrêté du 14 septembre 1990
date parution JO: 2000-09-22
equivalent EN: multicopy plasmid @en
equivalent EN: multicopy plasmid (en)
definition: Plasmide présent en de nombreuses copies dans une cellule hôte.
in scheme: Biologie
in scheme: concept-SD-biologie-genie-genetique
in scheme: concepts
notation: AGRI262

plasmide recombiné
type: ConceptConcept
type: Concept
creator: Commission d'enrichissement de la langue française, FranceTerme
source: révision de l'arrêté du 14 septembre 1990
date parution JO: 2000-09-22
equivalent EN: recombinant plasmid @en
equivalent EN: recombinant plasmid (en)
alternative label: plasmide hybride
definition: Plasmide dans lequel a été inséré un fragment d'ADN étranger.
in scheme: Biologie
in scheme: concept-SD-biologie-genie-genetique
in scheme: concepts
notation: AGRI263
note: Ce terme est le plus souvent employé pour désigner un plasmide créé par recombinaison in vitro.
related: chromosome artificiel de bactérie

polymorphisme de restriction
type: ConceptConcept
type: Concept
creator: Commission d'enrichissement de la langue française, FranceTerme
source: révision de l'arrêté du 14 septembre 1990
abbreviation: RFLP @en
date parution JO: 2000-09-22
deconseille ou frequent: polymorphisme de longueur des fragments de restriction
deconseille ou frequent: polymorphisme de taille des fragments de restriction
equivalent EN: RFLP @en
equivalent EN: RFLP (en)
equivalent EN: restriction fragment length polymorphism @en
equivalent EN: restriction fragment length polymorphism (en)
definition: Propriété qu'a l'ADN de différents allèles de générer des fragments de restriction de taille variable.
in scheme: Biologie
in scheme: concept-SD-biologie-genie-genetique
in scheme: concepts
notation: AGRI264
note: 1. Ce polymorphisme reflète directement des variations dans la séquence primaire de l'ADN.
note: 2. On trouve aussi les termes « polymorphisme de taille des fragments de restriction » et « polymorphisme de longueur des fragments de restriction ».

polynucléotide kinase
type: ConceptConcept
type: Concept
creator: Commission d'enrichissement de la langue française, FranceTerme
source: révision de l'arrêté du 14 septembre 1990
date parution JO: 2000-09-22
equivalent EN: polynucleotide kinase @en
equivalent EN: polynucleotide kinase (en)
definition: Enzyme phosphorylant l'extrémité 5' d'un polynucléotide.
in scheme: Biologie
in scheme: concept-SD-biologie-genie-genetique
in scheme: concepts
notation: AGRI265

polysome
type: ConceptConcept
type: Concept
creator: Commission d'enrichissement de la langue française, FranceTerme
source: révision de l'arrêté du 14 septembre 1990
date parution JO: 2000-09-22
equivalent EN: polyribosome @en
equivalent EN: polyribosome (en)
equivalent EN: polysome @en
equivalent EN: polysome (en)
part of speech: nom masculin
alternative label: polyribosome
definition: Complexe constitué par une molécule d'ARNm et des ribosomes.
in scheme: Biologie
in scheme: concept-SD-biologie-genie-genetique
in scheme: concepts
notation: AGRI266
note: La synthèse protéique a lieu sur ce complexe.

pompage d'essai
type: ConceptConcept
type: Concept
creator: Commission d'enrichissement de la langue française, FranceTerme
source: révision de l'arrêté du 7 avril 1987
date parution JO: 2000-09-22
equivalent EN: pumping test @en
equivalent EN: pumping test (en)
alternative label: essai de pompage
alternative label: essai par pompage
definition: Pompage avec contrôle de l'évolution du débit.
in scheme: Hydraulique
in scheme: concepts
notation: AGRI267

porosité
type: ConceptConcept
type: Concept
creator: Commission d'enrichissement de la langue française, FranceTerme
source: révision de l'arrêté du 7 avril 1987
date parution JO: 2000-09-22
equivalent EN: porosity @en
equivalent EN: porosity (en)
part of speech: nom féminin
definition: Volume des vides du sol exprimé en pourcentage du volume total.
in scheme: Sciences de la Terre
in scheme: concept-SD-sciences-de-la-terre-physique-du-sol
in scheme: concepts
notation: AGRI268

porosité de drainage
type: ConceptConcept
type: Concept
creator: Commission d'enrichissement de la langue française, FranceTerme
source: révision de l'arrêté du 7 avril 1987
date parution JO: 2000-09-22
equivalent EN: drainage effective porosity @en
equivalent EN: drainage effective porosity (en)
equivalent EN: drainage pore space @en
equivalent EN: drainage pore space (en)
equivalent EN: storage capacity @en
equivalent EN: storage capacity (en)
alternative label: porosité d'aération
alternative label: porosité utile
definition: Partie de la porosité rendue accessible à l'air par le rabattement d'une nappe.
in scheme: Hydraulique
in scheme: concept-SD-hydraulique-drainage-agricole
in scheme: concepts
notation: AGRI269

agent intercalant
type: ConceptConcept
type: Concept
creator: Commission d'enrichissement de la langue française, FranceTerme
source: révision de l'arrêté du 14 septembre 1990
date parution JO: 2000-09-22
equivalent EN: intercalating agent @en
equivalent EN: intercalating agent (en)
definition: Molécule capable de s'insérer entre les plateaux formés par les bases appariées d'un acide nucléique.
in scheme: Biologie
in scheme: concept-SD-biologie-genie-genetique
in scheme: concepts
notation: AGRI27

potentiel hydrique total
type: ConceptConcept
type: Concept
creator: Commission d'enrichissement de la langue française, FranceTerme
source: révision de l'arrêté du 7 avril 1987
date parution JO: 2000-09-22
equivalent EN: total soil water potential @en
equivalent EN: total soil water potential (en)
definition: État énergétique de l'eau du sol.
in scheme: Hydraulique
in scheme: Sciences de la Terre
in scheme: concept-SD-hydraulique-physique-du-sol
in scheme: concept-SD-sciences-de-la-terre-physique-du-sol
in scheme: concepts
notation: AGRI270

poulie motrice
type: ConceptConcept
type: Concept
creator: Commission d'enrichissement de la langue française, FranceTerme
source: révision de l'arrêté du 28 novembre 1985
date parution JO: 2000-09-22
equivalent EN: power-block @en
equivalent EN: power-block (en)
definition: Poulie entraînée par un moteur et permettant de haler des filets.
in scheme: Pêche et aquaculture
in scheme: concept-SD-peche-et-aquaculture-peche-maritime
in scheme: concepts
notation: AGRI271

profil hydrique
type: ConceptConcept
type: Concept
creator: Commission d'enrichissement de la langue française, FranceTerme
source: révision de l'arrêté du 7 avril 1987
date parution JO: 2000-09-22
equivalent EN: moisture content profile @en
equivalent EN: moisture content profile (en)
definition: Courbe donnant les teneurs en eau du sol mesurées à un instant donné, en fonction de la profondeur.
in scheme: Hydraulique
in scheme: Sciences de la Terre
in scheme: concept-SD-hydraulique-physique-du-sol
in scheme: concept-SD-sciences-de-la-terre-physique-du-sol
in scheme: concepts
notation: AGRI272

promoteur
type: ConceptConcept
type: Concept
creator: Commission d'enrichissement de la langue française, FranceTerme
source: révision de l'arrêté du 14 septembre 1990
date parution JO: 2000-09-22
equivalent EN: promotor @en
equivalent EN: promotor (en)
part of speech: nom masculin
definition: Séquence d'ADN nécessaire à l'initiation de la transcription et le plus souvent située en amont de la partie transcrite des gènes.
in scheme: Biologie
in scheme: concept-SD-biologie-genie-genetique
in scheme: concepts
notation: AGRI273
related: protéine de liaison avec la boîte TATA
related: gène rapporteur
related: régulation coordonnée
related: facteur général de transcription
related: concept-SANT65

prophage défectif
type: ConceptConcept
type: Concept
creator: Commission d'enrichissement de la langue française, FranceTerme
source: révision de l'arrêté du 14 septembre 1990
date parution JO: 2000-09-22
equivalent EN: defective prophage @en
equivalent EN: defective prophage (en)
definition: Prophage qui présente une mutation qui rend impossible l'accomplissement complet du cycle lytique lors de son induction.
in scheme: Biologie
in scheme: concept-SD-biologie-genie-genetique
in scheme: concept-SD-biologie-virologie
in scheme: concepts
notation: AGRI274
note: Un prophage défectif ne peut se multiplier sous forme de phage qu'en présence d'un phage assistant.

prosome
type: ConceptConcept
type: Concept
creator: Commission d'enrichissement de la langue française, FranceTerme
source: révision de l'arrêté du 14 septembre 1990
date parution JO: 2000-09-22
equivalent EN: prosome @en
equivalent EN: prosome (en)
part of speech: nom masculin
definition: Petite particule ribonucléoprotéique associée à un ARN messager libre et réprimée dans le cytoplasme.
in scheme: Biologie
in scheme: concept-SD-biologie-genie-genetique
in scheme: concepts
notation: AGRI275

proto-oncogène
type: ConceptConcept
type: Concept
creator: Commission d'enrichissement de la langue française, FranceTerme
source: révision de l'arrêté du 14 septembre 1990
date parution JO: 2000-09-22
equivalent EN: protooncogene @en
equivalent EN: protooncogene (en)
part of speech: nom masculin
definition: Gène existant dans le génome d'une cellule et pouvant devenir oncogène à la suite d'une activation consécutive à une mutation, une translocation ou à l'insertion d'un promoteur viral actif.
in scheme: Biologie
in scheme: concept-SD-biologie-genie-genetique
in scheme: concepts
notation: AGRI276
related: mutation
related: translocation

provirus
type: ConceptConcept
type: Concept
creator: Commission d'enrichissement de la langue française, FranceTerme
source: révision de l'arrêté du 14 septembre 1990
date parution JO: 2000-09-22
equivalent EN: provirus @en
equivalent EN: provirus (en)
part of speech: nom masculin
definition: Séquence d'ADN double brin située dans un chromosome d'eucaryote et correspondant au génome d'un rétrovirus.
in scheme: Biologie
in scheme: concept-SD-biologie-genie-genetique
in scheme: concept-SD-biologie-virologie
in scheme: concepts
notation: AGRI277
related: rétrovirus

rabattement
type: ConceptConcept
type: Concept
creator: Commission d'enrichissement de la langue française, FranceTerme
source: révision de l'arrêté du 7 avril 1987
date parution JO: 2000-09-22
equivalent EN: drawdown @en
equivalent EN: drawdown (en)
part of speech: nom masculin
definition: Diminution de la charge hydraulique déterminée en un point donné sous l'effet d'un prélèvement d'eau, naturel ou artificiel.
in scheme: Hydraulique
in scheme: concepts
notation: AGRI278

réarrangement génétique
type: ConceptConcept
type: Concept
creator: Commission d'enrichissement de la langue française, FranceTerme
source: révision de l'arrêté du 14 septembre 1990
date parution JO: 2000-09-22
equivalent EN: gene rearrangement @en
equivalent EN: gene rearrangement (en)
definition: Assemblage réunissant plusieurs morceaux d'ADN initialement non contigus.
in scheme: Biologie
in scheme: concept-SD-biologie-genie-genetique
in scheme: concepts
notation: AGRI279
note: Certains réarrangements conduisent à la formation de gènes fonctionnels (gène des anticorps). D'autres au contraire se traduisent par une inactivation de gènes.

agroéquipement
type: ConceptConcept
type: Concept
creator: Commission d'enrichissement de la langue française, FranceTerme
source: révision de l'arrêté du 20 septembre 1993
date parution JO: 2000-09-22
equivalent EN: agricultural equipment @en
equivalent EN: agricultural equipment (en)
part of speech: nom masculin
definition: Bien durable (essentiellement bâtiments et matériels) utilisé pour la production agricole et, éventuellement, la transformation de produits agricoles.
in scheme: Agriculture
in scheme: concept-SD-agriculture-economie-agricole
in scheme: concepts
notation: AGRI28

recharge
type: ConceptConcept
type: Concept
creator: Commission d'enrichissement de la langue française, FranceTerme
source: révision de l'arrêté du 7 avril 1987
date parution JO: 2000-09-22
part of speech: nom féminin
definition: Fraction de l'eau ou de la pluviométrie qui parvient, notamment par effet de gravité, à la zone saturée.
in scheme: Hydraulique
in scheme: Sciences de la Terre
in scheme: concept-SD-hydraulique-hydrogeologie
in scheme: concept-SD-sciences-de-la-terre-hydrogeologie
in scheme: concepts
notation: AGRI280
related: zone saturée

recombinaison génétique
type: ConceptConcept
type: Concept
creator: Commission d'enrichissement de la langue française, FranceTerme
source: révision de l'arrêté du 14 septembre 1990
date parution JO: 2000-09-22
equivalent EN: genetic recombination @en
equivalent EN: genetic recombination (en)
definition: Phénomène conduisant à l'apparition, dans une cellule ou dans un individu, de gènes ou de caractères héréditaires dans une association différente de celle observée chez les cellules ou individus parentaux.
in scheme: Biologie
in scheme: concept-SD-biologie-genetique
in scheme: concepts
notation: AGRI281
related: point chaud de recombinaison
related: recombinaison homologue

recombiné
type: ConceptConcept
type: Concept
creator: Commission d'enrichissement de la langue française, FranceTerme
source: révision de l'arrêté du 14 septembre 1990
date parution JO: 2000-09-22
deconseille ou frequent: recombinant
equivalent EN: recombinant @en
equivalent EN: recombinant (en)
equivalent EN: recombined @en
equivalent EN: recombined (en)
part of speech: nom masculin
definition: Organisme ou molécule résultant d'une recombinaison génétique naturelle ou expérimentale.
in scheme: Biologie
in scheme: concept-SD-biologie-genie-genetique
in scheme: concepts
notation: AGRI282
note: On trouve dans l'usage, sous l'influence de l'anglais, le terme « recombinant ». Il est plus rigoureux d'utiliser celui de « recombiné », qui marque que l'élément en cause résulte bel et bien d'une recombinaison.

recombiné
type: ConceptConcept
type: Concept
creator: Commission d'enrichissement de la langue française, FranceTerme
source: révision de l'arrêté du 14 septembre 1990
date parution JO: 2000-09-22
equivalent EN: recombinant @en
equivalent EN: recombinant (en)
equivalent EN: recombined @en
equivalent EN: recombined (en)
part of speech: adjectif
definition: Qualifie un organisme ou une molécule abritant un gène recombiné.
in scheme: Biologie
in scheme: concept-SD-biologie-genie-genetique
in scheme: concepts
notation: AGRI283
note: On trouve dans l'usage, sous l'influence de l'anglais, le terme « recombinant ». Il est plus rigoureux d'utiliser celui de « recombiné », qui marque que l'élément en cause résulte bel et bien d'une recombinaison.
related: inactivation génique par virus

régime de tarissement non influencé
type: ConceptConcept
type: Concept
creator: Commission d'enrichissement de la langue française, FranceTerme
source: révision de l'arrêté du 7 avril 1987
date parution JO: 2000-09-22
equivalent EN: tail recession regime @en
equivalent EN: tail recession regime (en)
definition: Régime des débits de la nappe sous l'effet du drainage après arrêt des infiltrations dues aux pluies.
in scheme: Hydraulique
in scheme: concepts
notation: AGRI284

remontée des eaux froides
type: ConceptConcept
type: Concept
creator: Commission d'enrichissement de la langue française, FranceTerme
source: révision de l'arrêté du 23 septembre 1987
date parution JO: 2000-09-22
equivalent EN: upwelling @en
equivalent EN: upwelling (en)
forme abregee: remontée d'eau
definition: Système de courant ascendant faisant remonter vers la surface des eaux froides inférieures.
in scheme: Sciences de la Terre
in scheme: concept-SD-sciences-de-la-terre-oceanographie
in scheme: concepts
notation: AGRI285
note: Ce phénomène peut provoquer des modifications de la faune marine.

remplissage
type: ConceptConcept
type: Concept
creator: Commission d'enrichissement de la langue française, FranceTerme
source: révision de l'arrêté du 14 septembre 1990
date parution JO: 2000-09-22
equivalent EN: filling in @en
equivalent EN: filling in (en)
part of speech: nom masculin
definition: Opération qui consiste à insérer des nucléotides dans une région simple brin d'un ADN pour la rendre entièrement double brin.
in scheme: Biologie
in scheme: concept-SD-biologie-genie-genetique
in scheme: concepts
notation: AGRI286
note: Cette opération nécessite l'utilisation d'une ADN polymérase I.
related: ADN polymérase

renaturation d'acide nucléique
type: ConceptConcept
type: Concept
creator: Commission d'enrichissement de la langue française, FranceTerme
source: révision de l'arrêté du 14 septembre 1990
date parution JO: 2000-09-22
equivalent EN: renaturation @en
equivalent EN: renaturation (en)
definition: Réassociation, après dénaturation, de simples brins d'ADN ou d'ARN complémentaires.
in scheme: Biologie
in scheme: concept-SD-biologie-genie-genetique
in scheme: concepts
notation: AGRI287
related: dénaturation d'acide nucléique

réparation de l'ADN
type: ConceptConcept
type: Concept
creator: Commission d'enrichissement de la langue française, FranceTerme
source: révision de l'arrêté du 14 septembre 1990
date parution JO: 2000-09-22
equivalent EN: DNA repair @en
equivalent EN: DNA repair (en)
definition: Ensemble des processus qui permettent la reconstitution d'un duplex normal à partir de structures présentant des anomalies diverses, telles que des interruptions plus ou moins importantes dans la continuité de l'un des brins, la présence de brins surnuméraires ou des défauts de complémentarité.
in scheme: Biologie
in scheme: concept-SD-biologie-genie-genetique
in scheme: concepts
notation: AGRI289
related: réparosome

agro-industrie
type: ConceptConcept
type: Concept
creator: Commission d'enrichissement de la langue française, FranceTerme
source: révision de l'arrêté du 20 septembre 1993
date parution JO: 2000-09-22
equivalent EN: agricultural industry @en
equivalent EN: agricultural industry (en)
equivalent EN: agro-food industry @en
equivalent EN: agro-food industry (en)
equivalent EN: agro-industry @en
equivalent EN: agro-industry (en)
equivalent EN: agro-processing industry @en
equivalent EN: agro-processing industry (en)
equivalent EN: factory farming @en
equivalent EN: factory farming (en)
part of speech: nom féminin
definition: Ensemble des activités industrielles visant à transformer des produits agricoles.
in scheme: Agriculture
in scheme: concept-SD-agriculture-industries-agricoles-et-alimentaires
in scheme: concepts
notation: AGRI29
related: agroalimentaire

répétition terminale longue
type: ConceptConcept
type: Concept
creator: Commission d'enrichissement de la langue française, FranceTerme
source: révision de l'arrêté du 14 septembre 1990
abbreviation: LTR @en
date parution JO: 2000-09-22
equivalent EN: LTR @en
equivalent EN: LTR (en)
equivalent EN: long terminal repeat @en
equivalent EN: long terminal repeat (en)
definition: Séquence directement répétée aux deux extrémités d'un ARN ou d'un ADN rétroviral.
in scheme: Biologie
in scheme: concept-SD-biologie-genie-genetique
in scheme: concept-SD-biologie-virologie
in scheme: concepts
notation: AGRI290

réplicon
type: ConceptConcept
type: Concept
creator: Commission d'enrichissement de la langue française, FranceTerme
source: révision de l'arrêté du 14 septembre 1990
date parution JO: 2000-09-22
equivalent EN: replicon @en
equivalent EN: replicon (en)
part of speech: nom masculin
definition: Unité de réplication formée par une molécule d'ADN pouvant se répliquer de façon autonome dans une cellule.
in scheme: Biologie
in scheme: concept-SD-biologie-genie-genetique
in scheme: concepts
notation: AGRI291
related: résolution d'un coïntégrat
related: coïntégrat
related: coïntégration

répresseur
type: ConceptConcept
type: Concept
creator: Commission d'enrichissement de la langue française, FranceTerme
source: révision de l'arrêté du 14 septembre 1990
date parution JO: 2000-09-22
equivalent EN: repressor @en
equivalent EN: repressor (en)
part of speech: nom masculin
definition: Protéine qui se lie aux séquences régulatrices de l'ADN (ou de l'ARN) et qui bloque ainsi respectivement la transcription ou la traduction.
in scheme: Biologie
in scheme: concept-SD-biologie-genie-genetique
in scheme: concepts
notation: AGRI292
related: corépresseur

résolution d'un coïntégrat
type: ConceptConcept
type: Concept
creator: Commission d'enrichissement de la langue française, FranceTerme
source: révision de l'arrêté du 14 septembre 1990
date parution JO: 2000-09-22
equivalent EN: cointegrate resolution @en
equivalent EN: cointegrate resolution (en)
definition: Mécanisme par lequel un coïntégrat redonne deux réplicons indépendants.
in scheme: Biologie
in scheme: concept-SD-biologie-genie-genetique
in scheme: concepts
notation: AGRI293
related: réplicon
related: coïntégrat

restriction
type: ConceptConcept
type: Concept
creator: Commission d'enrichissement de la langue française, FranceTerme
source: révision de l'arrêté du 14 septembre 1990
date parution JO: 2000-09-22
deconseille ou frequent: enzyme de restriction
equivalent EN: restriction @en
equivalent EN: restriction (en)
part of speech: nom féminin
definition: Mécanisme par lequel une cellule dégrade un ADN étranger.
in scheme: Biologie
in scheme: concept-SD-biologie-genie-genetique
in scheme: concepts
notation: AGRI294
note: Ce phénomène fait intervenir une endonucléase spécifique (enzyme de restriction) et une enzyme de modification qui protège l'ADN de l'hôte.
related: fragment de restriction
related: isoschizomère
related: site de restriction
related: carte de restriction
related: cartographie de restriction
related: nucléase-effecteur de type activateur de transcription
related: ciseaux moléculaires

rétrotransposon
type: ConceptConcept
type: Concept
creator: Commission d'enrichissement de la langue française, FranceTerme
source: révision de l'arrêté du 14 septembre 1990
date parution JO: 2000-09-22
equivalent EN: retrotransposon @en
equivalent EN: retrotransposon (en)
part of speech: nom masculin
definition: Classe de transposons dont la transposition nécessite la transcription inverse de leur produit de transcription.
in scheme: Biologie
in scheme: concept-SD-biologie-genie-genetique
in scheme: concepts
notation: AGRI295
related: transposon
related: élément nucléaire dispersé court
related: élément nucléaire dispersé long

rétrovirus
type: ConceptConcept
type: Concept
creator: Commission d'enrichissement de la langue française, FranceTerme
source: révision de l'arrêté du 14 septembre 1990
date parution JO: 2000-09-22
equivalent EN: retrovirus @en
equivalent EN: retrovirus (en)
part of speech: nom masculin
definition: Classe de virus à ARN spécifique des eucaryotes et dont la propagation nécessite la conversion de l'ARN en ADN double brin qui, lui, s'intègre dans le génome de la cellule hôte.
in scheme: Biologie
in scheme: concept-SD-biologie-genie-genetique
in scheme: concept-SD-biologie-virologie
in scheme: concepts
notation: AGRI296
related: provirus

saignée de drainage
type: ConceptConcept
type: Concept
creator: Commission d'enrichissement de la langue française, FranceTerme
source: révision de l'arrêté du 7 avril 1987
date parution JO: 2000-09-22
equivalent EN: coulter track @en
equivalent EN: coulter track (en)
definition: Résultat physique dans le sol de l'action d'une machine de pose de drains à coutre sous-soleur, appelée « draineuse sous-soleuse ».
in scheme: Hydraulique
in scheme: concept-SD-hydraulique-drainage-agricole
in scheme: concepts
notation: AGRI297

saison de drainage
type: ConceptConcept
type: Concept
creator: Commission d'enrichissement de la langue française, FranceTerme
source: révision de l'arrêté du 7 avril 1987
date parution JO: 2000-09-22
equivalent EN: drainage season @en
equivalent EN: drainage season (en)
definition: Période de l'année hydrologique sous climat tempéré caractérisée par un coefficient de restitution, pour un réseau de drainage donné.
in scheme: Hydraulique
in scheme: concept-SD-hydraulique-drainage-agricole
in scheme: concepts
notation: AGRI298
related: coefficient de restitution

sélection d'hybride
type: ConceptConcept
type: Concept
creator: Commission d'enrichissement de la langue française, FranceTerme
source: révision de l'arrêté du 14 septembre 1990
date parution JO: 2000-09-22
equivalent EN: hybrid selection @en
equivalent EN: hybrid selection (en)
definition: Sélection d'un acide nucléique monocaténaire après formation d'une molécule hybride avec un brin complémentaire.
in scheme: Biologie
in scheme: concept-SD-biologie-genie-genetique
in scheme: concepts
notation: AGRI299

ADN circulaire
type: ConceptConcept
type: Concept
creator: Commission d'enrichissement de la langue française, FranceTerme
source: révision de l'arrêté du 14 septembre 1990
date parution JO: 2000-09-22
deconseille ou frequent: molécule déroulée
deconseille ou frequent: molécule fermée
deconseille ou frequent: molécule ouverte
deconseille ou frequent: molécule relâchée
equivalent EN: circular DNA @en
equivalent EN: circular DNA (en)
definition: ADN formant une molécule circulaire.
in scheme: Biologie
in scheme: concept-SD-biologie-genetique
in scheme: concepts
notation: AGRI3
note: Dans le cas d'ADN circulaire double brin, on distingue les molécules ouvertes, dites « relâchées » (ou « déroulées » : un brin est coupé) et les molécules fermées (sans extrémités libres) qui souvent sont superenroulées.
related: réplication en cercle roulant
related: géminivirus

amorçage aléatoire
type: ConceptConcept
type: Concept
creator: Commission d'enrichissement de la langue française, FranceTerme
source: révision de l'arrêté du 14 septembre 1990
date parution JO: 2000-09-22
equivalent EN: random priming @en
equivalent EN: random priming (en)
definition: Déclenchement d'une synthèse d'acides nucléiques à l'aide d'amorces constituées d'un mélange d'oligonucléotides de séquences différentes.
in scheme: Biologie
in scheme: concept-SD-biologie-genie-genetique
in scheme: concepts
notation: AGRI30

séquençage
type: ConceptConcept
type: Concept
creator: Commission d'enrichissement de la langue française, FranceTerme
source: révision de l'arrêté du 14 septembre 1990
date parution JO: 2000-09-22
equivalent EN: sequencing @en
equivalent EN: sequencing (en)
part of speech: nom masculin
definition: Détermination de l'ordre linéaire des composants d'une macromolécule.
in scheme: Biologie
in scheme: concept-SD-biologie-genie-genetique
in scheme: concepts
notation: AGRI300
note: Par exemple, les acides aminés d'une protéine, les nucléotides d'un acide nucléique, etc.

séquence amplifiée
type: ConceptConcept
type: Concept
creator: Commission d'enrichissement de la langue française, FranceTerme
source: révision de l'arrêté du 14 septembre 1990
date parution JO: 2000-09-22
equivalent EN: amplified sequence @en
equivalent EN: amplified sequence (en)
definition: Séquence d'ADN intra- ou extrachromosomique dont le nombre est augmenté par amplification.
in scheme: Biologie
in scheme: concept-SD-biologie-genie-genetique
in scheme: concepts
notation: AGRI301

séquence chevauchante
type: ConceptConcept
type: Concept
creator: Commission d'enrichissement de la langue française, FranceTerme
source: révision de l'arrêté du 14 septembre 1990
date parution JO: 2000-09-22
equivalent EN: overlapping sequence @en
equivalent EN: overlapping sequence (en)
definition: Séquence d'ADN portant l'information correspondant à plusieurs gènes utilisant un cadre de lecture différent.
in scheme: Biologie
in scheme: concept-SD-biologie-genie-genetique
in scheme: concept-SD-biologie-virologie
in scheme: concepts
notation: AGRI302
note: Cette situation se rencontre assez fréquemment dans les génomes viraux.
related: cadre de lecture

séquence codante
type: ConceptConcept
type: Concept
creator: Commission d'enrichissement de la langue française, FranceTerme
source: révision de l'arrêté du 14 septembre 1990
date parution JO: 2000-09-22
equivalent EN: coding sequence @en
equivalent EN: coding sequence (en)
definition: Partie d'un gène qui définit directement la séquence en acides aminés de la protéine correspondante.
in scheme: Biologie
in scheme: concept-SD-biologie-genie-genetique
in scheme: concepts
notation: AGRI303

séquence d'insertion
type: ConceptConcept
type: Concept
creator: Commission d'enrichissement de la langue française, FranceTerme
source: révision de l'arrêté du 14 septembre 1990
date parution JO: 2000-09-22
equivalent EN: insertion sequence @en
equivalent EN: insertion sequence (en)
definition: Élément d'ADN capable de transposition d'une région du génome à une autre.
in scheme: Biologie
in scheme: concept-SD-biologie-genie-genetique
in scheme: concepts
notation: AGRI304
note: Les séquences d'insertion portent uniquement les fonctions nécessaires à leur transposition.
related: transposition

séquence de Shine Dalgarno
type: ConceptConcept
type: Concept
creator: Commission d'enrichissement de la langue française, FranceTerme
source: révision de l'arrêté du 14 septembre 1990
date parution JO: 2000-09-22
equivalent EN: Shine Dalgarno sequence @en
equivalent EN: Shine Dalgarno sequence (en)
definition: Séquence présente sur l'ARNm des procaryotes, en amont du codon d'initiation de la traduction et qui permet l'attachement du ribosome.
in scheme: Biologie
in scheme: concept-SD-biologie-genie-genetique
in scheme: concepts
notation: AGRI305
related: ARN messager
related: codon d'initiation

séquence de tête
type: ConceptConcept
type: Concept
creator: Commission d'enrichissement de la langue française, FranceTerme
source: révision de l'arrêté du 14 septembre 1990
date parution JO: 2000-09-22
equivalent EN: leader @en
equivalent EN: leader (en)
equivalent EN: leader region @en
equivalent EN: leader region (en)
equivalent EN: leader sequence @en
equivalent EN: leader sequence (en)
definition: Séquence qui se trouve en amont du codon d'initiation de traduction des ARN messagers.
in scheme: Biologie
in scheme: concept-SD-biologie-genie-genetique
in scheme: concepts
notation: AGRI306
related: codon d'initiation

séquence fondamentale
type: ConceptConcept
type: Concept
creator: Commission d'enrichissement de la langue française, FranceTerme
source: révision de l'arrêté du 14 septembre 1990
date parution JO: 2000-09-22
deconseille ou frequent: séquence consensus
equivalent EN: consensus sequence @en
equivalent EN: consensus sequence (en)
definition: Séquence idéalisée d'une région donnée d'un acide nucléique ou d'une protéine dans laquelle chaque position représente la base ou l'acide aminé rencontré le plus fréquemment.
in scheme: Biologie
in scheme: concept-SD-biologie-genie-genetique
in scheme: concepts
notation: AGRI307
note: 1. On dit aussi « séquence consensus ».
note: 2. Elle est établie après comparaison de séquences réelles.

séquence hautement répétée
type: ConceptConcept
type: Concept
creator: Commission d'enrichissement de la langue française, FranceTerme
source: révision de l'arrêté du 14 septembre 1990
date parution JO: 2000-09-22
equivalent EN: highly repeated sequence @en
equivalent EN: highly repeated sequence (en)
definition: Séquence d'ADN présente en un grand nombre de copies dans le génome.
in scheme: Biologie
in scheme: concept-SD-biologie-genie-genetique
in scheme: concepts
notation: AGRI308

séquence non codante
type: ConceptConcept
type: Concept
creator: Commission d'enrichissement de la langue française, FranceTerme
source: révision de l'arrêté du 14 septembre 1990
date parution JO: 2000-09-22
equivalent EN: non coding sequence @en
equivalent EN: non coding sequence (en)
definition: Partie d'un gène qui ne définit pas directement la séquence en acides aminés de la protéine correspondante.
in scheme: Biologie
in scheme: concept-SD-biologie-genie-genetique
in scheme: concepts
notation: AGRI309

amorce
type: ConceptConcept
type: Concept
creator: Commission d'enrichissement de la langue française, FranceTerme
source: révision de l'arrêté du 14 septembre 1990
date parution JO: 2000-09-22
equivalent EN: primer @en
equivalent EN: primer (en)
part of speech: nom féminin
definition: Oligonucléotide qui, hybridé avec une matrice d'acide nucléique, permet à une polymérase de déclencher la synthèse du brin complémentaire.
in scheme: Biologie
in scheme: concept-SD-biologie-genie-genetique
in scheme: concepts
notation: AGRI31
related: criblage différentiel

séquence palindromique
type: ConceptConcept
type: Concept
creator: Commission d'enrichissement de la langue française, FranceTerme
source: révision de l'arrêté du 14 septembre 1990
date parution JO: 2000-09-22
equivalent EN: palindrome @en
equivalent EN: palindrome (en)
equivalent EN: palindromic sequence @en
equivalent EN: palindromic sequence (en)
alternative label: palindrome
definition: Séquence d'ADN pouvant se lire de la même façon dans les deux sens par rapport à un point central soit sur le même brin (exemple : ATTGC.CGTTA), soit sur les deux brins (AACGTT et TTGCAA).
in scheme: Biologie
in scheme: concept-SD-biologie-genie-genetique
in scheme: concepts
notation: AGRI310
note: Les séquences complémentaires reconnues par la plupart des enzymes de restriction sont palindromiques.

séquence polyA
type: ConceptConcept
type: Concept
creator: Commission d'enrichissement de la langue française, FranceTerme
source: révision de l'arrêté du 14 septembre 1990
date parution JO: 2000-09-22
deconseille ou frequent: polyadénylation
equivalent EN: polyA region @en
equivalent EN: polyA region (en)
equivalent EN: polyA tail @en
equivalent EN: polyA tail (en)
equivalent EN: polyadenylated end @en
equivalent EN: polyadenylated end (en)
alternative label: queue polyA
alternative label: région polyA
definition: Long segment d'adénosines monophosphates polymérisées présent à l'extrémité 3' des ANRm des eucaryotes.
in scheme: Biologie
in scheme: concept-SD-biologie-genie-genetique
in scheme: concepts
notation: AGRI311
note: PolyA est l'abréviation de « polyadénylation ».
related: signal de polyadénylation

séquences répétées directes
type: ConceptConcept
type: Concept
creator: Commission d'enrichissement de la langue française, FranceTerme
source: révision de l'arrêté du 14 septembre 1990
date parution JO: 2000-09-22
equivalent EN: direct repeat @en
equivalent EN: direct repeat (en)
definition: Séquences identiques ou quasi identiques, présentes en plusieurs copies dans la même molécule d'ADN et ayant la même orientation.
in scheme: Biologie
in scheme: concept-SD-biologie-genie-genetique
in scheme: concepts
notation: AGRI312

séquences répétées en tandem
type: ConceptConcept
type: Concept
creator: Commission d'enrichissement de la langue française, FranceTerme
source: révision de l'arrêté du 14 septembre 1990
date parution JO: 2000-09-22
equivalent EN: tandem repeat @en
equivalent EN: tandem repeat (en)
definition: Séquences répétées directes adjacentes.
in scheme: Biologie
in scheme: concept-SD-biologie-genie-genetique
in scheme: concepts
notation: AGRI313
related: ADN satellite
related: néocentromère

séquences répétées inverses
type: ConceptConcept
type: Concept
creator: Commission d'enrichissement de la langue française, FranceTerme
source: révision de l'arrêté du 14 septembre 1990
date parution JO: 2000-09-22
deconseille ou frequent: séquences répétées inversées
equivalent EN: inverted repeat @en
equivalent EN: inverted repeat (en)
definition: Séquences identiques ou quasi identiques, présentes en plusieurs copies dans la même molécule d'ADN et ayant une orientation inverse.
in scheme: Biologie
in scheme: concept-SD-biologie-genie-genetique
in scheme: concepts
notation: AGRI314
note: 1. La répétition inverse, qui implique donc la présence de deux séquences complémentaires sur un même brin d'acide nucléique, permet la formation d'une boucle en épingle à cheveux.
note: 2. Lorsque les deux séquences sont adjacentes, elles forment un palindrome.
note: 3. On trouve aussi le terme « séquences répétées inversées ».
related: boucle en épingle à cheveux

séquence unique
type: ConceptConcept
type: Concept
creator: Commission d'enrichissement de la langue française, FranceTerme
source: révision de l'arrêté du 14 septembre 1990
date parution JO: 2000-09-22
equivalent EN: unique sequence @en
equivalent EN: unique sequence (en)
definition: Séquence d'ADN qui n'existe qu'en un seul exemplaire dans le génome.
in scheme: Biologie
in scheme: concept-SD-biologie-genie-genetique
in scheme: concepts
notation: AGRI315

signal de polyadénylation
type: ConceptConcept
type: Concept
creator: Commission d'enrichissement de la langue française, FranceTerme
source: révision de l'arrêté du 14 septembre 1990
date parution JO: 2000-09-22
equivalent EN: polyadenylation sequence @en
equivalent EN: polyadenylation sequence (en)
equivalent EN: polyadenylation signal @en
equivalent EN: polyadenylation signal (en)
alternative label: séquence de polyadénylation
definition: Motif nucléotidique situé en aval de la partie codante d'un gène et qui définit la position où doit s'ajouter la séquence polyA sur l'ARNm.
in scheme: Biologie
in scheme: concept-SD-biologie-genie-genetique
in scheme: concepts
notation: AGRI316
related: séquence polyA

site COS
type: ConceptConcept
type: Concept
creator: Commission d'enrichissement de la langue française, FranceTerme
source: révision de l'arrêté du 14 septembre 1990
date parution JO: 2000-09-22
deconseille ou frequent: cosmide
equivalent EN: COS site @en
equivalent EN: COS site (en)
definition: Site correspondant aux extrémités cohésives du génome du phage lambda.
in scheme: Biologie
in scheme: concept-SD-biologie-genie-genetique
in scheme: concept-SD-biologie-virologie
in scheme: concepts
notation: AGRI317
note: COS est l'abréviation de « cosmide ».
related: cosmide

site d'initiation de la transcription
type: ConceptConcept
type: Concept
creator: Commission d'enrichissement de la langue française, FranceTerme
source: révision de l'arrêté du 14 septembre 1990
date parution JO: 2000-09-22
equivalent EN: transcription initiation site @en
equivalent EN: transcription initiation site (en)
definition: Point précis où commence la transcription d'un gène.
in scheme: Biologie
in scheme: concept-SD-biologie-genie-genetique
in scheme: concepts
notation: AGRI318
related: unité de transcription
related: protéine de liaison avec la boîte TATA
related: activateur
related: concept-SANT65

site de restriction
type: ConceptConcept
type: Concept
creator: Commission d'enrichissement de la langue française, FranceTerme
source: révision de l'arrêté du 14 septembre 1990
date parution JO: 2000-09-22
equivalent EN: restriction site @en
equivalent EN: restriction site (en)
definition: Séquence d'ADN, cible d'une enzyme de restriction.
in scheme: Biologie
in scheme: concept-SD-biologie-genie-genetique
in scheme: concepts
notation: AGRI319
related: restriction
related: carte de restriction
related: polymorphisme de site de restriction
related: site de polyclonage

amplificateur
type: ConceptConcept
type: Concept
creator: Commission d'enrichissement de la langue française, FranceTerme
source: révision de l'arrêté du 14 septembre 1990
date parution JO: 2000-09-22
equivalent EN: enhancer @en
equivalent EN: enhancer (en)
part of speech: nom masculin
definition: Séquence d'ADN amplifiant très fortement la transcription d'un ou plusieurs gènes situés en cis.
in scheme: Biologie
in scheme: concept-SD-biologie-genie-genetique
in scheme: concepts
notation: AGRI32
note: L'amplificateur peut agir à de longues distances du gène et dans les deux orientations.

sol hydromorphe
type: ConceptConcept
type: Concept
creator: Commission d'enrichissement de la langue française, FranceTerme
source: révision de l'arrêté du 7 avril 1987
date parution JO: 2000-09-22
equivalent EN: hydromorphic soil @en
equivalent EN: hydromorphic soil (en)
definition: Sol présentant des signes d'hydromorphie, et soumis à un excès d'eau.
in scheme: Sciences de la Terre
in scheme: concept-SD-sciences-de-la-terre-hydrogeologie
in scheme: concept-SD-sciences-de-la-terre-pedologie
in scheme: concepts
notation: AGRI320
related: hydromorphie

sonde nucléique
type: ConceptConcept
type: Concept
creator: Commission d'enrichissement de la langue française, FranceTerme
source: révision de l'arrêté du 14 septembre 1990
date parution JO: 2000-09-22
equivalent EN: nucleic probe @en
equivalent EN: nucleic probe (en)
definition: Séquence d'ADN ou d'ARN marquée (par un composé fluorescent, un radioisotope, ou une enzyme) que l'on utilise pour détecter des séquences homologues (complémentaires) par hybridation in situ ou in vitro.
in scheme: Biologie
in scheme: concept-SD-biologie-genie-genetique
in scheme: concepts
notation: AGRI321
related: hybridation sur colonie
related: fluorochrome
related: typage de l'ADN
related: criblage d'ADN
related: hybridation fluorescente in situ

sondeur de filet
type: ConceptConcept
type: Concept
creator: Commission d'enrichissement de la langue française, FranceTerme
source: révision de l'arrêté du 28 novembre 1985
date parution JO: 2000-09-22
equivalent EN: Netzsonde @de
equivalent EN: Netzsonde (de)
definition: Appareil fixé sur la partie supérieure d'un chalut, permettant d'évaluer, par ultrasons, l'ouverture verticale du chalut, sa profondeur d'immersion, et de détecter la présence de bancs de poissons dans l'ouverture du filet ou à proximité de celle-ci.
in scheme: Pêche et aquaculture
in scheme: concept-SD-peche-et-aquaculture-peche-maritime
in scheme: concepts
notation: AGRI322

suppression extragénique
type: ConceptConcept
type: Concept
creator: Commission d'enrichissement de la langue française, FranceTerme
source: révision de l'arrêté du 14 septembre 1990
date parution JO: 2000-09-22
deconseille ou frequent: suppression intergénique
equivalent EN: intergenic mutation @en
equivalent EN: intergenic mutation (en)
equivalent EN: intergenic suppression @en
equivalent EN: intergenic suppression (en)
definition: Récupération d'une fonction perdue grâce à une seconde mutation localisée sur un autre gène que la mutation initiale.
in scheme: Biologie
in scheme: concept-SD-biologie-genie-genetique
in scheme: concepts
notation: AGRI324
note: Dans cette acception, on dit aussi « suppression intergénique ».
related: mutation inverse

suppression intragénique
type: ConceptConcept
type: Concept
creator: Commission d'enrichissement de la langue française, FranceTerme
source: révision de l'arrêté du 14 septembre 1990
date parution JO: 2000-09-22
equivalent EN: intragenic suppression @en
equivalent EN: intragenic suppression (en)
definition: Effet d'une mutation de compensation à l'intérieur du gène muté, qui restaure son activité.
in scheme: Biologie
in scheme: concept-SD-biologie-genie-genetique
in scheme: concepts
notation: AGRI325
note: La seconde mutation touche le même gène que la première, mais en un site différent.
related: mutation inverse

surface d'une nappe
type: ConceptConcept
type: Concept
creator: Commission d'enrichissement de la langue française, FranceTerme
source: révision de l'arrêté du 7 avril 1987
date parution JO: 2000-09-22
equivalent EN: phreatic surface @en
equivalent EN: phreatic surface (en)
equivalent EN: water-table @en
equivalent EN: water-table (en)
alternative label: niveau de nappe
alternative label: niveau de saturation
alternative label: surface de saturation
definition: Surface de la zone saturée d'un aquifère libre ou toit d'un aquifère captif.
in scheme: Sciences de la Terre
in scheme: concept-SD-sciences-de-la-terre-hydrogeologie
in scheme: concepts
notation: AGRI326
related: zone saturée

surface libre
type: ConceptConcept
type: Concept
creator: Commission d'enrichissement de la langue française, FranceTerme
source: révision de l'arrêté du 7 avril 1987
date parution JO: 2000-09-22
equivalent EN: free surface @en
equivalent EN: free surface (en)
definition: Lieu des points d'une nappe où la pression de l'eau est égale à la pression atmosphérique.
in scheme: Sciences de la Terre
in scheme: concept-SD-sciences-de-la-terre-hydrogeologie
in scheme: concepts
notation: AGRI327

surface piézométrique
type: ConceptConcept
type: Concept
creator: Commission d'enrichissement de la langue française, FranceTerme
source: révision de l'arrêté du 7 avril 1987
date parution JO: 2000-09-22
equivalent EN: piezometric surface @en
equivalent EN: piezometric surface (en)
alternative label: surface de charge
definition: Surface idéale qui représente la distribution des charges hydrauliques d'une nappe à écoulement bidimensionnel, ou des charges rapportées à une surface ou une strate déterminée de l'aquifère en cas d'écoulement tridimensionnel.
in scheme: Sciences de la Terre
in scheme: concept-SD-sciences-de-la-terre-hydrogeologie
in scheme: concepts
notation: AGRI328
related: nappe en charge

synthétiseur d'ADN
type: ConceptConcept
type: Concept
creator: Commission d'enrichissement de la langue française, FranceTerme
source: révision de l'arrêté du 14 septembre 1990
date parution JO: 2000-09-22
equivalent EN: DNA synthetizer @en
equivalent EN: DNA synthetizer (en)
definition: Appareil permettant la synthèse de polydésoxynucléotides par additions successives de désoxynucléotides sur une chaîne en croissance.
in scheme: Biologie
in scheme: concept-SD-biologie-genie-genetique
in scheme: concepts
notation: AGRI329

amplification de gène
type: ConceptConcept
type: Concept
creator: Commission d'enrichissement de la langue française, FranceTerme
source: révision de l'arrêté du 14 septembre 1990
date parution JO: 2000-09-22
equivalent EN: gene amplification @en
equivalent EN: gene amplification (en)
definition: Production in vivo de copies supplémentaires d'une séquence d'ADN ou d'une séquence extrachromosomique.
in scheme: Biologie
in scheme: concept-SD-biologie-genie-genetique
in scheme: concepts
notation: AGRI33

température de fusion
type: ConceptConcept
type: Concept
creator: Commission d'enrichissement de la langue française, FranceTerme
source: révision de l'arrêté du 14 septembre 1990
date parution JO: 2000-09-22
equivalent EN: melting temperature @en
equivalent EN: melting temperature (en)
definition: Température moyenne à laquelle 50 % de l'ADN double brin est dissocié.
in scheme: Biologie
in scheme: concept-SD-biologie-genie-genetique
in scheme: concepts
notation: AGRI330
note: Cette température dépend du pourcentage de GC (guanine, cytosine) et de la composition du milieu.
related: dénaturation d'acide nucléique

thérapie génique
type: ConceptConcept
type: Concept
creator: Commission d'enrichissement de la langue française, FranceTerme
source: révision de l'arrêté du 14 septembre 1990
date parution JO: 2000-09-22
equivalent EN: gene therapy @en
equivalent EN: gene therapy (en)
definition: Opération conduisant à l'addition d'un gène dans des cellules non germinales d'un organisme.
in scheme: Biologie
in scheme: concept-SD-biologie-genie-genetique
in scheme: concepts
notation: AGRI331

tirant d'eau
type: ConceptConcept
type: Concept
creator: Commission d'enrichissement de la langue française, FranceTerme
source: révision de l'arrêté du 7 avril 1987
date parution JO: 2000-09-22
equivalent EN: flow depth @en
equivalent EN: flow depth (en)
definition: Profondeur d'un écoulement à surface libre.
in scheme: Hydraulique
in scheme: concepts
notation: AGRI332
related: tirant d'eau critique

tirant d'eau critique
type: ConceptConcept
type: Concept
creator: Commission d'enrichissement de la langue française, FranceTerme
source: révision de l'arrêté du 7 avril 1987
date parution JO: 2000-09-22
equivalent EN: critical flow depth @en
equivalent EN: critical flow depth (en)
definition: Pour un écoulement à surface libre, tirant d'eau pour lequel l'énergie spécifique à débit donné est minimale.
in scheme: Hydraulique
in scheme: concepts
notation: AGRI333
related: tirant d'eau
related: vitesse critique

traduction ininterrompue
type: ConceptConcept
type: Concept
creator: Commission d'enrichissement de la langue française, FranceTerme
source: révision de l'arrêté du 14 septembre 1990
date parution JO: 2000-09-22
equivalent EN: readthrough translation @en
equivalent EN: readthrough translation (en)
equivalent EN: translational readthrough @en
equivalent EN: translational readthrough (en)
definition: Traduction d'un ARNm au-delà du codon normal de terminaison.
in scheme: Biologie
in scheme: concept-SD-biologie-genie-genetique
in scheme: concepts
notation: AGRI334
related: ARN messager
related: codon d'arrêt

transcription ininterrompue
type: ConceptConcept
type: Concept
creator: Commission d'enrichissement de la langue française, FranceTerme
source: révision de l'arrêté du 14 septembre 1990
date parution JO: 2000-09-22
equivalent EN: readthrough transcription @en
equivalent EN: readthrough transcription (en)
equivalent EN: transcriptional readthrough @en
equivalent EN: transcriptional readthrough (en)
definition: Transcription d'un ADN au-delà d'un facteur de terminaison de transcription.
in scheme: Biologie
in scheme: concept-SD-biologie-genie-genetique
in scheme: concepts
notation: AGRI335
related: facteur d'antiterminaison
related: facteur de terminaison

transfection
type: ConceptConcept
type: Concept
creator: Commission d'enrichissement de la langue française, FranceTerme
source: révision de l'arrêté du 14 septembre 1990
date parution JO: 2000-09-22
equivalent EN: transfection @en
equivalent EN: transfection (en)
part of speech: nom féminin
definition: Introduction de matériel génétique viral dans une cellule ; par extension, introduction de tout matériel génétique étranger dans la cellule rendue compétente.
in scheme: Biologie
in scheme: concept-SD-biologie-genie-genetique
in scheme: concept-SD-biologie-virologie
in scheme: concepts
notation: AGRI336
related: transfert de gènes

transférase terminale
type: ConceptConcept
type: Concept
creator: Commission d'enrichissement de la langue française, FranceTerme
source: révision de l'arrêté du 14 septembre 1990
date parution JO: 2000-09-22
deconseille ou frequent: terminale transférase
equivalent EN: terminal transferase @en
equivalent EN: terminal transferase (en)
definition: Enzyme capable d'ajouter un désoxynucléotide dans la partie 3'OH d'un brin d'ADN.
in scheme: Biologie
in scheme: concept-SD-biologie-genie-genetique
in scheme: concepts
notation: AGRI337
note: Le terme « terminale transférase » ne doit pas être utilisé en français.

transfert d'ADN
type: ConceptConcept
type: Concept
creator: Commission d'enrichissement de la langue française, FranceTerme
source: révision de l'arrêté du 14 septembre 1990
date parution JO: 2000-09-22
equivalent EN: Southern blotting @en
equivalent EN: Southern blotting (en)
forme abregee: Southern, n.m.
alternative label: technique de Southern
alternative label: transfert de Southern
definition: Transfert d'ADN dénaturé, depuis un gel (agarose par exemple) sur une membrane (nitrocellulose par exemple), où il peut être hybridé avec un acide nucléique complémentaire.
in scheme: Biologie
in scheme: concept-SD-biologie-genie-genetique
in scheme: concepts
notation: AGRI338
note: Southern est le nom du chercheur qui a mis au point cette technique.
related: transfert de protéines
related: transfert d'ARN

transfert d'ARN
type: ConceptConcept
type: Concept
creator: Commission d'enrichissement de la langue française, FranceTerme
source: révision de l'arrêté du 14 septembre 1990
date parution JO: 2000-09-22
equivalent EN: Northern blotting @en
equivalent EN: Northern blotting (en)
forme abregee: Northern, n.m.
alternative label: technique de Northern
alternative label: transfert de Northern
definition: Transfert d'ARN, depuis un gel (agarose par exemple) sur une membrane (nitrocellulose par exemple), où il peut être hybridé avec un acide nucléique complémentaire.
in scheme: Biologie
in scheme: concept-SD-biologie-genie-genetique
in scheme: concepts
notation: AGRI339
note: Le terme « technique de Northern » repose sur un jeu de mots analogique avec le terme « technique de Southern », formé à partir du nom de l'inventeur de cette technique.
related: transfert de protéines
related: transfert d'ADN

transfert de gènes
type: ConceptConcept
type: Concept
creator: Commission d'enrichissement de la langue française, FranceTerme
source: révision de l'arrêté du 14 septembre 1990
date parution JO: 2000-09-22
equivalent EN: gene transfer @en
equivalent EN: gene transfer (en)
definition: Introduction d'ADN étranger dans une cellule.
in scheme: Biologie
in scheme: concept-SD-biologie-genie-genetique
in scheme: concepts
notation: AGRI340
related: transfection
related: transgénèse

transfert de plages
type: ConceptConcept
type: Concept
creator: Commission d'enrichissement de la langue française, FranceTerme
source: révision de l'arrêté du 14 septembre 1990
date parution JO: 2000-09-22
equivalent EN: plaque lift @en
equivalent EN: plaque lift (en)
definition: Transfert de phages présents dans des plages de lyse d'une boîte de Petri sur un filtre avant de procéder à une hybridation moléculaire de leur matériel génétique.
in scheme: Biologie
in scheme: concept-SD-biologie-genie-genetique
in scheme: concepts
notation: AGRI341
related: hybridation sur plages
related: plage de lyse

transformation génétique
type: ConceptConcept
type: Concept
creator: Commission d'enrichissement de la langue française, FranceTerme
source: révision de l'arrêté du 14 septembre 1990
date parution JO: 2000-09-22
equivalent EN: genetic transformation @en
equivalent EN: genetic transformation (en)
definition: Modification du patrimoine génétique d'une cellule par introduction d'une information génétique étrangère.
in scheme: Biologie
in scheme: concept-SD-biologie-genie-genetique
in scheme: concepts
notation: AGRI342

transformation tumorale
type: ConceptConcept
type: Concept
creator: Commission d'enrichissement de la langue française, FranceTerme
source: révision de l'arrêté du 14 septembre 1990
date parution JO: 2000-09-22
equivalent EN: tumoral transformation @en
equivalent EN: tumoral transformation (en)
definition: Acquisition spontanée ou induite de nouvelles caractéristiques de croissance d'une cellule d'eucaryote, lui permettant une prolifération anarchique généralement due à l'expression d'oncogènes.
in scheme: Biologie
in scheme: concept-SD-biologie-genie-genetique
in scheme: concepts
notation: AGRI343
related: oncogène

transformé, -e
type: ConceptConcept
type: Concept
creator: Commission d'enrichissement de la langue française, FranceTerme
source: révision de l'arrêté du 14 septembre 1990
date parution JO: 2000-09-22
equivalent EN: transformed @en
equivalent EN: transformed (en)
part of speech: adjectif
definition: Qualifie un organisme issu d'une transformation génétique.
in scheme: Biologie
in scheme: concept-SD-biologie-genie-genetique
in scheme: concepts
notation: AGRI344

transgénèse
type: ConceptConcept
type: Concept
creator: Commission d'enrichissement de la langue française, FranceTerme
source: révision de l'arrêté du 14 septembre 1990
date parution JO: 2000-09-22
equivalent EN: transgenesis @en
equivalent EN: transgenesis (en)
part of speech: nom féminin
definition: Ensemble des opérations qui consistent à obtenir des organismes transgéniques.
in scheme: Biologie
in scheme: concept-SD-biologie-genie-genetique
in scheme: concepts
notation: AGRI345
related: transfert de gènes
related: cellule souche pluripotente induite
related: subtilisine
related: gène rapporteur

transgénique
type: ConceptConcept
type: Concept
creator: Commission d'enrichissement de la langue française, FranceTerme
source: révision de l'arrêté du 14 septembre 1990
date parution JO: 2000-09-22
equivalent EN: transgenic @en
equivalent EN: transgenic (en)
part of speech: adjectif
definition: Qualifie un être vivant issu d'une cellule dans laquelle a été introduit un ADN étranger.
in scheme: Biologie
in scheme: concept-SD-biologie-genie-genetique
in scheme: concepts
notation: AGRI346
note: L'organisme transgénique possède dans la majorité ou dans toutes ses cellules l'ADN étranger introduit. Le gène étranger peut donc se transmettre à la descendance.

translation de coupure
type: ConceptConcept
type: Concept
creator: Commission d'enrichissement de la langue française, FranceTerme
source: révision de l'arrêté du 14 septembre 1990
date parution JO: 2000-09-22
equivalent EN: nick translation @en
equivalent EN: nick translation (en)
alternative label: translation de brèche
alternative label: translation de cassure
alternative label: translation de césure
definition: Opération consistant à utiliser une coupure comme point de départ pour le remplacement d'un brin d'ADN par un brin néosynthétisé.
in scheme: Biologie
in scheme: concept-SD-biologie-genie-genetique
in scheme: concepts
notation: AGRI347
note: Cette technique est utilisée pour introduire in vitro des nucléotides marqués dans l'ADN.

translocation
type: ConceptConcept
type: Concept
creator: Commission d'enrichissement de la langue française, FranceTerme
source: révision de l'arrêté du 14 septembre 1990
date parution JO: 2000-09-22
equivalent EN: translocation @en
equivalent EN: translocation (en)
part of speech: nom féminin
definition: Clivage d'un segment de génome suivi de son intégration en un autre site.
in scheme: Biologie
in scheme: concept-SD-biologie-genie-genetique
in scheme: concepts
notation: AGRI348
related: proto-oncogène

transposase
type: ConceptConcept
type: Concept
creator: Commission d'enrichissement de la langue française, FranceTerme
source: révision de l'arrêté du 14 septembre 1990
date parution JO: 2000-09-22
equivalent EN: transposase @en
equivalent EN: transposase (en)
part of speech: nom féminin
definition: Enzyme codée par un gène porté par un élément transposable et qui permet la transposition.
in scheme: Biologie
in scheme: concept-SD-biologie-genie-genetique
in scheme: concepts
notation: AGRI349

anticodon
type: ConceptConcept
type: Concept
creator: Commission d'enrichissement de la langue française, FranceTerme
source: révision de l'arrêté du 14 septembre 1990
date parution JO: 2000-09-22
equivalent EN: anticodon @en
equivalent EN: anticodon (en)
part of speech: nom masculin
definition: Triplet de nucléotides de l'ARNt lui permettant de former des liaisons avec le codon correspondant d'une molécule d'ARNm.
in scheme: Biologie
in scheme: concept-SD-biologie-genie-genetique
in scheme: concepts
notation: AGRI35
related: ARN messager

transposition
type: ConceptConcept
type: Concept
creator: Commission d'enrichissement de la langue française, FranceTerme
source: révision de l'arrêté du 14 septembre 1990
date parution JO: 2000-09-22
equivalent EN: transposition @en
equivalent EN: transposition (en)
part of speech: nom féminin
definition: Changement de la localisation d'un fragment d'ADN sur le génome.
in scheme: Biologie
in scheme: concept-SD-biologie-genie-genetique
in scheme: concepts
notation: AGRI350
related: séquence d'insertion

transversion
type: ConceptConcept
type: Concept
creator: Commission d'enrichissement de la langue française, FranceTerme
source: révision de l'arrêté du 14 septembre 1990
date parution JO: 2000-09-22
equivalent EN: transversion @en
equivalent EN: transversion (en)
part of speech: nom féminin
definition: Mutation au cours de laquelle une base purique est remplacée par une base pyrimidique, ou vice versa.
in scheme: Biologie
in scheme: concept-SD-biologie-genie-genetique
in scheme: concepts
notation: AGRI351

trieur de cellules
type: ConceptConcept
type: Concept
creator: Commission d'enrichissement de la langue française, FranceTerme
source: révision de l'arrêté du 14 septembre 1990
date parution JO: 2000-09-22
equivalent EN: cell sorter @en
equivalent EN: cell sorter (en)
definition: Appareil permettant de trier différents types de cellules ou par extension des particules subcellulaires.
in scheme: Biologie
in scheme: concept-SD-biologie-genie-genetique
in scheme: concepts
notation: AGRI352

unité de répétition
type: ConceptConcept
type: Concept
creator: Commission d'enrichissement de la langue française, FranceTerme
source: révision de l'arrêté du 14 septembre 1990
date parution JO: 2000-09-22
equivalent EN: repeat unit @en
equivalent EN: repeat unit (en)
definition: Séquence d'ADN constituant le motif de base dans une région répétée.
in scheme: Biologie
in scheme: concept-SD-biologie-genie-genetique
in scheme: concepts
notation: AGRI353

unité de transcription
type: ConceptConcept
type: Concept
creator: Commission d'enrichissement de la langue française, FranceTerme
source: révision de l'arrêté du 14 septembre 1990
date parution JO: 2000-09-22
equivalent EN: transcription unit @en
equivalent EN: transcription unit (en)
definition: Région du génome située entre un site d'initiation et un site de terminaison de la transcription par l'ARN polymérase.
in scheme: Biologie
in scheme: concept-SD-biologie-genie-genetique
in scheme: concepts
notation: AGRI354
note: L'unité de transcription peut inclure plus d'un cistron.
related: site d'initiation de la transcription
related: cistron

vecteur
type: ConceptConcept
type: Concept
creator: Commission d'enrichissement de la langue française, FranceTerme
source: révision de l'arrêté du 14 septembre 1990
date parution JO: 2000-09-22
equivalent EN: vector @en
equivalent EN: vector (en)
part of speech: nom masculin
definition: Molécule d'acide nucléique dans laquelle il est possible d'insérer des fragments d'acide nucléique étranger, pour ensuite les introduire et les maintenir dans une cellule hôte.
in scheme: Biologie
in scheme: concept-SD-biologie-genie-genetique
in scheme: concepts
notation: AGRI355
note: Par exemple, le bactériophage lambda et les plasmides sont des vecteurs utilisés pour cloner des fragments d'ADN.
related: phagémide
related: site de polyclonage
related: banque d'ADN complémentaire
related: banque d'expression
related: banque génomique
related: chromosome artificiel de bactérie
related: chromosome artificiel de levure

vecteur d'expression
type: ConceptConcept
type: Concept
creator: Commission d'enrichissement de la langue française, FranceTerme
source: révision de l'arrêté du 14 septembre 1990
date parution JO: 2000-09-22
equivalent EN: expression vector @en
equivalent EN: expression vector (en)
definition: Vecteur possédant une région permettant l'insertion d'une séquence codante d'un gène entre les signaux indispensables à son expression.
in scheme: Biologie
in scheme: concept-SD-biologie-genie-genetique
in scheme: concepts
notation: AGRI356

vecteur navette
type: ConceptConcept
type: Concept
creator: Commission d'enrichissement de la langue française, FranceTerme
source: révision de l'arrêté du 14 septembre 1990
date parution JO: 2000-09-22
equivalent EN: shuttle vector @en
equivalent EN: shuttle vector (en)
definition: Vecteur capable de se répliquer dans au moins deux organismes différents grâce à des origines de réplication appropriées.
in scheme: Biologie
in scheme: concept-SD-biologie-genie-genetique
in scheme: concepts
notation: AGRI357
related: origine de réplication

virus assistant
type: ConceptConcept
type: Concept
creator: Commission d'enrichissement de la langue française, FranceTerme
source: révision de l'arrêté du 14 septembre 1990
date parution JO: 2000-09-22
equivalent EN: helper virus @en
equivalent EN: helper virus (en)
definition: Virus qui assure les fonctions manquantes d'un virus défectif, pour lui permettre de terminer son cycle infectieux au cours d'une infection mixte.
in scheme: Biologie
in scheme: concept-SD-biologie-genie-genetique
in scheme: concept-SD-biologie-virologie
in scheme: concepts
notation: AGRI358

vitesse critique
type: ConceptConcept
type: Concept
creator: Commission d'enrichissement de la langue française, FranceTerme
source: révision de l'arrêté du 7 avril 1987
date parution JO: 2000-09-22
equivalent EN: critical velocity @en
equivalent EN: critical velocity (en)
definition: Vitesse pour laquelle à débit donné, l'écoulement, dans un écoulement à surface libre, passe de l'écoulement fluvial à l'écoulement torrentiel.
in scheme: Hydraulique
in scheme: concepts
notation: AGRI359
related: tirant d'eau critique

anticorps monoclonal
type: ConceptConcept
type: Concept
creator: Commission d'enrichissement de la langue française, FranceTerme
source: révision de l'arrêté du 14 septembre 1990
date parution JO: 2000-09-22
equivalent EN: monoclonal antibody @en
equivalent EN: monoclonal antibody (en)
definition: Anticorps homogène produit par un clone de lymphocytes B descendant d'une seule et unique cellule mère et ne détectant généralement qu'un seul déterminant antigénique.
in scheme: Biologie
in scheme: concept-SD-biologie-genie-genetique
in scheme: concepts
notation: AGRI36
note: On produit les anticorps monoclonaux en grand nombre grâce aux hybridomes.
related: hybridome

vitesse de filtration
type: ConceptConcept
type: Concept
creator: Commission d'enrichissement de la langue française, FranceTerme
source: révision de l'arrêté du 7 avril 1987
date parution JO: 2000-09-22
equivalent EN: Darcy's velocity @en
equivalent EN: Darcy's velocity (en)
equivalent EN: macroscopic velocity @en
equivalent EN: macroscopic velocity (en)
alternative label: vitesse de Darcy
definition: Vitesse macroscopique fictive d'un fluide en mouvement à travers un milieu poreux saturé.
in scheme: Hydraulique
in scheme: Sciences de la Terre
in scheme: concept-SD-hydraulique-hydrogeologie
in scheme: concept-SD-sciences-de-la-terre-hydrogeologie
in scheme: concepts
notation: AGRI360
related: conductivité hydraulique

vitesse d'infiltration
type: ConceptConcept
type: Concept
creator: Commission d'enrichissement de la langue française, FranceTerme
source: révision de l'arrêté du 7 avril 1987
date parution JO: 2000-09-22
equivalent EN: infiltration rate @en
equivalent EN: infiltration rate (en)
definition: Vitesse macroscopique de pénétration d'une eau dans un sol généralement non saturé.
in scheme: Hydraulique
in scheme: concepts
notation: AGRI361

zone non saturée
type: ConceptConcept
type: Concept
creator: Commission d'enrichissement de la langue française, FranceTerme
source: révision de l'arrêté du 7 avril 1987
antonym: zone saturée
date parution JO: 2000-09-22
deconseille ou frequent: zone de rétention
equivalent EN: unsatured zone @en
equivalent EN: unsatured zone (en)
alternative label: zone aérée
definition: Zone du sol dans laquelle l'eau n'occupe pas complètement la porosité totale des roches ou du sol.
in scheme: Hydraulique
in scheme: Sciences de la Terre
in scheme: concept-SD-hydraulique-physique-du-sol
in scheme: concept-SD-sciences-de-la-terre-physique-du-sol
in scheme: concepts
notation: AGRI362
note: Le terme « zone de rétention » est parfois utilisé comme synonyme de « zone non saturée ».

zone saturée
type: ConceptConcept
type: Concept
creator: Commission d'enrichissement de la langue française, FranceTerme
source: révision de l'arrêté du 7 avril 1987
antonym: zone non saturée
date parution JO: 2000-09-22
equivalent EN: saturated zone @en
equivalent EN: saturated zone (en)
alternative label: zone d'accumulation
alternative label: zone de saturation
alternative label: zone noyée
definition: Zone du sol dans laquelle l'eau occupe complètement la porosité totale des roches ou du sol.
in scheme: Hydraulique
in scheme: Sciences de la Terre
in scheme: concept-SD-hydraulique-physique-du-sol
in scheme: concept-SD-sciences-de-la-terre-physique-du-sol
in scheme: concepts
notation: AGRI363
related: nappe
related: nappe en charge
related: recharge
related: surface d'une nappe
related: aquifère

aquifère
type: ConceptConcept
type: Concept
creator: Commission d'enrichissement de la langue française, FranceTerme
source: révision de l'arrêté du 7 avril 1987
date parution JO: 2000-09-22
equivalent EN: aquifer @en
equivalent EN: aquifer (en)
part of speech: adjectif
definition: Qui contient de l'eau en partie mobilisable par gravité.
in scheme: Sciences de la Terre
in scheme: concept-SD-sciences-de-la-terre-hydrologie
in scheme: concepts
notation: AGRI37
note: Ce terme ne doit pas être employé dans le sens impropre de « relatif à l'eau ».

aquifère
type: ConceptConcept
type: Concept
creator: Commission d'enrichissement de la langue française, FranceTerme
source: révision de l'arrêté du 7 avril 1987
date parution JO: 2000-09-22
equivalent EN: water-bearing layer @en
equivalent EN: water-bearing layer (en)
part of speech: nom masculin
definition: Couche ou massif solide, perméable, poreux, comportant une zone saturée, suffisamment conducteur d'eau souterraine pour permettre l'écoulement significatif d'une nappe souterraine et le captage de quantités d'eau appréciables.
in scheme: Sciences de la Terre
in scheme: concept-SD-sciences-de-la-terre-hydrologie
in scheme: concepts
notation: AGRI38
note: Ce terme ne doit pas être employé dans le sens impropre d' « eau souterraine ».
related: nappe
related: zone saturée

assainissement agricole
type: ConceptConcept
type: Concept
creator: Commission d'enrichissement de la langue française, FranceTerme
source: révision de l'arrêté du 7 avril 1987
date parution JO: 2000-09-22
equivalent EN: arterial drainage @en
equivalent EN: arterial drainage (en)
definition: Évacuation des eaux, regroupées naturellement ou à la suite du drainage, jusqu'au réseau hydrographique naturel.
in scheme: Hydraulique
in scheme: concept-SD-hydraulique-drainage-agricole
in scheme: concepts
notation: AGRI39
note: Ce terme n'est pas synonyme de « drainage ».

ADN complémentaire
type: ConceptConcept
type: Concept
creator: Commission d'enrichissement de la langue française, FranceTerme
source: révision de l'arrêté du 14 septembre 1990
abbreviation: ADNc
abbreviation: cDNA @en
date parution JO: 2000-09-22
equivalent EN: cDNA @en
equivalent EN: cDNA (en)
equivalent EN: complementary DNA @en
equivalent EN: complementary DNA (en)
definition: ADN simple brin, qui est une copie d'un ARN obtenu par une transcription inverse.
in scheme: Biologie
in scheme: concept-SD-biologie-genie-genetique
in scheme: concepts
notation: AGRI4
note: L'ADNc double brin résulte de la copie du premier brin par une ADN polymérase.
related: analyse en série de l'expression des gènes
related: étiquette de séquence transcrite
related: ADN polymérase
related: criblage différentiel
related: amplification rapide d'extrémités d'ADNc
related: banque d'ADN complémentaire

atténuateur
type: ConceptConcept
type: Concept
creator: Commission d'enrichissement de la langue française, FranceTerme
source: révision de l'arrêté du 14 septembre 1990
date parution JO: 2000-09-22
equivalent EN: attenuator @en
equivalent EN: attenuator (en)
part of speech: nom masculin
definition: Séquence de l'ADN sur laquelle porte l'atténuation.
in scheme: Biologie
in scheme: concept-SD-biologie-bacteriologie
in scheme: concept-SD-biologie-genie-genetique
in scheme: concepts
notation: AGRI40
related: atténuation

atténuation
type: ConceptConcept
type: Concept
creator: Commission d'enrichissement de la langue française, FranceTerme
source: révision de l'arrêté du 14 septembre 1990
date parution JO: 2000-09-22
equivalent EN: attenuation @en
equivalent EN: attenuation (en)
part of speech: nom féminin
definition: Système de contrôle de l'expression génique consistant en une interruption prématurée de la transcription d'un opéron de biosynthèse.
in scheme: Biologie
in scheme: concept-SD-biologie-bacteriologie
in scheme: concept-SD-biologie-genie-genetique
in scheme: concepts
notation: AGRI41
note: L'atténuation a lieu en un site appelé « atténuateur » et aboutit à la formation d'ARN messagers incomplets.
related: opéron
related: atténuateur

autoconsommation
type: ConceptConcept
type: Concept
creator: Commission d'enrichissement de la langue française, FranceTerme
source: révision de l'arrêté du 20 septembre 1993
date parution JO: 2000-09-22
equivalent EN: home consumption @en
equivalent EN: home consumption (en)
equivalent EN: self-consuming @en
equivalent EN: self-consuming (en)
part of speech: nom féminin
definition: Consommation de biens ou de services par celui qui les produit.
definition: Consumption of goods or services by the person who produces them. @en
in scheme: Agriculture
in scheme: Économie générale
in scheme: concept-SD-agriculture-economie-agricole
in scheme: concept-SD-economie-generale-economie-agricole
in scheme: concepts
notation: AGRI42
preferred label: home consumption @en

autofourniture
type: ConceptConcept
type: Concept
creator: Commission d'enrichissement de la langue française, FranceTerme
source: révision de l'arrêté du 20 septembre 1993
date parution JO: 2000-09-22
part of speech: nom féminin
definition: Utilisation dans une exploitation de certains de ses produits comme moyens de production.
in scheme: Agriculture
in scheme: concept-SD-agriculture-economie-agricole
in scheme: concepts
notation: AGRI43

bactérie lysogène
type: ConceptConcept
type: Concept
creator: Commission d'enrichissement de la langue française, FranceTerme
source: révision de l'arrêté du 14 septembre 1990
date parution JO: 2000-09-22
equivalent EN: lysogen @en
equivalent EN: lysogen (en)
equivalent EN: lysogenic bacteria @en
equivalent EN: lysogenic bacteria (en)
definition: Bactérie portant un phage tempéré.
in scheme: Biologie
in scheme: concept-SD-biologie-genie-genetique
in scheme: concept-SD-biologie-virologie
in scheme: concepts
notation: AGRI45
note: 1. L'induction du phage tempéré peut conduire à la lyse de la bactérie lysogène.
note: 2. Une bactérie lysogène peut produire des phages en dehors de toute nouvelle infection phagique.
related: lysogénie
related: phage tempéré

bactériophage
type: ConceptConcept
type: Concept
creator: Commission d'enrichissement de la langue française, FranceTerme
source: révision de l'arrêté du 14 septembre 1990
date parution JO: 2000-09-22
equivalent EN: bacteriophage @en
equivalent EN: bacteriophage (en)
forme abregee: phage, n.m.
part of speech: nom masculin
definition: Virus capable d'infecter une bactérie, de s'y multiplier et généralement de la lyser.
in scheme: Biologie
in scheme: concept-SD-biologie-genie-genetique
in scheme: concept-SD-biologie-virologie
in scheme: concepts
notation: AGRI46
related: cosmide
related: phage défectif
related: phagémide
related: banque d'ADN complémentaire
related: banque génomique
related: concept-SANT230
related: concept-SANT235

bail à cheptel
type: ConceptConcept
type: Concept
creator: Commission d'enrichissement de la langue française, FranceTerme
source: révision de l'arrêté du 20 septembre 1993
date parution JO: 2000-09-22
equivalent EN: livestock lease @en
equivalent EN: livestock lease (en)
definition: Mode de faire-valoir dans lequel un agriculteur s'associe à une personne qui possède des animaux pour les élever.
in scheme: Agriculture
in scheme: concepts
notation: AGRI47
note: Les produits en résultant sont partagés selon les modalités d'un contrat.

batterie de gènes
type: ConceptConcept
type: Concept
creator: Commission d'enrichissement de la langue française, FranceTerme
source: révision de l'arrêté du 14 septembre 1990
date parution JO: 2000-09-22
equivalent EN: gene cluster @en
equivalent EN: gene cluster (en)
definition: Groupe de gènes situés sur un même chromosome et codant des protéines ayant des structures voisines.
in scheme: Biologie
in scheme: concept-SD-biologie-genie-genetique
in scheme: concepts
notation: AGRI49

ADN en zigzag
type: ConceptConcept
type: Concept
creator: Commission d'enrichissement de la langue française, FranceTerme
source: révision de l'arrêté du 14 septembre 1990
abbreviation: ADNz
abbreviation: Z-DNA @en
date parution JO: 2000-09-22
equivalent EN: Z-DNA @en
equivalent EN: Z-DNA (en)
equivalent EN: zig-zag DNA @en
equivalent EN: zig-zag DNA (en)
definition: Duplex d'ADN dans lequel la double hélice est enroulée par la gauche au lieu de la droite.
in scheme: Biologie
in scheme: concept-SD-biologie-genie-genetique
in scheme: concepts
notation: AGRI5
note: 1. L'ADN adopte une configuration en zigzag quand les purines et les pyrimidines alternent sur le même brin.
note: 2. L'ADN en zigzag existe dans les chromosomes d'eucaryotes, mais sa fonction n'est pas encore connue.

boucle
type: ConceptConcept
type: Concept
creator: Commission d'enrichissement de la langue française, FranceTerme
source: révision de l'arrêté du 14 septembre 1990
date parution JO: 2000-09-22
equivalent EN: loop @en
equivalent EN: loop (en)
part of speech: nom féminin
definition: Séquence simple brin, repliée en épingle à cheveux, à l'extrémité d'un acide nucléique, par exemple dans un ARNt.
in scheme: Biologie
in scheme: concept-SD-biologie-genie-genetique
in scheme: concepts
notation: AGRI50
related: boucle
related: boucle en épingle à cheveux

boucle D
type: ConceptConcept
type: Concept
creator: Commission d'enrichissement de la langue française, FranceTerme
source: révision de l'arrêté du 14 septembre 1990
date parution JO: 2000-09-22
deconseille ou frequent: boucle désoxyribonucléique
equivalent EN: D loop @en
equivalent EN: D loop (en)
definition: Boucle d'ADN simple brin au sein d'une chaîne d'ADN en double brin.
in scheme: Biologie
in scheme: concept-SD-biologie-genie-genetique
in scheme: concepts
notation: AGRI51
note: D est l'initiale de « désoxyribonucléique ».

boucle en épingle à cheveux
type: ConceptConcept
type: Concept
creator: Commission d'enrichissement de la langue française, FranceTerme
source: révision de l'arrêté du 14 septembre 1990
date parution JO: 2000-09-22
equivalent EN: hairpin loop @en
equivalent EN: hairpin loop (en)
forme abregee: épingle à cheveux
alternative label: structure en épingle à cheveux
definition: Structure formée par l'appariement de deux régions complémentaires d'un même brin d'acide nucléique séparées par une courte boucle simple brin.
in scheme: Biologie
in scheme: concept-SD-biologie-genie-genetique
in scheme: concepts
notation: AGRI52
related: séquences répétées inverses
related: boucle
related: précurseur de micro-ARN

boucle R
type: ConceptConcept
type: Concept
creator: Commission d'enrichissement de la langue française, FranceTerme
source: révision de l'arrêté du 14 septembre 1990
date parution JO: 2000-09-22
deconseille ou frequent: boucle ribonucléique
equivalent EN: R loop @en
equivalent EN: R loop (en)
definition: Boucle d'ADN simple brin formée d'une hybridation avec un ARN.
in scheme: Biologie
in scheme: concept-SD-biologie-genie-genetique
in scheme: concepts
notation: AGRI53
note: R est l'initiale de « ribonucléique ».

brèche
type: ConceptConcept
type: Concept
creator: Commission d'enrichissement de la langue française, FranceTerme
source: révision de l'arrêté du 14 septembre 1990
date parution JO: 2000-09-22
equivalent EN: gap @en
equivalent EN: gap (en)
part of speech: nom féminin
alternative label: espace vide
definition: Absence d'un ou plusieurs nucléotides dans un des deux brins de l'ADN.
in scheme: Biologie
in scheme: concept-SD-biologie-genie-genetique
in scheme: concepts
notation: AGRI54

brin antisens
type: ConceptConcept
type: Concept
creator: Commission d'enrichissement de la langue française, FranceTerme
source: révision de l'arrêté du 14 septembre 1990
date parution JO: 2000-09-22
deconseille ou frequent: brin non codant
equivalent EN: antisense strand @en
equivalent EN: antisense strand (en)
equivalent EN: non coding strand @en
equivalent EN: non coding strand (en)
definition: Brin d'acide nucléique qui sert de matrice à une ARN polymérase pour la synthèse d'un ARN dont la séquence est complémentaire de celle de l'ARN portant l'information génétique.
in scheme: Biologie
in scheme: concept-SD-biologie-genie-genetique
in scheme: concepts
notation: AGRI55
note: Il est préférable d'éviter l'emploi du terme « brin non codant » qui peut prêter à confusion.
related: ARN polymérase

brin sens
type: ConceptConcept
type: Concept
creator: Commission d'enrichissement de la langue française, FranceTerme
source: révision de l'arrêté du 14 septembre 1990
date parution JO: 2000-09-22
deconseille ou frequent: brin codant
equivalent EN: coding strand @en
equivalent EN: coding strand (en)
equivalent EN: sense strand @en
equivalent EN: sense strand (en)
definition: Brin d'acide nucléique dont la séquence est semblable à celle de l'ARN formé lors de la transcription, l'uracile de l'ARN correspondant à la thymine de l'ADN.
in scheme: Biologie
in scheme: concept-SD-biologie-genie-genetique
in scheme: concepts
notation: AGRI56
note: Il est préférable d'éviter l'emploi du terme « brin codant » qui peut prêter à confusion.

cadre de lecture
type: ConceptConcept
type: Concept
creator: Commission d'enrichissement de la langue française, FranceTerme
source: révision de l'arrêté du 14 septembre 1990
date parution JO: 2000-09-22
equivalent EN: reading frame @en
equivalent EN: reading frame (en)
definition: Ordonnancement des nucléotides en codon.
in scheme: Biologie
in scheme: concept-SD-biologie-genie-genetique
in scheme: concepts
notation: AGRI57
note: Le cadre de lecture définit quel ensemble de trois nucléotides est lu comme codon. Il est déterminé par le codon d'initiation AUG et par le codon d'arrêt.
related: décalage du cadre de lecture
related: fusion traductionnelle
related: mutation ponctuelle
related: séquence chevauchante
related: cadre ouvert de lecture
related: codon d'arrêt
related: codon d'initiation

cadre ouvert de lecture
type: ConceptConcept
type: Concept
creator: Commission d'enrichissement de la langue française, FranceTerme
source: révision de l'arrêté du 14 septembre 1990
abbreviation: ORF @en
date parution JO: 2000-09-22
equivalent EN: ORF @en
equivalent EN: ORF (en)
equivalent EN: open reading frame @en
equivalent EN: open reading frame (en)
definition: Séquence contenant une série de triplets codant les acides aminés, non interrompue par un codon d'arrêt.
in scheme: Biologie
in scheme: concept-SD-biologie-genie-genetique
in scheme: concepts
notation: AGRI58
note: Cette séquence est potentiellement traduisible en protéines.
related: cadre de lecture
related: codon d'arrêt

campagne d'évaluation
type: ConceptConcept
type: Concept
creator: Commission d'enrichissement de la langue française, FranceTerme
source: révision de l'arrêté du 28 novembre 1985
date parution JO: 2000-09-22
equivalent EN: survey @en
equivalent EN: survey (en)
definition: Opération d'évaluation de l'abondance des ressources, mettant en œuvre des navires de recherche, et faisant appel à des méthodes d'échantillonnage.
in scheme: Pêche et aquaculture
in scheme: concept-SD-peche-et-aquaculture-peche-maritime
in scheme: concepts
notation: AGRI59

ADN hybride
type: ConceptConcept
type: Concept
creator: Commission d'enrichissement de la langue française, FranceTerme
source: révision de l'arrêté du 14 septembre 1990
date parution JO: 2000-09-22
equivalent EN: hybrid DNA @en
equivalent EN: hybrid DNA (en)
definition: Molécule d'ADN composée de deux brins d'origines distinctes.
in scheme: Biologie
in scheme: concept-SD-biologie-genie-genetique
in scheme: concepts
notation: AGRI6

cantonnement
type: ConceptConcept
type: Concept
creator: Commission d'enrichissement de la langue française, FranceTerme
source: révision de l'arrêté du 28 novembre 1985
date parution JO: 2000-09-22
deconseille ou frequent: réserve
equivalent EN: box @en
equivalent EN: box (en)
part of speech: nom masculin
definition: Zone délimitée dans laquelle la capture d'espèces marines est soit interdite, soit limitée dans le temps ou réservée à certains engins, en vue d'une meilleure gestion des ressources halieutiques.
in scheme: Pêche et aquaculture
in scheme: concept-SD-peche-et-aquaculture-peche-maritime
in scheme: concepts
notation: AGRI60
note: Ce terme ne doit pas être confondu avec « réserve », qui désigne une zone constamment interdite.

captage
type: ConceptConcept
type: Concept
creator: Commission d'enrichissement de la langue française, FranceTerme
source: révision de l'arrêté du 7 avril 1987
date parution JO: 2000-09-22
deconseille ou frequent: captation
equivalent EN: catch system @en
equivalent EN: catch system (en)
equivalent EN: diversion system @en
equivalent EN: diversion system (en)
part of speech: nom masculin
definition: Toute action et tout ouvrage destinés à intercepter et éliminer l'excès d'eau externe provoquant des engorgements localisés.
in scheme: Sciences de la Terre
in scheme: concept-SD-sciences-de-la-terre-hydrologie
in scheme: concepts
notation: AGRI61
note: 1. Cet objectif peut se conjuguer avec l'extraction d'eau souterraine à des fins d'utilisation (usage domestique, irrigation).
note: 2. « Captation », terme vieilli, est à éviter dans ce sens.

carte de restriction
type: ConceptConcept
type: Concept
creator: Commission d'enrichissement de la langue française, FranceTerme
source: révision de l'arrêté du 14 septembre 1990
date parution JO: 2000-09-22
equivalent EN: physical map @en
equivalent EN: physical map (en)
equivalent EN: restriction map @en
equivalent EN: restriction map (en)
alternative label: carte physique
definition: Représentation graphique de la localisation des sites de restriction sur une molécule d'ADN.
in scheme: Biologie
in scheme: concept-SD-biologie-genie-genetique
in scheme: concepts
notation: AGRI62
related: restriction
related: site de restriction
related: cartographie de restriction

carte génétique
type: ConceptConcept
type: Concept
creator: Commission d'enrichissement de la langue française, FranceTerme
source: révision de l'arrêté du 14 septembre 1990
date parution JO: 2000-09-22
equivalent EN: genetic map @en
equivalent EN: genetic map (en)
definition: Représentation graphique de la position des gènes les uns par rapport aux autres sur un génome.
in scheme: Biologie
in scheme: concept-SD-biologie-genie-genetique
in scheme: concepts
notation: AGRI63
related: cartographie de gènes

cartographie de gènes
type: ConceptConcept
type: Concept
creator: Commission d'enrichissement de la langue française, FranceTerme
source: révision de l'arrêté du 14 septembre 1990
date parution JO: 2000-09-22
equivalent EN: gene mapping @en
equivalent EN: gene mapping (en)
definition: Établissement d'une carte génétique.
in scheme: Biologie
in scheme: concept-SD-biologie-genie-genetique
in scheme: concepts
notation: AGRI64
related: carte génétique

cartographie de restriction
type: ConceptConcept
type: Concept
creator: Commission d'enrichissement de la langue française, FranceTerme
source: révision de l'arrêté du 14 septembre 1990
date parution JO: 2000-09-22
equivalent EN: restriction mapping @en
equivalent EN: restriction mapping (en)
definition: Établissement d'une carte de restriction.
in scheme: Biologie
in scheme: concept-SD-biologie-genie-genetique
in scheme: concepts
notation: AGRI65
related: restriction
related: carte de restriction

cartographie S 1
type: ConceptConcept
type: Concept
creator: Commission d'enrichissement de la langue française, FranceTerme
source: révision de l'arrêté du 14 septembre 1990
date parution JO: 2000-09-22
deconseille ou frequent: S1 mapping
deconseille ou frequent: cartographie S1
deconseille ou frequent: nucléase S 1
equivalent EN: S 1 mapping @en
equivalent EN: S 1 mapping (en)
definition: Cartographie d'un brin d'acide nucléique par hybridation avec un brin complémentaire suivie d'une digestion par la nucléase S 1.
in scheme: Biologie
in scheme: concept-SD-biologie-genie-genetique
in scheme: concepts
notation: AGRI66
note: La nucléase S 1 ne coupe que les régions d'acide nucléique monocaténaire.

cassure d'un brin
type: ConceptConcept
type: Concept
creator: Commission d'enrichissement de la langue française, FranceTerme
source: révision de l'arrêté du 14 septembre 1990
date parution JO: 2000-09-22
equivalent EN: nick @en
equivalent EN: nick (en)
alternative label: coupure simple brin
alternative label: césure
definition: Coupure d'une liaison phosphodiester entre deux nucléotides adjacents sur un des deux brins d'acide nucléique.
in scheme: Biologie
in scheme: concept-SD-biologie-genie-genetique
in scheme: concepts
notation: AGRI67

cellule assistante
type: ConceptConcept
type: Concept
creator: Commission d'enrichissement de la langue française, FranceTerme
source: révision de l'arrêté du 14 septembre 1990
date parution JO: 2000-09-22
equivalent EN: helper cell @en
equivalent EN: helper cell (en)
definition: Cellule nécessaire au développement ou à l'expression d'une autre cellule ou d'un virus.
in scheme: Biologie
in scheme: concept-SD-biologie-genie-genetique
in scheme: concepts
notation: AGRI68

cellule hôte
type: ConceptConcept
type: Concept
creator: Commission d'enrichissement de la langue française, FranceTerme
source: révision de l'arrêté du 14 septembre 1990
date parution JO: 2000-09-22
equivalent EN: host cell @en
equivalent EN: host cell (en)
definition: Cellule hébergeant un matériel génétique étranger apporté par un virus, un plasmide, un ADN recombiné in vitro, ou une cellule entière.
in scheme: Biologie
in scheme: concept-SD-biologie-genie-genetique
in scheme: concepts
notation: AGRI69
related: plasmide
related: concatémère
related: ADN recombiné
related: banque d'expression

ADN non répétitif
type: ConceptConcept
type: Concept
creator: Commission d'enrichissement de la langue française, FranceTerme
source: révision de l'arrêté du 14 septembre 1990
date parution JO: 2000-09-22
equivalent EN: non-repetitive DNA @en
equivalent EN: non-repetitive DNA (en)
definition: Séquences d'ADN présentes dans le génome en un petit nombre de copies.
in scheme: Biologie
in scheme: concept-SD-biologie-genie-genetique
in scheme: concepts
notation: AGRI7
note: Cet ADN présente la cinétique de réassociation attendue pour des séquences uniques, et se caractérise par une valeur de Cot élevée.

charge hydraulique
type: ConceptConcept
type: Concept
creator: Commission d'enrichissement de la langue française, FranceTerme
source: révision de l'arrêté du 7 avril 1987
date parution JO: 2000-09-22
equivalent EN: hydraulic head @en
equivalent EN: hydraulic head (en)
equivalent EN: total head @en
equivalent EN: total head (en)
definition: Quantité d'énergie d'un liquide.
in scheme: Hydraulique
in scheme: concepts
notation: AGRI71
note: Ce terme ne doit pas être confondu avec « hauteur piézométrique ».
related: gradient hydraulique

chromosome minuscule double
type: ConceptConcept
type: Concept
creator: Commission d'enrichissement de la langue française, FranceTerme
source: révision de l'arrêté du 14 septembre 1990
date parution JO: 2000-09-22
deconseille ou frequent: chromosome double minute
equivalent EN: double minute chromosome @en
equivalent EN: double minute chromosome (en)
definition: Fragment d'ADN extrachromosomique instable dépourvu de centromère.
in scheme: Biologie
in scheme: concept-SD-biologie-genie-genetique
in scheme: concepts
notation: AGRI72
note: 1. Les chromosomes minuscules doubles n'ont été décrits que chez les eucaryotes.
note: 2. Le terme « chromosome double minute » ne doit pas être utilisé en français.

cistron
type: ConceptConcept
type: Concept
creator: Commission d'enrichissement de la langue française, FranceTerme
source: révision de l'arrêté du 14 septembre 1990
date parution JO: 2000-09-22
equivalent EN: cistron @en
equivalent EN: cistron (en)
part of speech: nom masculin
definition: Région du génome qui ne porte qu'une seule information génétique transcrite en ARN.
in scheme: Biologie
in scheme: concept-SD-biologie-genie-genetique
in scheme: concepts
notation: AGRI73
note: 1. Il existe des ARN mono- ou polycistroniques.
note: 2. Ce terme vient de l'emploi du test cis-trans utilisé, en génétique classique, pour mettre les cistrons en évidence chez les bactéries.
note: 3. Pour un ARNm, un cistron correspond à un seul polypeptide.
related: ARN messager
related: ARN monocistronique
related: ARNm polycistronique
related: ARN polycistronique
related: mutation à effet polaire
related: unité de transcription
related: régulation coordonnée

clonage à l'aveugle
type: ConceptConcept
type: Concept
creator: Commission d'enrichissement de la langue française, FranceTerme
source: révision de l'arrêté du 14 septembre 1990
date parution JO: 2000-09-22
equivalent EN: shotgun cloning @en
equivalent EN: shotgun cloning (en)
forme abregee: clonage aveugle
definition: Clonage de fragments d'ADN générés de manière aléatoire.
in scheme: Biologie
in scheme: concept-SD-biologie-genie-genetique
in scheme: concepts
notation: AGRI75

codon d'arrêt
type: ConceptConcept
type: Concept
creator: Commission d'enrichissement de la langue française, FranceTerme
source: révision de l'arrêté du 14 septembre 1990
date parution JO: 2000-09-22
deconseille ou frequent: UAA
deconseille ou frequent: UAG
deconseille ou frequent: UGA
equivalent EN: nonsense codon @en
equivalent EN: nonsense codon (en)
equivalent EN: nonsense triplet @en
equivalent EN: nonsense triplet (en)
equivalent EN: stop codon @en
equivalent EN: stop codon (en)
alternative label: codon de terminaison
alternative label: codon non sens
definition: Triplet qui signale la fin d'un message génétique sur un ARNm.
in scheme: Biologie
in scheme: concept-SD-biologie-genie-genetique
in scheme: concepts
notation: AGRI76
note: 1. Les codons d'arrêt ne correspondent à aucun acide aminé, la traduction de l'ARNm en protéine cesse donc à partir du codon d'arrêt.
note: 2. Les codons d'arrêt sont le plus souvent UAA, UAG, UGA.
related: ARN messager
related: mutation non-sens
related: traduction ininterrompue
related: cadre de lecture
related: cadre ouvert de lecture
related: codon d'initiation

codon d'initiation
type: ConceptConcept
type: Concept
creator: Commission d'enrichissement de la langue française, FranceTerme
source: révision de l'arrêté du 14 septembre 1990
date parution JO: 2000-09-22
deconseille ou frequent: AUG
equivalent EN: initiation codon @en
equivalent EN: initiation codon (en)
equivalent EN: start codon @en
equivalent EN: start codon (en)
definition: Triplet qui signale le début du message génétique sur un ARNm.
in scheme: Biologie
in scheme: concept-SD-biologie-genie-genetique
in scheme: concepts
notation: AGRI77
note: 1. La traduction de l'ARNm en protéine commence au codon d'initiation.
note: 2. Le codon d'initiation est le plus souvent AUG, qui code une méthionine.
related: ARN messager
related: séquence de Shine Dalgarno
related: séquence de tête
related: cadre de lecture
related: codon d'arrêt
related: concept-SANT249
related: concept-SANT65

coefficient d'infiltration efficace
type: ConceptConcept
type: Concept
creator: Commission d'enrichissement de la langue française, FranceTerme
source: révision de l'arrêté du 7 avril 1987
date parution JO: 2000-09-22
equivalent EN: effective infiltration coefficient @en
equivalent EN: effective infiltration coefficient (en)
definition: Fraction du volume des précipitations alimentant une nappe.
in scheme: Hydraulique
in scheme: concept-SD-hydraulique-drainage-agricole
in scheme: concepts
notation: AGRI78
note: En drainage, il convient de bien distinguer le coefficient de restitution et le coefficient d'infiltration efficace.
related: infiltration efficace

coefficient de restitution
type: ConceptConcept
type: Concept
creator: Commission d'enrichissement de la langue française, FranceTerme
source: révision de l'arrêté du 7 avril 1987
date parution JO: 2000-09-22
equivalent EN: drainage efficiency @en
equivalent EN: drainage efficiency (en)
equivalent EN: outflow yield @en
equivalent EN: outflow yield (en)
definition: Rapport du volume d'eau évacué par les drains, pendant un épisode de drainage, au volume des précipitations générant cet épisode.
in scheme: Hydraulique
in scheme: concept-SD-hydraulique-drainage-agricole
in scheme: concepts
notation: AGRI79
related: saison de drainage

ADN polymérase
type: ConceptConcept
type: Concept
creator: Commission d'enrichissement de la langue française, FranceTerme
source: révision de l'arrêté du 14 septembre 1990
date parution JO: 2000-09-22
equivalent EN: DNA polymerase @en
equivalent EN: DNA polymerase (en)
definition: Enzyme catalysant la polymérisation (5' vers 3') des monocléotides triphosphates qui constituent l'ADN.
in scheme: Biologie
in scheme: concept-SD-biologie-genie-genetique
in scheme: concepts
notation: AGRI8
related: remplissage
related: ADN complémentaire

coiffe
type: ConceptConcept
type: Concept
creator: Commission d'enrichissement de la langue française, FranceTerme
source: révision de l'arrêté du 14 septembre 1990
date parution JO: 2000-09-22
equivalent EN: cap @en
equivalent EN: cap (en)
part of speech: nom féminin
alternative label: chapeau
definition: Courte séquence nucléotidique ajoutée, par modification post-transcriptionnelle, à l'extrémité 5' de l'ARN messager chez les eucaryotes.
in scheme: Biologie
in scheme: concept-SD-biologie-genie-genetique
in scheme: concepts
notation: AGRI80
related: ARN messager

coïntégrat
type: ConceptConcept
type: Concept
creator: Commission d'enrichissement de la langue française, FranceTerme
source: révision de l'arrêté du 14 septembre 1990
date parution JO: 2000-09-22
equivalent EN: cointegrate @en
equivalent EN: cointegrate (en)
part of speech: nom masculin
definition: Molécule résultant de la fusion de deux réplicons en un seul.
in scheme: Biologie
in scheme: concept-SD-biologie-genie-genetique
in scheme: concepts
notation: AGRI81
related: réplicon
related: résolution d'un coïntégrat
related: coïntégration

coïntégration
type: ConceptConcept
type: Concept
creator: Commission d'enrichissement de la langue française, FranceTerme
source: révision de l'arrêté du 14 septembre 1990
date parution JO: 2000-09-22
equivalent EN: cointegration @en
equivalent EN: cointegration (en)
part of speech: nom féminin
definition: Fusion de deux réplicons, par exemple deux plasmides, en une seule structure appelée « coïntégrat ».
in scheme: Biologie
in scheme: concept-SD-biologie-genie-genetique
in scheme: concepts
notation: AGRI82
note: 1. Cette fusion peut être due à la présence d'un transposon sur l'un des réplicons.
note: 2. Si l'un des plasmides est un facteur de conjugaison, elle aboutit au transfert du coïntégrat ou des deux plasmides.
related: plasmide
related: réplicon
related: coïntégrat
related: transposon

collecteur
type: ConceptConcept
type: Concept
creator: Commission d'enrichissement de la langue française, FranceTerme
source: révision de l'arrêté du 7 avril 1987
date parution JO: 2000-09-22
deconseille ou frequent: collecteur enterré
equivalent EN: carrier drain @en
equivalent EN: carrier drain (en)
equivalent EN: main drain @en
equivalent EN: main drain (en)
part of speech: nom masculin
definition: Conduite ou fossé destiné à recevoir les écoulements captés dans les parcelles par plusieurs types d'ouvrages et à les acheminer jusqu'à l'exutoire.
in scheme: Hydraulique
in scheme: concept-SD-hydraulique-drainage-agricole
in scheme: concepts
notation: AGRI83
note: On utilise souvent le terme « collecteur » pour « collecteur enterré ».
related: exutoire

colonie cellulaire
type: ConceptConcept
type: Concept
creator: Commission d'enrichissement de la langue française, FranceTerme
source: révision de l'arrêté du 14 septembre 1990
date parution JO: 2000-09-22
equivalent EN: cell colony @en
equivalent EN: cell colony (en)
definition: Amas de cellules issues d'une seule ou d'un petit nombre de cellules.
in scheme: Biologie
in scheme: concept-SD-biologie-genie-genetique
in scheme: concepts
notation: AGRI84
note: Une colonie issue d'une seule cellule constitue un clone.

compatibilité
type: ConceptConcept
type: Concept
creator: Commission d'enrichissement de la langue française, FranceTerme
source: révision de l'arrêté du 14 septembre 1990
date parution JO: 2000-09-22
equivalent EN: compatibility @en
equivalent EN: compatibility (en)
part of speech: nom féminin
definition: Capacité de deux plasmides à coexister de façon stable à l'intérieur d'un hôte commun.
in scheme: Biologie
in scheme: concept-SD-biologie-genie-genetique
in scheme: concepts
notation: AGRI85
related: plasmide

compétence génétique
type: ConceptConcept
type: Concept
creator: Commission d'enrichissement de la langue française, FranceTerme
source: révision de l'arrêté du 14 septembre 1990
date parution JO: 2000-09-22
equivalent EN: genetic competence @en
equivalent EN: genetic competence (en)
definition: État d'une cellule qui permet la pénétration d'un acide nucléique étranger.
in scheme: Biologie
in scheme: concept-SD-biologie-genie-genetique
in scheme: concepts
notation: AGRI86
note: Cet état peut exister naturellement ou être obtenu expérimentalement.

concatémère
type: ConceptConcept
type: Concept
creator: Commission d'enrichissement de la langue française, FranceTerme
source: révision de l'arrêté du 14 septembre 1990
date parution JO: 2000-09-22
equivalent EN: concatemer @en
equivalent EN: concatemer (en)
part of speech: nom masculin
definition: Longue molécule d'ADN constituée d'un même monomère répété et formant un multimère linéaire.
in scheme: Biologie
in scheme: concept-SD-biologie-genie-genetique
in scheme: concepts
notation: AGRI88
note: 1. Une telle structure se rencontre au cours du cycle de réplication d'un phage tel que le phage lambda.
note: 2. Des concatémères se forment également lorsque des séquences d'ADN sont introduites artificiellement dans une cellule hôte.
related: cellule hôte

conductivité hydraulique
type: ConceptConcept
type: Concept
creator: Commission d'enrichissement de la langue française, FranceTerme
source: révision de l'arrêté du 7 avril 1987
date parution JO: 2000-09-22
equivalent EN: hydraulic conductivity @en
equivalent EN: hydraulic conductivity (en)
equivalent EN: permeability @en
equivalent EN: permeability (en)
definition: Paramètre quantifiant l'intensité d'un écoulement dans un milieu poreux sous l'influence d'un gradient hydraulique.
in scheme: Hydraulique
in scheme: concepts
notation: AGRI89
note: 1. En milieu poreux saturé, la loi de Darcy exprime la proportionnalité de la vitesse de filtration et du gradient hydraulique : cette constante de proportionnalité est la conductivité hydraulique. Une conductivité hydraulique en milieu poreux non saturé peut également être définie, par généralisation de la loi de Darcy. Sa valeur dépend alors, notamment, de la teneur en eau.
note: 2. La conductivité hydraulique saturée d'un fluide en mouvement isotherme dans un milieu poreux saturé est proportionnelle au rapport du poids volumique du fluide à la viscosité dynamique de ce fluide. Le facteur de proportionnalité est la perméabilité intrinsèque, appelée souvent « perméabilité », du milieu poreux.
related: vitesse de filtration

ADN recombiné
type: ConceptConcept
type: Concept
creator: Commission d'enrichissement de la langue française, FranceTerme
source: révision de l'arrêté du 14 septembre 1990
date parution JO: 2000-09-22
equivalent EN: recombinant DNA @en
equivalent EN: recombinant DNA (en)
definition: Molécule d'ADN dans laquelle des séquences qui ne sont pas naturellement contiguës sont juxtaposées par manipulation in vitro.
in scheme: Biologie
in scheme: concept-SD-biologie-genie-genetique
in scheme: concepts
notation: AGRI9
related: cellule hôte

conjugaison
type: ConceptConcept
type: Concept
creator: Commission d'enrichissement de la langue française, FranceTerme
source: révision de l'arrêté du 14 septembre 1990
date parution JO: 2000-09-22
equivalent EN: conjugation @en
equivalent EN: conjugation (en)
equivalent EN: mating @en
equivalent EN: mating (en)
part of speech: nom féminin
definition: Transfert naturel d'ADN plasmidique ou chromosomique d'une cellule bactérienne à une autre par l'intermédiaire d'un pont cytoplasmique.
in scheme: Biologie
in scheme: concept-SD-biologie-genie-genetique
in scheme: concepts
notation: AGRI90
related: facteur de fertilité

contrôle en cis
type: ConceptConcept
type: Concept
creator: Commission d'enrichissement de la langue française, FranceTerme
source: révision de l'arrêté du 14 septembre 1990
date parution JO: 2000-09-22
equivalent EN: cis control @en
equivalent EN: cis control (en)
definition: Régulation de l'expression génétique par les séquences d'ADN au voisinage d'un gène situé sur le même chromosome.
in scheme: Biologie
in scheme: concept-SD-biologie-genie-genetique
in scheme: concepts
notation: AGRI92

contrôle en trans
type: ConceptConcept
type: Concept
creator: Commission d'enrichissement de la langue française, FranceTerme
source: révision de l'arrêté du 14 septembre 1990
date parution JO: 2000-09-22
equivalent EN: trans control @en
equivalent EN: trans control (en)
definition: Régulation de l'expression génétique qui s'exerce par l'intermédiaire d'un facteur diffusible.
in scheme: Biologie
in scheme: concept-SD-biologie-genie-genetique
in scheme: concepts
notation: AGRI93

corépresseur
type: ConceptConcept
type: Concept
creator: Commission d'enrichissement de la langue française, FranceTerme
source: révision de l'arrêté du 14 septembre 1990
date parution JO: 2000-09-22
equivalent EN: corepressor @en
equivalent EN: corepressor (en)
part of speech: nom masculin
definition: Molécule qui déclenche la répression de la transcription de gènes spécifiques en se fixant au répresseur.
in scheme: Biologie
in scheme: concept-SD-biologie-genie-genetique
in scheme: concepts
notation: AGRI94
related: répresseur

couche imperméable
type: ConceptConcept
type: Concept
creator: Commission d'enrichissement de la langue française, FranceTerme
source: révision de l'arrêté du 7 avril 1987
date parution JO: 2000-09-22
equivalent EN: impervious floor @en
equivalent EN: impervious floor (en)
equivalent EN: impervious layer @en
equivalent EN: impervious layer (en)
definition: Niveau imperméable ou relativement imperméable dans le profil d'un sol, au-dessus duquel se produit une accumulation de l'eau.
in scheme: Hydraulique
in scheme: concepts
notation: AGRI95

courbe de Cot
type: ConceptConcept
type: Concept
creator: Commission d'enrichissement de la langue française, FranceTerme
source: révision de l'arrêté du 14 septembre 1990
abbreviation: Cot @en
date parution JO: 2000-09-22
equivalent EN: Cot @en
equivalent EN: Cot (en)
equivalent EN: Cot curve @en
equivalent EN: Cot curve (en)
forme abregee: Cot
definition: Courbe obtenue lors d'une réassociation de plusieurs ADN monocaténaires complémentaires.
in scheme: Biologie
in scheme: concept-SD-biologie-genie-genetique
in scheme: concepts
notation: AGRI96
note: Les points de la courbe représentent la concentration en ADN double brin en fonction du produit de la concentration totale en ADN (Co) par le temps d'incubation (t) dans des conditions déterminées.

culture vivrière
type: ConceptConcept
type: Concept
creator: Commission d'enrichissement de la langue française, FranceTerme
source: révision de l'arrêté du 20 septembre 1993
date parution JO: 2000-09-22
deconseille ou frequent: culture de case
equivalent EN: subsistence crop @en
equivalent EN: subsistence crop (en)
definition: Dans le tiers monde, culture pratiquée principalement en vue de la consommation alimentaire dans le pays même.
in scheme: Agriculture
in scheme: concepts
notation: AGRI98
note: On donne parfois à ce terme le sens de culture pratiquée pour la consommation sur place, sans commercialisation. Il vaut mieux employer alors le terme « culture de case ».

antiblocage de sécurité
type: ConceptConcept
type: Concept
creator: Commission d'enrichissement de la langue française, FranceTerme
abbreviation: ABS
date parution JO: 1999-10-23
deconseille ou frequent: Antiblockiersystem
equivalent EN: ABS @en
equivalent EN: ABS (de)
equivalent EN: ABS (en)
equivalent EN: Anti-Blockier-System @de
equivalent EN: Anti-Blockier-System (de)
equivalent EN: Anti-lock Braking System @en
equivalent EN: Anti-lock Braking System (en)
definition: Dispositif de régulation du système de freinage qui limite le risque de blocage des roues au freinage.
in scheme: Automobile
in scheme: concepts
notation: AUTO1
related: assistance au freinage d'urgence

dispositif antidémarrage
type: ConceptConcept
type: Concept
creator: Commission d'enrichissement de la langue française, FranceTerme
abbreviation: immobiliser @en
date parution JO: 2004-02-15
equivalent EN: engine immobiliser @en
equivalent EN: engine immobiliser (en)
equivalent EN: immobiliser @en
equivalent EN: immobiliser (en)
forme abregee: antidémarrage, n.m.
definition: Équipement de protection d'un véhicule contre le vol, qui empêche le démarrage du moteur.
in scheme: Automobile
in scheme: concepts
notation: AUTO10

taux de reconduction
type: ConceptConcept
type: Concept
creator: Commission d'enrichissement de la langue française, FranceTerme
date parution JO: 2011-06-08
deconseille ou frequent: taux de carry-over
equivalent EN: carry-over ratio @en
equivalent EN: carry-over ratio (en)
definition: Pourcentage des outillages de production, des composants ou des pièces existants qui sont réutilisés pour la fabrication de nouveaux modèles.
in scheme: Automobile
in scheme: Économie générale
in scheme: Industrie
in scheme: concepts
notation: AUTO100
note: L'utilisation de l'expression « taux de carry-over » est déconseillée.

hybridation
type: ConceptConcept
type: Concept
creator: Commission d'enrichissement de la langue française, FranceTerme
date parution JO: 2011-06-08
equivalent EN: hybridization @en
equivalent EN: hybridization (en)
part of speech: nom féminin
definition: Association de deux techniques de motorisation permettant d'assurer la propulsion d'un véhicule automobile.
in scheme: Automobile
in scheme: concepts
notation: AUTO101
note: L'hybridation a pour effet de réduire la consommation et les émissions par rapport à un véhicule équipé seulement d'un moteur thermique.
related: véhicule à motorisation microhybride
related: véhicule à motorisation hybride
related: véhicule hybride à air comprimé

véhicule à motorisation hybride complète
type: ConceptConcept
type: Concept
creator: Commission d'enrichissement de la langue française, FranceTerme
date parution JO: 2011-06-08
equivalent EN: full hybrid @en
equivalent EN: full hybrid (en)
equivalent EN: full hybrid vehicle @en
equivalent EN: full hybrid vehicle (en)
forme abregee: hybride complet
forme abregee: véhicule hybride complet
broader: concept-voiture-electrique
definition: Véhicule à motorisation hybride dont le ou les moteurs électriques ont une puissance suffisante pour assurer à eux seuls, pendant un temps limité, la propulsion.
in scheme: Automobile
in scheme: concepts
notation: AUTO103
related: véhicule à motorisation hybride
related: électromobilité

véhicule à motorisation microhybride
type: ConceptConcept
type: Concept
creator: Commission d'enrichissement de la langue française, FranceTerme
date parution JO: 2011-06-08
equivalent EN: micro hybrid @en
equivalent EN: micro hybrid (en)
equivalent EN: micro-hybrid vehicle @en
equivalent EN: micro-hybrid vehicle (en)
forme abregee: microhybride, n.m.
forme abregee: véhicule microhybride
broader: concept-voiture-electrique
definition: Véhicule dont l'hybridation est limitée à un système de mise en veille du moteur thermique.
in scheme: Automobile
in scheme: concepts
notation: AUTO104
related: hybridation
related: véhicule à motorisation hybride
related: système de mise en veille

véhicule à motorisation semi-hybride
type: ConceptConcept
type: Concept
creator: Commission d'enrichissement de la langue française, FranceTerme
date parution JO: 2011-06-08
equivalent EN: mild hybrid @en
equivalent EN: mild hybrid (en)
equivalent EN: mild hybrid vehicle @en
equivalent EN: mild hybrid vehicle (en)
forme abregee: semi-hybride, n.m.
forme abregee: véhicule semi-hybride
definition: Véhicule à moteur thermique, équipé d'un moteur électrique de faible puissance et d'un système de récupération d'énergie au freinage qui apportent un complément de puissance à bas régime ou lors d'une phase de forte accélération.
in scheme: Automobile
in scheme: concepts
notation: AUTO105
related: véhicule à motorisation hybride

véhicule à motorisation hybride rechargeable
type: ConceptConcept
type: Concept
creator: Commission d'enrichissement de la langue française, FranceTerme
date parution JO: 2011-06-08
equivalent EN: plug-in hybrid @en
equivalent EN: plug-in hybrid (en)
equivalent EN: plug-in hybrid vehicle @en
equivalent EN: plug-in hybrid vehicle (en)
forme abregee: hybride rechargeable
forme abregee: véhicule hybride rechargeable
broader: concept-voiture-electrique
definition: Véhicule à motorisation hybride dont les batteries peuvent être rechargées par raccordement à un réseau de distribution électrique.
in scheme: Automobile
in scheme: concepts
notation: AUTO106
related: véhicule à motorisation hybride
related: électromobilité

véhicule à quatre roues directrices
type: ConceptConcept
type: Concept
creator: Commission d'enrichissement de la langue française, FranceTerme
abbreviation: 4WS vehicle @en
date parution JO: 2011-06-08
deconseille ou frequent: véhicule à 4 roues directrices
equivalent EN: 4-wheel steering vehicle @en
equivalent EN: 4-wheel steering vehicle (en)
equivalent EN: 4WS vehicle @en
equivalent EN: 4WS vehicle (en)
equivalent EN: all wheel steering vehicle @en
equivalent EN: all wheel steering vehicle (en)
equivalent EN: four-wheel steering vehicle @en
equivalent EN: four-wheel steering vehicle (en)
broader: concept-automobile
definition: Véhicule dont les roues arrière s'orientent automatiquement selon le braquage des roues avant, ce qui a pour effet d'améliorer sa maniabilité à faible vitesse ou sa stabilité à vitesse élevée.
in scheme: Automobile
in scheme: concepts
notation: AUTO107

remanufacturage
type: ConceptConcept
type: Concept
creator: Commission d'enrichissement de la langue française, FranceTerme
date parution JO: 2014-05-20
equivalent EN: remanufacturing @en
equivalent EN: remanufacturing (en)
part of speech: nom masculin
definition: Remise en état d’une pièce ou d'un sous-ensemble automobile usagé, selon des processus industriels rétablissant les performances et la qualité d’origine.
in scheme: Automobile
in scheme: Économie générale
in scheme: Industrie
in scheme: concepts
notation: AUTO108

aide au stationnement
type: ConceptConcept
type: Concept
creator: Commission d'enrichissement de la langue française, FranceTerme
date parution JO: 2014-05-20
equivalent EN: parking aids @en
equivalent EN: parking aids (en)
definition: Ensemble d’informations essentiellement visuelles ou sonores fournies au conducteur afin de lui faciliter les manœuvres de stationnement, dont il conserve la maîtrise.
in scheme: Automobile
in scheme: concepts
notation: AUTO109
related: stationnement assisté
related: stationnement automatique

électro-stabilisateur programmé
type: ConceptConcept
type: Concept
creator: Commission d'enrichissement de la langue française, FranceTerme
abbreviation: ESC @en
abbreviation: ESP
date parution JO: 2004-02-15
deconseille ou frequent: DSC
deconseille ou frequent: VDC
deconseille ou frequent: VSA
deconseille ou frequent: dynamic stability control
deconseille ou frequent: vehicle dynamic control
deconseille ou frequent: vehicle stability assist
equivalent EN: ESC @en
equivalent EN: ESC (en)
equivalent EN: ESP @de
equivalent EN: ESP (de)
equivalent EN: ESP (en)
equivalent EN: electronic stability control @en
equivalent EN: electronic stability control (en)
equivalent EN: electronic stability program @en
equivalent EN: electronic stability program (en)
equivalent EN: elektronisches Stabilitätsprogramm @de
equivalent EN: elektronisches Stabilitätsprogramm (de)
definition: Système de régulation électronique de l'ensemble du comportement dynamique d'un véhicule.
in scheme: Automobile
in scheme: concepts
notation: AUTO11

stationnement assisté
type: ConceptConcept
type: Concept
creator: Commission d'enrichissement de la langue française, FranceTerme
date parution JO: 2014-05-20
equivalent EN: park assist @en
equivalent EN: park assist (en)
equivalent EN: park assist system @en
equivalent EN: park assist system (en)
alternative label: stationnement semi-automatique
definition: Dispositif qui actionne la direction du véhicule pour faciliter les manœuvres de stationnement, le conducteur conservant la maîtrise de la boîte de vitesses, de l’accélérateur et du frein.
in scheme: Automobile
in scheme: concepts
notation: AUTO110
related: aide au stationnement
related: stationnement automatique
related: voiturier automatique

stationnement automatique
type: ConceptConcept
type: Concept
creator: Commission d'enrichissement de la langue française, FranceTerme
date parution JO: 2014-05-20
equivalent EN: full park assist @en
equivalent EN: full park assist (en)
definition: Dispositif qui prend en charge l’intégralité des manœuvres de stationnement, le conducteur restant présent dans le véhicule.
in scheme: Automobile
in scheme: concepts
notation: AUTO111
related: aide au stationnement
related: stationnement assisté
related: voiturier automatique

assistance à l'écoconduite
type: ConceptConcept
type: Concept
creator: Commission d'enrichissement de la langue française, FranceTerme
date parution JO: 2014-05-20
deconseille ou frequent: ecoassist
equivalent EN: eco assist @en
equivalent EN: eco assist (en)
equivalent EN: eco-driving assist @en
equivalent EN: eco-driving assist (en)
definition: Ensemble des dispositifs installés sur un véhicule qui fournissent au conducteur des informations l’aidant à réduire la consommation d’énergie.
in scheme: Automobile
in scheme: concepts
notation: AUTO112
note: L’indicateur de changement de rapport et l’indicateur d’autonomie sont des exemples d’assistance à l’écoconduite.
related: écoconduite

écoconduite
type: ConceptConcept
type: Concept
creator: Commission d'enrichissement de la langue française, FranceTerme
date parution JO: 2014-05-20
deconseille ou frequent: ecodriving
equivalent EN: eco-driving @en
equivalent EN: eco-driving (en)
equivalent EN: efficient driving @en
equivalent EN: efficient driving (en)
part of speech: nom féminin
definition: Ensemble de pratiques de conduite permettant à l’automobiliste de réduire la consommation d’énergie du véhicule et d’en limiter l’usure.
in scheme: Automobile
in scheme: concepts
notation: AUTO113
related: assistance à l'écoconduite

boîte de vitesses à double embrayage
type: ConceptConcept
type: Concept
creator: Commission d'enrichissement de la langue française, FranceTerme
abbreviation: DCT @en
date parution JO: 2014-05-20
deconseille ou frequent: boîte de vitesse à double embrayage
equivalent EN: DCT @en
equivalent EN: DCT (en)
equivalent EN: dual-clutch transmission @en
equivalent EN: dual-clutch transmission (en)
definition: Boîte de vitesses à changement de rapports automatique constituée de deux demi-boîtes, l’une pour les rapports pairs, l’autre pour les rapports impairs, chacune dotée d’un embrayage, qui permet un changement de rapport quasi instantané et sans rupture de traction.
in scheme: Automobile
in scheme: concepts
notation: AUTO114

coupé-cabriolet
type: ConceptConcept
type: Concept
creator: Commission d'enrichissement de la langue française, FranceTerme
date parution JO: 2014-05-20
deconseille ou frequent: coupé cabriolet
part of speech: nom masculin
definition: Véhicule de type coupé, dont le toit, constitué d’éléments rigides, est repliable dans le coffre à bagages ou dans un compartiment spécifique.
in scheme: Automobile
in scheme: concepts
notation: AUTO115

échange minute de batterie
type: ConceptConcept
type: Concept
creator: Commission d'enrichissement de la langue française, FranceTerme
date parution JO: 2014-05-20
equivalent EN: quick drop @en
equivalent EN: quick drop (en)
forme abregee: échange minute
alternative label: échange rapide de batterie
definition: Remplacement rapide, sur un véhicule électrique, de la batterie de traction déchargée par une batterie chargée.
in scheme: Automobile
in scheme: concepts
notation: AUTO116

feux de jour
type: ConceptConcept
type: Concept
creator: Commission d'enrichissement de la langue française, FranceTerme
abbreviation: DRL @en
date parution JO: 2014-05-20
deconseille ou frequent: daytime running lamp
deconseille ou frequent: daytime running lamps
deconseille ou frequent: feux de circulation diurne
deconseille ou frequent: feux diurnes
equivalent EN: DRL @en
equivalent EN: DRL (en)
equivalent EN: daytime running lights @en
equivalent EN: daytime running lights (en)
definition: Feux de signalisation spécifiques, situés à l’avant du véhicule, qui s’allument automatiquement au démarrage du moteur et permettent au véhicule d’être plus visible en circulation de jour.
in scheme: Automobile
in scheme: concepts
notation: AUTO117
note: On trouve aussi les termes « feux diurnes » et « feux de circulation diurne ».
related: signature lumineuse

gestion de la consommation électrique
type: ConceptConcept
type: Concept
creator: Commission d'enrichissement de la langue française, FranceTerme
abbreviation: ESM @en
abbreviation: GCE
date parution JO: 2014-05-20
equivalent EN: ESM @en
equivalent EN: ESM (en)
equivalent EN: electric system management @en
equivalent EN: electric system management (en)
definition: Ensemble des dispositifs qui optimisent le fonctionnement des différents systèmes électriques et électroniques du véhicule afin d’en réduire la consommation d’énergie.
in scheme: Automobile
in scheme: concepts
notation: AUTO118

prolongateur d'autonomie
type: ConceptConcept
type: Concept
creator: Commission d'enrichissement de la langue française, FranceTerme
date parution JO: 2014-05-20
equivalent EN: range extender @en
equivalent EN: range extender (en)
definition: Générateur embarqué dans un véhicule électrique, destiné à accroître l’autonomie de ce dernier en assurant la recharge de la batterie de traction.
in scheme: Automobile
in scheme: concepts
notation: AUTO119

installation de surveillance d'allure
type: ConceptConcept
type: Concept
creator: Commission d'enrichissement de la langue française, FranceTerme
abbreviation: ISA
date parution JO: 2004-02-15
equivalent EN: ISA @en
equivalent EN: ISA (en)
equivalent EN: intelligent speed adaptation @en
equivalent EN: intelligent speed adaptation (en)
definition: Système faisant appel à un équipement externe qui, en cas de dépassement d'une vitesse limite, adresse un signal au conducteur ou commande automatiquement une adaptation de l'allure en agissant sur certains organes du véhicule.
in scheme: Automobile
in scheme: concepts
notation: AUTO12

recharge itinérante
type: ConceptConcept
type: Concept
creator: Commission d'enrichissement de la langue française, FranceTerme
date parution JO: 2014-05-20
deconseille ou frequent: plug surfing
deconseille ou frequent: plugsurfing
definition: Pratique consistant à recharger les batteries d’un véhicule électrique en accédant, en différents points de son itinéraire, à un réseau de bornes de recharge.
in scheme: Automobile
in scheme: concepts
notation: AUTO121
note: 1. Des informations concernant la localisation et la disponibilité des bornes peuvent être fournies aux utilisateurs par des dispositifs embarqués ou non.
note: 2. « Plugsurfing », qui est le nom d’un site de l'internet, ne doit pas être employé.

rétrogradage
type: ConceptConcept
type: Concept
creator: Commission d'enrichissement de la langue française, FranceTerme
date parution JO: 2014-05-20
equivalent EN: downshifting @en
equivalent EN: downshifting (en)
part of speech: nom masculin
definition: Passage à un rapport de transmission inférieur, qui permet d’augmenter le régime du moteur et de disposer ainsi de davantage de puissance ou de frein moteur.
in scheme: Automobile
in scheme: concepts
notation: AUTO122
related: rétrogradage forcé

sangle supérieure
type: ConceptConcept
type: Concept
creator: Commission d'enrichissement de la langue française, FranceTerme
date parution JO: 2014-05-20
equivalent EN: top tether @en
equivalent EN: top tether (en)
definition: Sangle installée sur un siège pour enfant, qui maintient le haut du siège pour en limiter le basculement en cas de choc.
in scheme: Automobile
in scheme: concepts
notation: AUTO123

récupérateur d'énergie cinétique
type: ConceptConcept
type: Concept
creator: Commission d'enrichissement de la langue française, FranceTerme
abbreviation: KERS @en
abbreviation: REC
date parution JO: 2014-05-20
equivalent EN: KERS @en
equivalent EN: KERS (en)
equivalent EN: kinetic energy recovery system @en
equivalent EN: kinetic energy recovery system (en)
definition: Système permettant de récupérer une partie de l’énergie cinétique produite lors de la décélération d’un véhicule.
in scheme: Automobile
in scheme: concepts
notation: AUTO124
note: L’énergie ainsi récupérée est restituée notamment lors des phases de démarrage ou d’accélération du véhicule.

voiture de salon
type: ConceptConcept
type: Concept
creator: Commission d'enrichissement de la langue française, FranceTerme
date parution JO: 2014-05-20
equivalent EN: show car @en
equivalent EN: show car (en)
definition: Maquette de véhicule grandeur nature destinée à attirer l’attention du visiteur dans un lieu d’exposition.
in scheme: Automobile
in scheme: concepts
notation: AUTO125
related: voiture concept

volant moteur bimasse
type: ConceptConcept
type: Concept
creator: Commission d'enrichissement de la langue française, FranceTerme
abbreviation: DMF @en
abbreviation: DVA
date parution JO: 2014-05-20
equivalent EN: DMF @en
equivalent EN: DMF (en)
equivalent EN: double-mass flywheel @en
equivalent EN: double-mass flywheel (en)
equivalent EN: dual-mass flywheel @en
equivalent EN: dual-mass flywheel (en)
forme abregee: volant bimasse
alternative label: double volant amortisseur
definition: Volant moteur composé de deux parties liées de manière élastique et amortie, qui permet de diminuer les vibrations engendrées par le moteur.
in scheme: Automobile
in scheme: concepts
notation: AUTO126

voiturier automatique
type: ConceptConcept
type: Concept
creator: Commission d'enrichissement de la langue française, FranceTerme
date parution JO: 2014-05-20
deconseille ou frequent: cybervalet
equivalent EN: valet parking @en
equivalent EN: valet parking (en)
definition: Système qui prend en charge, en l’absence du conducteur, l’intégralité des manœuvres nécessaires pour qu’un véhicule parvenu à son point d’arrivée gagne son aire de stationnement.
in scheme: Automobile
in scheme: concepts
notation: AUTO127
related: stationnement assisté
related: stationnement automatique
related: véhicule autonome

abaissement du régime moteur
type: ConceptConcept
type: Concept
creator: Commission d'enrichissement de la langue française, FranceTerme
date parution JO: 2015-07-28
equivalent EN: downspeeding @en
equivalent EN: downspeeding (en)
forme abregee: abaissement du régime
definition: Décalage des plages de fonctionnement d’un moteur vers des régimes inférieurs, visant à diminuer ses frottements internes et, partant, la consommation.
in scheme: Automobile
in scheme: concept-SD-automobile-moteurs
in scheme: concepts
notation: AUTO128
related: réduction

aide à la vision de nuit
type: ConceptConcept
type: Concept
creator: Commission d'enrichissement de la langue française, FranceTerme
date parution JO: 2015-07-28
deconseille ou frequent: système night vision
equivalent EN: night view assist @en
equivalent EN: night view assist (en)
equivalent EN: night vision @en
equivalent EN: night vision (en)
equivalent EN: night vision assist @en
equivalent EN: night vision assist (en)
equivalent EN: night vision system @en
equivalent EN: night vision system (en)
definition: Dispositif d’imagerie qui permet de détecter de nuit des obstacles peu ou non visibles à l’œil nu et d’en alerter le conducteur.
in scheme: Automobile
in scheme: concepts
notation: AUTO129
note: L'aide à la vision de nuit peut également permettre de déclencher des signaux indiquant la présence du véhicule.

recouvrement
type: ConceptConcept
type: Concept
creator: Commission d'enrichissement de la langue française, FranceTerme
date parution JO: 2004-02-15
equivalent EN: overlap @en
equivalent EN: overlap (en)
part of speech: nom masculin
definition: Portion de la largeur frontale d'un véhicule heurtant (ou heurté) en contact avec un autre véhicule ou un obstacle, au moment d'un choc avec décalage.
in scheme: Automobile
in scheme: concepts
notation: AUTO13
related: décalage

surveillance des angles morts
type: ConceptConcept
type: Concept
creator: Commission d'enrichissement de la langue française, FranceTerme
date parution JO: 2015-07-28
equivalent EN: blind spot detection @en
equivalent EN: blind spot detection (en)
definition: Système qui détecte les dangers potentiels dans les angles morts du véhicule et qui alerte le conducteur à l'aide d'un signal lumineux, sonore ou vibratoire.
in scheme: Automobile
in scheme: concepts
notation: AUTO130
note: Certains systèmes de surveillance des angles morts corrigent automatiquement la marche du véhicule.
related: système d'aide à la conduite

gestion de la batterie
type: ConceptConcept
type: Concept
creator: Commission d'enrichissement de la langue française, FranceTerme
abbreviation: BMS @en
date parution JO: 2015-07-28
deconseille ou frequent: GOB
equivalent EN: BMS @en
equivalent EN: BMS (en)
equivalent EN: battery management system @en
equivalent EN: battery management system (en)
definition: Système électronique qui assure le contrôle et l'optimisation du fonctionnement de la batterie d'un véhicule en régulant sa charge et sa décharge, et qui en mesure les paramètres.
in scheme: Automobile
in scheme: concepts
notation: AUTO131

suivi de voie automatique
type: ConceptConcept
type: Concept
creator: Commission d'enrichissement de la langue française, FranceTerme
date parution JO: 2015-07-28
equivalent EN: active lane keeping assist @en
equivalent EN: active lane keeping assist (en)
definition: Système qui corrige la trajectoire du véhicule pour le maintenir dans sa voie.
in scheme: Automobile
in scheme: concepts
notation: AUTO132
related: conduite autonome en embouteillage
related: avertisseur de sortie involontaire de voie

surveillance de la pression des pneus
type: ConceptConcept
type: Concept
creator: Commission d'enrichissement de la langue française, FranceTerme
abbreviation: TPMS @en
date parution JO: 2015-07-28
equivalent EN: TPMS @en
equivalent EN: TPMS (en)
equivalent EN: tire pressure monitoring system @en
equivalent EN: tire pressure monitoring system (en)
equivalent EN: tyre pressure monitoring system @en
equivalent EN: tyre pressure monitoring system (en)
definition: Système de diagnostic embarqué fonctionnant grâce à des capteurs, qui permet d’alerter le conducteur en cas de baisse de pression d’un ou de plusieurs pneus de son véhicule.
in scheme: Automobile
in scheme: concepts
notation: AUTO133
related: système de diagnostic embarqué

système précollision
type: ConceptConcept
type: Concept
creator: Commission d'enrichissement de la langue française, FranceTerme
abbreviation: PCS @en
date parution JO: 2015-07-28
deconseille ou frequent: système precrash
equivalent EN: PCS @en
equivalent EN: PCS (en)
equivalent EN: precrash system @en
equivalent EN: precrash system (en)
definition: Dispositif qui détecte l’imminence d’une collision et permet d'en atténuer les conséquences en actionnant des systèmes de sécurité du véhicule.
in scheme: Automobile
in scheme: concepts
notation: AUTO134

tout-chemin de loisir
type: ConceptConcept
type: Concept
creator: Commission d'enrichissement de la langue française, FranceTerme
abbreviation: CUV @en
abbreviation: TCL
date parution JO: 2015-07-28
equivalent EN: CUV @en
equivalent EN: CUV (en)
equivalent EN: crossover utility vehicle @en
equivalent EN: crossover utility vehicle (en)
definition: Véhicule de tourisme, de taille moyenne, caractérisé par une garde au sol élevée et une position de conduite haute.
in scheme: Automobile
in scheme: concepts
notation: AUTO135
note: Contrairement au tout-terrain de loisir, le tout-chemin de loisir ne dispose généralement pas de quatre roues motrices.
related: tout-terrain de loisir

véhicule à motorisation hybride
type: ConceptConcept
type: Concept
creator: Commission d'enrichissement de la langue française, FranceTerme
date parution JO: 2015-07-28
equivalent EN: hybrid @en
equivalent EN: hybrid (en)
equivalent EN: hybrid vehicle @en
equivalent EN: hybrid vehicle (en)
forme abregee: hybride, n.m.
forme abregee: véhicule hybride
definition: Véhicule dont la propulsion est obtenue par l’association d’un moteur thermique et d’un ou de plusieurs moteurs utilisant un autre type d'énergie.
in scheme: Automobile
in scheme: concepts
notation: AUTO136
related: hybridation
related: véhicule à motorisation hybride complète
related: véhicule à motorisation microhybride
related: véhicule à motorisation semi-hybride
related: véhicule à motorisation hybride rechargeable
related: véhicule hybride à air comprimé
scope note: Cette publication annule et remplace celle du Journal officiel du 8 juin 2011.

véhicule hybride à air comprimé
type: ConceptConcept
type: Concept
creator: Commission d'enrichissement de la langue française, FranceTerme
date parution JO: 2015-07-28
deconseille ou frequent: hybride air
equivalent EN: hybrid air @en
equivalent EN: hybrid air (en)
forme abregee: hybride à air comprimé
definition: Véhicule à motorisation hybride dont la propulsion est obtenue par la combinaison de l’énergie thermique et de l’énergie pneumatique.
in scheme: Automobile
in scheme: concepts
notation: AUTO137
note: L’énergie pneumatique, stockée dans un réservoir, est produite par un compresseur qui récupère en particulier l’énergie de décélération du véhicule.
related: hybridation
related: véhicule à motorisation hybride

multimarquage
type: ConceptConcept
type: Concept
creator: Commission d'enrichissement de la langue française, FranceTerme
date parution JO: 2016-06-11
equivalent EN: crossbadging @en
equivalent EN: crossbadging (en)
part of speech: nom masculin
definition: Stratégie d’entreprise qui consiste à concevoir et à commercialiser un véhicule sous plusieurs marques, chaque marque assurant la différenciation des véhicules par des modifications d’aspect.
in scheme: Automobile
in scheme: Économie et gestion d'entreprise
in scheme: concepts
notation: AUTO139
related: remarquage

régulateur de vitesse et d'espacement
type: ConceptConcept
type: Concept
creator: Commission d'enrichissement de la langue française, FranceTerme
abbreviation: ACC @en
abbreviation: RVE
date parution JO: 2004-02-15
equivalent EN: ACC @en
equivalent EN: ACC (en)
equivalent EN: adaptive cruise control @en
equivalent EN: adaptive cruise control (en)
definition: Dispositif embarqué agissant automatiquement et qui permet à un véhicule d'en suivre un autre à une distance appropriée.
in scheme: Automobile
in scheme: concepts
notation: AUTO14
related: conduite autonome en embouteillage

remarquage
type: ConceptConcept
type: Concept
creator: Commission d'enrichissement de la langue française, FranceTerme
date parution JO: 2016-06-11
equivalent EN: badge engineering @en
equivalent EN: badge engineering (en)
equivalent EN: rebadging @en
equivalent EN: rebadging (en)
part of speech: nom masculin
definition: Stratégie d’entreprise qui consiste à commercialiser sous une marque différente un véhicule proposé jusqu’alors à la vente sous une autre marque.
in scheme: Automobile
in scheme: Économie et gestion d'entreprise
in scheme: concepts
notation: AUTO140
related: multimarquage

suspension anticipative
type: ConceptConcept
type: Concept
creator: Commission d'enrichissement de la langue française, FranceTerme
date parution JO: 2016-06-11
deconseille ou frequent: Magic body control
definition: Système qui adapte en permanence les réglages de la suspension grâce à l’évaluation, par des capteurs, du relief de la chaussée en avant du véhicule.
in scheme: Automobile
in scheme: concepts
notation: AUTO141
note: « Magic body control », qui est un nom de marque, ne doit pas être employé.
related: suspension adaptative

système d'aide à la conduite
type: ConceptConcept
type: Concept
creator: Commission d'enrichissement de la langue française, FranceTerme
date parution JO: 2016-06-11
deconseille ou frequent: système avancé d'aide à la conduite
equivalent EN: ADAS @en
equivalent EN: ADAS (en)
equivalent EN: advanced driver assistance system @en
equivalent EN: advanced driver assistance system (en)
definition: Système embarqué d'assistance et d’information destiné à faciliter la conduite du véhicule et à la rendre plus sûre.
in scheme: Automobile
in scheme: concepts
notation: AUTO142
note: On trouve aussi le terme « système avancé d'aide à la conduite ».
related: surveillance des angles morts
related: système de vue aérienne
related: avertisseur de sortie involontaire de voie

véhicule autonome
type: ConceptConcept
type: Concept
creator: Commission d'enrichissement de la langue française, FranceTerme
date parution JO: 2016-06-11
equivalent EN: autonomous vehicle @en
equivalent EN: autonomous vehicle (en)
equivalent EN: self-driving vehicle @en
equivalent EN: self-driving vehicle (en)
definition: Véhicule connecté qui, une fois programmé, se déplace sur la voie publique de façon automatique, sans intervention de ses utilisateurs.
in scheme: Automobile
in scheme: concepts
notation: AUTO143
related: voiturier automatique
related: véhicule connecté
related: conduite autonome en embouteillage
related: conduite autonome
related: taxi sans chauffeur
related: navette autonome

véhicule connecté
type: ConceptConcept
type: Concept
creator: Commission d'enrichissement de la langue française, FranceTerme
date parution JO: 2016-06-11
equivalent EN: connected vehicle @en
equivalent EN: connected vehicle (en)
definition: Véhicule automobile doté de technologies lui permettant d’échanger en continu des données avec son environnement.
in scheme: Automobile
in scheme: concepts
notation: AUTO144
note: Un véhicule connecté peut échanger des données avec des centres de services automobiles spécialisés, avec des systèmes de géolocalisation, avec d’autres véhicules ou encore avec divers dispositifs de l’infrastructure routière.
related: véhicule autonome
related: assurance à la conduite
related: géonavigateur participatif
related: concept-TELE538

assurance au kilomètre
type: ConceptConcept
type: Concept
creator: Commission d'enrichissement de la langue française, FranceTerme
date parution JO: 2016-06-11
equivalent EN: PAYD @en
equivalent EN: PAYD (en)
equivalent EN: PAYD insurance @en
equivalent EN: PAYD insurance (en)
equivalent EN: pay-as-you-drive @en
equivalent EN: pay-as-you-drive (en)
equivalent EN: pay-as-you-drive insurance @en
equivalent EN: pay-as-you-drive insurance (en)
definition: Contrat d’assurance d’un véhicule dont la prime est ajustée en fonction du nombre de kilomètres parcourus durant une période donnée.
in scheme: Assurance
in scheme: Automobile
in scheme: concepts
notation: AUTO145
related: assurance à la conduite
related: assurance automobile à la minute

gestion thermique du moteur
type: ConceptConcept
type: Concept
creator: Commission d'enrichissement de la langue française, FranceTerme
date parution JO: 2018-03-28
deconseille ou frequent: thermo management
equivalent EN: thermomanagement @en
equivalent EN: thermomanagement (en)
definition: Système qui optimise la circulation du liquide de refroidissement à l’intérieur d’un moteur thermique afin d’en accélérer la montée en température et de réduire ainsi la consommation de carburant et les émissions.
in scheme: Automobile
in scheme: concepts
notation: AUTO146
preferred label: thermomanagement @en

caméra-témoin de circulation
type: ConceptConcept
type: Concept
creator: Commission d'enrichissement de la langue française, FranceTerme
date parution JO: 2018-03-28
deconseille ou frequent: ConnectedCAM
deconseille ou frequent: caméra-témoin de trafic
equivalent EN: dash camera @en
equivalent EN: dash camera (en)
equivalent EN: dashboard camera @en
equivalent EN: dashboard camera (en)
equivalent EN: dashcam @en
equivalent EN: dashcam (en)
equivalent EN: scene recorder @en
equivalent EN: scene recorder (en)
definition: Caméra embarquée qui enregistre ce qui se passe en avant du véhicule.
in scheme: Automobile
in scheme: concepts
notation: AUTO147
note: Le plus souvent, seules les dernières minutes de l’enregistrement sont conservées en mémoire ; elles servent, par exemple, à documenter les circonstances d’un accident.
preferred label: dashboard camera @en

tourbillon longitudinal
type: ConceptConcept
type: Concept
creator: Commission d'enrichissement de la langue française, FranceTerme
date parution JO: 2004-02-15
equivalent EN: swirl @en
equivalent EN: swirl (en)
definition: Mouvement tourbillonnaire hélicoïdal des gaz d'admission dans le cylindre d'un moteur, dont l'axe de rotation est parallèle à l'axe du cylindre.
in scheme: Automobile
in scheme: concepts
notation: AUTO15
related: tourbillon transversal

conduite autonome en embouteillage
type: ConceptConcept
type: Concept
creator: Commission d'enrichissement de la langue française, FranceTerme
date parution JO: 2018-03-28
deconseille ou frequent: conduite automatique en embouteillage
equivalent EN: traffic jam assist @en
equivalent EN: traffic jam assist (en)
equivalent EN: traffic jam chauffeur @en
equivalent EN: traffic jam chauffeur (en)
equivalent EN: traffic jam pilot @en
equivalent EN: traffic jam pilot (en)
definition: Système qui permet à un véhicule de se déplacer de façon automatique dans les embouteillages.
in scheme: Automobile
in scheme: concepts
notation: AUTO151
note: Les conduites autonomes en embouteillage les plus simples permettent seulement de suivre le véhicule précédent dans une même file ; les plus élaborées permettent également le changement de file.
preferred label: traffic jam assist @en
related: suivi de voie automatique
related: régulateur de vitesse et d'espacement
related: véhicule autonome
related: conduite autonome

assurance à la conduite
type: ConceptConcept
type: Concept
creator: Commission d'enrichissement de la langue française, FranceTerme
date parution JO: 2018-03-28
equivalent EN: PHYD insurance @en
equivalent EN: PHYD insurance (en)
equivalent EN: pay-how-you-drive insurance @en
equivalent EN: pay-how-you-drive insurance (en)
definition: Contrat d’assurance d’un véhicule dont la prime est calculée en fonction du comportement au volant des conducteurs et du mode d’utilisation du véhicule.
in scheme: Assurance
in scheme: Automobile
in scheme: concepts
notation: AUTO155
note: Le comportement des conducteurs et le mode d’utilisation du véhicule sont appréciés en fonction des données transmises à la compagnie d’assurances par des capteurs embarqués.
preferred label: pay-how-you-drive insurance @en
related: véhicule connecté
related: assurance au kilomètre
related: assurance automobile à la minute

conduite autonome
type: ConceptConcept
type: Concept
creator: Commission d'enrichissement de la langue française, FranceTerme
date parution JO: 2018-03-28
equivalent EN: automated driving @en
equivalent EN: automated driving (en)
equivalent EN: autonomous driving @en
equivalent EN: autonomous driving (en)
definition: Mode de conduite automatique d’un véhicule, qui ne requiert pas l’intervention de ses utilisateurs ; par extension, système qui permet ce mode de conduite.
in scheme: Automobile
in scheme: Transports et mobilité
in scheme: concepts
notation: AUTO157
preferred label: automated driving @en
related: véhicule autonome
related: conduite autonome en embouteillage
related: navette autonome

contrôle de vigilance
type: ConceptConcept
type: Concept
creator: Commission d'enrichissement de la langue française, FranceTerme
date parution JO: 2018-03-28
deconseille ou frequent: Attention assist
deconseille ou frequent: driver alert control
equivalent EN: driver alert @en
equivalent EN: driver alert (en)
equivalent EN: driver alert system @en
equivalent EN: driver alert system (en)
equivalent EN: driver monitoring @en
equivalent EN: driver monitoring (en)
equivalent EN: driver monitoring system @en
equivalent EN: driver monitoring system (en)
forme developpee: driver alert system @en
forme developpee: système de contrôle de vigilance
definition: Dispositif embarqué qui, au moyen de capteurs, analyse le comportement du conducteur afin de détecter une éventuelle baisse de sa vigilance et de l’en avertir.
in scheme: Automobile
in scheme: concepts
notation: AUTO158
note: 1. Les capteurs utilisés peuvent être des caméras qui analysent les mouvements des yeux et de la tête du conducteur. Il existe également des systèmes d’analyse de la rotation du volant qui permettent d’apprécier l’état de vigilance du conducteur.
note: 2. Le terme « Attention assist », qui est un nom de marque déposée, ne doit pas être utilisé.
preferred label: driver alert @en
related: concept-SANT174

géonavigateur participatif
type: ConceptConcept
type: Concept
creator: Commission d'enrichissement de la langue française, FranceTerme
date parution JO: 2018-03-28
deconseille ou frequent: GPS communautaire
deconseille ou frequent: GPS participatif
deconseille ou frequent: géonavigateur communautaire
deconseille ou frequent: waze
definition: Système de géonavigation qui exploite en temps réel les informations reçues automatiquement des véhicules connectés à ce système ou fournies par le conducteur.
in scheme: Automobile
in scheme: Transports et mobilité
in scheme: concepts
notation: AUTO159
related: véhicule connecté
related: géonavigateur
related: concept-TELE547

tourbillon transversal
type: ConceptConcept
type: Concept
creator: Commission d'enrichissement de la langue française, FranceTerme
date parution JO: 2004-02-15
equivalent EN: tumble @en
equivalent EN: tumble (en)
definition: Mouvement tourbillonnaire hélicoïdal des gaz d'admission dans le cylindre d'un moteur, dont l'axe de rotation est perpendiculaire à l'axe du cylindre.
in scheme: Automobile
in scheme: concepts
notation: AUTO16
related: tourbillon longitudinal

duplication d'écran
type: ConceptConcept
type: Concept
creator: Commission d'enrichissement de la langue française, FranceTerme
date parution JO: 2018-03-28
deconseille ou frequent: Mirror Link
deconseille ou frequent: car play
deconseille ou frequent: réplication d'écran
equivalent EN: mirroring @en
equivalent EN: mirroring (en)
equivalent EN: screen mirroring @en
equivalent EN: screen mirroring (en)
definition: Système qui permet, sur un terminal multimédia, d’afficher l’écran d’un mobile multifonction ou d’un autre terminal et d’accéder à certaines des fonctions et applications de ce dernier ; par extension, l’affichage ainsi obtenu.
in scheme: Automobile
in scheme: Télécommunications
in scheme: concepts
notation: AUTO160
note: 1. Dans le domaine de l’automobile, le terminal multimédia est intégré au tableau de bord du véhicule.
note: 2. Le terme « Mirror Link », qui est un nom de marque déposée, ne doit pas être utilisé.
preferred label: screen mirroring @en

taxi sans chauffeur
type: ConceptConcept
type: Concept
creator: Commission d'enrichissement de la langue française, FranceTerme
date parution JO: 2018-03-28
deconseille ou frequent: robot taxi
equivalent EN: autonomous taxi @en
equivalent EN: autonomous taxi (en)
equivalent EN: driverless cab @en
equivalent EN: driverless cab (en)
equivalent EN: driverless taxi @en
equivalent EN: driverless taxi (en)
alternative label: taxi autonome
definition: Véhicule autonome servant de taxi, dont la course est commandée au moyen d’une application informatique.
in scheme: Automobile
in scheme: Transports et mobilité
in scheme: concepts
notation: AUTO161
preferred label: autonomous taxi @en
related: véhicule autonome
related: navette autonome

plateforme modulaire
type: ConceptConcept
type: Concept
creator: Commission d'enrichissement de la langue française, FranceTerme
date parution JO: 2020-06-03
deconseille ou frequent: plate forme madulaire
deconseille ou frequent: plate forme modulable
equivalent EN: CMP @en
equivalent EN: CMP (en)
equivalent EN: common modular platform @en
equivalent EN: common modular platform (en)
alternative label: plateforme modulable
definition: Plateforme conçue pour recevoir des organes de même fonction mais de dessin différent.
in scheme: Automobile
in scheme: concepts
notation: AUTO162
note: Une plateforme modulaire peut, par exemple, permettre plusieurs empattements et recevoir diverses sortes de trains roulants avant et arrière, de réservoirs à carburant et de motorisations.
related: plateforme

assurance automobile à la minute
type: ConceptConcept
type: Concept
creator: Commission d'enrichissement de la langue française, FranceTerme
date parution JO: 2020-06-03
deconseille ou frequent: PWYD insurance
deconseille ou frequent: pay when you drive insurance
forme abregee: assurance à la minute
definition: Contrat d’assurance d’un véhicule dont la prime est calculée en fonction du temps d’utilisation effectif.
in scheme: Assurance
in scheme: Automobile
in scheme: concepts
notation: AUTO163
note: Le temps d’utilisation est calculé à l’aide d’un dispositif connecté embarqué.
related: assurance au kilomètre
related: assurance à la conduite
related: système de diagnostic embarqué
related: concept-TELE538

commande gestuelle
type: ConceptConcept
type: Concept
creator: Commission d'enrichissement de la langue française, FranceTerme
date parution JO: 2020-06-03
deconseille ou frequent: reconnaissance gestuelle
equivalent EN: gesture control @en
equivalent EN: gesture control (en)
definition: Dispositif qui permet au conducteur d’un véhicule de commander par geste, sans contact physique avec un instrument de bord, certaines fonctions non essentielles à la conduite tout en continuant à regarder la route.
in scheme: Automobile
in scheme: concepts
notation: AUTO164
note: 1. La commande gestuelle fait appel à des capteurs dont les informations sont traitées par un logiciel capable de reconnaître une gamme de gestes prédéfinis et de déclencher l’action correspondante.
note: 2. La commande gestuelle peut concerner, par exemple, le volume sonore délivré par les haut-parleurs ou la prise d’un appel téléphonique.
related: interface avec l'utilisateur

feux de route antiéblouissement
type: ConceptConcept
type: Concept
creator: Commission d'enrichissement de la langue française, FranceTerme
date parution JO: 2020-06-03
deconseille ou frequent: GFHB
deconseille ou frequent: feu de route anti éblouissement
deconseille ou frequent: feu de route antiéblouissement
deconseille ou frequent: feux de route anti éblouissement
deconseille ou frequent: glare-free highbeam
equivalent EN: glare-free high beam @en
equivalent EN: glare-free high beam (en)
definition: Feux de route commandés par un dispositif qui modifie automatiquement la forme du faisceau lumineux en présence d’autres véhicules pour éviter d’éblouir leur conducteur.
in scheme: Automobile
in scheme: concepts
notation: AUTO165
related: projecteur adaptatif
related: feux de route automatiques

plateforme
type: ConceptConcept
type: Concept
creator: Commission d'enrichissement de la langue française, FranceTerme
date parution JO: 2020-06-03
deconseille ou frequent: plate-forme
equivalent EN: platform @en
equivalent EN: platform (en)
part of speech: nom féminin
definition: Ensemble de composants formant une structure de base commune à des véhicules différents, ce qui permet des économies d’échelle.
in scheme: Automobile
in scheme: concepts
notation: AUTO166
note: 1. La plateforme détermine la voie et l’empattement des véhicules.
note: 2. La plateforme comprend généralement le soubassement, le groupe motopropulseur et les trains roulants, voire des éléments tels que le système de climatisation, les sièges et le réservoir.
related: plateforme modulaire
scope note: Cette publication annule et remplace celle du Journal officiel du 23 décembre 2007.

projecteur adaptatif
type: ConceptConcept
type: Concept
creator: Commission d'enrichissement de la langue française, FranceTerme
date parution JO: 2020-06-03
deconseille ou frequent: feu adaptatif
deconseille ou frequent: feux adaptatifs
definition: Projecteur qui émet un faisceau lumineux dont la forme et l’intensité s’adaptent automatiquement aux conditions de circulation telles que la présence d’autres véhicules, le lieu et la nature de la voie, l’éclairage ambiant ou les conditions météorologiques, ainsi qu’à la vitesse du véhicule.
in scheme: Automobile
in scheme: concepts
notation: AUTO167
note: L’antiéblouissement est une des fonctions du projecteur adaptatif.
related: feux de route antiéblouissement
related: feux de route automatiques

signature lumineuse
type: ConceptConcept
type: Concept
creator: Commission d'enrichissement de la langue française, FranceTerme
date parution JO: 2020-06-03
equivalent EN: lighting signature @en
equivalent EN: lighting signature (en)
definition: Stylisation des dispositifs d’éclairage d’un véhicule, qui permet d’identifier la marque, voire le modèle.
in scheme: Automobile
in scheme: concepts
notation: AUTO169
note: La signature lumineuse s’applique généralement aux feux de jour et aux feux de signalisation arrière auxquels on donne un dessin représentatif de la marque ou du modèle.
related: feux de jour

système d'optimisation d'adhérence
type: ConceptConcept
type: Concept
creator: Commission d'enrichissement de la langue française, FranceTerme
date parution JO: 2020-06-03
deconseille ou frequent: extended grip
equivalent EN: advanced grip control @en
equivalent EN: advanced grip control (en)
equivalent EN: grip control @en
equivalent EN: grip control (en)
forme abregee: optimisation d'adhérence
definition: Système qui, en agissant sur la puissance délivrée par le moteur et sur la vitesse de rotation de chacune des roues motrices par l’intermédiaire des freins, permet d’optimiser l’adhérence d’un véhicule à deux roues motrices.
in scheme: Automobile
in scheme: concepts
notation: AUTO171
note: Le système d’optimisation d’adhérence est particulièrement utile dans des conditions difficiles, telles que des terrains enneigés, sablonneux ou boueux.

robot collaboratif
type: ConceptConcept
type: Concept
creator: Commission d'enrichissement de la langue française, FranceTerme
date parution JO: 2020-06-03
equivalent EN: cobot @en
equivalent EN: cobot (en)
equivalent EN: collaborative robot @en
equivalent EN: collaborative robot (en)
definition: Robot capable d’interagir avec l’homme dans un espace de travail partagé, pour accomplir une tâche prédéfinie.
in scheme: Économie générale
in scheme: Industrie
in scheme: Robotique
in scheme: concepts
notation: AUTO172

feux de route automatiques
type: ConceptConcept
type: Concept
creator: Commission d'enrichissement de la langue française, FranceTerme
date parution JO: 2020-06-03
deconseille ou frequent: feu de route automatique
definition: Feux de route commandés par un dispositif qui enclenche automatiquement la fonction feux de croisement en présence d’autres véhicules pour éviter d’éblouir leur conducteur.
in scheme: Automobile
in scheme: concepts
notation: AUTO173
related: feux de route antiéblouissement
related: projecteur adaptatif

décalage
type: ConceptConcept
type: Concept
creator: Commission d'enrichissement de la langue française, FranceTerme
date parution JO: 2004-02-15
equivalent EN: offset @en
equivalent EN: offset (en)
part of speech: nom masculin
definition: Distance qui, dans un choc latéral, sépare l'axe longitudinal du véhicule heurtant de l'axe transversal médian du véhicule heurté.
in scheme: Automobile
in scheme: concepts
notation: AUTO174
note: Le terme peut être également utilisé dans le cas d'un choc entre un véhicule et un obstacle fixe.
related: recouvrement
related: décalage

communication de véhicule à X
type: ConceptConcept
type: Concept
creator: Commission d'enrichissement de la langue française, FranceTerme
date parution JO: 2022-03-30
deconseille ou frequent: VAX
deconseille ou frequent: communication V2X
deconseille ou frequent: technologie V2X
deconseille ou frequent: vehicle to X communication
deconseille ou frequent: vehicle to everything
deconseille ou frequent: véhicule à X
equivalent EN: V2X @en
equivalent EN: V2X (en)
equivalent EN: V2X communication @en
equivalent EN: V2X communication (en)
equivalent EN: vehicle-to-X communication @en
equivalent EN: vehicle-to-X communication (en)
equivalent EN: vehicle-to-everything @en
equivalent EN: vehicle-to-everything (en)
forme abregee: communication VAX
definition: Échange, par une liaison sans fil, d’informations ou de données entre un véhicule et une infrastructure routière, un réseau de télécommunication ou un objet connecté ; par extension, ensemble des systèmes de communication permettant cet échange.
in scheme: Automobile
in scheme: Transports et mobilité
in scheme: concepts
notation: AUTO175
note: La communication de véhicule à X peut être une communication de véhicule à véhicule, une communication de véhicule à infrastructure ou une communication de véhicule à réseau.
related: communication de véhicule à infrastructure
related: communication de véhicule à véhicule
related: communication de véhicule à réseau
related: concept-TELE538

communication de véhicule à infrastructure
type: ConceptConcept
type: Concept
creator: Commission d'enrichissement de la langue française, FranceTerme
date parution JO: 2022-03-30
deconseille ou frequent: communication V2I
deconseille ou frequent: technologie V2I
deconseille ou frequent: véhicule à infrastructure
equivalent EN: V2I @en
equivalent EN: V2I (en)
equivalent EN: V2I communication @en
equivalent EN: V2I communication (en)
equivalent EN: vehicle-to-infrastructure communication @en
equivalent EN: vehicle-to-infrastructure communication (en)
forme abregee: communication VAI
definition: Échange, par une liaison sans fil, d’informations ou de données entre un véhicule et le système de gestion de l’infrastructure routière, grâce à des relais situés le long des axes routiers ; par extension, ensemble des systèmes de communication permettant cet échange.
in scheme: Automobile
in scheme: Transports et mobilité
in scheme: concepts
notation: AUTO176
note: Les informations et les données échangées permettent aux gestionnaires du réseau routier d’établir en temps réel un état de la circulation qui est transmis aux véhicules.
related: communication de véhicule à X
related: communication de véhicule à véhicule
related: communication de véhicule à réseau

communication de véhicule à véhicule
type: ConceptConcept
type: Concept
creator: Commission d'enrichissement de la langue française, FranceTerme
date parution JO: 2022-03-30
deconseille ou frequent: communication V2V
deconseille ou frequent: communication entre véhicules
deconseille ou frequent: technologie V2V
equivalent EN: V2V @en
equivalent EN: V2V (en)
equivalent EN: V2V communication @en
equivalent EN: V2V communication (en)
equivalent EN: vehicle-to-vehicle communication @en
equivalent EN: vehicle-to-vehicle communication (en)
forme abregee: communication VAV
definition: Échange direct d’informations ou de données entre des véhicules par une liaison sans fil, notamment à des fins de sécurité ; par extension, ensemble des systèmes de communication permettant cet échange.
in scheme: Automobile
in scheme: Transports et mobilité
in scheme: concepts
notation: AUTO177
note: Les informations et les données échangées portent notamment sur la vitesse, la position et la direction des véhicules.
related: communication de véhicule à X
related: communication de véhicule à infrastructure
related: communication de véhicule à réseau

communication de véhicule à réseau
type: ConceptConcept
type: Concept
creator: Commission d'enrichissement de la langue française, FranceTerme
date parution JO: 2022-03-30
deconseille ou frequent: communication V2N
deconseille ou frequent: technologie V2N
deconseille ou frequent: véhicule à réseau
equivalent EN: V2N @en
equivalent EN: V2N (en)
equivalent EN: V2N communication @en
equivalent EN: V2N communication (en)
equivalent EN: vehicle-to-network communication @en
equivalent EN: vehicle-to-network communication (en)
forme abregee: communication VAR
definition: Échange, par une liaison sans fil, d’informations ou de données entre un véhicule et un réseau de télécommunication ; par extension, ensemble des systèmes de communication permettant cet échange.
in scheme: Automobile
in scheme: Transports et mobilité
in scheme: concepts
notation: AUTO178
related: communication de véhicule à X
related: communication de véhicule à infrastructure
related: communication de véhicule à véhicule

turborécupérateur
type: ConceptConcept
type: Concept
creator: Commission d'enrichissement de la langue française, FranceTerme
date parution JO: 2004-02-15
equivalent EN: turbocompound @en
equivalent EN: turbocompound (en)
part of speech: nom masculin
definition: Dispositif de récupération de l'énergie d'échappement d'un moteur diesel, qui comporte une turbine de suralimentation et une turbine agissant sur l'arbre moteur.
in scheme: Automobile
in scheme: concepts
notation: AUTO18

système d'infodivertissement
type: ConceptConcept
type: Concept
creator: Commission d'enrichissement de la langue française, FranceTerme
date parution JO: 2022-03-30
deconseille ou frequent: infodivertissement
deconseille ou frequent: multimédia de bord
equivalent EN: infotainment system @en
equivalent EN: infotainment system (en)
definition: Équipement embarqué qui regroupe les fonctions de géonavigation, de téléphonie, ainsi que l’accès à des contenus audio et vidéo ou à des services en ligne.
in scheme: Automobile
in scheme: Transports et mobilité
in scheme: concepts
notation: AUTO180
related: géonavigateur
related: multimédia de bord

rétroviseur numérique
type: ConceptConcept
type: Concept
creator: Commission d'enrichissement de la langue française, FranceTerme
date parution JO: 2022-03-30
deconseille ou frequent: CMS
deconseille ou frequent: SRVM
deconseille ou frequent: camera monitoring system
deconseille ou frequent: digital rear view mirror
deconseille ou frequent: e-mirror system
deconseille ou frequent: intelligent rear view mirror
deconseille ou frequent: rétroviseur numérique
deconseille ou frequent: rétrovision par caméra
deconseille ou frequent: smart rear view mirror
equivalent EN: e-mirror @en
equivalent EN: e-mirror (en)
definition: Dispositif de rétrovision comprenant plusieurs écrans qui affichent les images provenant de caméras fixées sur le véhicule.
in scheme: Automobile
in scheme: concepts
notation: AUTO181
note: Le rétroviseur numérique supprime les angles morts et permet une vision large vers l’arrière du véhicule, ce qui contribue à la sécurité. Il améliore l’aérodynamisme du véhicule, les caméras ayant une plus faible résistance à l’air que les rétroviseurs traditionnels.

système de vue aérienne
type: ConceptConcept
type: Concept
creator: Commission d'enrichissement de la langue française, FranceTerme
date parution JO: 2022-03-30
deconseille ou frequent: Bird’s Eye View Camera
deconseille ou frequent: bird view camera system
deconseille ou frequent: bird view system
deconseille ou frequent: birdview
deconseille ou frequent: birdview camera system
equivalent EN: birdview system @en
equivalent EN: birdview system (en)
forme abregee: vue aérienne
definition: Système d’aide à la conduite qui, grâce à des caméras fixées sur le véhicule, reconstitue une vue de dessus de celui-ci et de son environnement immédiat, facilitant ainsi les manœuvres à basse vitesse.
in scheme: Automobile
in scheme: concepts
notation: AUTO182
related: système d'aide à la conduite

pré-tendeur
type: ConceptConcept
type: Concept
creator: Commission d'enrichissement de la langue française, FranceTerme
date parution JO: 1999-10-23
equivalent EN: pretensioner @en
equivalent EN: pretensioner (en)
part of speech: nom masculin
definition: Dispositif qui imprime, dès la survenance d'un choc, une tension initiale à la ceinture de sécurité pour la rendre plus rapidement efficace.
in scheme: Automobile
in scheme: concepts
notation: AUTO2

rampe commune à haute pression
type: ConceptConcept
type: Concept
creator: Commission d'enrichissement de la langue française, FranceTerme
date parution JO: 1999-10-23
equivalent EN: common rail @en
equivalent EN: common rail (en)
forme abregee: rampe commune
definition: Rampe d'alimentation commune, maintenue à très haute pression, qui permet une injection directe du carburant dans chaque cylindre d'un moteur.
in scheme: Automobile
in scheme: concepts
notation: AUTO3

angle d'attaque
type: ConceptConcept
type: Concept
creator: Commission d'enrichissement de la langue française, FranceTerme
date parution JO: 2006-04-05
equivalent EN: approach angle @en
equivalent EN: approach angle (en)
definition: Inclinaison maximale de la pente ascendante que peut aborder un véhicule sans endommager le bas de sa caisse.
in scheme: Automobile
in scheme: concepts
notation: AUTO35
related: angle de crête
related: angle de fuite

angle de crête
type: ConceptConcept
type: Concept
creator: Commission d'enrichissement de la langue française, FranceTerme
date parution JO: 2006-04-05
equivalent EN: ramp angle @en
equivalent EN: ramp angle (en)
definition: Angle minimal d'une crête que peut franchir un véhicule sans endommager le bas de sa caisse.
in scheme: Automobile
in scheme: concepts
notation: AUTO36
related: angle d'attaque
related: angle de fuite

angle de fuite
type: ConceptConcept
type: Concept
creator: Commission d'enrichissement de la langue française, FranceTerme
date parution JO: 2006-04-05
equivalent EN: departure angle @en
equivalent EN: departure angle (en)
definition: Inclinaison maximale de la pente descendante que peut aborder un véhicule sans endommager le bas de sa caisse.
in scheme: Automobile
in scheme: concepts
notation: AUTO37
related: angle d'attaque
related: angle de crête

assistance au freinage d'urgence
type: ConceptConcept
type: Concept
creator: Commission d'enrichissement de la langue française, FranceTerme
abbreviation: AFU
abbreviation: BAS @en
abbreviation: DBC @en
abbreviation: EBA @en
date parution JO: 2006-04-05
equivalent EN: BAS @en
equivalent EN: BAS (en)
equivalent EN: DBC @en
equivalent EN: DBC (en)
equivalent EN: EBA @en
equivalent EN: EBA (en)
equivalent EN: brake assistance system @en
equivalent EN: brake assistance system (en)
equivalent EN: dynamic brake control @en
equivalent EN: dynamic brake control (en)
equivalent EN: emergency brake assist @en
equivalent EN: emergency brake assist (en)
definition: Système agissant sur les freins qui permet d'obtenir une décélération maximale dans une situation d'urgence.
in scheme: Automobile
in scheme: concepts
notation: AUTO38
note: Ce système concerne principalement les véhicules équipés de l'antiblocage de sécurité (ABS).
related: antiblocage de sécurité

carnet de route
type: ConceptConcept
type: Concept
creator: Commission d'enrichissement de la langue française, FranceTerme
date parution JO: 2006-04-05
equivalent EN: road book @en
equivalent EN: road book (en)
definition: Ensemble de notes et d'indications relatives à la topographie et à la signalisation qui permettent à l'équipage d'un véhicule de rallye de s'orienter plus facilement sur le parcours.
in scheme: Automobile
in scheme: concept-SD-automobile-sport-automobile
in scheme: concepts
notation: AUTO40
related: concept-automobile

citadine
type: ConceptConcept
type: Concept
creator: Commission d'enrichissement de la langue française, FranceTerme
date parution JO: 2006-04-05
equivalent EN: city car @en
equivalent EN: city car (en)
part of speech: nom féminin
definition: Petite voiture particulière destinée principalement à l'usage urbain.
in scheme: Automobile
in scheme: concepts
notation: AUTO41

commande électrique (à)
type: ConceptConcept
type: Concept
creator: Commission d'enrichissement de la langue française, FranceTerme
date parution JO: 2006-04-05
deconseille ou frequent: commande électrique
deconseille ou frequent: à commande électrique
equivalent EN: by-wire @en
equivalent EN: by-wire (en)
part of speech: locution adjectivale
definition: Se dit de la transmission d'un ordre assurée par une liaison électrique ou électronique.
in scheme: Automobile
in scheme: concepts
notation: AUTO42

compresseur d'alimentation
type: ConceptConcept
type: Concept
creator: Commission d'enrichissement de la langue française, FranceTerme
date parution JO: 2006-04-05
equivalent EN: supercharger @en
equivalent EN: supercharger (en)
forme abregee: compresseur, n.m.
definition: Compresseur entraîné mécaniquement ou électriquement, qui augmente la quantité d'air fournie au moteur.
in scheme: Automobile
in scheme: concept-SD-automobile-moteurs
in scheme: concepts
notation: AUTO43

feux de détresse
type: ConceptConcept
type: Concept
creator: Commission d'enrichissement de la langue française, FranceTerme
abbreviation: hazard lights @en
date parution JO: 2006-04-05
deconseille ou frequent: warning
deconseille ou frequent: warnings
equivalent EN: hazard lights @en
equivalent EN: hazard lights (en)
equivalent EN: hazard warning lights @en
equivalent EN: hazard warning lights (en)
definition: Feux de signalisation clignotant de façon simultanée pour indiquer une situation de danger, tels l'arrêt forcé d'un véhicule ou la réduction soudaine de sa vitesse.
in scheme: Automobile
in scheme: concepts
notation: AUTO44
note: L'emploi en français des mots warning et warnings est à proscrire.

multimarque
type: ConceptConcept
type: Concept
creator: Commission d'enrichissement de la langue française, FranceTerme
date parution JO: 2006-04-05
deconseille ou frequent: multibranding
part of speech: adjectif
definition: Se dit de la vente, par un même distributeur, de véhicules automobiles de marques différentes.
in scheme: Automobile
in scheme: concepts
notation: AUTO45

piraterie routière
type: ConceptConcept
type: Concept
creator: Commission d'enrichissement de la langue française, FranceTerme
date parution JO: 2006-04-05
deconseille ou frequent: car jacking
equivalent EN: carjacking @en
equivalent EN: carjacking (en)
definition: Vol d'un véhicule avec agression du conducteur.
in scheme: Automobile
in scheme: concepts
notation: AUTO46
related: pirate de la route

télésécurité
type: ConceptConcept
type: Concept
creator: Commission d'enrichissement de la langue française, FranceTerme
date parution JO: 2006-04-05
equivalent EN: e-safety @en
equivalent EN: e-safety (en)
part of speech: nom féminin
definition: Ensemble des systèmes électroniques et télématiques qui visent à renforcer la sécurité des usagers de la route en améliorant les réactions des véhicules en fonction de leur environnement routier.
in scheme: Automobile
in scheme: concepts
notation: AUTO47

véhicule métis
type: ConceptConcept
type: Concept
creator: Commission d'enrichissement de la langue française, FranceTerme
abbreviation: crossover @en
date parution JO: 2006-04-05
deconseille ou frequent: cross over
equivalent EN: crossover @en
equivalent EN: crossover (en)
equivalent EN: crossover vehicle @en
equivalent EN: crossover vehicle (en)
forme abregee: métis, n.m.
definition: Véhicule dont la carrosserie réunit des caractéristiques propres à deux ou plusieurs catégories différentes.
in scheme: Automobile
in scheme: concepts
notation: AUTO48

pirate de la route
type: ConceptConcept
type: Concept
creator: Commission d'enrichissement de la langue française, FranceTerme
date parution JO: 2006-04-05
equivalent EN: carjacker @en
equivalent EN: carjacker (en)
in scheme: Automobile
in scheme: concepts
notation: AUTO49
related: piraterie routière

moteur à injection directe
type: ConceptConcept
type: Concept
creator: Commission d'enrichissement de la langue française, FranceTerme
date parution JO: 2006-04-05
equivalent EN: direct injection engine @en
equivalent EN: direct injection engine (en)
in scheme: Automobile
in scheme: concept-SD-automobile-moteurs
in scheme: concepts
notation: AUTO50

aide au démarrage en côte
type: ConceptConcept
type: Concept
creator: Commission d'enrichissement de la langue française, FranceTerme
abbreviation: ADC
abbreviation: HSA @en
date parution JO: 2006-06-02
equivalent EN: HSA @en
equivalent EN: HSA (en)
equivalent EN: hill holder @en
equivalent EN: hill holder (en)
equivalent EN: hill start assist @en
equivalent EN: hill start assist (en)
equivalent EN: hill start assistance @en
equivalent EN: hill start assistance (en)
definition: Système d'aide automatique à la manœuvre d'un véhicule automobile sur un terrain en pente.
in scheme: Automobile
in scheme: concepts
notation: AUTO51

autoallumage par compression
type: ConceptConcept
type: Concept
creator: Commission d'enrichissement de la langue française, FranceTerme
abbreviation: HCCI @en
date parution JO: 2006-06-02
equivalent EN: HCCI @en
equivalent EN: HCCI (en)
equivalent EN: homogeneous charge compression ignition @en
equivalent EN: homogeneous charge compression ignition (en)
definition: Procédé de combustion appliqué aux moteurs diesel, consistant en une auto-inflammation d'un mélange homogène d'air et de combustible.
in scheme: Automobile
in scheme: concept-SD-automobile-moteurs
in scheme: concepts
notation: AUTO52

autoallumage par gaz chauds
type: ConceptConcept
type: Concept
creator: Commission d'enrichissement de la langue française, FranceTerme
abbreviation: ATAC @en
date parution JO: 2006-06-02
equivalent EN: ATAC @en
equivalent EN: ATAC (en)
equivalent EN: active thermo-atmosphere combustion @en
equivalent EN: active thermo-atmosphere combustion (en)
definition: Procédé consistant à utiliser les gaz résiduels provenant de la combustion précédente pour enflammer le mélange d'air et de carburant nouvellement admis.
in scheme: Automobile
in scheme: concept-SD-automobile-moteurs
in scheme: concepts
notation: AUTO53

autoallumage préréglé
type: ConceptConcept
type: Concept
creator: Commission d'enrichissement de la langue française, FranceTerme
abbreviation: CAI @en
date parution JO: 2006-06-02
equivalent EN: CAI @en
equivalent EN: CAI (en)
equivalent EN: controlled auto-ignition @en
equivalent EN: controlled auto-ignition (en)
definition: Procédé de combustion appliqué aux moteurs à essence, consistant en une auto-inflammation du mélange d'air et de carburant dans des conditions prédéterminées.
in scheme: Automobile
in scheme: concept-SD-automobile-moteurs
in scheme: concepts
notation: AUTO54

avertisseur de sortie involontaire de voie
type: ConceptConcept
type: Concept
creator: Commission d'enrichissement de la langue française, FranceTerme
abbreviation: LGS @en
abbreviation: LKS @en
date parution JO: 2006-06-02
equivalent EN: LGS @en
equivalent EN: LGS (en)
equivalent EN: LKS @en
equivalent EN: LKS (en)
equivalent EN: lane guard system @en
equivalent EN: lane guard system (en)
equivalent EN: lane keeping system @en
equivalent EN: lane keeping system (en)
forme abregee: avertisseur de sortie de voie
definition: Dispositif de sécurité qui informe le conducteur du franchissement de la ligne de délimitation de voie s'il n'a pas fait usage des clignotants.
in scheme: Automobile
in scheme: concepts
notation: AUTO55
related: suivi de voie automatique
related: système d'aide à la conduite

couple à bas régime
type: ConceptConcept
type: Concept
creator: Commission d'enrichissement de la langue française, FranceTerme
date parution JO: 2006-06-02
equivalent EN: low-end torque @en
equivalent EN: low-end torque (en)
definition: Couple moteur disponible dès que l'on sort du régime de ralenti.
in scheme: Automobile
in scheme: concept-SD-automobile-moteurs
in scheme: concepts
notation: AUTO56

soupape de décharge
type: ConceptConcept
type: Concept
creator: Commission d'enrichissement de la langue française, FranceTerme
date parution JO: 2006-06-02
equivalent EN: wastegate @en
equivalent EN: wastegate (en)
definition: Soupape qui limite et régule la pression de suralimentation d'un moteur.
in scheme: Automobile
in scheme: concept-SD-automobile-moteurs
in scheme: concepts
notation: AUTO57

surcouple temporaire
type: ConceptConcept
type: Concept
creator: Commission d'enrichissement de la langue française, FranceTerme
date parution JO: 2006-06-02
equivalent EN: overboost @en
equivalent EN: overboost (en)
definition: Supplément de couple rendu disponible un court instant au moyen d'un accroissement de la pression de suralimentation.
in scheme: Automobile
in scheme: concept-SD-automobile-moteurs
in scheme: concepts
notation: AUTO58

système de diagnostic embarqué
type: ConceptConcept
type: Concept
creator: Commission d'enrichissement de la langue française, FranceTerme
abbreviation: OBD system @en
date parution JO: 2006-06-02
equivalent EN: OBD system @en
equivalent EN: OBD system (en)
equivalent EN: on-board diagnostic system @en
equivalent EN: on-board diagnostic system (en)
forme abregee: diagnostic embarqué
definition: Dispositif de bord qui surveille et enregistre les paramètres de fonctionnement du véhicule, et qui, en cas d'anomalie ou d'incident, donne l'alerte.
in scheme: Automobile
in scheme: concepts
notation: AUTO59
related: surveillance de la pression des pneus
related: assurance automobile à la minute

système de mise en veille
type: ConceptConcept
type: Concept
creator: Commission d'enrichissement de la langue française, FranceTerme
date parution JO: 2006-06-02
deconseille ou frequent: Stop and Go
deconseille ou frequent: Stop and Start
forme abregee: mise en veille
definition: Système de commande qui arrête le moteur thermique lorsque le véhicule est immobile au point mort et provoque son redémarrage à la première sollicitation du conducteur.
in scheme: Automobile
in scheme: concept-SD-automobile-moteurs
in scheme: concepts
notation: AUTO60
note: 1. Ce système a pour avantages de réduire la consommation et les émissions du moteur, et d'améliorer le confort acoustique du véhicule.
note: 2. « Stop and Go » et « Stop and Start », qui sont des noms déposés, ne doivent pas être employés.
related: véhicule à motorisation microhybride

affichage tête haute
type: ConceptConcept
type: Concept
creator: Commission d'enrichissement de la langue française, FranceTerme
abbreviation: HUD @en
date parution JO: 2007-12-23
equivalent EN: HUD @en
equivalent EN: HUD (en)
equivalent EN: head-up display @en
equivalent EN: head-up display (en)
definition: Affichage, dans l'axe de vision du conducteur, d'informations complétant celles du tableau de bord.
in scheme: Automobile
in scheme: concepts
notation: AUTO61

groupe d'options
type: ConceptConcept
type: Concept
creator: Commission d'enrichissement de la langue française, FranceTerme
date parution JO: 2007-12-23
equivalent EN: pack @en
equivalent EN: pack (en)
definition: Ensemble d'équipements proposés en option par le constructeur à l'acheteur d'un véhicule, et dont la composition ne peut être modifiée.
in scheme: Automobile
in scheme: concepts
notation: AUTO62

pneu à roulage à plat
type: ConceptConcept
type: Concept
creator: Commission d'enrichissement de la langue française, FranceTerme
abbreviation: run-flat tyre @en
date parution JO: 2007-12-23
equivalent EN: run-flat tyre @en
equivalent EN: run-flat tyre (en)
equivalent EN: run-on-flat tyre @en
equivalent EN: run-on-flat tyre (en)
definition: Pneumatique à affaissement limité, capable d'assurer temporairement et sans dommage la progression d'un véhicule en cas de perte, même totale, de pression.
in scheme: Automobile
in scheme: concepts
notation: AUTO64

réduction
type: ConceptConcept
type: Concept
creator: Commission d'enrichissement de la langue française, FranceTerme
date parution JO: 2007-12-23
equivalent EN: downsizing @en
equivalent EN: downsizing (en)
part of speech: nom féminin
definition: Diminution de la masse, des dimensions et de la cylindrée d'un moteur, visant à réduire sa consommation et son encombrement, tout en conservant ses performances de couple et de puissance.
in scheme: Automobile
in scheme: concept-SD-automobile-moteurs
in scheme: concepts
notation: AUTO65
related: abaissement du régime moteur

rideau gonflable
type: ConceptConcept
type: Concept
creator: Commission d'enrichissement de la langue française, FranceTerme
date parution JO: 2007-12-23
equivalent EN: curtain airbag @en
equivalent EN: curtain airbag (en)
definition: Coussin gonflable qui se déploie le long des vitres d'un véhicule lors d'un choc latéral, afin de protéger la tête de ses occupants.
in scheme: Automobile
in scheme: concepts
notation: AUTO66
related: sac gonflable

suspension adaptative
type: ConceptConcept
type: Concept
creator: Commission d'enrichissement de la langue française, FranceTerme
date parution JO: 2007-12-23
equivalent EN: active suspension system @en
equivalent EN: active suspension system (en)
definition: Système de correction de la suspension d'un véhicule en fonction de différents paramètres, tels que sa charge, sa vitesse, l'état de la route ou les conditions climatiques.
in scheme: Automobile
in scheme: concepts
notation: AUTO67
related: suspension anticipative

tout-terrain de loisir
type: ConceptConcept
type: Concept
creator: Commission d'enrichissement de la langue française, FranceTerme
abbreviation: SUV @en
abbreviation: TTL
date parution JO: 2007-12-23
equivalent EN: SUV @en
equivalent EN: SUV (en)
equivalent EN: sport utility vehicle @en
equivalent EN: sport utility vehicle (en)
definition: Véhicule généralement muni de quatre roues motrices et à usage de tourisme.
in scheme: Automobile
in scheme: concepts
notation: AUTO68
related: tout-chemin de loisir

voiture concept
type: ConceptConcept
type: Concept
creator: Commission d'enrichissement de la langue française, FranceTerme
date parution JO: 2007-12-23
deconseille ou frequent: prototype
equivalent EN: concept car @en
equivalent EN: concept car (en)
definition: Véhicule destiné à présenter au public un savoir-faire novateur en vue d'applications futures sur des véhicules de série.
in scheme: Automobile
in scheme: concepts
notation: AUTO70
note: La « voiture concept » doit être distinguée du « prototype », qui précède une série.
related: voiture de salon

affichage nocturne de confort
type: ConceptConcept
type: Concept
creator: Commission d'enrichissement de la langue française, FranceTerme
date parution JO: 2009-02-22
equivalent EN: black panel @en
equivalent EN: black panel (en)
equivalent EN: night panel @en
equivalent EN: night panel (en)
definition: Fonction permettant d'interrompre momentanément, lors d'une utilisation nocturne, l'affichage lumineux des indications fournies par certains instruments du tableau de bord, afin notamment de réduire la fatigue visuelle du conducteur.
in scheme: Automobile
in scheme: concepts
notation: AUTO71
note: L'affichage lumineux peut être réactivé par le conducteur en cas de besoin.

boîte-tampon
type: ConceptConcept
type: Concept
creator: Commission d'enrichissement de la langue française, FranceTerme
date parution JO: 2009-02-22
equivalent EN: crash box @en
equivalent EN: crash box (en)
part of speech: nom féminin
definition: Élément, situé entre les traverses des boucliers et de la carrosserie, destiné à absorber l'énergie d'un choc.
in scheme: Automobile
in scheme: concepts
notation: AUTO72

éclairage prolongé
type: ConceptConcept
type: Concept
creator: Commission d'enrichissement de la langue française, FranceTerme
abbreviation: follow-me-home @en
date parution JO: 2009-02-22
equivalent EN: follow-me-home @en
equivalent EN: follow-me-home (en)
equivalent EN: follow-me-home function @en
equivalent EN: follow-me-home function (en)
definition: Fonction qui maintient allumés les feux de croisement pendant quelques dizaines de secondes, après l'arrêt du moteur.
in scheme: Automobile
in scheme: concepts
notation: AUTO73

étiquetage des émissions de CO
type: ConceptConcept
type: Concept
creator: Commission d'enrichissement de la langue française, FranceTerme
date parution JO: 2009-02-22
equivalent EN: car labelling @en
equivalent EN: car labelling (en)
forme abregee: étiquetage CO2
definition: Affichage obligatoire, sur les sites d'exposition ou de vente d'automobiles, du niveau d'émission de dioxyde de carbone (CO2) lié à la consommation de carburant d'un véhicule par kilomètre parcouru.
in scheme: Automobile
in scheme: Énergie
in scheme: concepts
notation: AUTO74

mobimètre
type: ConceptConcept
type: Concept
creator: Commission d'enrichissement de la langue française, FranceTerme
abbreviation: OBU @en
date parution JO: 2009-02-22
equivalent EN: OBU @en
equivalent EN: OBU (en)
equivalent EN: mobimeter @en
equivalent EN: mobimeter (en)
equivalent EN: on-board unit @en
equivalent EN: on-board unit (en)
definition: Dispositif embarqué qui relève, enregistre et peut transmettre différents paramètres du trajet d'un véhicule.
in scheme: Automobile
in scheme: Transports et mobilité
in scheme: concept-SD-automobile-transport-routier
in scheme: concept-SD-transports-et-mobilite-transport-routier
in scheme: concepts
notation: AUTO75
note: Les données enregistrées par le mobimètre, telles que les distances parcourues, l'itinéraire suivi ou les horaires de passage, permettent d'apprécier les conditions dans lesquelles s'effectue un trajet, notamment pour déterminer le niveau de taxation correspondant à l'usage des infrastructures.

système d'admission à géométrie variable
type: ConceptConcept
type: Concept
creator: Commission d'enrichissement de la langue française, FranceTerme
date parution JO: 2009-02-22
equivalent EN: variable-geometry induction system @en
equivalent EN: variable-geometry induction system (en)
equivalent EN: variable-geometry intake system @en
equivalent EN: variable-geometry intake system (en)
forme abregee: admission à géométrie variable
definition: Dispositif ajustant la longueur ou la section du circuit d'admission d'air dans le moteur afin d'en optimiser le remplissage.
in scheme: Automobile
in scheme: concept-SD-automobile-moteurs
in scheme: concepts
notation: AUTO76

système de réduction catalytique sélective
type: ConceptConcept
type: Concept
creator: Commission d'enrichissement de la langue française, FranceTerme
abbreviation: RCS
abbreviation: SCR system @en
date parution JO: 2009-02-22
equivalent EN: SCR system @en
equivalent EN: SCR system (en)
equivalent EN: selective catalytic reduction system @en
equivalent EN: selective catalytic reduction system (en)
forme abregee: réduction catalytique sélective
definition: Dispositif de post-traitement des gaz d'échappement, qui permet au convertisseur catalytique, grâce à l'apport d'une solution d'urée, de réduire principalement les oxydes d'azote.
in scheme: Automobile
in scheme: concepts
notation: AUTO77
note: Cette technique de dépollution s'applique surtout aux gaz d'échappement des moteurs diesel des véhicules industriels.

véhicule à émission zéro
type: ConceptConcept
type: Concept
creator: Commission d'enrichissement de la langue française, FranceTerme
abbreviation: VEZ
abbreviation: ZEV @en
date parution JO: 2009-02-22
equivalent EN: ZEV @en
equivalent EN: ZEV (en)
equivalent EN: zero emission vehicle @en
equivalent EN: zero emission vehicle (en)
definition: Véhicule ne rejetant ni polluant ni gaz à effet de serre.
in scheme: Automobile
in scheme: concepts
notation: AUTO78
related: électromobilité

position de tête
type: ConceptConcept
type: Concept
creator: Commission d'enrichissement de la langue française, FranceTerme
date parution JO: 2009-02-22
equivalent EN: pole position @en
equivalent EN: pole position (en)
definition: Place la plus favorable, attribuée, au départ d'une course, au concurrent qui a réalisé la meilleure performance lors des phases qualificatives.
in scheme: Sports
in scheme: concepts
notation: AUTO79

véhicule polycarburant
type: ConceptConcept
type: Concept
creator: Commission d'enrichissement de la langue française, FranceTerme
abbreviation: FFV @en
date parution JO: 2009-02-22
equivalent EN: FFV @en
equivalent EN: FFV (en)
equivalent EN: flex-fuel vehicle @en
equivalent EN: flex-fuel vehicle (en)
equivalent EN: flexible-fuelled vehicle @en
equivalent EN: flexible-fuelled vehicle (en)
definition: Véhicule dont le moteur est conçu pour être alimenté par différents carburants.
in scheme: Automobile
in scheme: concept-SD-automobile-moteurs
in scheme: concepts
notation: AUTO80
note: Le carburant peut être un mélange.
scope note: Cette publication annule et remplace celle du terme « véhicule à carburant modulable » au Journal officiel du 5 avril 2006.

recyclage des gaz d'échappement
type: ConceptConcept
type: Concept
creator: Commission d'enrichissement de la langue française, FranceTerme
abbreviation: EGR @en
abbreviation: EGR system @en
abbreviation: RGE
date parution JO: 2010-04-24
equivalent EN: EGR @en
equivalent EN: EGR (en)
equivalent EN: EGR system @en
equivalent EN: EGR system (en)
equivalent EN: exhaust gas recirculation @en
equivalent EN: exhaust gas recirculation (en)
equivalent EN: exhaust gas recirculation system @en
equivalent EN: exhaust gas recirculation system (en)
definition: Récupération partielle des gaz d'échappement d'un véhicule, qui sont réintroduits à l'admission en vue de réduire les émissions d'oxydes d'azote ; par extension, dispositif permettant cette récupération.
in scheme: Automobile
in scheme: concepts
notation: AUTO87

décalage
type: ConceptConcept
type: Concept
creator: Commission d'enrichissement de la langue française, FranceTerme
date parution JO: 2004-02-15
equivalent EN: offset @en
equivalent EN: offset (en)
part of speech: nom masculin
definition: Distance qui, dans un choc frontal, sépare les deux axes longitudinaux médians de deux véhicules se heurtant.
in scheme: Automobile
in scheme: concepts
notation: AUTO9
note: Le terme peut être également utilisé dans le cas d'un choc entre un véhicule et un obstacle fixe.
related: recouvrement
related: décalage

rétrogradage forcé
type: ConceptConcept
type: Concept
creator: Commission d'enrichissement de la langue française, FranceTerme
date parution JO: 2010-04-24
equivalent EN: kick-down @en
equivalent EN: kick-down (en)
definition: Passage à un rapport inférieur de la boîte de vitesses d'un véhicule doté d'une transmission automatique, obtenu en appuyant à fond sur l'accélérateur.
in scheme: Automobile
in scheme: concepts
notation: AUTO91
related: rétrogradage

transmission à variation continue
type: ConceptConcept
type: Concept
creator: Commission d'enrichissement de la langue française, FranceTerme
abbreviation: CVT @en
abbreviation: TVC
date parution JO: 2010-04-24
equivalent EN: CVT @en
equivalent EN: CVT (en)
equivalent EN: continuously variable transmission @en
equivalent EN: continuously variable transmission (en)
definition: Transmission automatique dont le rapport de démultiplication peut varier continûment entre deux valeurs limites.
in scheme: Automobile
in scheme: concepts
notation: AUTO92

accidentogène
type: ConceptConcept
type: Concept
creator: Commission d'enrichissement de la langue française, FranceTerme
date parution JO: 2011-06-08
part of speech: adjectif
definition: Qui est de nature à augmenter la probabilité d'accidents.
in scheme: Transports et mobilité
in scheme: concept-SD-transports-et-mobilite-transport-routier
in scheme: concepts
notation: AUTO93

échange minute d'outillage
type: ConceptConcept
type: Concept
creator: Commission d'enrichissement de la langue française, FranceTerme
abbreviation: CRO
abbreviation: SMED @en
date parution JO: 2011-06-08
equivalent EN: SMED @en
equivalent EN: SMED (en)
equivalent EN: single minute exchange of die @en
equivalent EN: single minute exchange of die (en)
alternative label: changement rapide d'outillage
definition: Méthode mise en œuvre dans une chaîne de production qui permet, lors d'une modification ou d'un changement de l'objet fabriqué, de remplacer un outillage dans un délai aussi court que possible.
in scheme: Économie générale
in scheme: Industrie
in scheme: concepts
notation: AUTO97
note: L'échange minute d'outillage permet de réduire la taille minimale des lots de fabrication sans augmentation sensible des coûts, en rationalisant les temps de réglage au cours et en dehors des phases de production.

ensemble routier de grande capacité
type: ConceptConcept
type: Concept
creator: Commission d'enrichissement de la langue française, FranceTerme
abbreviation: EMS @en
abbreviation: ERGC
date parution JO: 2011-06-08
equivalent EN: EMS @en
equivalent EN: EMS (en)
equivalent EN: European modular system @en
equivalent EN: European modular system (en)
definition: Combinaison de modules de véhicules industriels constitués d'un porteur et d'une remorque ou d'un tracteur et de deux remorques.
in scheme: Transports et mobilité
in scheme: concept-SD-transports-et-mobilite-transport-routier
in scheme: concepts
notation: AUTO98

système d'appel d'urgence
type: ConceptConcept
type: Concept
creator: Commission d'enrichissement de la langue française, FranceTerme
date parution JO: 2011-06-08
deconseille ou frequent: e-Call
deconseille ou frequent: emergency call
equivalent EN: eCall @en
equivalent EN: eCall (en)
forme abregee: appel d'urgence
definition: Dispositif radioélectrique embarqué à déclenchement automatique ou manuel, qui, en cas d'accident ou d'urgence, transmet à un centre d'appels les données permettant aux secours d'intervenir.
in scheme: Automobile
in scheme: concepts
notation: AUTO99

BAIIDA
type: ConceptConcept
type: Concept
equivalent EN: EBITDA (en)
forme developpee: Earnings before interest, taxes, depreciation and amortization @en
forme developpee: bénéfice avant intérêts, impôts et dotations aux amortissements
graphique: https://en.wikipedia.org/wiki/Earnings_before_interest,_taxes,_depreciation,_and_amortization @en
graphique: https://fr.wikipedia.org/wiki/Earnings_before_interest,_taxes,_depreciation,_and_amortization
url source: https://www.bdc.ca/en/articles-tools/entrepreneur-toolkit/templates-business-guides/glossary/pages/ebitda.aspx
url source: https://www.bdc.ca/fr/articles-outils/boite-outils-entrepreneur/gabarits-documents-guides-affaires/glossaire/pages/baiida.aspx
definition: Earnings before interest, taxes, depreciation and amortization is the primary calculation used to determine how much of a company’s cash flow comes from ongoing operations. It is an important indicator of the health of a business. @en
definition: Le bénéfice avant intérêts, impôts et dotations aux amortissements constitue le principal calcul pour déterminer dans quelle mesure le flux de trésorerie de l’entreprise provient des opérations en cours. Il s’agit d’un indicateur important de la santé d’une entreprise.
in scheme: Économie générale
in scheme: concept-SD-economie-generale-comptabilite
in scheme: concepts
note: Bankers and other finance professionals use EBITDA to decide how much money they are willing to lend a company. They may use other measures as well, but EBITDA is one of the strongest and most consistent measures. EBITDA is also used to: help determine the value of a company; assess a company’s ability to pay its debts; determine the ability of a business to generate surpluses for activities like paying dividends. @en
note: Il s’agit des revenus avant intérêts, impôts (taxes), dotations aux amortissements et provisions sur immobilisations (mais après dotations aux provisions sur stocks et créances clients).
note: Les banquiers et autres professionnels de la finance utilisent le BAIIDA pour décider du montant du prêt qu’ils sont prêts à consentir à une entreprise. Ils peuvent utiliser d’autres mesures, mais le BAIIDA est l’une des plus solides et des plus cohérentes. On utilise aussi le BAIIDA pour : aider à déterminer la valeur d’une entreprise ; évaluer la capacité d’une entreprise à payer ses dettes ; déterminer la capacité d’une entreprise à générer des excédents, notamment pour le paiement des dividendes.
preferred label: EBITDA @en

acide de Lewis
type: ConceptConcept
type: Concept
creator: Commission d'enrichissement de la langue française, FranceTerme
date parution JO: 2001-04-18
equivalent EN: Lewis acid @en
equivalent EN: Lewis acid (en)
graphique: https://www.lachimie.net/index.php#.Whwsr0riaUk
definition: Entité moléculaire, ou l'espèce chimique correspondante, qui accepte un doublet d'électrons.
in scheme: Chimie
in scheme: concepts
notation: CHIM1
note: Un acide de Lewis est donc capable de s'associer avec une autre entité moléculaire, dite « base de Lewis », pour former un adduit par mise en commun du doublet de la base. On peut citer comme exemple le trifluorure de bore.
related: adduit
related: électrophile
related: acide de Brønsted
related: acide dur
related: acide mou
related: superacide
related: liaison de coordination
related: carbophile
related: oxophile
related: azophile
related: base de Lewis

chromophore
type: ConceptConcept
type: Concept
creator: Commission d'enrichissement de la langue française, FranceTerme
date parution JO: 2001-04-18
equivalent EN: chromophore @en
equivalent EN: chromophore (en)
equivalent EN: chromophoric @en
equivalent EN: chromophoric (en)
part of speech: adjectif
definition: Se dit d'un ensemble d'atomes à l'origine de la couleur d'une entité moléculaire et, par extension et plus généralement, à l'origine d'une transition électronique donnée.
in scheme: Chimie
in scheme: concept-SD-chimie-spectroscopie
in scheme: concepts
notation: CHIM10
note: Le terme « chromophore » est également employé comme substantif.
related: hypsochrome
related: bathochrome

conformation en cuvette
type: ConceptConcept
type: Concept
creator: Commission d'enrichissement de la langue française, FranceTerme
date parution JO: 2001-04-18
equivalent EN: tub conformation @en
equivalent EN: tub conformation (en)
definition: Conformation de symétrie D2d d’un cycle saturé à huit chaînons, dans laquelle les quatre atomes qui forment une paire de liaisons diamétralement opposées du cycle se trouvent dans un plan alors que les quatre autres atomes sont d’un même côté de ce plan.
in scheme: Chimie
in scheme: concept-SD-chimie-stereochimie
in scheme: concepts
notation: CHIM100
note: Le cyclooctane est susceptible de se trouver dans cette conformation.

conformation gauche
type: ConceptConcept
type: Concept
creator: Commission d'enrichissement de la langue française, FranceTerme
date parution JO: 2001-04-18
equivalent EN: gauche conformation @en
equivalent EN: gauche conformation (en)
definition: Conformation d'un édifice moléculaire dans laquelle les trois liaisons formées par deux atomes ou groupes attachés à deux atomes adjacents forment un angle de torsion égal à (ou voisin de) + 60° ou - 60°.
in scheme: Chimie
in scheme: concept-SD-chimie-stereochimie
in scheme: concepts
notation: CHIM101
note: 1. La conformation gauche est un cas particulier de conformation décalée.
note: 2. Cette conformation correspond sensiblement à celle désignée par le terme « conformation synclinale ».
related: conformation synclinale
related: angle de torsion
related: conformation décalée

conformation synclinale
type: ConceptConcept
type: Concept
creator: Commission d'enrichissement de la langue française, FranceTerme
date parution JO: 2001-04-18
equivalent EN: synclinal conformation @en
equivalent EN: synclinal conformation (en)
definition: Conformation d'un édifice moléculaire dans laquelle les trois liaisons formées par deux atomes ou groupes attachés à deux atomes adjacents forment un angle de torsion compris entre + 30° et + 90° ou entre - 30° et - 90°.
in scheme: Chimie
in scheme: concept-SD-chimie-stereochimie
in scheme: concepts
notation: CHIM102
note: La conformation synclinale peut être décrite par le symbole sc.
related: conformation gauche
related: conformation synpériplanaire
related: angle de torsion
related: conformation anticlinale
related: conformation antipériplanaire
related: conformation décalée

conformation synpériplanaire
type: ConceptConcept
type: Concept
creator: Commission d'enrichissement de la langue française, FranceTerme
date parution JO: 2001-04-18
equivalent EN: synperiplanar conformation @en
equivalent EN: synperiplanar conformation (en)
definition: Conformation d'un édifice moléculaire dans laquelle les trois liaisons formées par deux atomes ou groupes attachés à deux atomes adjacents forment un angle de torsion compris entre 0° et + 30° ou entre 0° et - 30°.
in scheme: Chimie
in scheme: concept-SD-chimie-stereochimie
in scheme: concepts
notation: CHIM103
note: 1. Du grec syn, « ensemble », et peri, « autour de », et du latin planus, « plan ».
note: 2. La conformation synpériplanaire peut être décrite par le symbole sp.
related: conformation synclinale
related: angle de torsion
related: conformation anticlinale
related: conformation antipériplanaire
related: conformation éclipsée

conformationnel, -elle
type: ConceptConcept
type: Concept
creator: Commission d'enrichissement de la langue française, FranceTerme
date parution JO: 2001-04-18
equivalent EN: conformational @en
equivalent EN: conformational (en)
part of speech: adjectif
definition: Qui est relatif à la conformation.
in scheme: Chimie
in scheme: concept-SD-chimie-stereochimie
in scheme: concepts
notation: CHIM104
note: Exemple : isomère conformationnel.
related: conformation

conformère
type: ConceptConcept
type: Concept
creator: Commission d'enrichissement de la langue française, FranceTerme
date parution JO: 2001-04-18
equivalent EN: conformer @en
equivalent EN: conformer (en)
part of speech: nom masculin
definition: Élément d'un ensemble de stéréo-isomères conformationnels dont chacun est caractérisé par une conformation correspondant à un minimum distinct d'énergie potentielle de l'entité moléculaire.
in scheme: Chimie
in scheme: concept-SD-chimie-stereochimie
in scheme: concepts
notation: CHIM105
related: rotamère
related: atropisomère
related: conformation

conglomérat racémique
type: ConceptConcept
type: Concept
creator: Commission d'enrichissement de la langue française, FranceTerme
date parution JO: 2001-04-18
equivalent EN: racemic conglomerate @en
equivalent EN: racemic conglomerate (en)
definition: Mélange en quantités égales de deux énantiomères sous forme de cristaux non identiques dont chacun ne contient qu'un seul des deux énantiomères présents.
in scheme: Chimie
in scheme: concept-SD-chimie-stereochimie
in scheme: concepts
notation: CHIM106
related: énantiomère
related: racémique
related: composé racémique

constitution d'une entité moléculaire
type: ConceptConcept
type: Concept
creator: Commission d'enrichissement de la langue française, FranceTerme
date parution JO: 2001-04-18
equivalent EN: constitution @en
equivalent EN: constitution (en)
forme abregee: constitution, n.f.
definition: Terme conventionnellement utilisé pour décrire la nature et les modes d'union des atomes formant une entité moléculaire, en incluant la multiplicité des liaisons mais sans indications sur leur disposition dans l'espace.
in scheme: Chimie
in scheme: concept-SD-chimie-stereochimie
in scheme: concepts
notation: CHIM107
related: configuration
related: conformation

dédoublement d'un racémique
type: ConceptConcept
type: Concept
creator: Commission d'enrichissement de la langue française, FranceTerme
date parution JO: 2001-04-18
equivalent EN: enantiomer resolution @en
equivalent EN: enantiomer resolution (en)
definition: Séparation d'un racémique en ses composants énantiomères.
in scheme: Chimie
in scheme: concept-SD-chimie-stereochimie
in scheme: concepts
notation: CHIM108
related: énantiomère
related: racémique
related: composé méso

dextrogyre
type: ConceptConcept
type: Concept
creator: Commission d'enrichissement de la langue française, FranceTerme
date parution JO: 2001-04-18
equivalent EN: dextrorotatory @en
equivalent EN: dextrorotatory (en)
part of speech: adjectif
definition: Se dit de toute substance chimique et spécialement d'un stéréo-isomère faisant tourner vers la droite le plan de polarisation de la lumière.
in scheme: Chimie
in scheme: concept-SD-chimie-stereochimie
in scheme: concepts
notation: CHIM109
note: Le sens de rotation du plan de polarisation est dans ce cas conventionnellement indiqué par le signe + entre parenthèses (+).
related: lévogyre
related: pouvoir rotatoire
related: activité optique

complexe
type: ConceptConcept
type: Concept
creator: Commission d'enrichissement de la langue française, FranceTerme
date parution JO: 2001-04-18
equivalent EN: complex @en
equivalent EN: complex (en)
part of speech: nom masculin
definition: Entité moléculaire formée par l'association de deux ou de plusieurs entités moléculaires, ioniques ou neutres ; l'espèce chimique correspondante.
in scheme: Chimie
in scheme: concepts
notation: CHIM11
related: adduit
related: entité moléculaire
related: exciplexe
related: composé en couronne
related: liaison de coordination
related: molécule hôte
related: molécule incluse

diastéréo-isomère
type: ConceptConcept
type: Concept
creator: Commission d'enrichissement de la langue française, FranceTerme
date parution JO: 2001-04-18
deconseille ou frequent: diastéréomère
equivalent EN: diastereoisomer @en
equivalent EN: diastereoisomer (en)
equivalent EN: diastereoisomeric @en
equivalent EN: diastereoisomeric (en)
equivalent EN: diastereomer @en
equivalent EN: diastereomer (en)
equivalent EN: diastereomeric @en
equivalent EN: diastereomeric (en)
part of speech: nom masculin ou adjectif
alternative label: diastéréo-isomérique
definition: Élément d'un ensemble de stéréo-isomères qui ne sont pas des énantiomères.
in scheme: Chimie
in scheme: concept-SD-chimie-stereochimie
in scheme: concepts
notation: CHIM110
note: 1. Le terme est également fréquemment contracté en « diastéréomère ».
note: 2. Les diastéréo-isomères sont caractérisés par des différences de propriétés physiques et par quelques différences de comportement chimique vis-à-vis des réactifs achiraux aussi bien que chiraux.
related: énantiomère
related: épimère
related: stéréo-isomère
related: stéréosélectivité

diastéréosélectif, -ive
type: ConceptConcept
type: Concept
creator: Commission d'enrichissement de la langue française, FranceTerme
date parution JO: 2001-04-18
equivalent EN: diastereoselective @en
equivalent EN: diastereoselective (en)
part of speech: adjectif
definition: Se dit d'une synthèse ou d'une réaction au cours de laquelle un ou plusieurs éléments stéréogènes nouveaux sont introduits dans une molécule de manière telle que des diastéréo-isomères sont produits en quantités inégales.
in scheme: Chimie
in scheme: concept-SD-chimie-stereochimie
in scheme: concepts
notation: CHIM111
related: stéréosélectivité
related: synthèse asymétrique

diastéréotope
type: ConceptConcept
type: Concept
creator: Commission d'enrichissement de la langue française, FranceTerme
date parution JO: 2001-04-18
equivalent EN: diastereotopic @en
equivalent EN: diastereotopic (en)
part of speech: adjectif
alternative label: diastéréotopique
definition: Se dit d'atomes ou de groupes d'atomes identiques du point de vue de la constitution et situés dans des régions non symétriques d'une entité moléculaire.
in scheme: Chimie
in scheme: concept-SD-chimie-stereochimie
in scheme: concepts
notation: CHIM112
note: 1. Par exemple, les deux atomes d'hydrogène du groupe méthylène de l'acide malique naturel, optiquement actif, HO2C-CHOH-CH2-CO2H, voisins d'un centre chiral présent sous une seule configuration, sont dits « diastéréotopes ».
note: 2. Le remplacement de l'un des deux atomes ou groupes d'atomes diastéréotopes par un atome (ou groupe) différent se traduit par la formation de l'un ou de l'autre membre d'une paire de diastéréo-isomères.
related: énantiotope
related: homotope
related: stéréohétérotope

dispersion rotatoire optique
type: ConceptConcept
type: Concept
creator: Commission d'enrichissement de la langue française, FranceTerme
date parution JO: 2001-04-18
equivalent EN: rotatory dispersion @en
equivalent EN: rotatory dispersion (en)
definition: Variation du pouvoir rotatoire d'une substance en fonction de la longueur d'onde du rayonnement lumineux utilisé.
in scheme: Chimie
in scheme: concept-SD-chimie-chimie-physique
in scheme: concept-SD-chimie-stereochimie
in scheme: concepts
notation: CHIM113
related: pouvoir rotatoire

énantiomère
type: ConceptConcept
type: Concept
creator: Commission d'enrichissement de la langue française, FranceTerme
date parution JO: 2001-04-18
deconseille ou frequent: antipode optique
deconseille ou frequent: isomère énantiomorphe
equivalent EN: enantiomer @en
equivalent EN: enantiomer (en)
equivalent EN: enantiomeric @en
equivalent EN: enantiomeric (en)
part of speech: nom masculin ou adjectif
alternative label: énantiomérique
definition: Chacune des deux entités moléculaires qui sont des images l'une de l'autre dans un miroir et qui ne sont pas superposables.
in scheme: Chimie
in scheme: concept-SD-chimie-stereochimie
in scheme: concepts
notation: CHIM114
note: 1. Du grec enantios, « opposé », et meros, « partie ».
note: 2. Le terme a été étendu aux espèces chimiques présentant les mêmes caractéristiques.
note: 3. Les énantiomères étaient anciennement appelés « antipodes optiques » ou « isomères énantiomorphes ».
related: conglomérat racémique
related: dédoublement d'un racémique
related: diastéréo-isomère
related: énantiomorphe
related: racémique
related: stéréo-isomère
related: stéréosélectivité
related: unité configurationnelle élémentaire
related: distomère
related: eutomère
related: chiralité
related: composé racémique

énantiomorphe
type: ConceptConcept
type: Concept
creator: Commission d'enrichissement de la langue française, FranceTerme
date parution JO: 2001-04-18
equivalent EN: enantiomorphic @en
equivalent EN: enantiomorphic (en)
part of speech: adjectif
alternative label: énantiomorphique
definition: Se dit de chacun des constituants d'une paire d'objets chiraux qui sont des images l'un de l'autre dans un miroir et qui ne sont pas superposables.
in scheme: Chimie
in scheme: concept-SD-chimie-stereochimie
in scheme: concepts
notation: CHIM115
note: 1. Du grec enantios, « opposé », et morphe, « forme ».
note: 2. Le terme s'applique également à des groupes situés dans une entité moléculaire et qui présentent entre eux la même relation.
related: énantiomère
related: énantiotope
related: chiralité

énantiosélectif, -ive
type: ConceptConcept
type: Concept
creator: Commission d'enrichissement de la langue française, FranceTerme
date parution JO: 2001-04-18
equivalent EN: enantioselective @en
equivalent EN: enantioselective (en)
part of speech: adjectif
definition: Se dit d'une synthèse ou d'une réaction au cours de laquelle sont obtenus, à partir d'un précurseur achiral, deux énantiomères d'un produit chiral en quantités inégales.
in scheme: Chimie
in scheme: concept-SD-chimie-stereochimie
in scheme: concepts
notation: CHIM116
related: stéréosélectivité
related: synthèse asymétrique
related: synthèse stéréosélective

énantiotope
type: ConceptConcept
type: Concept
creator: Commission d'enrichissement de la langue française, FranceTerme
date parution JO: 2001-04-18
equivalent EN: enantiotopic @en
equivalent EN: enantiotopic (en)
part of speech: adjectif
alternative label: énantiotopique
definition: Se dit d'atomes ou de groupes d'atomes identiques du point de vue de la constitution et situés dans des régions symétriques d'une entité moléculaire, c'est-à-dire apparentées l'une à l'autre par des éléments de symétrie qui peuvent être un plan de symétrie, un centre d'inversion ou un axe de rotation-réflexion.
in scheme: Chimie
in scheme: concept-SD-chimie-stereochimie
in scheme: concepts
notation: CHIM117
note: 1. Par exemple, les deux atomes d'hydrogène du groupe méthylène de l'alcool éthylique, CH3-CH2-OH, sont dits « énantiotopes ».
note: 2. Le remplacement de l'un des deux groupes énantiotopes de la paire par un atome (ou groupe d'atomes) différent conduit à la formation de l'un ou de l'autre membre d'une paire d'énantiomères.
note: 3. De la même manière, si l'addition ou la complexation sur l'une des deux faces définies par une double liaison ou par un plan moléculaire, conduit à une espèce chirale, les deux faces sont dites « énantiotopes ».
related: diastéréotope
related: énantiomorphe
related: homotope
related: prochiral, -e
related: prochiralité
related: stéréohétérotope
related: composé méso

épimère
type: ConceptConcept
type: Concept
creator: Commission d'enrichissement de la langue française, FranceTerme
date parution JO: 2001-04-18
equivalent EN: epimer @en
equivalent EN: epimer (en)
equivalent EN: epimeric @en
equivalent EN: epimeric (en)
part of speech: adjectif
alternative label: épimérique
definition: Se dit de chacun des diastéréo-isomères qui comportent plusieurs centres stéréogènes tétraédriques et qui possèdent des configurations opposées au niveau de l'un seulement de ces centres.
in scheme: Chimie
in scheme: concept-SD-chimie-stereochimie
in scheme: concepts
notation: CHIM118
note: Ce terme est également employé comme substantif.
related: diastéréo-isomère
related: stéréogène
related: anomère

épimérisation
type: ConceptConcept
type: Concept
creator: Commission d'enrichissement de la langue française, FranceTerme
date parution JO: 2001-04-18
deconseille ou frequent: epimerisation
deconseille ou frequent: epimerization
equivalent EN: epimerisation (GB) @en
equivalent EN: epimerisation (en-GB)
equivalent EN: epimerization (US) @en
equivalent EN: epimerization (en-US)
part of speech: nom féminin
definition: Interconversion d'épimères.
in scheme: Chimie
in scheme: concept-SD-chimie-stereochimie
in scheme: concepts
notation: CHIM119
related: mutarotation

condensation
type: ConceptConcept
type: Concept
creator: Commission d'enrichissement de la langue française, FranceTerme
date parution JO: 2001-04-18
equivalent EN: condensation @en
equivalent EN: condensation (en)
part of speech: nom féminin
definition: Réaction de jonction entre deux ou plusieurs entités moléculaires aboutissant à un seul produit et qui s'accompagne généralement de l'élimination d'une petite molécule (eau, ammoniac, etc.).
in scheme: Chimie
in scheme: concepts
notation: CHIM12
note: 1. La réaction peut également se produire entre des sites réactionnels séparés d'une même entité moléculaire.
note: 2. En chimie organique, la définition s'applique, le plus souvent, à la soudure de molécules par formation de liaisons entre atomes de carbone.
note: 3. En chimie inorganique, la réaction peut conduire à une seule famille de produits plutôt qu'à un seul produit.
related: condensation croisée
related: autocondensation

hélicité
type: ConceptConcept
type: Concept
creator: Commission d'enrichissement de la langue française, FranceTerme
date parution JO: 2001-04-18
deconseille ou frequent: hélice droite
deconseille ou frequent: hélice gauche
equivalent EN: helicity @en
equivalent EN: helicity (en)
part of speech: nom féminin
definition: Chiralité d'une entité moléculaire en forme d'hélice ou de vis.
in scheme: Chimie
in scheme: concept-SD-chimie-stereochimie
in scheme: concepts
notation: CHIM120
note: Selon le sens du pas, on parle de « hélice droite » ou de « hélice gauche ».

homotope
type: ConceptConcept
type: Concept
creator: Commission d'enrichissement de la langue française, FranceTerme
date parution JO: 2001-04-18
equivalent EN: homotopic @en
equivalent EN: homotopic (en)
part of speech: adjectif
alternative label: homotopique
definition: Se dit d'atomes ou de groupes d'atomes apparentés l'un à l'autre par une rotation selon un axe d'ordre n.
in scheme: Chimie
in scheme: concept-SD-chimie-stereochimie
in scheme: concepts
notation: CHIM121
note: Par exemple, le chloroforme CHCl3 qui présente un axe C3 possède trois atomes de chlore homotopes.
related: diastéréotope
related: énantiotope
related: stéréohétérotope

induction asymétrique
type: ConceptConcept
type: Concept
creator: Commission d'enrichissement de la langue française, FranceTerme
date parution JO: 2001-04-18
equivalent EN: asymmetric induction @en
equivalent EN: asymmetric induction (en)
definition: Formation prédominante de l'un des énantiomères ou diastéréo-isomères possibles au cours d'une réaction sous l'influence d'un facteur chiral.
in scheme: Chimie
in scheme: concept-SD-chimie-stereochimie
in scheme: concepts
notation: CHIM122
related: stéréosélectivité
related: synthèse asymétrique
related: synthèse stéréosélective
related: chiralité

isomérie cis-trans
type: ConceptConcept
type: Concept
creator: Commission d'enrichissement de la langue française, FranceTerme
date parution JO: 2001-04-18
equivalent EN: cis-trans isomerism @en
equivalent EN: cis-trans isomerism (en)
definition: Isomérie présentée par des composés éthyléniques ou cyclaniques (et analogues hétéroatomiques) stéréo-isomères qui diffèrent par la disposition des atomes ou groupes d'atomes par rapport à un plan de référence.
in scheme: Chimie
in scheme: concept-SD-chimie-stereochimie
in scheme: concepts
notation: CHIM123
note: 1. Le plan de référence approprié d'une double liaison est perpendiculaire à celui des liaisons sigma concernées et inclut les atomes de la double liaison. Pour un cycle, il s'agit du plan moyen du cycle.
note: 2. Dans les isomères cis, les atomes ou groupes d'atomes considérés se trouvent d'un même côté du plan de référence alors que dans les isomères trans, ils se trouvent de part et d'autre de ce plan.
related: stéréodescripteur
related: stéréogène

lévogyre
type: ConceptConcept
type: Concept
creator: Commission d'enrichissement de la langue française, FranceTerme
date parution JO: 2001-04-18
equivalent EN: levorotatory @en
equivalent EN: levorotatory (en)
part of speech: adjectif
definition: Se dit de toute substance chimique et spécialement d'un stéréo-isomère faisant tourner vers la gauche le plan de polarisation de la lumière.
in scheme: Chimie
in scheme: concept-SD-chimie-stereochimie
in scheme: concepts
notation: CHIM124
note: 1. Du latin laevus, « gauche », et gyre, « tourner ».
note: 2. Le sens de rotation du plan de polarisation est dans ce cas conventionnellement indiqué par le signe - entre parenthèses (-).
related: dextrogyre
related: pouvoir rotatoire
related: activité optique

liaison axiale
type: ConceptConcept
type: Concept
creator: Commission d'enrichissement de la langue française, FranceTerme
date parution JO: 2001-04-18
deconseille ou frequent: pseudo-axiale
deconseille ou frequent: quasi-axiale
equivalent EN: axial bond @en
equivalent EN: axial bond (en)
definition: Liaison perpendiculaire au plan contenant (ou passant au plus près de) la majorité des atomes du cycle.
in scheme: Chimie
in scheme: concept-SD-chimie-stereochimie
in scheme: concepts
notation: CHIM125
note: 1. Dans le cyclohexane en conformation en chaise, les liaisons axiales sont alternées et parallèles à l'axe de symétrie C3.
note: 2. Dans les cycles analogues mono-insaturés, les liaisons correspondantes issues d'atomes contigus à un atome doublement lié sont dites « quasi-axiales » ou « pseudo-axiales ».
related: liaison équatoriale
related: conformation en chaise

liaison de type beaupré
type: ConceptConcept
type: Concept
creator: Commission d'enrichissement de la langue française, FranceTerme
date parution JO: 2001-04-18
equivalent EN: bowsprit @en
equivalent EN: bowsprit (en)
forme abregee: liaison beaupré
definition: Dans le cyclohexane, ou dans les autres cycles saturés à six chaînons se trouvant en conformation en bateau, liaison exocyclique issue de l'un des deux atomes situés hors du plan renfermant les quatre autres et qui est sensiblement parallèle à ce plan.
in scheme: Chimie
in scheme: concept-SD-chimie-stereochimie
in scheme: concepts
notation: CHIM126
related: liaison de type mât
related: conformation en bateau

liaison de type mât
type: ConceptConcept
type: Concept
creator: Commission d'enrichissement de la langue française, FranceTerme
date parution JO: 2001-04-18
equivalent EN: flagpole @en
equivalent EN: flagpole (en)
forme abregee: liaison mât
definition: Dans le cyclohexane, ou dans les autres cycles saturés à six chaînons se trouvant en conformation en bateau, liaison exocyclique issue de l'un des deux atomes se trouvant hors du plan renfermant les quatre autres et qui se distingue d'une liaison de type beaupré.
in scheme: Chimie
in scheme: concept-SD-chimie-stereochimie
in scheme: concepts
notation: CHIM127
related: liaison de type beaupré
related: conformation en bateau

liaison équatoriale
type: ConceptConcept
type: Concept
creator: Commission d'enrichissement de la langue française, FranceTerme
date parution JO: 2001-04-18
deconseille ou frequent: pseudo-équatoriale
deconseille ou frequent: quasi-équatoriale
equivalent EN: equatorial bond @en
equivalent EN: equatorial bond (en)
definition: Liaison parallèle au plan contenant (ou passant au plus près de) la majorité des atomes du cycle.
in scheme: Chimie
in scheme: concept-SD-chimie-stereochimie
in scheme: concepts
notation: CHIM128
note: 1. Dans le cyclohexane en conformation en chaise, les liaisons équatoriales sont parallèles à deux des liaisons du cycle.
note: 2. Dans les cycles analogues mono-insaturés, les liaisons correspondantes issues d'atomes contigus à un atome doublement lié sont dites « quasi-équatoriales » ou « pseudo-équatoriales ».
related: liaison axiale
related: conformation en chaise

mutarotation
type: ConceptConcept
type: Concept
creator: Commission d'enrichissement de la langue française, FranceTerme
date parution JO: 2001-04-18
equivalent EN: mutarotation @en
equivalent EN: mutarotation (en)
part of speech: nom féminin
definition: Variation du pouvoir rotatoire d'une solution résultant d'une épimérisation spontanée ou sous l'influence d'un catalyseur.
in scheme: Chimie
in scheme: concept-SD-chimie-stereochimie
in scheme: concepts
notation: CHIM129
related: épimérisation

condensation croisée
type: ConceptConcept
type: Concept
creator: Commission d'enrichissement de la langue française, FranceTerme
date parution JO: 2001-04-18
equivalent EN: cross-condensation @en
equivalent EN: cross-condensation (en)
equivalent EN: crossed condensation @en
equivalent EN: crossed condensation (en)
definition: Condensation entre deux composés différents.
in scheme: Chimie
in scheme: concepts
notation: CHIM13
note: Par exemple, la condensation de l'acétone sur le benzaldéhyde est une condensation croisée dans laquelle une molécule de chaque substance est impliquée.
related: condensation
related: autocondensation

pouvoir rotatoire
type: ConceptConcept
type: Concept
creator: Commission d'enrichissement de la langue française, FranceTerme
date parution JO: 2001-04-18
equivalent EN: optical rotation @en
equivalent EN: optical rotation (en)
equivalent EN: specific rotation @en
equivalent EN: specific rotation (en)
definition: Valeur mesurée de l'angle de rotation du plan de polarisation de la lumière dans des conditions expérimentales données.
in scheme: Chimie
in scheme: concept-SD-chimie-chimie-physique
in scheme: concept-SD-chimie-stereochimie
in scheme: concepts
notation: CHIM130
note: 1. Le pouvoir rotatoire varie notamment avec la longueur d'onde du rayonnement lumineux utilisé.
note: 2. Enregistré dans des conditions de référence, il est qualifié de « pouvoir rotatoire spécifique » et constitue une constante caractéristique d'un composé.
related: dextrogyre
related: dispersion rotatoire optique
related: lévogyre
related: activité optique

prochiral, -e
type: ConceptConcept
type: Concept
creator: Commission d'enrichissement de la langue française, FranceTerme
date parution JO: 2001-04-18
equivalent EN: prochiral @en
equivalent EN: prochiral (en)
part of speech: adjectif
definition: Se dit d'un arrangement achiral d'atomes, susceptible de devenir chiral par une seule opération introduisant une dissymétrie.
in scheme: Chimie
in scheme: concept-SD-chimie-stereochimie
in scheme: concepts
notation: CHIM131
note: 1. Par exemple, la molécule achirale CH3-CH2-OH peut être considérée comme prochirale car elle peut être convertie en la molécule chirale CH3-CHD-OH par simple remplacement isotopique de l'un des deux atomes d'hydrogène énantiotopes du groupe méthylène par un atome de deutérium.
note: 2. « Ch » se prononce [k].
related: énantiotope
related: prochiralité
related: chiralité

prochiralité
type: ConceptConcept
type: Concept
creator: Commission d'enrichissement de la langue française, FranceTerme
date parution JO: 2001-04-18
equivalent EN: prochirality @en
equivalent EN: prochirality (en)
part of speech: nom féminin
definition: Propriété géométrique d'un arrangement achiral d'atomes, susceptible de devenir chiral par une seule opération introduisant une dissymétrie.
in scheme: Chimie
in scheme: concept-SD-chimie-stereochimie
in scheme: concepts
notation: CHIM132
note: « Ch » se prononce [k].
related: énantiotope
related: prochiral, -e
related: achiral, -e
related: chiralité

projection cunéiforme
type: ConceptConcept
type: Concept
creator: Commission d'enrichissement de la langue française, FranceTerme
date parution JO: 2001-04-18
equivalent EN: wegde projection @en
equivalent EN: wegde projection (en)
alternative label: projection en triangles
definition: Projection stéréochimique dans le plan moyen d'une entité moléculaire dans laquelle les liaisons sont figurées par des coins dont la base représente l'atome le plus proche et le sommet l'atome le plus éloigné.
in scheme: Chimie
in scheme: concept-SD-chimie-stereochimie
in scheme: concepts
notation: CHIM133

projection de Fischer
type: ConceptConcept
type: Concept
creator: Commission d'enrichissement de la langue française, FranceTerme
date parution JO: 2001-04-18
equivalent EN: Fischer projection @en
equivalent EN: Fischer projection (en)
definition: Projection d'une entité moléculaire dans laquelle les liaisons dessinées verticalement se trouvent au-dessous du plan de projection tandis que les liaisons horizontales se trouvent au-dessus de ce plan.
in scheme: Chimie
in scheme: concept-SD-chimie-stereochimie
in scheme: concepts
notation: CHIM134
note: La projection de Fischer est utilisée essentiellement dans le domaine des sucres, des aminoacides et des composés apparentés où le placement à droite ou à gauche des substituants OH ou NH2 (et dérivés) des liaisons horizontales du carbone asymétrique d'indice numérique le plus élevé définit des séries de composés apparentés (séries D et L).

projection de Newman
type: ConceptConcept
type: Concept
creator: Commission d'enrichissement de la langue française, FranceTerme
date parution JO: 2001-04-18
equivalent EN: Newman projection @en
equivalent EN: Newman projection (en)
definition: Projection représentant l'arrangement spatial des liaisons de deux atomes adjacents d'une entité moléculaire.
in scheme: Chimie
in scheme: concept-SD-chimie-stereochimie
in scheme: concepts
notation: CHIM135
note: La structure apparaît comme si elle était vue dans l'axe de la liaison entre ces deux atomes et les liaisons de ces atomes avec les autres groupes sont dessinées comme des projections sur le plan du papier. Les liaisons partant de l'atome le plus proche de l'observateur sont dessinées comme concourantes au centre d'un cercle représentant cet atome. Les liaisons partant de l'autre atome sont représentées comme se projetant en arrière de ce cercle.

racémique
type: ConceptConcept
type: Concept
creator: Commission d'enrichissement de la langue française, FranceTerme
date parution JO: 2001-04-18
equivalent EN: racemate @en
equivalent EN: racemate (en)
equivalent EN: racemic @en
equivalent EN: racemic (en)
part of speech: nom masculin
definition: Mélange équimoléculaire de deux énantiomères.
in scheme: Chimie
in scheme: concept-SD-chimie-stereochimie
in scheme: concepts
notation: CHIM136
note: 1. Du latin racemus, « grappe (de raisin) ».
note: 2. Ce terme est également employé comme adjectif.
note: 3. Le racémique ne présente donc pas d'activité optique.
note: 4. Le substantif racémique a été anciennement utilisé pour désigner un « composé racémique ».
note: 5. Le terme anglais racemate a été parfois improprement utilisé en français pour désigner un « racémique ».
related: conglomérat racémique
related: dédoublement d'un racémique
related: énantiomère
related: glissement chiral
related: composé racémique

règles séquentielles
type: ConceptConcept
type: Concept
creator: Commission d'enrichissement de la langue française, FranceTerme
date parution JO: 2001-04-18
equivalent EN: CIP rule @en
equivalent EN: CIP rule (en)
equivalent EN: sequence rule @en
equivalent EN: sequence rule (en)
definition: Règles établissant un ordre conventionnel des atomes ou des groupes d'atomes, afin de dénommer sans ambiguïté les configurations absolues des stéréo-isomères chiraux ou les configurations d'isomères cis-trans.
in scheme: Chimie
in scheme: concept-SD-chimie-stereochimie
in scheme: concepts
notation: CHIM137
note: En chimie organique, les règles séquentielles ont été définies à l'origine par R.S. Cahn, C.K. Ingold et V. Prelog.
related: stéréodescripteur
related: configuration absolue

rotamère
type: ConceptConcept
type: Concept
creator: Commission d'enrichissement de la langue française, FranceTerme
date parution JO: 2001-04-18
equivalent EN: rotamer @en
equivalent EN: rotamer (en)
part of speech: nom masculin
definition: Élément d'un ensemble de conformères résultant d'une rotation restreinte autour d'une liaison simple.
in scheme: Chimie
in scheme: concept-SD-chimie-stereochimie
in scheme: concepts
notation: CHIM138
note: Les rotamères qui ne concernent que les enchaînements non linéaires d'atomes A-B-C-D constituent donc une classe particulière de conformères.
related: conformère

stéréodescripteur
type: ConceptConcept
type: Concept
creator: Commission d'enrichissement de la langue française, FranceTerme
date parution JO: 2001-04-18
equivalent EN: stereodescriptor @en
equivalent EN: stereodescriptor (en)
part of speech: nom masculin
definition: Symbole caractérisant la configuration ou la conformation d'une entité moléculaire.
in scheme: Chimie
in scheme: concept-SD-chimie-stereochimie
in scheme: concepts
notation: CHIM139
note: Exemples de stéréodescripteurs utilisés pour spécifier les configurations : R, S, E, Z, cis, trans, ou les conformations : ac, ap, sc, sp.
related: isomérie cis-trans
related: règles séquentielles
related: composé méso
related: configuration absolue

conditions drastiques
type: ConceptConcept
type: Concept
creator: Commission d'enrichissement de la langue française, FranceTerme
date parution JO: 2001-04-18
equivalent EN: drastic conditions @en
equivalent EN: drastic conditions (en)
definition: Dans une réaction chimique, conditions, notamment de température ou de pression, exceptionnellement énergiques.
in scheme: Chimie
in scheme: concepts
notation: CHIM14

stéréogène
type: ConceptConcept
type: Concept
creator: Commission d'enrichissement de la langue française, FranceTerme
date parution JO: 2001-04-18
equivalent EN: stereogenic @en
equivalent EN: stereogenic (en)
part of speech: adjectif
alternative label: stéréogénique
definition: Se dit d'un atome ou d'un groupe d'atomes qui, dans une entité moléculaire, peut être considéré comme à l'origine d'une stéréo-isomérie.
in scheme: Chimie
in scheme: concept-SD-chimie-stereochimie
in scheme: concepts
notation: CHIM140
note: Un atome asymétrique, centre chiral, avec ses ligands, est un exemple traditionnel de groupe stéréogène ; de même un groupe d'atomes constitué d'une double liaison avec ses substituants qui peut donner naissance à une isomérie cis-trans.
related: épimère
related: isomérie cis-trans
related: centre chiral
related: configuration relative

stéréohétérotope
type: ConceptConcept
type: Concept
creator: Commission d'enrichissement de la langue française, FranceTerme
date parution JO: 2001-04-18
equivalent EN: stereoheterotopic @en
equivalent EN: stereoheterotopic (en)
part of speech: adjectif
alternative label: stéréohétérotopique
definition: Se dit d'atomes ou de groupes d'atomes soit énantiotopes, soit diastéréotopes.
in scheme: Chimie
in scheme: concept-SD-chimie-stereochimie
in scheme: concepts
notation: CHIM141
related: diastéréotope
related: énantiotope
related: homotope

stéréo-isomère
type: ConceptConcept
type: Concept
creator: Commission d'enrichissement de la langue française, FranceTerme
date parution JO: 2001-04-18
deconseille ou frequent: stéréomère
equivalent EN: stereoisomer @en
equivalent EN: stereoisomer (en)
equivalent EN: stereoisomeric @en
equivalent EN: stereoisomeric (en)
part of speech: nom masculin ou adjectif
alternative label: stéréo-isomérique
definition: Chacun des isomères qui ne diffèrent entre eux que par la disposition de leurs atomes dans l'espace.
in scheme: Chimie
in scheme: concept-SD-chimie-stereochimie
in scheme: concepts
notation: CHIM142
note: 1. On trouve aussi le terme « stéréomère ».
note: 2. Exemple : le glucose et le mannose sont des oses stéréo-isomères.
related: diastéréo-isomère
related: énantiomère
related: stéréosélectivité
related: isomère
related: tautomère

stéréosélectif, -ive
type: ConceptConcept
type: Concept
creator: Commission d'enrichissement de la langue française, FranceTerme
date parution JO: 2001-04-18
equivalent EN: stereoselective @en
equivalent EN: stereoselective (en)
part of speech: adjectif
definition: Se dit d'un processus qui conduit à la formation prédominante d'un stéréo-isomère plutôt que d'un autre.
in scheme: Chimie
in scheme: concept-SD-chimie-stereochimie
in scheme: concepts
notation: CHIM143
related: synthèse asymétrique
related: synthèse stéréosélective

stéréosélectivité
type: ConceptConcept
type: Concept
creator: Commission d'enrichissement de la langue française, FranceTerme
date parution JO: 2001-04-18
deconseille ou frequent: diastéréosélectivité
deconseille ou frequent: énantiosélectivité
equivalent EN: stereoselectivity @en
equivalent EN: stereoselectivity (en)
part of speech: nom féminin
definition: Formation prédominante d'un stéréo-isomère plutôt que d'un autre dans une réaction chimique.
in scheme: Chimie
in scheme: concept-SD-chimie-stereochimie
in scheme: concepts
notation: CHIM144
note: 1. Lorsque les stéréo-isomères sont des énantiomères, le phénomène est appelé « énantiosélectivité ».
note: 2. Lorsque les stéréo-isomères sont des diastéréo-isomères, le phénomène est appelé « diastéréosélectivité ».
related: diastéréo-isomère
related: diastéréosélectif, -ive
related: énantiomère
related: énantiosélectif, -ive
related: induction asymétrique
related: stéréo-isomère
related: stéréospécificité
related: synthèse asymétrique

stéréospécificité
type: ConceptConcept
type: Concept
creator: Commission d'enrichissement de la langue française, FranceTerme
date parution JO: 2001-04-18
equivalent EN: stereospecificity @en
equivalent EN: stereospecificity (en)
part of speech: nom féminin
definition: Formation dans une réaction d'un seul produit de constitution et de configuration spécifiques à partir d'un composé de configuration déterminée.
in scheme: Chimie
in scheme: concept-SD-chimie-stereochimie
in scheme: concepts
notation: CHIM145
note: 1. Par exemple, l'addition du brome à l'un des isomères cis ou trans d'un alcène, tel que le but-2-ène, est une réaction stéréospécifique.
note: 2. Selon cette définition, tout processus stéréospécifique est nécessairement stéréosélectif, mais un processus stéréosélectif peut ne pas être stéréospécifique.
related: stéréosélectivité

suprafacial, -e
type: ConceptConcept
type: Concept
creator: Commission d'enrichissement de la langue française, FranceTerme
date parution JO: 2001-04-18
equivalent EN: suprafacial @en
equivalent EN: suprafacial (en)
part of speech: adjectif
definition: Se dit du processus par lequel une partie d'une molécule subit deux changements dans sa façon de se lier à deux centres externes à cette partie lorsque les deux changements se produisent sur la même face d'une entité moléculaire.
in scheme: Chimie
in scheme: concept-SD-chimie-stereochimie
in scheme: concepts
notation: CHIM146
note: Le terme « changement » comprend la disparition ou la formation d'une liaison.

synthèse asymétrique
type: ConceptConcept
type: Concept
creator: Commission d'enrichissement de la langue française, FranceTerme
date parution JO: 2001-04-18
deconseille ou frequent: synthèse diastéréosélective
deconseille ou frequent: synthèse énantiosélective
equivalent EN: asymmetric synthesis @en
equivalent EN: asymmetric synthesis (en)
definition: Synthèse d'un produit chiral à partir d'un précurseur achiral sans recours à des dédoublements de produits ou d'intermédiaires racémiques.
in scheme: Chimie
in scheme: concept-SD-chimie-stereochimie
in scheme: concepts
notation: CHIM147
note: Du fait de désaccord sur l'extension de cette définition à des substances dont les molécules comportent déjà un ou plusieurs éléments chiraux, et dans lesquelles la synthèse introduit un nouvel élément chiral, il est préférable de remplacer ce terme traditionnel par « synthèse énantiosélective » ou « synthèse diastéréosélective » selon le cas.
related: diastéréosélectif, -ive
related: énantiosélectif, -ive
related: induction asymétrique
related: stéréosélectif, -ive
related: stéréosélectivité
related: synthèse stéréosélective

synthèse stéréosélective
type: ConceptConcept
type: Concept
creator: Commission d'enrichissement de la langue française, FranceTerme
date parution JO: 2001-04-18
equivalent EN: stereoselective synthesis @en
equivalent EN: stereoselective synthesis (en)
definition: Synthèse, ou réaction, dans laquelle un ou plusieurs nouveaux éléments de chiralité sont formés dans une molécule substrat et qui conduit à des proportions inégales de produits stéréo-isomères : énantiomères (synthèse énantiosélective) ou diastéréo-isomères (synthèse diastéréosélective).
in scheme: Chimie
in scheme: concept-SD-chimie-stereochimie
in scheme: concepts
notation: CHIM148
related: énantiosélectif, -ive
related: induction asymétrique
related: stéréosélectif, -ive
related: synthèse asymétrique

atactique
type: ConceptConcept
type: Concept
creator: Commission d'enrichissement de la langue française, FranceTerme
date parution JO: 2002-03-01
equivalent EN: atactic @en
equivalent EN: atactic (en)
part of speech: adjectif
definition: Se dit d'une macromolécule ou d'un polymère réguliers constitués d'unités configurationnelles élémentaires qui ne sont pas majoritairement identiques.
in scheme: Chimie
in scheme: concept-SD-chimie-polymeres
in scheme: concept-SD-chimie-stereochimie
in scheme: concepts
notation: CHIM149
note: Du grec a, privatif, et taktikos, relatif à l'« art de ranger, de manœuvrer ».
related: isotactique
related: syndiotactique
related: tactique
related: unité configurationnelle élémentaire
related: macromolécule
related: polymère

conversion intersystèmes
type: ConceptConcept
type: Concept
creator: Commission d'enrichissement de la langue française, FranceTerme
date parution JO: 2001-04-18
equivalent EN: intersystem crossing @en
equivalent EN: intersystem crossing (en)
alternative label: croisement intersystèmes
alternative label: passage intersystèmes
definition: Processus non radiatif de transition entre états électroniques de multiplicités différentes.
in scheme: Chimie
in scheme: concept-SD-chimie-nomenclature
in scheme: concepts
notation: CHIM15

bicaténaire
type: ConceptConcept
type: Concept
creator: Commission d'enrichissement de la langue française, FranceTerme
date parution JO: 2002-03-01
equivalent EN: double-strand @en
equivalent EN: double-strand (en)
part of speech: adjectif
definition: Se dit d'une macromolécule ou d'un polymère constitués de deux chaînes reliées entre elles et formant une séquence ininterrompue de cycles telle que les cycles adjacents possèdent un ou plusieurs atomes communs.
in scheme: Chimie
in scheme: concept-SD-chimie-polymeres
in scheme: concepts
notation: CHIM150
related: échelle (en)
related: monocaténaire
related: multicaténaire
related: spiro-
related: macromolécule
related: polymère

bloc
type: ConceptConcept
type: Concept
creator: Commission d'enrichissement de la langue française, FranceTerme
date parution JO: 2002-03-01
equivalent EN: block @en
equivalent EN: block (en)
part of speech: nom masculin
definition: Partie d'une macromolécule comprenant de nombreuses unités constitutives et qui possède au moins une particularité de constitution ou de configuration qui n'apparaît pas dans les parties adjacentes.
in scheme: Chimie
in scheme: concept-SD-chimie-polymeres
in scheme: concept-SD-chimie-stereochimie
in scheme: concepts
notation: CHIM151
note: Dans certains cas, les définitions relatives aux macromolécules peuvent également s'appliquer aux blocs.
related: chaîne
related: polymère à blocs
related: polymère à stéréoblocs
related: polymère greffé
related: unité constitutive
related: macromolécule

chaîne
type: ConceptConcept
type: Concept
creator: Commission d'enrichissement de la langue française, FranceTerme
date parution JO: 2002-03-01
equivalent EN: chain @en
equivalent EN: chain (en)
part of speech: nom féminin
definition: Macromolécule ou partie d'une macromolécule comportant une séquence linéaire ou ramifiée d'unités constitutives située entre deux unités constitutives limites qui peuvent être chacune un groupe terminal, un point de branchement ou une particularité caractéristique de la macromolécule.
in scheme: Chimie
in scheme: concept-SD-chimie-polymeres
in scheme: concepts
notation: CHIM152
note: Dans certains cas, les définitions relatives aux macromolécules peuvent également s'appliquer aux chaînes.
related: bloc
related: chaîne principale
related: monocaténaire
related: unité constitutive
related: séquence configurationnelle
related: séquence constitutive
related: macromolécule
related: nœud de réticulation

chaîne principale
type: ConceptConcept
type: Concept
creator: Commission d'enrichissement de la langue française, FranceTerme
date parution JO: 2002-03-01
equivalent EN: backbone @en
equivalent EN: backbone (en)
equivalent EN: main chain @en
equivalent EN: main chain (en)
definition: Chaîne linéaire à laquelle toutes les autres chaînes, qu'elles soient courtes ou longues, sont attachées.
in scheme: Chimie
in scheme: concept-SD-chimie-polymeres
in scheme: concepts
notation: CHIM153
note: Les chaînes attachées à la chaîne principale peuvent être considérées comme des chaînes latérales.
related: chaîne

copolymère à blocs
type: ConceptConcept
type: Concept
creator: Commission d'enrichissement de la langue française, FranceTerme
date parution JO: 2002-03-01
equivalent EN: block copolymer @en
equivalent EN: block copolymer (en)
definition: Polymère à blocs issu de plusieurs espèces de monomères.
in scheme: Chimie
in scheme: concept-SD-chimie-polymeres
in scheme: concepts
notation: CHIM154
related: copolymère greffé
related: copolymérisation
related: copolymère
related: polymère à blocs
related: monomère

copolymère aléatoire
type: ConceptConcept
type: Concept
creator: Commission d'enrichissement de la langue française, FranceTerme
date parution JO: 2002-03-01
equivalent EN: random copolymer @en
equivalent EN: random copolymer (en)
definition: Copolymère constitué de macromolécules dans lesquelles la probabilité de trouver une unité monomère donnée en un point donné de la chaîne est indépendante de la nature des unités adjacentes.
in scheme: Chimie
in scheme: concept-SD-chimie-polymeres
in scheme: concepts
notation: CHIM155
related: copolymère statistique
related: copolymère
related: macromolécule

copolymère alterné
type: ConceptConcept
type: Concept
creator: Commission d'enrichissement de la langue française, FranceTerme
date parution JO: 2002-03-01
equivalent EN: alternating copolymer @en
equivalent EN: alternating copolymer (en)
definition: Copolymère constitué de macromolécules comportant deux sortes d'unités monomères distribuées en alternance.
in scheme: Chimie
in scheme: concept-SD-chimie-polymeres
in scheme: concepts
notation: CHIM156
related: copolymérisation
related: copolymère
related: unité constitutive
related: unité monomère
related: macromolécule

copolymère greffé
type: ConceptConcept
type: Concept
creator: Commission d'enrichissement de la langue française, FranceTerme
date parution JO: 2002-03-01
equivalent EN: graft copolymer @en
equivalent EN: graft copolymer (en)
definition: Polymère greffé issu de plusieurs espèces de monomères.
in scheme: Chimie
in scheme: concept-SD-chimie-polymeres
in scheme: concepts
notation: CHIM157
related: copolymère à blocs
related: copolymérisation
related: polymère greffé
related: monomère

copolymère statistique
type: ConceptConcept
type: Concept
creator: Commission d'enrichissement de la langue française, FranceTerme
date parution JO: 2002-03-01
equivalent EN: statistical copolymer @en
equivalent EN: statistical copolymer (en)
definition: Copolymère constitué de macromolécules dans lesquelles la distribution des unités monomères obéit à des lois statistiques connues.
in scheme: Chimie
in scheme: concept-SD-chimie-polymeres
in scheme: concepts
notation: CHIM158
related: copolymère aléatoire
related: copolymérisation
related: copolymère
related: unité monomère
related: macromolécule

copolymérisation
type: ConceptConcept
type: Concept
creator: Commission d'enrichissement de la langue française, FranceTerme
date parution JO: 2002-03-01
deconseille ou frequent: copolymerisation
deconseille ou frequent: copolymerization
equivalent EN: coploymerization (US) @en
equivalent EN: coploymerization (en-US)
equivalent EN: copolymerisation (GB) @en
equivalent EN: copolymerisation (en-GB)
part of speech: nom féminin
definition: Polymérisation conduisant à un copolymère.
in scheme: Chimie
in scheme: concept-SD-chimie-polymeres
in scheme: concepts
notation: CHIM159
related: copolymère à blocs
related: copolymère alterné
related: copolymère greffé
related: copolymère statistique
related: copolymère
related: polymérisation

copolymère
type: ConceptConcept
type: Concept
creator: Commission d'enrichissement de la langue française, FranceTerme
date parution JO: 2001-04-18
equivalent EN: copolymer @en
equivalent EN: copolymer (en)
part of speech: nom masculin
definition: Polymère issu de plusieurs espèces de monomères.
in scheme: Chimie
in scheme: concept-SD-chimie-chimie-macromoleculaire
in scheme: concepts
notation: CHIM16
related: copolymère à blocs
related: copolymère aléatoire
related: copolymère alterné
related: copolymère statistique
related: copolymérisation
related: monomère
related: oligomère
related: polymère

degré de polymérisation
type: ConceptConcept
type: Concept
creator: Commission d'enrichissement de la langue française, FranceTerme
date parution JO: 2002-03-01
deconseille ou frequent: degree of polymerisation
deconseille ou frequent: degree of polymerization
equivalent EN: degree of polymerisation (GB) @en
equivalent EN: degree of polymerisation (en-GB)
equivalent EN: degree of polymerization (US) @en
equivalent EN: degree of polymerization (en-US)
definition: Nombre d'unités monomères d'une macromolécule.
in scheme: Chimie
in scheme: concept-SD-chimie-polymeres
in scheme: concepts
notation: CHIM160
related: unité monomère
related: macromolécule

dépolymérisation
type: ConceptConcept
type: Concept
creator: Commission d'enrichissement de la langue française, FranceTerme
date parution JO: 2002-03-01
deconseille ou frequent: depolymerisation
deconseille ou frequent: depolymerization
equivalent EN: depolymerisation (GB) @en
equivalent EN: depolymerisation (en-GB)
equivalent EN: depolymerization (US) @en
equivalent EN: depolymerization (en-US)
part of speech: nom féminin
definition: Processus de transformation d'un polymère en monomère ou en un mélange de monomères.
in scheme: Chimie
in scheme: concept-SD-chimie-polymeres
in scheme: concepts
notation: CHIM161
related: dépropagation
related: monomère
related: polymère
related: polymérisation

dépropagation
type: ConceptConcept
type: Concept
creator: Commission d'enrichissement de la langue française, FranceTerme
date parution JO: 2002-03-01
equivalent EN: unzipping @en
equivalent EN: unzipping (en)
part of speech: nom féminin
definition: Dépolymérisation qui procède par une séquence répétitive de réactions chimiques progressant au long d'une macromolécule et qui aboutit habituellement à des molécules monomères et à des chaînes de plus en plus courtes à chaque stade réactionnel.
in scheme: Chimie
in scheme: concept-SD-chimie-polymeres
in scheme: concepts
notation: CHIM162
note: La dépropagation désigne le processus inverse de la phase principale d'une polymérisation en chaîne, la phase de propagation, qui procède par une séquence répétitive de réactions allongeant la macromolécule d'une unité monomère à chaque stade réactionnel.
related: dépolymérisation
related: polymérisation en chaîne
related: macromolécule

échelle (en)
type: ConceptConcept
type: Concept
creator: Commission d'enrichissement de la langue française, FranceTerme
date parution JO: 2002-03-01
deconseille ou frequent: en échelle
deconseille ou frequent: échelle
equivalent EN: ladder @en
equivalent EN: ladder (en)
part of speech: locution adjectivale
definition: Se dit d'une macromolécule ou d'un polymère bicaténaires constitués d'une séquence ininterrompue de cycles telle que les cycles adjacents possèdent au moins deux atomes communs.
in scheme: Chimie
in scheme: concept-SD-chimie-polymeres
in scheme: concepts
notation: CHIM163
related: bicaténaire
related: macromolécule
related: polymère

groupe terminal
type: ConceptConcept
type: Concept
creator: Commission d'enrichissement de la langue française, FranceTerme
date parution JO: 2002-03-01
equivalent EN: end-group @en
equivalent EN: end-group (en)
definition: Groupe situé à une extrémité d'une macromolécule.
in scheme: Chimie
in scheme: concept-SD-chimie-polymeres
in scheme: concepts
notation: CHIM164
related: macromolécule

homopolymère
type: ConceptConcept
type: Concept
creator: Commission d'enrichissement de la langue française, FranceTerme
date parution JO: 2002-03-01
equivalent EN: homopolymer @en
equivalent EN: homopolymer (en)
part of speech: nom masculin
definition: Polymère issu d'une seule espèce de monomère.
in scheme: Chimie
in scheme: concept-SD-chimie-polymeres
in scheme: concepts
notation: CHIM165
related: homopolymérisation
related: monomère
related: polymère

homopolymérisation
type: ConceptConcept
type: Concept
creator: Commission d'enrichissement de la langue française, FranceTerme
date parution JO: 2002-03-01
deconseille ou frequent: homopolymerisation
deconseille ou frequent: homopolymerization
equivalent EN: homopolymerisation (GB) @en
equivalent EN: homopolymerisation (en-GB)
equivalent EN: homopolymerization (US) @en
equivalent EN: homopolymerization (en-US)
part of speech: nom féminin
definition: Polymérisation conduisant à un homopolymère.
in scheme: Chimie
in scheme: concept-SD-chimie-polymeres
in scheme: concepts
notation: CHIM166
related: homopolymère
related: polymérisation

irrégulier, -ière
type: ConceptConcept
type: Concept
creator: Commission d'enrichissement de la langue française, FranceTerme
date parution JO: 2002-03-01
equivalent EN: irregular @en
equivalent EN: irregular (en)
part of speech: adjectif
definition: Se dit d'une macromolécule ou d'un polymère dont la structure comporte plus d'une sorte d'unités constitutives, ou des unités constitutives identiques mais non reliées entre elles de la même manière.
in scheme: Chimie
in scheme: concept-SD-chimie-polymeres
in scheme: concepts
notation: CHIM167
related: unité constitutive
related: régulier, -ière
related: macromolécule
related: polymère

isotactique
type: ConceptConcept
type: Concept
creator: Commission d'enrichissement de la langue française, FranceTerme
date parution JO: 2002-03-01
equivalent EN: isotactic @en
equivalent EN: isotactic (en)
part of speech: adjectif
definition: Se dit d'une macromolécule ou d'un polymère tactiques constitués majoritairement d'une seule sorte d'unités configurationnelles élémentaires, généralement reliées entre elles de la même manière.
in scheme: Chimie
in scheme: concept-SD-chimie-polymeres
in scheme: concept-SD-chimie-stereochimie
in scheme: concepts
notation: CHIM168
note: 1. Du grec isos, « égal », et taktikos, relatif à l'« art de ranger, de manœuvrer ».
note: 2. Dans une macromolécule ou dans un polymère isotactiques, le motif configurationnel est identique à l'unité configurationnelle élémentaire.
related: atactique
related: motif configurationnel
related: syndiotactique
related: tactique
related: unité configurationnelle élémentaire
related: macromolécule
related: polymère

linéaire
type: ConceptConcept
type: Concept
creator: Commission d'enrichissement de la langue française, FranceTerme
date parution JO: 2002-03-01
equivalent EN: linear @en
equivalent EN: linear (en)
part of speech: adjectif
definition: Se dit d'une macromolécule ou d'un polymère résultant d'une répétition multiple en séquence linéaire d'unités qui dérivent de molécules de faible masse moléculaire.
in scheme: Chimie
in scheme: concept-SD-chimie-polymeres
in scheme: concepts
notation: CHIM169
related: macromolécule
related: polymère

désactivation
type: ConceptConcept
type: Concept
creator: Commission d'enrichissement de la langue française, FranceTerme
date parution JO: 2001-04-18
equivalent EN: deactivation @en
equivalent EN: deactivation (en)
equivalent EN: quenching @en
equivalent EN: quenching (en)
part of speech: nom féminin
definition: Passage d'une entité moléculaire d'un état excité à un niveau d'énergie inférieur.
in scheme: Chimie
in scheme: concept-SD-chimie-photochimie
in scheme: concepts
notation: CHIM17
related: désactiveur
related: extincteur

monocaténaire
type: ConceptConcept
type: Concept
creator: Commission d'enrichissement de la langue française, FranceTerme
date parution JO: 2002-03-01
equivalent EN: single-strand @en
equivalent EN: single-strand (en)
part of speech: adjectif
definition: Se dit d'une macromolécule ou d'un polymère constitués d'une seule chaîne et dont les unités constitutives adjacentes sont unies l'une à l'autre par deux atomes appartenant respectivement à chacune des deux unités.
in scheme: Chimie
in scheme: concept-SD-chimie-polymeres
in scheme: concepts
notation: CHIM171
related: bicaténaire
related: chaîne
related: multicaténaire
related: unité constitutive
related: macromolécule
related: polymère

motif configurationnel
type: ConceptConcept
type: Concept
creator: Commission d'enrichissement de la langue française, FranceTerme
date parution JO: 2002-03-01
equivalent EN: configurational repeating unit @en
equivalent EN: configurational repeating unit (en)
definition: Le plus petit ensemble d'unités configurationnelles élémentaires successives nécessaire pour définir la répétition configurationnelle en un ou plusieurs sites de stéréo-isomérie de la chaîne principale d'une macromolécule régulière.
in scheme: Chimie
in scheme: concept-SD-chimie-polymeres
in scheme: concept-SD-chimie-stereochimie
in scheme: concepts
notation: CHIM172
note: L'ensemble peut être constitué d'une, de deux ou de plusieurs unités configurationnelles élémentaires.
related: isotactique
related: motif de stéréorépétition
related: régulier, -ière
related: syndiotactique
related: tacticité
related: tactique
related: unité configurationnelle élémentaire
related: macromolécule

motif constitutif
type: ConceptConcept
type: Concept
creator: Commission d'enrichissement de la langue française, FranceTerme
abbreviation: CRU @en
abbreviation: MC
date parution JO: 2002-03-01
equivalent EN: CRU @en
equivalent EN: CRU (en)
equivalent EN: constitutional repeating unit @en
equivalent EN: constitutional repeating unit (en)
definition: La plus petite unité constitutive dont la répétition conduit à une macromolécule régulière.
in scheme: Chimie
in scheme: concept-SD-chimie-polymeres
in scheme: concepts
notation: CHIM173
note: La nomenclature systématique des macromolécules et des polymères est fondée sur la répétition du motif constitutif. Exemple : « poly(1-phényléthylène) », correspondant au nom semi-systématique « polystyrène ».
related: unité constitutive
related: régulier, -ière
related: unité configurationnelle élémentaire
related: macromolécule

motif de stéréorépétition
type: ConceptConcept
type: Concept
creator: Commission d'enrichissement de la langue française, FranceTerme
date parution JO: 2002-03-01
equivalent EN: stereorepeating unit @en
equivalent EN: stereorepeating unit (en)
definition: Motif configurationnel qui définit la répétition configurationnelle à tous les sites de stéréo-isomérie de la chaîne principale d'une macromolécule régulière.
in scheme: Chimie
in scheme: concept-SD-chimie-polymeres
in scheme: concept-SD-chimie-stereochimie
in scheme: concepts
notation: CHIM174
related: motif configurationnel
related: régulier, -ière
related: stéréorégulier, -ière
related: macromolécule

multicaténaire
type: ConceptConcept
type: Concept
creator: Commission d'enrichissement de la langue française, FranceTerme
date parution JO: 2002-03-01
equivalent EN: multi-strand @en
equivalent EN: multi-strand (en)
part of speech: adjectif
definition: Se dit d'une macromolécule ou d'un polymère dont les unités constitutives adjacentes sont unies l'une à l'autre par plus de quatre atomes, dont plus de deux sont situés à l'une des extrémités de chaque unité constitutive.
in scheme: Chimie
in scheme: concept-SD-chimie-polymeres
in scheme: concepts
notation: CHIM175
related: bicaténaire
related: monocaténaire
related: unité constitutive
related: macromolécule
related: polymère

oligomérisation
type: ConceptConcept
type: Concept
creator: Commission d'enrichissement de la langue française, FranceTerme
date parution JO: 2002-03-01
deconseille ou frequent: oligomerisation
deconseille ou frequent: oligomerization
equivalent EN: oligomerisation (GB) @en
equivalent EN: oligomerisation (en-GB)
equivalent EN: oligomerization (US) @en
equivalent EN: oligomerization (en-US)
part of speech: nom féminin
definition: Processus de transformation d'un monomère, ou d'un mélange de monomères, en un oligomère.
in scheme: Chimie
in scheme: concept-SD-chimie-polymeres
in scheme: concepts
notation: CHIM177
related: télomérisation
related: monomère
related: oligomère
related: polymérisation

polyaddition
type: ConceptConcept
type: Concept
creator: Commission d'enrichissement de la langue française, FranceTerme
date parution JO: 2002-03-01
equivalent EN: polyaddition @en
equivalent EN: polyaddition (en)
part of speech: nom féminin
definition: Polymérisation par étapes dans laquelle la croissance des chaînes polymères résulte de réactions d'addition entre molécules de tous degrés de polymérisation.
in scheme: Chimie
in scheme: concept-SD-chimie-polymeres
in scheme: concepts
notation: CHIM178
note: 1. Du point de vue pratique, une polyaddition ne peut, par définition, donner lieu à une libération d'espèce chimique de faible masse moléculaire ; c'est le cas, par exemple, de la polyaddition des diols sur les diisocyanates qui conduit aux polyuréthanes.
note: 2. La polymérisation des composés éthyléniques n'est pas considérée en général comme une polyaddition, mais plutôt comme une polymérisation en chaîne.
related: polymérisation en chaîne
related: polymérisation

polycondensation
type: ConceptConcept
type: Concept
creator: Commission d'enrichissement de la langue française, FranceTerme
date parution JO: 2002-03-01
equivalent EN: polycondensation @en
equivalent EN: polycondensation (en)
part of speech: nom féminin
definition: Polymérisation par étapes dans laquelle la croissance des chaînes polymères résulte de réactions de condensation entre molécules de tous degrés de polymérisation.
in scheme: Chimie
in scheme: concept-SD-chimie-polymeres
in scheme: concepts
notation: CHIM179
note: Du point de vue pratique, une polycondensation s'accompagne de la libération d'une espèce chimique de faible masse moléculaire ; c'est le cas, par exemple, de la polycondensation des diamines et des diacides qui conduit à des polyamides et à de l'eau.
related: polymérisation

désactiveur
type: ConceptConcept
type: Concept
creator: Commission d'enrichissement de la langue française, FranceTerme
date parution JO: 2001-04-18
equivalent EN: quencher @en
equivalent EN: quencher (en)
part of speech: nom masculin
definition: Entité moléculaire ou espèce chimique qui désactive un état excité d'une autre entité moléculaire par transfert d'énergie, par transfert d'électron ou par un mécanisme chimique.
in scheme: Chimie
in scheme: concept-SD-chimie-photochimie
in scheme: concepts
notation: CHIM18
note: Dans le cas de la luminescence, on utilise plus fréquemment le terme « extincteur ».
related: désactivation
related: extincteur

polymère à blocs
type: ConceptConcept
type: Concept
creator: Commission d'enrichissement de la langue française, FranceTerme
date parution JO: 2002-03-01
equivalent EN: block polymer @en
equivalent EN: block polymer (en)
definition: Polymère dont les macromolécules sont constituées de blocs enchaînés linéairement.
in scheme: Chimie
in scheme: concept-SD-chimie-polymeres
in scheme: concepts
notation: CHIM180
note: Les blocs sont assemblés directement ou par l'intermédiaire d'une unité constitutive qui ne fait pas partie intégrante des blocs.
related: bloc
related: copolymère à blocs
related: polymère à stéréoblocs
related: polymère greffé
related: unité constitutive
related: macromolécule
related: polymère

polymère à stéréoblocs
type: ConceptConcept
type: Concept
creator: Commission d'enrichissement de la langue française, FranceTerme
date parution JO: 2002-03-01
equivalent EN: stereoblock polymer @en
equivalent EN: stereoblock polymer (en)
definition: Polymère dont les macromolécules sont constituées de blocs stéréoréguliers et peuvent aussi comporter des blocs non stéréoréguliers.
in scheme: Chimie
in scheme: concept-SD-chimie-polymeres
in scheme: concept-SD-chimie-stereochimie
in scheme: concepts
notation: CHIM181
related: bloc
related: polymère à blocs
related: unité constitutive
related: stéréorégulier, -ière
related: macromolécule
related: polymère

polymère greffé
type: ConceptConcept
type: Concept
creator: Commission d'enrichissement de la langue française, FranceTerme
date parution JO: 2002-03-01
equivalent EN: graft polymer @en
equivalent EN: graft polymer (en)
definition: Polymère composé de macromolécules comportant une ou plusieurs sortes de blocs liés à la chaîne principale ; ces blocs constituent des chaînes latérales et présentent des caractéristiques de constitution ou de conformation différentes de celles de la chaîne principale.
in scheme: Chimie
in scheme: concept-SD-chimie-polymeres
in scheme: concepts
notation: CHIM182
related: bloc
related: copolymère greffé
related: polymère à blocs
related: unité constitutive
related: macromolécule
related: polymère

polymère non uniforme
type: ConceptConcept
type: Concept
creator: Commission d'enrichissement de la langue française, FranceTerme
date parution JO: 2002-03-01
equivalent EN: non-uniform polymer @en
equivalent EN: non-uniform polymer (en)
equivalent EN: polydisperse polymer @en
equivalent EN: polydisperse polymer (en)
alternative label: polymère polydispersé
definition: Polymère composé de molécules qui diffèrent du point de vue de la masse moléculaire ou de la constitution, ou bien des deux.
in scheme: Chimie
in scheme: concept-SD-chimie-polymeres
in scheme: concepts
notation: CHIM183
related: polymère uniforme
related: polymère

polymère uniforme
type: ConceptConcept
type: Concept
creator: Commission d'enrichissement de la langue française, FranceTerme
date parution JO: 2002-03-01
equivalent EN: monodisperse polymer @en
equivalent EN: monodisperse polymer (en)
equivalent EN: uniform polymer @en
equivalent EN: uniform polymer (en)
alternative label: polymère monodispersé
definition: Polymère composé de molécules ayant la même masse moléculaire et la même constitution.
in scheme: Chimie
in scheme: concept-SD-chimie-polymeres
in scheme: concepts
notation: CHIM184
note: Un polymère uniforme du point de vue de la masse moléculaire ou de la constitution peut être dit « uniforme » à condition d'en préciser la raison ; par exemple : polymère uniforme du point de vue de la constitution.
related: polymère non uniforme

unité constitutive
type: ConceptConcept
type: Concept
creator: Commission d'enrichissement de la langue française, FranceTerme
date parution JO: 2002-03-01
equivalent EN: constitutional unit @en
equivalent EN: constitutional unit (en)
definition: Atome ou groupe d'atomes, incluant les atomes ou groupes d'atomes éventuellement attachés, qui constitue une partie fondamentale de la structure d'une macromolécule.
in scheme: Chimie
in scheme: concept-SD-chimie-polymeres
in scheme: concepts
notation: CHIM185
related: bloc
related: chaîne
related: copolymère alterné
related: irrégulier, -ière
related: monocaténaire
related: motif constitutif
related: multicaténaire
related: polymère à blocs
related: polymère à stéréoblocs
related: polymère greffé
related: régulier, -ière
related: réseau
related: séquence constitutive
related: unité configurationnelle
related: unité monomère
related: macromolécule

régulier, -ière
type: ConceptConcept
type: Concept
creator: Commission d'enrichissement de la langue française, FranceTerme
date parution JO: 2002-03-01
equivalent EN: regular @en
equivalent EN: regular (en)
part of speech: adjectif
definition: Se dit d'une macromolécule, d'un oligomère ou d'un polymère qui résultent de la répétition d'unités constitutives toutes identiques et reliées entre elles de la même manière.
in scheme: Chimie
in scheme: concept-SD-chimie-polymeres
in scheme: concepts
notation: CHIM186
related: irrégulier, -ière
related: motif configurationnel
related: motif constitutif
related: motif de stéréorépétition
related: unité constitutive
related: stéréorégulier, -ière
related: tactique
related: unité configurationnelle élémentaire
related: macromolécule
related: oligomère
related: polymère

stéréorégulier, -ière
type: ConceptConcept
type: Concept
creator: Commission d'enrichissement de la langue française, FranceTerme
date parution JO: 2002-03-01
equivalent EN: stereoregular @en
equivalent EN: stereoregular (en)
part of speech: adjectif
definition: Se dit d'une macromolécule ou d'un polymère réguliers qui ne comportent qu'un seul type de motif de stéréorépétition dans un arrangement séquentiel unique.
in scheme: Chimie
in scheme: concept-SD-chimie-polymeres
in scheme: concept-SD-chimie-stereochimie
in scheme: concepts
notation: CHIM187
related: motif de stéréorépétition
related: polymère à stéréoblocs
related: régulier, -ière
related: macromolécule
related: polymère

polymérisation en chaîne
type: ConceptConcept
type: Concept
creator: Commission d'enrichissement de la langue française, FranceTerme
date parution JO: 2002-03-01
deconseille ou frequent: chain polymerisation
deconseille ou frequent: chain polymerization
deconseille ou frequent: polymérisation en chaîne avec condensation
equivalent EN: chain polymerisation (GB) @en
equivalent EN: chain polymerisation (en-GB)
equivalent EN: chain polymerization (US) @en
equivalent EN: chain polymerization (en-US)
definition: Polymérisation dans laquelle la croissance d'une chaîne polymère résulte exclusivement d'une ou plusieurs réactions entre monomère et site réactif de la chaîne polymère, avec régénération du ou des sites réactifs à la fin de chaque étape de croissance.
in scheme: Chimie
in scheme: concept-SD-chimie-polymeres
in scheme: concepts
notation: CHIM188
note: 1. Une polymérisation en chaîne comporte des réactions d'amorçage et de propagation et peut également inclure des réactions de terminaison et de transfert de chaîne.
note: 2. Lorsqu'un sous-produit de faible masse moléculaire se forme dans la réaction, il est recommandé de préciser : « polymérisation en chaîne avec condensation ».
note: 3. Si nécessaire, le type de réaction chimique impliquée dans l'étape de croissance peut, de plus, être précisé ; par exemple : polymérisation cationique en chaîne, etc.
related: dépropagation
related: polyaddition
related: télomérisation
related: transfert de chaîne
related: monomère
related: polymère
related: polymérisation

prépolymère
type: ConceptConcept
type: Concept
creator: Commission d'enrichissement de la langue française, FranceTerme
date parution JO: 2002-03-01
equivalent EN: pre-polymer @en
equivalent EN: pre-polymer (en)
equivalent EN: pre-polymeric @en
equivalent EN: pre-polymeric (en)
part of speech: nom masculin
definition: Macromolécule, oligomère ou polymère capables de subir une polymérisation ultérieure grâce à des groupes réactifs.
in scheme: Chimie
in scheme: concept-SD-chimie-polymeres
in scheme: concepts
notation: CHIM189
note: Ce terme est aussi utilisé comme adjectif.
related: téléchélique
related: transfert de chaîne
related: macromolécule
related: oligomère
related: polymère
related: polymérisation

dismutation
type: ConceptConcept
type: Concept
creator: Commission d'enrichissement de la langue française, FranceTerme
date parution JO: 2001-04-18
equivalent EN: dismutation @en
equivalent EN: dismutation (en)
equivalent EN: disproportionation @en
equivalent EN: disproportionation (en)
part of speech: nom féminin
definition: Type de réaction d'oxydoréduction dans laquelle deux molécules d'une espèce chimique A réagissent entre elles en donnant naissance à une molécule A' par oxydation et une molécule A'' par réduction.
in scheme: Chimie
in scheme: concepts
notation: CHIM19

réseau
type: ConceptConcept
type: Concept
creator: Commission d'enrichissement de la langue française, FranceTerme
date parution JO: 2002-03-01
equivalent EN: network @en
equivalent EN: network (en)
part of speech: nom masculin
definition: Macromolécule très ramifiée dans laquelle chaque unité constitutive est reliée à chacune des autres ainsi qu'aux limites de la phase macroscopique par de nombreux chemins permanents à travers la macromolécule.
in scheme: Chimie
in scheme: concept-SD-chimie-polymeres
in scheme: concepts
notation: CHIM190
related: unité constitutive
related: macromolécule

séquence configurationnelle
type: ConceptConcept
type: Concept
creator: Commission d'enrichissement de la langue française, FranceTerme
date parution JO: 2002-03-01
deconseille ou frequent: dyade
deconseille ou frequent: triade
equivalent EN: configurational sequence @en
equivalent EN: configurational sequence (en)
definition: Partie d'une chaîne comportant une ou plusieurs sortes d'unités configurationnelles qui se succèdent dans un ordre défini.
in scheme: Chimie
in scheme: concept-SD-chimie-polymeres
in scheme: concept-SD-chimie-stereochimie
in scheme: concepts
notation: CHIM191
note: Les séquences configurationnelles comprenant deux unités configurationnelles sont dénommées « dyades », celles en comprenant trois, « triades ».
related: chaîne
related: unité configurationnelle

séquence constitutive
type: ConceptConcept
type: Concept
creator: Commission d'enrichissement de la langue française, FranceTerme
date parution JO: 2002-03-01
equivalent EN: constitutional sequence @en
equivalent EN: constitutional sequence (en)
definition: Partie d'une chaîne comportant une ou plusieurs sortes d'unités constitutives qui se succèdent dans un ordre défini.
in scheme: Chimie
in scheme: concept-SD-chimie-polymeres
in scheme: concepts
notation: CHIM192
note: Les séquences constitutives comprenant deux unités constitutives sont dénommées « dyades », celles en comprenant trois, « triades ».
related: chaîne
related: unité constitutive

spiro-
type: ConceptConcept
type: Concept
creator: Commission d'enrichissement de la langue française, FranceTerme
date parution JO: 2002-03-01
equivalent EN: spiro- @en
equivalent EN: spiro- (en)
definition: Sert à désigner une macromolécule ou un polymère bicaténaires constitués d'une séquence ininterrompue de cycles telle que les cycles adjacents n'ont qu'un seul atome commun.
in scheme: Chimie
in scheme: concept-SD-chimie-polymeres
in scheme: concepts
notation: CHIM193
related: bicaténaire
related: macromolécule
related: polymère

syndiotactique
type: ConceptConcept
type: Concept
creator: Commission d'enrichissement de la langue française, FranceTerme
date parution JO: 2002-03-01
equivalent EN: syndiotactic @en
equivalent EN: syndiotactic (en)
part of speech: adjectif
definition: Se dit d'une macromolécule ou d'un polymère tactiques constitués majoritairement d'unités configurationnelles élémentaires énantiomères régulièrement alternées.
in scheme: Chimie
in scheme: concept-SD-chimie-polymeres
in scheme: concept-SD-chimie-stereochimie
in scheme: concepts
notation: CHIM194
note: 1. Du grec sundein, « lier ensemble », et taktikos, relatif à l'« art de ranger, de manœuvrer ».
note: 2. Dans une macromolécule ou dans un polymère syndiotactiques, le motif configurationnel est constitué de deux unités configurationnelles élémentaires.
related: atactique
related: isotactique
related: motif configurationnel
related: tactique
related: unité configurationnelle élémentaire
related: macromolécule
related: polymère

tacticité
type: ConceptConcept
type: Concept
creator: Commission d'enrichissement de la langue française, FranceTerme
date parution JO: 2002-03-01
equivalent EN: tacticity @en
equivalent EN: tacticity (en)
part of speech: nom féminin
definition: Ordonnancement dans la succession des motifs configurationnels de la chaîne principale d'une macromolécule régulière ou d'un polymère régulier.
in scheme: Chimie
in scheme: concept-SD-chimie-polymeres
in scheme: concept-SD-chimie-stereochimie
in scheme: concepts
notation: CHIM195
note: Du grec taktikê (technê), « art de ranger, de manœuvrer ».
related: motif configurationnel
related: macromolécule

tactique
type: ConceptConcept
type: Concept
creator: Commission d'enrichissement de la langue française, FranceTerme
date parution JO: 2002-03-01
equivalent EN: tactic @en
equivalent EN: tactic (en)
part of speech: adjectif
definition: Se dit d'une macromolécule ou d'un polymère réguliers constitués de motifs configurationnels majoritairement identiques.
in scheme: Chimie
in scheme: concept-SD-chimie-polymeres
in scheme: concept-SD-chimie-stereochimie
in scheme: concepts
notation: CHIM196
note: Du grec taktikos, relatif à l'« art de ranger, de manœuvrer ».
related: atactique
related: isotactique
related: motif configurationnel
related: régulier, -ière
related: syndiotactique
related: macromolécule
related: polymère

téléchélique
type: ConceptConcept
type: Concept
creator: Commission d'enrichissement de la langue française, FranceTerme
date parution JO: 2002-03-01
equivalent EN: telechelic @en
equivalent EN: telechelic (en)
part of speech: adjectif
definition: Se dit d'un oligomère ou d'un polymère linéaires capables de subir une polymérisation ultérieure du fait de la présence de groupes réactifs à chacune des deux extrémités de la chaîne.
in scheme: Chimie
in scheme: concept-SD-chimie-polymeres
in scheme: concepts
notation: CHIM197
note: Du grec télé, « loin, à distance », et khélé, « pince ».
related: prépolymère
related: oligomère
related: polymère
related: polymérisation

télomérisation
type: ConceptConcept
type: Concept
creator: Commission d'enrichissement de la langue française, FranceTerme
date parution JO: 2002-03-01
equivalent EN: telomerisation @en
equivalent EN: telomerisation (en)
part of speech: nom féminin
definition: Oligomérisation ou polymérisation par réaction en chaîne, effectuées en présence d'un excès d'agent de transfert et telle que les groupes terminaux sont des fragments de l'agent de transfert.
in scheme: Chimie
in scheme: concept-SD-chimie-polymeres
in scheme: concepts
notation: CHIM198
note: Par exemple, la télomérisation du styrène, amorcée par la rupture homolytique de CI3CBr conduit au télomère CI3C[CH2-CH-(C6H5)] nBr.
related: oligomérisation
related: polymérisation en chaîne
related: transfert de chaîne
related: polymérisation

transfert de chaîne
type: ConceptConcept
type: Concept
creator: Commission d'enrichissement de la langue française, FranceTerme
date parution JO: 2002-03-01
equivalent EN: chain transfer @en
equivalent EN: chain transfer (en)
definition: Stade réactionnel se produisant généralement au cours de réactions en chaîne et dans lequel le site réactif est transféré de la macromolécule en cours de croissance à une autre molécule, ou à une autre partie de la même molécule.
in scheme: Chimie
in scheme: concept-SD-chimie-polymeres
in scheme: concepts
notation: CHIM199
related: polymérisation en chaîne
related: prépolymère
related: télomérisation
related: transfert intramoléculaire
related: macromolécule

adduit
type: ConceptConcept
type: Concept
creator: Commission d'enrichissement de la langue française, FranceTerme
date parution JO: 2001-04-18
equivalent EN: adduct @en
equivalent EN: adduct (en)
part of speech: nom masculin
definition: Espèce chimique AB dont chaque entité moléculaire est formée par combinaison directe de deux entités moléculaires distinctes A et B.
in scheme: Chimie
in scheme: concepts
notation: CHIM2
note: 1. Il existe aussi des stœchiométries différentes de 1/1.
note: 2. Dans certains cas, en particulier en chimie organique, la formation de l'adduit s'accompagne d'un changement de la nature et de la multiplicité des liaisons entre atomes des entités A et B.
note: 3. Quand A et B sont des groupes appartenant à la même entité moléculaire, il peut se former un adduit intramoléculaire.
related: acide de Lewis
related: complexe
related: cycloaddition
related: liaison de coordination
related: base de Lewis

électrofuge
type: ConceptConcept
type: Concept
creator: Commission d'enrichissement de la langue française, FranceTerme
date parution JO: 2001-04-18
equivalent EN: electrofugal @en
equivalent EN: electrofugal (en)
equivalent EN: electrofuge @en
equivalent EN: electrofuge (en)
part of speech: adjectif
definition: Se dit d'un atome ou d'un groupe d'atomes qui, dans une réaction hétérolytique, part en abandonnant le doublet de la liaison covalente ; par extension, qualifie également toute transformation impliquant un tel processus.
in scheme: Chimie
in scheme: concepts
notation: CHIM20
note: Ce terme est également employé comme substantif. Exemple : lors de la nitration du benzène, l'ion H+ est l'électrofuge.
related: électrophile
related: nucléofuge

transfert intramoléculaire
type: ConceptConcept
type: Concept
creator: Commission d'enrichissement de la langue française, FranceTerme
date parution JO: 2002-03-01
equivalent EN: backbiting @en
equivalent EN: backbiting (en)
definition: Transfert de chaîne à une autre partie de la même molécule.
in scheme: Chimie
in scheme: concept-SD-chimie-polymeres
in scheme: concepts
notation: CHIM200
related: transfert de chaîne

unité configurationnelle
type: ConceptConcept
type: Concept
creator: Commission d'enrichissement de la langue française, FranceTerme
date parution JO: 2002-03-01
equivalent EN: configurational unit @en
equivalent EN: configurational unit (en)
definition: Unité constitutive possédant un ou plusieurs sites de stéréo-isomérie définie.
in scheme: Chimie
in scheme: concept-SD-chimie-polymeres
in scheme: concept-SD-chimie-stereochimie
in scheme: concepts
notation: CHIM201
related: unité constitutive
related: séquence configurationnelle
related: unité configurationnelle élémentaire
related: macromolécule

unité configurationnelle élémentaire
type: ConceptConcept
type: Concept
creator: Commission d'enrichissement de la langue française, FranceTerme
date parution JO: 2002-03-01
equivalent EN: configurational base unit @en
equivalent EN: configurational base unit (en)
definition: Motif constitutif dont la configuration est définie en un site de stéréo-isomérie au moins dans la chaîne principale d'une macromolécule.
in scheme: Chimie
in scheme: concept-SD-chimie-polymeres
in scheme: concept-SD-chimie-stereochimie
in scheme: concepts
notation: CHIM202
note: 1. Dans une macromolécule ou un polymère réguliers, l'unité configurationnelle élémentaire correspond au motif constitutif.
note: 2. Deux unités configurationnelles élémentaires sont appelées « énantiomères » lorsqu'elles sont images non superposables l'une de l'autre dans un miroir constitué par le plan contenant les liaisons de la chaîne principale.
related: énantiomère
related: atactique
related: isotactique
related: motif configurationnel
related: motif constitutif
related: régulier, -ière
related: syndiotactique
related: unité configurationnelle
related: macromolécule
related: polymère

unité monomère
type: ConceptConcept
type: Concept
creator: Commission d'enrichissement de la langue française, FranceTerme
date parution JO: 2002-03-01
equivalent EN: monomer unit @en
equivalent EN: monomer unit (en)
equivalent EN: monomeric unit @en
equivalent EN: monomeric unit (en)
definition: Unité constitutive la plus grande de la structure d'une macromolécule formée à partir d'une seule molécule de monomère.
in scheme: Chimie
in scheme: concept-SD-chimie-polymeres
in scheme: concepts
notation: CHIM203
related: copolymère alterné
related: copolymère statistique
related: degré de polymérisation
related: unité constitutive
related: macromolécule
related: monomère

remplissage d'une colonne de chromatographie
type: ConceptConcept
type: Concept
creator: Commission d'enrichissement de la langue française, FranceTerme
date parution JO: 2001-04-18
equivalent EN: packing @en
equivalent EN: packing (en)
in scheme: Chimie
in scheme: concepts
notation: CHIM205

remplissage d'une colonne de distillation
type: ConceptConcept
type: Concept
creator: Commission d'enrichissement de la langue française, FranceTerme
date parution JO: 2001-04-18
equivalent EN: packing @en
equivalent EN: packing (en)
in scheme: Chimie
in scheme: concepts
notation: CHIM206

processus par étapes
type: ConceptConcept
type: Concept
creator: Commission d'enrichissement de la langue française, FranceTerme
date parution JO: 2001-04-18
equivalent EN: stepwise process @en
equivalent EN: stepwise process (en)
in scheme: Chimie
in scheme: concepts
notation: CHIM207

affaissement d'une monocouche
type: ConceptConcept
type: Concept
creator: Commission d'enrichissement de la langue française, FranceTerme
date parution JO: 2003-06-15
equivalent EN: monolayer collapse @en
equivalent EN: monolayer collapse (en)
definition: Perte du caractère bidimensionnel d'une monocouche flottante sous l'effet d'une pression latérale excessive.
in scheme: Chimie
in scheme: concept-SD-chimie-chimie-physique
in scheme: concepts
notation: CHIM209
related: monocouche flottante
related: séquence de Langmuir

électrophile
type: ConceptConcept
type: Concept
creator: Commission d'enrichissement de la langue française, FranceTerme
date parution JO: 2001-04-18
equivalent EN: electrophile @en
equivalent EN: electrophile (en)
equivalent EN: electrophilic @en
equivalent EN: electrophilic (en)
part of speech: adjectif
definition: Se dit d'un réactif qui forme avec un autre réactif, le nucléophile, une liaison dont les deux électrons proviennent du nucléophile; par extension, qualifie également toute transformation impliquant un tel processus.
in scheme: Chimie
in scheme: concepts
notation: CHIM21
note: 1. Ce terme est également employé comme substantif. Exemple : lors de la nitration du benzène, le cation NO2+ est l'électrophile.
note: 2. Les réactifs électrophiles sont des acides de Lewis.
related: acide de Lewis
related: électrofuge
related: nucléophile

angle de contact
type: ConceptConcept
type: Concept
creator: Commission d'enrichissement de la langue française, FranceTerme
date parution JO: 2003-06-15
deconseille ou frequent: angle de raccordement
equivalent EN: contact angle @en
equivalent EN: contact angle (en)
definition: Angle dièdre formé par deux interfaces contiguës à leur intersection apparente.
in scheme: Chimie
in scheme: concept-SD-chimie-chimie-physique
in scheme: concepts
notation: CHIM210
note: L’expression « angle de raccordement » n’est pas recommandée.
related: ligne de contact

autoassemblage bidimensionnel
type: ConceptConcept
type: Concept
creator: Commission d'enrichissement de la langue française, FranceTerme
date parution JO: 2003-06-15
equivalent EN: two-dimensional self-assembling @en
equivalent EN: two-dimensional self-assembling (en)
definition: Réorganisation spontanée d'une monocouche composite en une monocouche recomposée.
in scheme: Chimie
in scheme: concept-SD-chimie-chimie-physique
in scheme: concepts
notation: CHIM211
related: dépôt par trempage
related: monocouche composite
related: monocouche recomposée

bicouche
type: ConceptConcept
type: Concept
creator: Commission d'enrichissement de la langue française, FranceTerme
date parution JO: 2003-06-15
equivalent EN: bilayer @en
equivalent EN: bilayer (en)
part of speech: nom féminin
definition: Film mince constitué de deux monocouches distinctes superposées.
in scheme: Chimie
in scheme: concept-SD-chimie-chimie-physique
in scheme: concepts
notation: CHIM212
related: couche monomoléculaire
related: film

bord de Plateau
type: ConceptConcept
type: Concept
creator: Commission d'enrichissement de la langue française, FranceTerme
date parution JO: 2003-06-15
equivalent EN: Plateau border @en
equivalent EN: Plateau border (en)
definition: Région de l'espace à la périphérie des films de mousse ou des films de mouillage, qui assure la continuité entre le film et la phase liquide génératrice.
in scheme: Chimie
in scheme: concept-SD-chimie-chimie-physique
in scheme: concepts
notation: CHIM213
note: Du nom du physicien belge Joseph Plateau (1801-1883).
related: film de mouillage
related: film de mousse
related: ligne de contact
related: zone de transition d'un film

coétalement
type: ConceptConcept
type: Concept
creator: Commission d'enrichissement de la langue française, FranceTerme
date parution JO: 2003-06-15
equivalent EN: co-spreading @en
equivalent EN: co-spreading (en)
part of speech: nom masculin
definition: Action de déposer ensemble et simultanément, à la surface d'un liquide, deux espèces chimiques, l'une amphiphile et l'autre non amphiphile.
in scheme: Chimie
in scheme: concept-SD-chimie-chimie-physique
in scheme: concepts
notation: CHIM214
related: composé semi-amphiphile
related: cuve de Langmuir
related: sous-phase
related: amphiphile

composé semi-amphiphile
type: ConceptConcept
type: Concept
creator: Commission d'enrichissement de la langue française, FranceTerme
date parution JO: 2003-06-15
equivalent EN: co-amphiphilic compound @en
equivalent EN: co-amphiphilic compound (en)
definition: Composé doué de propriétés amphiphiles, formé par combinaison de deux espèces chimiques, l'une amphiphile et l'autre non amphiphile.
in scheme: Chimie
in scheme: concept-SD-chimie-chimie-physique
in scheme: concepts
notation: CHIM215
note: L'usage de cette expression est généralement restreint aux composés montrant une activité fonctionnelle spécifique liée à la présence de l'espèce non amphiphile.
related: coétalement
related: amphiphile

couche
type: ConceptConcept
type: Concept
creator: Commission d'enrichissement de la langue française, FranceTerme
date parution JO: 2003-06-15
equivalent EN: layer @en
equivalent EN: layer (en)
part of speech: nom féminin
definition: Faible épaisseur de matière à la surface ou au sein d'un film, d'un liquide ou d'un solide.
in scheme: Chimie
in scheme: concept-SD-chimie-chimie-physique
in scheme: concepts
notation: CHIM216
note: Contrairement au film, la couche n'a pas nécessairement des limites physiques bien déterminées.
related: couche interfaciale
related: double couche
related: film
related: multicouche

couche adsorbée
type: ConceptConcept
type: Concept
creator: Commission d'enrichissement de la langue française, FranceTerme
date parution JO: 2003-06-15
equivalent EN: adsorbed layer @en
equivalent EN: adsorbed layer (en)
definition: Ensemble d'entités moléculaires accumulées dans une région interfaciale et provenant des phases en contact.
in scheme: Chimie
in scheme: concept-SD-chimie-chimie-physique
in scheme: concepts
notation: CHIM217
note: Les couches adsorbées peuvent être soit des monocouches, soit des multicouches.
related: couche interfaciale
related: couche monomoléculaire
related: monocouche flottante
related: multicouche

couche interfaciale
type: ConceptConcept
type: Concept
creator: Commission d'enrichissement de la langue française, FranceTerme
date parution JO: 2003-06-15
equivalent EN: interfacial layer @en
equivalent EN: interfacial layer (en)
definition: Couche non homogène de transition entre deux phases homogènes.
in scheme: Chimie
in scheme: concept-SD-chimie-chimie-physique
in scheme: concepts
notation: CHIM218
related: couche
related: couche adsorbée
related: double couche
related: épaisseur efficace de la couche interfaciale
related: surface de tension

couche monomoléculaire
type: ConceptConcept
type: Concept
creator: Commission d'enrichissement de la langue française, FranceTerme
date parution JO: 2003-06-15
deconseille ou frequent: film monomoléculaire
equivalent EN: monomolecular layer @en
equivalent EN: monomolecular layer (en)
alternative label: monocouche
definition: Couche constituée d'une seule assise de molécules.
in scheme: Chimie
in scheme: concept-SD-chimie-chimie-physique
in scheme: concepts
notation: CHIM219
note: L'expression « film monomoléculaire » est ambiguë pour désigner une couche monomoléculaire et ne doit pas être utilisée.
related: bicouche
related: couche adsorbée
related: cristallite bidimensionnelle
related: film de Langmuir-Blodgett
related: hétérofilm
related: homofilm
related: lubrifiant moléculaire
related: monocouche composite
related: monocouche organisée
related: multicouche
related: nanotube

empilement
type: ConceptConcept
type: Concept
creator: Commission d'enrichissement de la langue française, FranceTerme
date parution JO: 2001-04-18
equivalent EN: close packing @en
equivalent EN: close packing (en)
equivalent EN: stacking @en
equivalent EN: stacking (en)
part of speech: nom masculin
definition: Disposition compacte des atomes, des molécules ou des ions dans une structure organisée, par exemple une structure cristalline.
in scheme: Chimie
in scheme: concepts
notation: CHIM22

cristallite bidimensionnelle
type: ConceptConcept
type: Concept
creator: Commission d'enrichissement de la langue française, FranceTerme
date parution JO: 2003-06-15
equivalent EN: two-dimensional crystallite @en
equivalent EN: two-dimensional crystallite (en)
definition: Portion d'une monocouche dont l'ordonnancement est analogue à celui d'un cristal.
in scheme: Chimie
in scheme: concept-SD-chimie-chimie-physique
in scheme: concepts
notation: CHIM220
related: couche monomoléculaire

cuve de Langmuir
type: ConceptConcept
type: Concept
creator: Commission d'enrichissement de la langue française, FranceTerme
date parution JO: 2003-06-15
equivalent EN: Langmuir trough @en
equivalent EN: Langmuir trough (en)
definition: Récipient à compartiment opératoire unique qui permet de former une monocouche d'une espèce, soluble ou insoluble, à la surface de l'eau et de la transférer sur un support solide.
in scheme: Chimie
in scheme: concept-SD-chimie-chimie-physique
in scheme: concepts
notation: CHIM221
related: coétalement
related: film de Langmuir-Blodgett
related: méthode de Langmuir-Blodgett
related: monocouche flottante
related: séquence de Langmuir

cuve de préparation en continu
type: ConceptConcept
type: Concept
creator: Commission d'enrichissement de la langue française, FranceTerme
date parution JO: 2003-06-15
equivalent EN: continuous trough @en
equivalent EN: continuous trough (en)
forme abregee: cuve continue
definition: Récipient à plusieurs compartiments qui sert à préparer en continu une monocouche flottante et à la transférer sur un support solide pour former un film de Langmuir-Blodgett.
in scheme: Chimie
in scheme: concept-SD-chimie-chimie-physique
in scheme: concepts
notation: CHIM222
note: Les différentes étapes de la préparation s'effectuent simultanément et en continu dans des compartiments spécifiques.
related: film de Langmuir-Blodgett
related: monocouche flottante

démouillage
type: ConceptConcept
type: Concept
creator: Commission d'enrichissement de la langue française, FranceTerme
date parution JO: 2003-06-15
equivalent EN: dewetting @en
equivalent EN: dewetting (en)
part of speech: nom masculin
definition: Processus spontané qui réduit l'aire de contact entre un solide et un film de mouillage.
in scheme: Chimie
in scheme: concept-SD-chimie-chimie-physique
in scheme: concepts
notation: CHIM223
note: Ce terme désigne l'assèchement de la surface par rétraction du film, mais non par évaporation.
related: film de mouillage

dépôt à la tournette
type: ConceptConcept
type: Concept
creator: Commission d'enrichissement de la langue française, FranceTerme
date parution JO: 2003-06-15
equivalent EN: spin coating @en
equivalent EN: spin coating (en)
definition: Méthode de formation d'un film mince par dépôt d'une solution de la substance du film sur un plateau qui tourne à vitesse élevée.
in scheme: Chimie
in scheme: concept-SD-chimie-chimie-physique
in scheme: concepts
notation: CHIM224
related: dépôt par étalement

dépôt par étalement
type: ConceptConcept
type: Concept
creator: Commission d'enrichissement de la langue française, FranceTerme
date parution JO: 2003-06-15
equivalent EN: spreading method @en
equivalent EN: spreading method (en)
definition: Méthode de formation d'un film par dépôt d'une solution de la substance du film sur un support et évaporation du solvant.
in scheme: Chimie
in scheme: concept-SD-chimie-chimie-physique
in scheme: concepts
notation: CHIM225
note: Cette expression convient aussi bien aux films solides qu'aux monocouches flottantes.
related: dépôt à la tournette
related: monocouche flottante
related: séquence de Langmuir

dépôt par trempage
type: ConceptConcept
type: Concept
creator: Commission d'enrichissement de la langue française, FranceTerme
date parution JO: 2003-06-15
equivalent EN: dip coating @en
equivalent EN: dip coating (en)
definition: Méthode de formation d'un film par immersion d'un support solide dans une solution ou une suspension de la substance du film, puis émersion et évaporation du solvant.
in scheme: Chimie
in scheme: concept-SD-chimie-chimie-physique
in scheme: concepts
notation: CHIM226
related: autoassemblage bidimensionnel

désaccord de réseau
type: ConceptConcept
type: Concept
creator: Commission d'enrichissement de la langue française, FranceTerme
date parution JO: 2003-06-15
equivalent EN: lattice mismatch @en
equivalent EN: lattice mismatch (en)
definition: Différence relative entre le pas du réseau du film cristallin formé par épitaxie et celui de la matrice cristalline sous-jacente.
in scheme: Chimie
in scheme: concept-SD-chimie-chimie-physique
in scheme: concepts
notation: CHIM227
related: épitaxie

double couche
type: ConceptConcept
type: Concept
creator: Commission d'enrichissement de la langue française, FranceTerme
date parution JO: 2003-06-15
equivalent EN: double layer @en
equivalent EN: double layer (en)
definition: Couche que l'on peut décrire sous la forme de deux sous-couches adjacentes dissemblables, mais interdépendantes.
in scheme: Chimie
in scheme: concept-SD-chimie-chimie-physique
in scheme: concepts
notation: CHIM228
note: Exemple : double couche électrique.
related: couche
related: couche interfaciale

effet Marangoni
type: ConceptConcept
type: Concept
creator: Commission d'enrichissement de la langue française, FranceTerme
date parution JO: 2003-06-15
equivalent EN: Marangoni effect @en
equivalent EN: Marangoni effect (en)
definition: Phénomène dynamique au cours duquel un gradient de tension interfaciale provoque un mouvement des fluides adjacents et réciproquement.
in scheme: Chimie
in scheme: concept-SD-chimie-chimie-physique
in scheme: concepts
notation: CHIM229
note: Du nom du physicien italien Carlo Giuseppe Matteo Marangoni (1840-1925).
related: tension interfaciale

entité moléculaire
type: ConceptConcept
type: Concept
creator: Commission d'enrichissement de la langue française, FranceTerme
date parution JO: 2001-04-18
equivalent EN: molecular entity @en
equivalent EN: molecular entity (en)
definition: Tout atome, molécule, ion, paire d'ions, radical, diradical, ion radical, complexe, conformère, etc., bien défini chimiquement ou isotopiquement et pouvant être identifié individuellement.
in scheme: Chimie
in scheme: concepts
notation: CHIM23
related: complexe
related: entité réagissante
related: espèce chimique
related: exciplexe
related: aromatique
related: chélation
related: composé d'inclusion
related: radical
related: radicalaire
related: transition rotovibronique
related: transition vibronique
related: rotaxane
related: piégeage
related: piège chimique

empreinte moléculaire
type: ConceptConcept
type: Concept
creator: Commission d'enrichissement de la langue française, FranceTerme
date parution JO: 2003-06-15
equivalent EN: molecular print @en
equivalent EN: molecular print (en)
equivalent EN: molecular replica @en
equivalent EN: molecular replica (en)
definition: Site de reconnaissance moléculaire créé à l'interface d'une monocouche de Langmuir-Blodgett par la présence antérieure d'une entité moléculaire structurante.
in scheme: Chimie
in scheme: concept-SD-chimie-chimie-physique
in scheme: concepts
notation: CHIM230

épaisseur critique d'un film
type: ConceptConcept
type: Concept
creator: Commission d'enrichissement de la langue française, FranceTerme
date parution JO: 2003-06-15
equivalent EN: critical film thickness @en
equivalent EN: critical film thickness (en)
definition: Épaisseur d'un film liquide pour laquelle la probabilité de rupture spontanée est maximale.
in scheme: Chimie
in scheme: concept-SD-chimie-chimie-physique
in scheme: concepts
notation: CHIM231
related: rupture spontanée d'un film

épaisseur efficace de la couche interfaciale
type: ConceptConcept
type: Concept
creator: Commission d'enrichissement de la langue française, FranceTerme
date parution JO: 2003-06-15
equivalent EN: interfacial layer effective thickness @en
equivalent EN: interfacial layer effective thickness (en)
definition: Distance entre deux surfaces fictives décrivant les limites de la couche interfaciale.
in scheme: Chimie
in scheme: concept-SD-chimie-chimie-physique
in scheme: concepts
notation: CHIM232
related: couche interfaciale

épaisseur équivalente d'un film
type: ConceptConcept
type: Concept
creator: Commission d'enrichissement de la langue française, FranceTerme
date parution JO: 2003-06-15
equivalent EN: film equivalent thickness @en
equivalent EN: film equivalent thickness (en)
forme abregee: épaisseur équivalente
definition: Épaisseur calculée d'une couche homogène fictive qui, pour une substance solide ou liquide donnée, aurait la même propriété que celle qui est effectivement mesurée pour un film ou une couche interfaciale.
in scheme: Chimie
in scheme: concept-SD-chimie-chimie-physique
in scheme: concepts
notation: CHIM233

épitaxie
type: ConceptConcept
type: Concept
creator: Commission d'enrichissement de la langue française, FranceTerme
date parution JO: 2003-06-15
equivalent EN: epitaxy @en
equivalent EN: epitaxy (en)
part of speech: nom féminin
definition: Processus de croissance cristalline, couche par couche, l'organisation des entités moléculaires ou atomiques des couches étant déterminée par le réseau d'une matrice cristalline sous-jacente.
in scheme: Chimie
in scheme: concept-SD-chimie-chimie-physique
in scheme: concepts
notation: CHIM234
note: Ce terme est défini avec un sens plus restreint dans le domaine des composants électroniques.
related: désaccord de réseau
related: hétéro-épitaxie
related: homo-épitaxie
related: matrice moléculaire bidimensionnelle
related: reconnaissance moléculaire

film
type: ConceptConcept
type: Concept
creator: Commission d'enrichissement de la langue française, FranceTerme
date parution JO: 2003-06-15
equivalent EN: film @en
equivalent EN: film (en)
part of speech: nom masculin
definition: Pellicule de matière solide ou liquide.
in scheme: Chimie
in scheme: concept-SD-chimie-chimie-physique
in scheme: concepts
notation: CHIM235
note: Le terme « film » est à déconseiller pour désigner une couche d'adsorption.
related: bicouche
related: couche
related: multicouche alternée

film asymétrique
type: ConceptConcept
type: Concept
creator: Commission d'enrichissement de la langue française, FranceTerme
date parution JO: 2003-06-15
equivalent EN: asymmetric film @en
equivalent EN: asymmetric film (en)
definition: Tout film séparant deux phases différentes.
in scheme: Chimie
in scheme: concept-SD-chimie-chimie-physique
in scheme: concepts
notation: CHIM236
related: film de mouillage
related: film symétrique

film d'émulsion
type: ConceptConcept
type: Concept
creator: Commission d'enrichissement de la langue française, FranceTerme
date parution JO: 2003-06-15
equivalent EN: emulsion film @en
equivalent EN: emulsion film (en)
definition: Film liquide séparant deux gouttelettes d'une émulsion.
in scheme: Chimie
in scheme: concept-SD-chimie-chimie-physique
in scheme: concepts
notation: CHIM237
related: film symétrique

film de Langmuir-Blodgett
type: ConceptConcept
type: Concept
creator: Commission d'enrichissement de la langue française, FranceTerme
abbreviation: LB film @en
date parution JO: 2003-06-15
equivalent EN: LB film @en
equivalent EN: LB film (en)
equivalent EN: Langmuir-Blodgett film @en
equivalent EN: Langmuir-Blodgett film (en)
forme abregee: film LB
definition: Tout film obtenu par la méthode de Langmuir-Blodgett ou par des méthodes dérivées.
in scheme: Chimie
in scheme: concept-SD-chimie-chimie-physique
in scheme: concepts
notation: CHIM238
related: couche monomoléculaire
related: cuve de Langmuir
related: cuve de préparation en continu
related: matrice moléculaire bidimensionnelle
related: méthode de Langmuir-Blodgett
related: multicouche
related: multicouche alternée
related: multicouche alternée centrosymétrique
related: séquence de Langmuir

film de mouillage
type: ConceptConcept
type: Concept
creator: Commission d'enrichissement de la langue française, FranceTerme
date parution JO: 2003-06-15
equivalent EN: wetting film @en
equivalent EN: wetting film (en)
definition: Film liquide asymétrique formé par un liquide sur un support solide ou liquide et qui sépare le support d'une phase gazeuse.
in scheme: Chimie
in scheme: concept-SD-chimie-chimie-physique
in scheme: concepts
notation: CHIM239
related: bord de Plateau
related: démouillage
related: film asymétrique

entité réagissante
type: ConceptConcept
type: Concept
creator: Commission d'enrichissement de la langue française, FranceTerme
date parution JO: 2001-04-18
equivalent EN: reactive entity @en
equivalent EN: reactive entity (en)
definition: Entité moléculaire (molécule, radical, ion, etc.) participant à une étape donnée d'une transformation chimique.
in scheme: Chimie
in scheme: concepts
notation: CHIM24
note: Par exemple, le cation NO2+ est l'entité réagissante dans la nitration du benzène.
related: entité moléculaire
related: réactif

film de mousse
type: ConceptConcept
type: Concept
creator: Commission d'enrichissement de la langue française, FranceTerme
date parution JO: 2003-06-15
equivalent EN: foam film @en
equivalent EN: foam film (en)
definition: Film liquide séparant deux phases gazeuses ou deux bulles d'une mousse.
in scheme: Chimie
in scheme: concept-SD-chimie-chimie-physique
in scheme: concepts
notation: CHIM240
related: bord de Plateau

film de suspension
type: ConceptConcept
type: Concept
creator: Commission d'enrichissement de la langue française, FranceTerme
date parution JO: 2003-06-15
equivalent EN: suspension film @en
equivalent EN: suspension film (en)
definition: Film liquide séparant deux solides ou deux grains d'une suspension.
in scheme: Chimie
in scheme: concept-SD-chimie-chimie-physique
in scheme: concepts
notation: CHIM241
related: film symétrique

film noir
type: ConceptConcept
type: Concept
creator: Commission d'enrichissement de la langue française, FranceTerme
date parution JO: 2003-06-15
equivalent EN: black film @en
equivalent EN: black film (en)
definition: Tout film liquide suffisamment mince pour apparaître noir par suite d'une très faible réflexion de la lumière visible.
in scheme: Chimie
in scheme: concept-SD-chimie-chimie-physique
in scheme: concepts
notation: CHIM242
related: film noir de Newton
related: film noir ordinaire

film noir de Newton
type: ConceptConcept
type: Concept
creator: Commission d'enrichissement de la langue française, FranceTerme
date parution JO: 2003-06-15
equivalent EN: Newton black film @en
equivalent EN: Newton black film (en)
definition: Film noir ultramince qui se distingue des films noirs ordinaires par l'absence de cœur liquide.
in scheme: Chimie
in scheme: concept-SD-chimie-chimie-physique
in scheme: concepts
notation: CHIM243
related: film noir
related: film noir ordinaire

film noir ordinaire
type: ConceptConcept
type: Concept
creator: Commission d'enrichissement de la langue française, FranceTerme
date parution JO: 2003-06-15
equivalent EN: common black film @en
equivalent EN: common black film (en)
definition: Film noir d'épaisseur suffisante pour qu'il existe un cœur liquide présentant un certain désordre moléculaire.
in scheme: Chimie
in scheme: concept-SD-chimie-chimie-physique
in scheme: concepts
notation: CHIM244
related: film noir
related: film noir de Newton

film plan
type: ConceptConcept
type: Concept
creator: Commission d'enrichissement de la langue française, FranceTerme
date parution JO: 2003-06-15
equivalent EN: planar film @en
equivalent EN: planar film (en)
definition: Film limité par deux faces planes et parallèles.
in scheme: Chimie
in scheme: concept-SD-chimie-chimie-physique
in scheme: concepts
notation: CHIM245

film symétrique
type: ConceptConcept
type: Concept
creator: Commission d'enrichissement de la langue française, FranceTerme
date parution JO: 2003-06-15
equivalent EN: symmetric film @en
equivalent EN: symmetric film (en)
definition: Film séparant deux phases identiques.
in scheme: Chimie
in scheme: concept-SD-chimie-chimie-physique
in scheme: concepts
notation: CHIM246
related: film asymétrique
related: film d'émulsion
related: film de suspension

fossette
type: ConceptConcept
type: Concept
creator: Commission d'enrichissement de la langue française, FranceTerme
date parution JO: 2003-06-15
equivalent EN: dimple @en
equivalent EN: dimple (en)
part of speech: nom féminin
definition: Dépression d'origine hydrodynamique à la périphérie d'un film liquide en cours d'amincissement.
in scheme: Chimie
in scheme: concept-SD-chimie-chimie-physique
in scheme: concepts
notation: CHIM247
related: mode péristaltique d'un film

hétéro-épitaxie
type: ConceptConcept
type: Concept
creator: Commission d'enrichissement de la langue française, FranceTerme
date parution JO: 2003-06-15
equivalent EN: heteroepitaxy @en
equivalent EN: heteroepitaxy (en)
part of speech: nom féminin
definition: Épitaxie dans laquelle la croissance du film cristallin s'effectue sur une matrice de nature chimique différente.
in scheme: Chimie
in scheme: concept-SD-chimie-chimie-physique
in scheme: concepts
notation: CHIM248
related: épitaxie
related: homo-épitaxie

hétérofilm
type: ConceptConcept
type: Concept
creator: Commission d'enrichissement de la langue française, FranceTerme
date parution JO: 2003-06-15
deconseille ou frequent: hétérocouche
equivalent EN: heterolayer @en
equivalent EN: heterolayer (en)
part of speech: nom masculin
definition: Film constitué d'un empilement périodique ou non périodique de monocouches chimiquement différentes.
in scheme: Chimie
in scheme: concept-SD-chimie-chimie-physique
in scheme: concepts
notation: CHIM249
note: En vue d'éviter toute ambiguïté, le terme « hétérocouche », utilisé dans cette acception, est déconseillé.
related: couche monomoléculaire

espèce chimique
type: ConceptConcept
type: Concept
creator: Commission d'enrichissement de la langue française, FranceTerme
date parution JO: 2001-04-18
equivalent EN: chemical species @en
equivalent EN: chemical species (en)
definition: Ensemble d'atomes ou d'entités moléculaires structuralement et chimiquement identiques.
in scheme: Chimie
in scheme: concepts
notation: CHIM25
related: entité moléculaire
related: chélation
related: analyte
related: atomisation
related: cellule d'électrolyse
related: entraîneur
related: liaison hydrogène
related: point isosbestique
related: protogène
related: protophile
related: analogue chimique
related: biotransformation
related: spéciation

homo-épitaxie
type: ConceptConcept
type: Concept
creator: Commission d'enrichissement de la langue française, FranceTerme
date parution JO: 2003-06-15
equivalent EN: homoepitaxy @en
equivalent EN: homoepitaxy (en)
part of speech: nom féminin
definition: Épitaxie dans laquelle le processus de croissance du film s'effectue sur une matrice de même nature chimique.
in scheme: Chimie
in scheme: concept-SD-chimie-chimie-physique
in scheme: concepts
notation: CHIM250
related: épitaxie
related: hétéro-épitaxie

homofilm
type: ConceptConcept
type: Concept
creator: Commission d'enrichissement de la langue française, FranceTerme
date parution JO: 2003-06-15
deconseille ou frequent: homocouche
equivalent EN: homolayer @en
equivalent EN: homolayer (en)
part of speech: nom masculin
definition: Film constitué de monocouches chimiquement identiques.
in scheme: Chimie
in scheme: concept-SD-chimie-chimie-physique
in scheme: concepts
notation: CHIM251
note: En vue d'éviter toute ambiguïté, le terme « homocouche », utilisé dans cette acception, est déconseillé.
related: couche monomoléculaire

ligne de contact
type: ConceptConcept
type: Concept
creator: Commission d'enrichissement de la langue française, FranceTerme
date parution JO: 2003-06-15
deconseille ou frequent: ligne de raccordement
equivalent EN: contact line @en
equivalent EN: contact line (en)
definition: Ligne correspondant à l'intersection apparente de deux interfaces contiguës.
in scheme: Chimie
in scheme: concept-SD-chimie-chimie-physique
in scheme: concepts
notation: CHIM252
note: 1. Dans le cas d'un film liquide, la ligne de contact le sépare de son bord de Plateau.
note: 2. L’expression « ligne de raccordement » n’est pas recommandée.
related: angle de contact
related: bord de Plateau
related: tension de ligne

longueur d'onde critique
type: ConceptConcept
type: Concept
creator: Commission d'enrichissement de la langue française, FranceTerme
date parution JO: 2003-06-15
equivalent EN: critical wavelength @en
equivalent EN: critical wavelength (en)
definition: Longueur d'onde de la déformation périodique d'un film liquide en mode péristaltique, pour laquelle la probabilité de rupture spontanée est maximale.
in scheme: Chimie
in scheme: concept-SD-chimie-chimie-physique
in scheme: concepts
notation: CHIM253
related: mode péristaltique d'un film

lubrifiant moléculaire
type: ConceptConcept
type: Concept
creator: Commission d'enrichissement de la langue française, FranceTerme
date parution JO: 2003-06-15
equivalent EN: molecular lubricant @en
equivalent EN: molecular lubricant (en)
definition: Espèce chimique incorporée temporairement dans une monocouche pour favoriser son homogénéisation ou son organisation moléculaire.
in scheme: Chimie
in scheme: concept-SD-chimie-chimie-physique
in scheme: concepts
notation: CHIM254
related: couche monomoléculaire

matrice moléculaire bidimensionnelle
type: ConceptConcept
type: Concept
creator: Commission d'enrichissement de la langue française, FranceTerme
date parution JO: 2003-06-15
equivalent EN: template @en
equivalent EN: template (en)
equivalent EN: two-dimensional molecular pattern @en
equivalent EN: two-dimensional molecular pattern (en)
definition: Arrangement spécifique des entités moléculaires d'une monocouche flottante ou de Langmuir-Blodgett devant servir de trame au cours de l'adsorption ou du dépôt ultérieurs d'entités moléculaires.
in scheme: Chimie
in scheme: concept-SD-chimie-chimie-physique
in scheme: concepts
notation: CHIM255
related: épitaxie
related: film de Langmuir-Blodgett
related: monocouche flottante

méthode de Langmuir-Blodgett
type: ConceptConcept
type: Concept
creator: Commission d'enrichissement de la langue française, FranceTerme
abbreviation: LB method @en
date parution JO: 2003-06-15
equivalent EN: LB method @en
equivalent EN: LB method (en)
equivalent EN: Langmuir-Blodgett method @en
equivalent EN: Langmuir-Blodgett method (en)
forme abregee: méthode LB
definition: Méthode de préparation d'un film solide consistant à transférer une monocouche flottante sur un support solide par trempages répétés de celui-ci dans la sous-phase.
in scheme: Chimie
in scheme: concept-SD-chimie-chimie-physique
in scheme: concepts
notation: CHIM256
related: cuve de Langmuir
related: film de Langmuir-Blodgett
related: monocouche flottante
related: séquence de Langmuir
related: sous-phase
related: taux de transfert
related: transfert horizontal d'une monocouche
related: transfert vertical d'une monocouche

mode de flexion d'un film
type: ConceptConcept
type: Concept
creator: Commission d'enrichissement de la langue française, FranceTerme
date parution JO: 2003-06-15
equivalent EN: bending mode @en
equivalent EN: bending mode (en)
definition: Mode de couplage des ondulations simultanées des deux interfaces d'un film liquide, tel que son épaisseur reste constante.
in scheme: Chimie
in scheme: concept-SD-chimie-chimie-physique
in scheme: concepts
notation: CHIM257

mode péristaltique d'un film
type: ConceptConcept
type: Concept
creator: Commission d'enrichissement de la langue française, FranceTerme
date parution JO: 2003-06-15
deconseille ou frequent: pincement
equivalent EN: squeezing mode @en
equivalent EN: squeezing mode (en)
definition: Mode de couplage des ondulations simultanées des deux interfaces d'un film liquide, qui provoque des réductions locales de l'épaisseur du film, appelées « pincements ».
in scheme: Chimie
in scheme: concept-SD-chimie-chimie-physique
in scheme: concepts
notation: CHIM258
related: fossette
related: longueur d'onde critique
related: rupture spontanée d'un film

étape cinétiquement limitante
type: ConceptConcept
type: Concept
creator: Commission d'enrichissement de la langue française, FranceTerme
date parution JO: 2001-04-18
equivalent EN: rate-controlling step @en
equivalent EN: rate-controlling step (en)
equivalent EN: rate-determining step @en
equivalent EN: rate-determining step (en)
equivalent EN: rate-limiting step @en
equivalent EN: rate-limiting step (en)
alternative label: étape cinétiquement déterminante
definition: Étape la plus lente d'une réaction chimique comportant plusieurs étapes et qui limite par suite la vitesse de la réaction globale.
in scheme: Chimie
in scheme: concepts
notation: CHIM26

module d'élasticité d'extension de surface
type: ConceptConcept
type: Concept
creator: Commission d'enrichissement de la langue française, FranceTerme
date parution JO: 2003-06-15
equivalent EN: dilational elasticity modulus @en
equivalent EN: dilational elasticity modulus (en)
definition: Coefficient qui lie, à forme géométrique invariable, une variation de la tension superficielle au taux de variation correspondante de l'aire d'une monocouche flottante ou d'une solution de substance tensio-active.
in scheme: Chimie
in scheme: concept-SD-chimie-chimie-physique
in scheme: concepts
notation: CHIM260

module d'élasticité d'un film
type: ConceptConcept
type: Concept
creator: Commission d'enrichissement de la langue française, FranceTerme
date parution JO: 2003-06-15
equivalent EN: film elasticity modulus @en
equivalent EN: film elasticity modulus (en)
definition: Coefficient qui lie la variation réversible de l'épaisseur d'un film liquide ou solide à la contrainte exercée perpendiculairement à ce film.
in scheme: Chimie
in scheme: concept-SD-chimie-chimie-physique
in scheme: concepts
notation: CHIM261

module d'élasticité de Gibbs
type: ConceptConcept
type: Concept
creator: Commission d'enrichissement de la langue française, FranceTerme
date parution JO: 2003-06-15
equivalent EN: Gibbs elasticity modulus @en
equivalent EN: Gibbs elasticity modulus (en)
definition: Coefficient qui lie la variation de la tension d'un film liquide à la variation correspondante de son aire, à courbure et forme invariables.
in scheme: Chimie
in scheme: concept-SD-chimie-chimie-physique
in scheme: concepts
notation: CHIM262

module de cisaillement de surface
type: ConceptConcept
type: Concept
creator: Commission d'enrichissement de la langue française, FranceTerme
date parution JO: 2003-06-15
equivalent EN: surface shear modulus @en
equivalent EN: surface shear modulus (en)
definition: Matrice de coefficients qui relient, à aire invariable, une contrainte tangentielle appliquée à un film ou à une monocouche flottante à la déformation correspondante.
in scheme: Chimie
in scheme: concept-SD-chimie-chimie-physique
in scheme: concepts
notation: CHIM263
related: monocouche flottante

monocouche composite
type: ConceptConcept
type: Concept
creator: Commission d'enrichissement de la langue française, FranceTerme
date parution JO: 2003-06-15
deconseille ou frequent: couche mixte
equivalent EN: mixed monolayer @en
equivalent EN: mixed monolayer (en)
equivalent EN: multicomponent monolayer @en
equivalent EN: multicomponent monolayer (en)
definition: Monocouche formée de deux constituants ou plus.
in scheme: Chimie
in scheme: concept-SD-chimie-chimie-physique
in scheme: concepts
notation: CHIM264
note: L'usage de l'expression « couche mixte » en ce sens est déconseillé.
related: autoassemblage bidimensionnel
related: couche monomoléculaire
related: monocouche recomposée

monocouche flottante
type: ConceptConcept
type: Concept
creator: Commission d'enrichissement de la langue française, FranceTerme
date parution JO: 2003-06-15
equivalent EN: floating monolayer @en
equivalent EN: floating monolayer (en)
definition: Monocouche formée à la surface d'un liquide dans lequel elle est insoluble.
in scheme: Chimie
in scheme: concept-SD-chimie-chimie-physique
in scheme: concepts
notation: CHIM265
note: La monocouche est dite « compacte » ou « lâche » selon la concentration moléculaire surfacique.
related: affaissement d'une monocouche
related: couche adsorbée
related: cuve de Langmuir
related: cuve de préparation en continu
related: dépôt par étalement
related: matrice moléculaire bidimensionnelle
related: méthode de Langmuir-Blodgett
related: module de cisaillement de surface
related: séquence de Langmuir
related: sous-phase
related: taux de transfert
related: transfert horizontal d'une monocouche
related: transfert vertical d'une monocouche

monocouche organisée
type: ConceptConcept
type: Concept
creator: Commission d'enrichissement de la langue française, FranceTerme
date parution JO: 2003-06-15
equivalent EN: organized monolayer @en
equivalent EN: organized monolayer (en)
definition: Monocouche constituée d'entités conçues de manière à s'organiser spontanément à l'échelle moléculaire.
in scheme: Chimie
in scheme: concept-SD-chimie-chimie-physique
in scheme: concepts
notation: CHIM266
related: couche monomoléculaire

monocouche recomposée
type: ConceptConcept
type: Concept
creator: Commission d'enrichissement de la langue française, FranceTerme
date parution JO: 2003-06-15
equivalent EN: compound monolayer @en
equivalent EN: compound monolayer (en)
definition: Monocouche composite dans laquelle l'association spécifique entre constituants différents conduit à la structure unique bidimensionnelle recherchée.
in scheme: Chimie
in scheme: concept-SD-chimie-chimie-physique
in scheme: concepts
notation: CHIM267
related: autoassemblage bidimensionnel
related: monocouche composite

multicouche
type: ConceptConcept
type: Concept
creator: Commission d'enrichissement de la langue française, FranceTerme
date parution JO: 2003-06-15
equivalent EN: multilayer @en
equivalent EN: multilayer (en)
part of speech: nom féminin
definition: Film constitué de plusieurs monocouches distinctes superposées.
in scheme: Chimie
in scheme: concept-SD-chimie-chimie-physique
in scheme: concepts
notation: CHIM268
related: couche
related: couche adsorbée
related: couche monomoléculaire
related: film de Langmuir-Blodgett

multicouche alternée
type: ConceptConcept
type: Concept
creator: Commission d'enrichissement de la langue française, FranceTerme
date parution JO: 2003-06-15
equivalent EN: alternate multilayer @en
equivalent EN: alternate multilayer (en)
definition: Tout empilement où alternent des monocouches solides chimiquement différentes.
in scheme: Chimie
in scheme: concept-SD-chimie-chimie-physique
in scheme: concepts
notation: CHIM269
related: film
related: film de Langmuir-Blodgett
related: multicouche alternée centrosymétrique
related: multicouche alternée deux par deux

état excité
type: ConceptConcept
type: Concept
creator: Commission d'enrichissement de la langue française, FranceTerme
date parution JO: 2001-04-18
equivalent EN: excited state @en
equivalent EN: excited state (en)
definition: État d'un atome, ou d'une entité moléculaire, dont l'énergie est plus élevée que celle de l'état fondamental.
in scheme: Chimie
in scheme: concept-SD-chimie-photochimie
in scheme: concepts
notation: CHIM27
related: état fondamental

multicouche alternée centrosymétrique
type: ConceptConcept
type: Concept
creator: Commission d'enrichissement de la langue française, FranceTerme
date parution JO: 2003-06-15
equivalent EN: centrosymmetric multilayer @en
equivalent EN: centrosymmetric multilayer (en)
definition: Multicouche solide alternée dans laquelle la disposition des monocouches possède un centre de symétrie.
in scheme: Chimie
in scheme: concept-SD-chimie-chimie-physique
in scheme: concepts
notation: CHIM270
related: film de Langmuir-Blodgett
related: multicouche alternée
related: multicouche alternée deux par deux

multicouche alternée deux par deux
type: ConceptConcept
type: Concept
creator: Commission d'enrichissement de la langue française, FranceTerme
date parution JO: 2003-06-15
equivalent EN: paired multilayer @en
equivalent EN: paired multilayer (en)
definition: Multicouche alternée centrosymétrique dans laquelle deux monocouches successives de même nature chimique sont en contact par les parties hydrophobes de leurs entités moléculaires.
in scheme: Chimie
in scheme: concept-SD-chimie-chimie-physique
in scheme: concepts
notation: CHIM271
related: multicouche alternée
related: multicouche alternée centrosymétrique

paramètre d'étalement d'un liquide sur un support
type: ConceptConcept
type: Concept
creator: Commission d'enrichissement de la langue française, FranceTerme
date parution JO: 2003-06-15
equivalent EN: spreading parameter @en
equivalent EN: spreading parameter (en)
forme abregee: paramètre d'étalement
definition: Différence entre les énergies de l'unité de surface d'un support solide ou liquide, respectivement avant et après son contact avec un liquide donné, dans des conditions expérimentales déterminées.
in scheme: Chimie
in scheme: concept-SD-chimie-chimie-physique
in scheme: concepts
notation: CHIM272
note: Cette grandeur physique permet de prévoir si un liquide donné est susceptible de s'étaler à la surface d'un support solide ou liquide.

pression de disjonction
type: ConceptConcept
type: Concept
creator: Commission d'enrichissement de la langue française, FranceTerme
date parution JO: 2003-06-15
equivalent EN: disjoining pressure @en
equivalent EN: disjoining pressure (en)
definition: Pression interne exercée par un film mince sur ses interfaces et tendant à les écarter.
in scheme: Chimie
in scheme: concept-SD-chimie-chimie-physique
in scheme: concepts
notation: CHIM273
note: On a employé également ce terme lorsque cette pression est négative et tend à rapprocher les interfaces.

pression de Laplace
type: ConceptConcept
type: Concept
creator: Commission d'enrichissement de la langue française, FranceTerme
date parution JO: 2003-06-15
deconseille ou frequent: pression capillaire
equivalent EN: Laplace pressure @en
equivalent EN: Laplace pressure (en)
definition: Différence entre les pressions de deux fluides séparés par une interface courbe sous tension.
in scheme: Chimie
in scheme: concept-SD-chimie-chimie-physique
in scheme: concepts
notation: CHIM274
note: L’expression « pression capillaire » n’est pas recommandée.

rupture spontanée d'un film
type: ConceptConcept
type: Concept
creator: Commission d'enrichissement de la langue française, FranceTerme
date parution JO: 2003-06-15
equivalent EN: film spontaneous rupturing @en
equivalent EN: film spontaneous rupturing (en)
definition: Rupture d'un film liquide provoquée par un amincissement local excessif dû à des ondulations d'origine exclusivement thermique.
in scheme: Chimie
in scheme: concept-SD-chimie-chimie-physique
in scheme: concepts
notation: CHIM275
related: épaisseur critique d'un film
related: mode péristaltique d'un film

séquence de Langmuir
type: ConceptConcept
type: Concept
creator: Commission d'enrichissement de la langue française, FranceTerme
date parution JO: 2003-06-15
equivalent EN: Langmuir sequence @en
equivalent EN: Langmuir sequence (en)
definition: Procédé discontinu qui sert à préparer des monocouches flottantes et à les empiler sur un support solide pour former un film de Langmuir-Blodgett.
in scheme: Chimie
in scheme: concept-SD-chimie-chimie-physique
in scheme: concepts
notation: CHIM276
note: La séquence de Langmuir se compose de quatre étapes successives : l'étalement de la solution, l'évaporation du solvant, la compression latérale de la monocouche et son transfert.
related: affaissement d'une monocouche
related: cuve de Langmuir
related: dépôt par étalement
related: film de Langmuir-Blodgett
related: méthode de Langmuir-Blodgett
related: monocouche flottante

sous-phase
type: ConceptConcept
type: Concept
creator: Commission d'enrichissement de la langue française, FranceTerme
date parution JO: 2003-06-15
equivalent EN: subphase @en
equivalent EN: subphase (en)
part of speech: nom féminin
definition: Liquide sur lequel flotte une monocouche ou un film.
in scheme: Chimie
in scheme: concept-SD-chimie-chimie-physique
in scheme: concepts
notation: CHIM277
related: coétalement
related: méthode de Langmuir-Blodgett
related: monocouche flottante

super-réseau
type: ConceptConcept
type: Concept
creator: Commission d'enrichissement de la langue française, FranceTerme
date parution JO: 2003-06-15
equivalent EN: superlattice @en
equivalent EN: superlattice (en)
part of speech: nom masculin
definition: Multicouche périodique formée par la répétition d'un motif élémentaire constitué de couches successives chimiquement différentes.
in scheme: Chimie
in scheme: concept-SD-chimie-chimie-physique
in scheme: concepts
notation: CHIM278
note: Les couches successives peuvent être constituées soit d'atomes, soit de molécules.

surface de tension
type: ConceptConcept
type: Concept
creator: Commission d'enrichissement de la langue française, FranceTerme
date parution JO: 2003-06-15
equivalent EN: surface of tension @en
equivalent EN: surface of tension (en)
definition: Membrane fictive dont les propriétés mécaniques seraient équivalentes à celles d'une couche interfaciale ou d'un film liquide.
in scheme: Chimie
in scheme: concept-SD-chimie-chimie-physique
in scheme: concepts
notation: CHIM279
note: La surface de tension est située à l'intérieur de la couche interfaciale ou du film liquide.
related: couche interfaciale
related: tension d'un film
related: tension interfaciale
related: tension superficielle

état fondamental
type: ConceptConcept
type: Concept
creator: Commission d'enrichissement de la langue française, FranceTerme
date parution JO: 2001-04-18
equivalent EN: ground state @en
equivalent EN: ground state (en)
definition: État d'un atome, ou d'une entité moléculaire, correspondant à son niveau d'énergie le plus bas.
in scheme: Chimie
in scheme: concept-SD-chimie-photochimie
in scheme: concepts
notation: CHIM28
related: état excité

taux de transfert
type: ConceptConcept
type: Concept
creator: Commission d'enrichissement de la langue française, FranceTerme
date parution JO: 2003-06-15
equivalent EN: transfer ratio @en
equivalent EN: transfer ratio (en)
definition: Dans la méthode de Langmuir-Blodgett, rapport entre la diminution de l'aire de la monocouche flottante et l'aire réceptrice du support solide du film.
in scheme: Chimie
in scheme: concept-SD-chimie-chimie-physique
in scheme: concepts
notation: CHIM280
related: méthode de Langmuir-Blodgett
related: monocouche flottante
related: transfert horizontal d'une monocouche
related: transfert vertical d'une monocouche

tension d'un film
type: ConceptConcept
type: Concept
creator: Commission d'enrichissement de la langue française, FranceTerme
date parution JO: 2003-06-15
equivalent EN: film tension @en
equivalent EN: film tension (en)
definition: Rapport entre le travail réversible fourni pour augmenter l'aire d'un film liquide et l'augmentation d'aire correspondante, toutes choses étant égales par ailleurs.
in scheme: Chimie
in scheme: concept-SD-chimie-chimie-physique
in scheme: concepts
notation: CHIM281
note: Le qualificatif « dynamique » s'applique lorsque la mesure de la tension de film est effectuée sur un système hors équilibre.
related: surface de tension

tension de ligne
type: ConceptConcept
type: Concept
creator: Commission d'enrichissement de la langue française, FranceTerme
date parution JO: 2003-06-15
equivalent EN: line tension @en
equivalent EN: line tension (en)
definition: Rapport entre le travail réversible nécessaire pour allonger une ligne de contact et l'allongement correspondant, toutes choses étant égales par ailleurs.
in scheme: Chimie
in scheme: concept-SD-chimie-chimie-physique
in scheme: concepts
notation: CHIM282
note: Le qualificatif « dynamique » s'applique lorsque la mesure de la tension de ligne est effectuée sur un système hors équilibre.
related: ligne de contact

tension interfaciale
type: ConceptConcept
type: Concept
creator: Commission d'enrichissement de la langue française, FranceTerme
date parution JO: 2003-06-15
equivalent EN: interfacial tension @en
equivalent EN: interfacial tension (en)
definition: Rapport entre le travail réversible fourni pour étendre une interface de séparation fluide - fluide et l'extension correspondante de l'interface, toutes choses étant égales par ailleurs.
in scheme: Chimie
in scheme: concept-SD-chimie-chimie-physique
in scheme: concepts
notation: CHIM283
note: Le qualificatif « dynamique » s'applique lorsque la mesure de la tension interfaciale est effectuée sur un système hors équilibre.
related: effet Marangoni
related: surface de tension
related: tension superficielle

tension superficielle
type: ConceptConcept
type: Concept
creator: Commission d'enrichissement de la langue française, FranceTerme
date parution JO: 2003-06-15
equivalent EN: surface tension @en
equivalent EN: surface tension (en)
definition: Rapport entre le travail réversible fourni pour étendre une interface de séparation liquide - gaz et l'extension correspondante de l'interface, toutes choses étant égales par ailleurs.
in scheme: Chimie
in scheme: concept-SD-chimie-chimie-physique
in scheme: concepts
notation: CHIM284
note: Le qualificatif « dynamique » s'applique lorsque la mesure de la tension superficielle est effectuée sur un système hors équilibre.
related: surface de tension
related: tension interfaciale

transfert horizontal d'une monocouche
type: ConceptConcept
type: Concept
creator: Commission d'enrichissement de la langue française, FranceTerme
date parution JO: 2003-06-15
equivalent EN: horizontal lifting @en
equivalent EN: horizontal lifting (en)
definition: Technique de transfert d'une monocouche flottante sur un support solide horizontal par une variante de la méthode de Langmuir-Blodgett.
in scheme: Chimie
in scheme: concept-SD-chimie-chimie-physique
in scheme: concepts
notation: CHIM285
related: méthode de Langmuir-Blodgett
related: monocouche flottante
related: taux de transfert
related: transfert vertical d'une monocouche

transfert vertical d'une monocouche
type: ConceptConcept
type: Concept
creator: Commission d'enrichissement de la langue française, FranceTerme
date parution JO: 2003-06-15
equivalent EN: vertical dipping @en
equivalent EN: vertical dipping (en)
definition: Technique de transfert d'une monocouche flottante sur un support solide vertical par la méthode de Langmuir-Blodgett.
in scheme: Chimie
in scheme: concept-SD-chimie-chimie-physique
in scheme: concepts
notation: CHIM286
related: méthode de Langmuir-Blodgett
related: monocouche flottante
related: taux de transfert
related: transfert horizontal d'une monocouche

viscosité d'extension de surface
type: ConceptConcept
type: Concept
creator: Commission d'enrichissement de la langue française, FranceTerme
date parution JO: 2003-06-15
equivalent EN: surface dilational viscosity @en
equivalent EN: surface dilational viscosity (en)
definition: Matrice de coefficients qui lient, à forme géométrique invariable, une contrainte de surface aux vitesses relatives correspondantes des éléments de la surface d'une monocouche flottante ou d'une solution de substance tensio-active.
in scheme: Chimie
in scheme: concept-SD-chimie-chimie-physique
in scheme: concepts
notation: CHIM287
note: On parle par exemple de « viscosité d'extension de surface » lorsqu'on étend une couche circulaire de manière à ce qu'elle reste circulaire.
related: viscosité de cisaillement de surface

viscosité de cisaillement de surface
type: ConceptConcept
type: Concept
creator: Commission d'enrichissement de la langue française, FranceTerme
date parution JO: 2003-06-15
equivalent EN: surface shear viscosity @en
equivalent EN: surface shear viscosity (en)
definition: Matrice de coefficients qui lient, à aire invariable, une contrainte tangentielle aux vitesses relatives correspondantes des éléments de la surface d'une monocouche flottante ou d'une solution de substance tensio-active.
in scheme: Chimie
in scheme: concept-SD-chimie-chimie-physique
in scheme: concepts
notation: CHIM288
note: On parle par exemple de « viscosité de cisaillement de surface » lorsqu'une contrainte déforme en un losange la surface carrée d'une monocouche flottante.
related: viscosité d'extension de surface

zone de transition d'un film
type: ConceptConcept
type: Concept
creator: Commission d'enrichissement de la langue française, FranceTerme
date parution JO: 2003-06-15
equivalent EN: transition zone @en
equivalent EN: transition zone (en)
forme abregee: zone de transition
definition: Région du bord de Plateau où peuvent exister des variations spatiales de certaines propriétés de surface.
in scheme: Chimie
in scheme: concept-SD-chimie-chimie-physique
in scheme: concepts
notation: CHIM289
related: bord de Plateau

excimère
type: ConceptConcept
type: Concept
creator: Commission d'enrichissement de la langue française, FranceTerme
date parution JO: 2001-04-18
equivalent EN: excimer @en
equivalent EN: excimer (en)
part of speech: nom masculin
definition: Dimère qui n'existe que dans un état électronique excité.
in scheme: Chimie
in scheme: concept-SD-chimie-photochimie
in scheme: concepts
notation: CHIM29
note: Un excimère se dissocie généralement à l'état fondamental.
related: exciplexe

durée de vie d'un film
type: ConceptConcept
type: Concept
creator: Commission d'enrichissement de la langue française, FranceTerme
date parution JO: 2003-06-15
equivalent EN: film lifetime @en
equivalent EN: film lifetime (en)
in scheme: Chimie
in scheme: concept-SD-chimie-chimie-physique
in scheme: concepts
notation: CHIM290

longueur caractéristique
type: ConceptConcept
type: Concept
creator: Commission d'enrichissement de la langue française, FranceTerme
date parution JO: 2003-06-15
equivalent EN: characteristic length @en
equivalent EN: characteristic length (en)
equivalent EN: scale @en
equivalent EN: scale (en)
in scheme: Chimie
in scheme: concept-SD-chimie-chimie-physique
in scheme: concepts
notation: CHIM291

longueur de cohérence
type: ConceptConcept
type: Concept
creator: Commission d'enrichissement de la langue française, FranceTerme
date parution JO: 2003-06-15
equivalent EN: coherence length @en
equivalent EN: coherence length (en)
in scheme: Chimie
in scheme: concept-SD-chimie-chimie-physique
in scheme: concepts
notation: CHIM292

longueur de Debye
type: ConceptConcept
type: Concept
creator: Commission d'enrichissement de la langue française, FranceTerme
date parution JO: 2003-06-15
equivalent EN: Debye length @en
equivalent EN: Debye length (en)
in scheme: Chimie
in scheme: concept-SD-chimie-chimie-physique
in scheme: concepts
notation: CHIM293

acide de Brønsted
type: ConceptConcept
type: Concept
creator: Commission d'enrichissement de la langue française, FranceTerme
date parution JO: 2003-10-08
deconseille ou frequent: base conjuguée
equivalent EN: Brønsted acid @en
equivalent EN: Brønsted acid (en)
equivalent EN: protonic acid @en
equivalent EN: protonic acid (en)
definition: Entité moléculaire, ou l'espèce chimique correspondante, capable de céder un hydron (proton) en donnant une autre entité ou espèce chimique : la base conjuguée.
in scheme: Chimie
in scheme: concepts
notation: CHIM295
note: On qualifie les acides de ce type de « forts » ou « faibles » selon qu'ils sont complètement ou partiellement dissociés en solution aqueuse.
related: acide de Lewis
related: acide dur
related: base de Brønsted
related: hydron
related: superacide
related: tampon

acide dur
type: ConceptConcept
type: Concept
creator: Commission d'enrichissement de la langue française, FranceTerme
date parution JO: 2003-10-08
equivalent EN: hard acid @en
equivalent EN: hard acid (en)
definition: Acide de Lewis dont le centre accepteur d'électrons est faiblement polarisable.
in scheme: Chimie
in scheme: concepts
notation: CHIM296
note: 1. Par « polarisable », on entend ici : « dont le nuage électronique peut se déformer facilement sous l'effet d'un champ électrique ».
note: 2. Un acide dur s'associe plutôt à une base dure qu'à une base molle.
related: acide de Lewis
related: acide de Brønsted
related: acide mou
related: base dure
related: base molle

acide mou
type: ConceptConcept
type: Concept
creator: Commission d'enrichissement de la langue française, FranceTerme
date parution JO: 2003-10-08
equivalent EN: soft acid @en
equivalent EN: soft acid (en)
definition: Acide de Lewis dont le centre accepteur d'électrons est fortement polarisable.
in scheme: Chimie
in scheme: concepts
notation: CHIM297
note: 1. Par « polarisable », on entend ici : « dont le nuage électronique peut se déformer facilement sous l'effet d'un champ électrique ».
note: 2. Un acide mou s'associe plutôt à une base molle qu'à une base dure.
related: acide de Lewis
related: acide dur
related: base dure
related: base molle
related: carbophile

hyperconjugaison
type: ConceptConcept
type: Concept
creator: Commission d'enrichissement de la langue française, FranceTerme
date parution JO: 2003-10-08
equivalent EN: hyperconjugation @en
equivalent EN: hyperconjugation (en)
part of speech: nom féminin
definition: Interaction électronique d'une liaison simple soit avec un centre cationique ou radicalaire, soit avec une double liaison ou un système délocalisé d'électrons.
in scheme: Chimie
in scheme: concepts
notation: CHIM298
note: Le cation tertiobutyle et le toluène sont des exemples d'entités moléculaires pour lesquelles on admet une telle hyperconjugaison.
related: conjugaison
related: orbitale
related: résonance
related: structure limite

alkylation
type: ConceptConcept
type: Concept
creator: Commission d'enrichissement de la langue française, FranceTerme
date parution JO: 2003-10-08
equivalent EN: alkylation @en
equivalent EN: alkylation (en)
part of speech: nom féminin
definition: Introduction d'un groupe hydrocarboné monovalent non aromatique dans une espèce chimique.
in scheme: Chimie
in scheme: concepts
notation: CHIM299
note: Ce terme s'emploie également, avec un sens particulier, dans le domaine de l'industrie pétrolière.

ambident, -e
type: ConceptConcept
type: Concept
creator: Commission d'enrichissement de la langue française, FranceTerme
date parution JO: 2001-04-18
equivalent EN: ambident @en
equivalent EN: ambident (en)
part of speech: adjectif
definition: Qualifie une entité moléculaire, ou l'espèce chimique correspondante, qui possède deux sites distincts en forte interaction, capables, au cours d'une réaction, d'être l'un ou l'autre le siège d'une nouvelle liaison.
in scheme: Chimie
in scheme: concepts
notation: CHIM3
note: 1. Du latin ambo, « tous les deux », et dens, « la dent ».
note: 2. On peut citer comme exemples : l'ion énolate, qui peut agir avec les électrophiles soit par l'atome de carbone en beta, soit par l'atome d'oxygène, et l'ion nitrite, qui peut réagir de même soit par l'atome d'azote, soit par l'atome d'oxygène.

exciplexe
type: ConceptConcept
type: Concept
creator: Commission d'enrichissement de la langue française, FranceTerme
date parution JO: 2001-04-18
equivalent EN: exciplex @en
equivalent EN: exciplex (en)
part of speech: nom masculin
definition: Complexe de stœchiométrie donnée, formé à partir d'au moins deux entités moléculaires chimiquement distinctes et qui n'existe que dans un état électronique excité.
in scheme: Chimie
in scheme: concept-SD-chimie-photochimie
in scheme: concepts
notation: CHIM30
note: Un exciplexe se dissocie généralement à l'état fondamental.
related: complexe
related: entité moléculaire
related: excimère

indice de coordination
type: ConceptConcept
type: Concept
creator: Commission d'enrichissement de la langue française, FranceTerme
date parution JO: 2003-10-08
equivalent EN: coordination number @en
equivalent EN: coordination number (en)
alternative label: coordinence
alternative label: nombre de coordination
definition: Nombre d'atomes, de molécules ou d'ions directement liés à un atome central dans une entité moléculaire.
in scheme: Chimie
in scheme: concepts
notation: CHIM300
note: 1. Exemples : dans le méthane CH4, l'indice de coordination du carbone est 4 ; celui du cobalt est 6 dans le cation complexe hexaamminecobalt [Co(NH3)6]3+.
note: 2. L'expression est utilisée avec un sens différent dans la description géométrique des cristaux ioniques ; il s'agit alors du nombre de voisins les plus proches de l'ion considéré. Exemple : dans le chlorure de sodium, les ions forment un réseau régulier et chaque ion a l'indice de coordination 6.
related: composé en couronne

aromatique
type: ConceptConcept
type: Concept
creator: Commission d'enrichissement de la langue française, FranceTerme
date parution JO: 2003-10-08
equivalent EN: aromatic @en
equivalent EN: aromatic (en)
part of speech: adjectif
definition: Se dit d'une entité moléculaire qui comporte un système conjugué cyclique et qui, en raison de la délocalisation électronique, présente une énergie plus basse et par suite une stabilité plus grande que toutes les structures limites possibles.
in scheme: Chimie
in scheme: concepts
notation: CHIM301
note: 1. Ce caractère se rencontre dans les systèmes cycliques plans comportant (4n + 2) électrons π ; l'exemple classique d'une telle entité est le benzène (pour lequel n = 1).
note: 2. Traditionnellement utilisé pour qualifier les hydrocarbures dont la formule comporte un ou plusieurs noyaux benzéniques, ce terme est parfois employé comme substantif pour les désigner.
related: entité moléculaire
related: conjugaison
related: résonance
related: structure limite

assistance anchimère
type: ConceptConcept
type: Concept
creator: Commission d'enrichissement de la langue française, FranceTerme
date parution JO: 2003-10-08
equivalent EN: anchimeric assistance @en
equivalent EN: anchimeric assistance (en)
definition: Accélération d'une réaction résultant de l'interaction entre un centre réactionnel et des électrons d'un groupe appartenant à la même molécule mais qui ne sont pas conjugués avec ce centre.
in scheme: Chimie
in scheme: concepts
notation: CHIM302
note: 1. Du grec ankura, « ancre » ; « ch » se prononce [k].
note: 2. L’assistance anchimère intervient fréquemment dans les réactions de substitution nucléophile, par exemple dans l'hydrolyse facilitée de l'ypérite [sulfure de bis (2-chloroéthyle)].
related: conjugaison
related: nucléophile

base de Brønsted
type: ConceptConcept
type: Concept
creator: Commission d'enrichissement de la langue française, FranceTerme
date parution JO: 2003-10-08
deconseille ou frequent: acide conjugué
equivalent EN: Brønsted base @en
equivalent EN: Brønsted base (en)
definition: Entité moléculaire, ou l'espèce chimique correspondante, capable d'accepter un hydron (proton) en donnant une autre entité ou espèce chimique : l'acide conjugué.
in scheme: Chimie
in scheme: concepts
notation: CHIM303
note: On qualifie les bases de ce type de « fortes » ou « faibles » selon que les acides conjugués sont partiellement ou complètement dissociés en solution aqueuse.
related: acide de Brønsted
related: base dure
related: base molle
related: hydron
related: tampon
related: base de Lewis

base dure
type: ConceptConcept
type: Concept
creator: Commission d'enrichissement de la langue française, FranceTerme
date parution JO: 2003-10-08
equivalent EN: hard base @en
equivalent EN: hard base (en)
definition: Base de Lewis dont le centre donneur d'électrons est faiblement polarisable.
in scheme: Chimie
in scheme: concepts
notation: CHIM304
note: 1. Par « polarisable », on entend ici : « dont le nuage électronique peut se déformer facilement sous l'effet d'un champ électrique ».
note: 2. Une base dure s'associe plutôt à un acide dur qu'à un acide mou.
related: acide dur
related: acide mou
related: base de Brønsted
related: base molle
related: base de Lewis

base molle
type: ConceptConcept
type: Concept
creator: Commission d'enrichissement de la langue française, FranceTerme
date parution JO: 2003-10-08
equivalent EN: soft base @en
equivalent EN: soft base (en)
definition: Base de Lewis dont le centre donneur d'électrons est fortement polarisable.
in scheme: Chimie
in scheme: concepts
notation: CHIM305
note: 1. Par « polarisable », on entend ici : « dont le nuage électronique peut se déformer facilement sous l'effet d'un champ électrique ».
note: 2. Une base molle s'associe plutôt à un acide mou qu'à un acide dur.
related: acide dur
related: acide mou
related: base de Brønsted
related: base dure
related: base de Lewis

indice de liaison
type: ConceptConcept
type: Concept
creator: Commission d'enrichissement de la langue française, FranceTerme
date parution JO: 2003-10-08
equivalent EN: bond order @en
equivalent EN: bond order (en)
alternative label: ordre de liaison
definition: Valeur calculée, entière ou décimale, du nombre de paires d'électrons liant deux atomes par référence à une liaison simple.
in scheme: Chimie
in scheme: concepts
notation: CHIM306
note: 1. Une liaison simple est une liaison covalente qui met en jeu une seule paire d'électrons localisés.
note: 2. Dans la méthode de la résonance, cet indice peut être considéré comme la moyenne pondérée des nombres de paires d'électrons liant deux atomes dans chacune des structures limites prises en considération ; ainsi dans le benzène, l'indice de liaison entre deux atomes de carbone est voisin de 1,5.
related: résonance
related: structure limite

chélate
type: ConceptConcept
type: Concept
creator: Commission d'enrichissement de la langue française, FranceTerme
date parution JO: 2003-10-08
equivalent EN: chelate @en
equivalent EN: chelate (en)
part of speech: nom masculin
definition: Entité moléculaire comportant une chélation ; l'espèce chimique correspondante.
in scheme: Chimie
in scheme: concepts
notation: CHIM307
note: Du grec khélé, « pince » ; « ch » se prononce [k].
related: chélation
related: composé en couronne
related: cryptand

chélation
type: ConceptConcept
type: Concept
creator: Commission d'enrichissement de la langue française, FranceTerme
date parution JO: 2003-10-08
equivalent EN: chelation @en
equivalent EN: chelation (en)
part of speech: nom féminin
definition: Formation ou présence de liaisons ou autres forces attractives entre un atome central unique et deux ou plusieurs sites liants distincts d'un même ligand.
in scheme: Chimie
in scheme: concepts
notation: CHIM308
note: 1. Du grec khélé, « pince » ; « ch » se prononce [k].
note: 2. On limite souvent l'utilisation de ce terme aux cas où l'atome central est un atome métallique.
related: entité moléculaire
related: espèce chimique
related: chélate

indice de valence formelle
type: ConceptConcept
type: Concept
creator: Commission d'enrichissement de la langue française, FranceTerme
date parution JO: 2003-10-08
equivalent EN: bonding number @en
equivalent EN: bonding number (en)
definition: Nombre total de liaisons à deux électrons qu'un atome d'un hydrure fondamental peut contracter avec les atomes adjacents, y compris ceux d'hydrogène.
in scheme: Chimie
in scheme: concept-SD-chimie-nomenclature
in scheme: concepts
notation: CHIM309
note: Cette notion est particulièrement importante pour les atomes à valence variable, tels que le soufre et le phosphore ; ainsi le phosphore peut avoir l'indice de valence formelle 3 ou 5 selon qu'il se trouve dans les hydrures PH3 ou PH5 ou dans leurs dérivés.
related: structure fondamentale

extincteur
type: ConceptConcept
type: Concept
creator: Commission d'enrichissement de la langue française, FranceTerme
date parution JO: 2001-04-18
equivalent EN: quencher @en
equivalent EN: quencher (en)
part of speech: nom masculin
definition: Entité moléculaire ou espèce chimique introduite dans une substance luminescente afin de supprimer l'émission lumineuse ou d'en réduire la durée.
in scheme: Chimie
in scheme: concept-SD-chimie-photochimie
in scheme: concepts
notation: CHIM31
related: désactivation
related: désactiveur

clathrate
type: ConceptConcept
type: Concept
creator: Commission d'enrichissement de la langue française, FranceTerme
date parution JO: 2003-10-08
deconseille ou frequent: composé en cage
equivalent EN: cage compound @en
equivalent EN: cage compound (en)
equivalent EN: clathrate @en
equivalent EN: clathrate (en)
part of speech: nom masculin
definition: Composé d'inclusion dans lequel la molécule incluse est enfermée dans une cage formée par la molécule hôte ou par un réseau de molécules hôtes.
in scheme: Chimie
in scheme: concepts
notation: CHIM310
note: 1. Du grec klathron, « fermeture ».
note: 2. L'expression « composé en cage » est déconseillée.
related: composé d'inclusion

isotopomère
type: ConceptConcept
type: Concept
creator: Commission d'enrichissement de la langue française, FranceTerme
date parution JO: 2003-10-08
equivalent EN: isotopomer @en
equivalent EN: isotopomer (en)
part of speech: nom masculin
definition: Chacun des isomères qui ont le même nombre d'atomes isotopiquement distincts mais qui diffèrent par la position de ces atomes.
in scheme: Chimie
in scheme: concepts
notation: CHIM311
note: 1. Le terme résulte de l'association des mots « isotope » et « isomère » ; il est également utilisé comme adjectif.
note: 2. À titre d'exemples, on peut citer CH3-CDO et CH2D-CHO.
related: isomère

composé d'inclusion
type: ConceptConcept
type: Concept
creator: Commission d'enrichissement de la langue française, FranceTerme
date parution JO: 2003-10-08
equivalent EN: inclusion complex @en
equivalent EN: inclusion complex (en)
equivalent EN: inclusion compound @en
equivalent EN: inclusion compound (en)
definition: Composé dont l'un des composants forme une cavité de taille limitée ou un réseau cristallin dans lesquels sont logées la ou les entités moléculaires d'une seconde espèce chimique.
in scheme: Chimie
in scheme: concepts
notation: CHIM312
note: L'attraction entre l'hôte et la ou les molécules incluses étant due à des forces de Van der Waals, il n'y a pas de liaisons chimiques fortes entre ces espèces.
related: entité moléculaire
related: clathrate
related: molécule hôte
related: molécule incluse

lyophile
type: ConceptConcept
type: Concept
creator: Commission d'enrichissement de la langue française, FranceTerme
date parution JO: 2003-10-08
equivalent EN: lyophilic @en
equivalent EN: lyophilic (en)
part of speech: adjectif
definition: Qui présente une affinité avec un solvant donné.
in scheme: Chimie
in scheme: concepts
notation: CHIM313
note: 1. Le préfixe lyo- vient du grec luein, « dissoudre ».
note: 2. Divers termes sont utilisés lorsqu'on souhaite préciser la nature du solvant pour lequel se manifeste cette affinité ; exemples : hydrophile (eau), lipophile (graisses), etc.
related: lyophobe

composé en couronne
type: ConceptConcept
type: Concept
creator: Commission d'enrichissement de la langue française, FranceTerme
date parution JO: 2003-10-08
equivalent EN: coronand @en
equivalent EN: coronand (en)
equivalent EN: coronate @en
equivalent EN: coronate (en)
equivalent EN: crown compound @en
equivalent EN: crown compound (en)
forme abregee: composé couronne
definition: Assemblage monocyclique comportant au moins trois sites liants retenus ensemble par des liaisons covalentes et suffisamment proches pour former des chélates avec des espèces cationiques incluses en position centrale ou quasi centrale.
in scheme: Chimie
in scheme: concepts
notation: CHIM314
note: On peut citer comme exemples de telles molécules les éthers-couronnes, capables de fixer les cations alcalins.
related: complexe
related: indice de coordination
related: chélate
related: cryptand
related: ligand
related: macrocycle

conjugaison
type: ConceptConcept
type: Concept
creator: Commission d'enrichissement de la langue française, FranceTerme
date parution JO: 2003-10-08
deconseille ou frequent: système conjugué
equivalent EN: conjugation @en
equivalent EN: conjugation (en)
part of speech: nom féminin
definition: Délocalisation d'électrons de type π, par exemple dans une séquence de liaisons simples et multiples alternées.
in scheme: Chimie
in scheme: concepts
notation: CHIM315
note: 1. L'unité structurale présentant une telle délocalisation est appelée « système conjugué ».
note: 2. Ce terme désigne, par exemple, le recouvrement des orbitales atomiques, de type « p », d'au moins trois atomes adjacents.
related: hyperconjugaison
related: aromatique
related: assistance anchimère
related: mésomérie
related: orbitale
related: formule développée
related: réaction chélotrope
related: réaction électrocyclique
related: résonance
related: graphène

cryptand
type: ConceptConcept
type: Concept
creator: Commission d'enrichissement de la langue française, FranceTerme
date parution JO: 2003-10-08
equivalent EN: cryptand @en
equivalent EN: cryptand (en)
part of speech: nom masculin
definition: Entité moléculaire formée d'un assemblage cyclique ou polycyclique de ligands comprenant au moins trois sites liants, qui définit une cavité moléculaire capable de lier fortement et ainsi de masquer une autre entité moléculaire qui peut être un cation, un anion ou une espèce neutre.
in scheme: Chimie
in scheme: concepts
notation: CHIM316
note: On admet parfois que les « composés en couronne » appartiennent à ce groupe.
related: chélate
related: composé en couronne
related: cryptate
related: ligand
related: piège chimique

cryptate
type: ConceptConcept
type: Concept
creator: Commission d'enrichissement de la langue française, FranceTerme
date parution JO: 2003-10-08
equivalent EN: cryptate @en
equivalent EN: cryptate (en)
part of speech: nom masculin
definition: Complexe formé par l'association d'un cryptand et de l'entité moléculaire située dans sa cavité.
in scheme: Chimie
in scheme: concepts
notation: CHIM317
related: cryptand

cycloaddition
type: ConceptConcept
type: Concept
creator: Commission d'enrichissement de la langue française, FranceTerme
date parution JO: 2003-10-08
equivalent EN: cycloaddition @en
equivalent EN: cycloaddition (en)
part of speech: nom féminin
definition: Réaction dans laquelle au moins deux molécules insaturées, ou deux parties d'une molécule, se combinent pour former un seul adduit cyclique.
in scheme: Chimie
in scheme: concepts
notation: CHIM318
note: Une cycloaddition peut être une réaction péricyclique ou une réaction par étapes.
related: adduit
related: réaction chélotrope
related: réaction péricyclique

lyophobe
type: ConceptConcept
type: Concept
creator: Commission d'enrichissement de la langue française, FranceTerme
date parution JO: 2003-10-08
equivalent EN: lyophobic @en
equivalent EN: lyophobic (en)
part of speech: adjectif
definition: Qui ne présente pas d'affinité avec un solvant donné.
in scheme: Chimie
in scheme: concepts
notation: CHIM319
related: lyophile

formule brute
type: ConceptConcept
type: Concept
creator: Commission d'enrichissement de la langue française, FranceTerme
date parution JO: 2001-04-18
deconseille ou frequent: formule empirique
deconseille ou frequent: formule moléculaire
equivalent EN: empirical formula @en
equivalent EN: empirical formula (en)
definition: Formule obtenue par la juxtaposition des symboles atomiques, pour donner l'expression la plus simple possible de la composition stœchiométrique du composé considéré compatible avec les résultats de l'analyse élémentaire quantitative.
in scheme: Chimie
in scheme: concepts
notation: CHIM32
note: 1. Par exemple, la formule brute de tous les oses, et en particulier du glucose, est CH2O.
note: 2. L'expression « formule empirique », parfois utilisée, est impropre.
note: 3. Certains auteurs utilisent de manière erronée cette expression pour désigner la « formule moléculaire ».
related: formule moléculaire

décroissance radioactive
type: ConceptConcept
type: Concept
creator: Commission d'enrichissement de la langue française, FranceTerme
date parution JO: 2003-10-08
equivalent EN: radioactive decay @en
equivalent EN: radioactive decay (en)
definition: Diminution d'activité dans le temps d'une substance ou d'un mélange de substances radioactives par désintégration radioactive.
in scheme: Chimie
in scheme: concept-SD-chimie-chimie-nucleaire
in scheme: concepts
notation: CHIM320
related: désintégration radioactive

mésomérie
type: ConceptConcept
type: Concept
creator: Commission d'enrichissement de la langue française, FranceTerme
date parution JO: 2003-10-08
equivalent EN: mesomerism @en
equivalent EN: mesomerism (en)
part of speech: nom féminin
definition: Mode de représentation ou d'étude de la structure réelle d'une entité moléculaire dont les électrons de liaison sont délocalisés ; ce mode considère cette entité comme intermédiaire entre deux ou plusieurs structures hypothétiques comportant des liaisons localisées, c'est-à-dire susceptibles d'être représentées par les formules de Lewis habituelles.
in scheme: Chimie
in scheme: concepts
notation: CHIM321
note: 1. Du grec mesos, « situé au milieu ».
note: 2. Ce mode de représentation a été considéré comme l'expression initiale du concept de résonance développé ultérieurement à l'aide de la mécanique quantique.
note: 3. Contrairement à ce que l'on rencontre parfois, les structures limites ne peuvent être qualifiées de « mésomères ».
related: conjugaison
related: résonance
related: structure limite

demi-vie
type: ConceptConcept
type: Concept
creator: Commission d'enrichissement de la langue française, FranceTerme
date parution JO: 2003-10-08
deconseille ou frequent: période d'un nucléide radioactif
equivalent EN: half-life @en
equivalent EN: half-life (en)
part of speech: nom féminin
definition: Dans la cinétique d'une réaction au cours de laquelle un réactif réagit complètement, temps nécessaire pour que la concentration de ce réactif soit réduite de moitié.
in scheme: Chimie
in scheme: concepts
notation: CHIM322
note: Pour la désintégration d'un échantillon de nucléide radioactif, on parle de « période d'un nucléide radioactif ».

effet inductif
type: ConceptConcept
type: Concept
creator: Commission d'enrichissement de la langue française, FranceTerme
date parution JO: 2003-10-08
equivalent EN: inductive effect @en
equivalent EN: inductive effect (en)
alternative label: effet inducteur
definition: Modification des densités de charge d'un atome ou d'un groupe d'atomes par induction électrostatique, le long d'une chaîne d'atomes d'une entité moléculaire, sous l'effet d'atomes voisins.
in scheme: Chimie
in scheme: concepts
notation: CHIM323
related: effet mésomère

effet isotopique
type: ConceptConcept
type: Concept
creator: Commission d'enrichissement de la langue française, FranceTerme
date parution JO: 2003-10-08
equivalent EN: isotope effect @en
equivalent EN: isotope effect (en)
equivalent EN: isotopic effect @en
equivalent EN: isotopic effect (en)
definition: Modification d'une propriété physique ou chimique d'une espèce chimique résultant d'un changement de sa composition isotopique.
in scheme: Chimie
in scheme: concepts
notation: CHIM324

effet mésomère
type: ConceptConcept
type: Concept
creator: Commission d'enrichissement de la langue française, FranceTerme
date parution JO: 2003-10-08
equivalent EN: mesomeric effect @en
equivalent EN: mesomeric effect (en)
definition: Effet produit sur une grandeur expérimentale, telle une vitesse de réaction, par un atome ou un groupe d'atomes introduit comme substituant dans une entité de référence, du fait de la création ou de l'extension d'une délocalisation d'électrons.
in scheme: Chimie
in scheme: concepts
notation: CHIM326
related: effet inductif

électronégativité
type: ConceptConcept
type: Concept
creator: Commission d'enrichissement de la langue française, FranceTerme
date parution JO: 2003-10-08
deconseille ou frequent: électronégatif
equivalent EN: electronegativity @en
equivalent EN: electronegativity (en)
part of speech: nom féminin
definition: Aptitude d'un atome, ou d'un groupe d'atomes, d'une entité moléculaire à attirer des électrons de liaison.
in scheme: Chimie
in scheme: concepts
notation: CHIM327
note: 1. Des théories différentes ont conduit divers auteurs à proposer des échelles différentes de valeurs relatives de l'électronégativité.
note: 2. L'adjectif « électronégatif » qualifie aussi, en électrolyse, les espèces qui se déplacent vers l'anode.

orbitale
type: ConceptConcept
type: Concept
creator: Commission d'enrichissement de la langue française, FranceTerme
date parution JO: 2003-10-08
deconseille ou frequent: fonction d'onde orbitale
equivalent EN: orbital @en
equivalent EN: orbital (en)
part of speech: nom féminin
definition: Fonction mathématique représentant l'onde stationnaire associée à un électron en interaction avec les autres particules constituant l'atome ou l'entité moléculaire considérés, et qui détermine la région de l'espace correspondant à une probabilité de présence donnée de cet électron et à son niveau d'énergie.
in scheme: Chimie
in scheme: concept-SD-chimie-mecanique-quantique
in scheme: concepts
notation: CHIM328
note: Forme elliptique de l'expression « fonction d'onde orbitale ».
related: hyperconjugaison
related: conjugaison
related: résonance
related: case quantique

entité fluctuante
type: ConceptConcept
type: Concept
creator: Commission d'enrichissement de la langue française, FranceTerme
date parution JO: 2003-10-08
equivalent EN: fluxional entity @en
equivalent EN: fluxional entity (en)
definition: Entité moléculaire qui subit des réarrangements dégénérés rapides.
in scheme: Chimie
in scheme: concepts
notation: CHIM329
related: réarrangement dégénéré
related: tautomérie de valence

formule développée
type: ConceptConcept
type: Concept
creator: Commission d'enrichissement de la langue française, FranceTerme
date parution JO: 2001-04-18
equivalent EN: line formula @en
equivalent EN: line formula (en)
definition: Représentation plane d'une entité moléculaire dans laquelle on utilise des traits pour indiquer la présence de liaisons simples ou multiples entre les atomes, sans indication ou implication concernant leurs orientations dans l'espace.
in scheme: Chimie
in scheme: concepts
notation: CHIM33
related: conjugaison
related: formule de Lewis
related: radical
related: formule moléculaire
related: formule stéréochimique

état stationnaire
type: ConceptConcept
type: Concept
creator: Commission d'enrichissement de la langue française, FranceTerme
date parution JO: 2003-10-08
equivalent EN: stationary state @en
equivalent EN: stationary state (en)
definition: État d'un système ouvert dans lequel les grandeurs physiques en chaque point du système n'évoluent pas en dépit d'échanges de matière ou d'énergie avec l'extérieur.
in scheme: Chimie
in scheme: concepts
notation: CHIM330
note: L'état stationnaire est différent de l'état d'équilibre.

formule de Lewis
type: ConceptConcept
type: Concept
creator: Commission d'enrichissement de la langue française, FranceTerme
date parution JO: 2003-10-08
equivalent EN: Lewis formula @en
equivalent EN: Lewis formula (en)
equivalent EN: Lewis structure @en
equivalent EN: Lewis structure (en)
equivalent EN: electron dot structure @en
equivalent EN: electron dot structure (en)
alternative label: structure de Lewis
definition: Formule développée d'une entité moléculaire dans laquelle tous les électrons de la couche de valence sont représentés par des points placés de telle sorte que deux points schématisent une paire d'électrons ou une liaison covalente simple entre deux atomes.
in scheme: Chimie
in scheme: concepts
notation: CHIM331
note: 1. Une liaison double est représentée par deux paires de points et une liaison triple par trois paires de points.
note: 2. Par souci de simplification, on représente souvent les paires d'électrons par des tirets.
related: formule développée

hydron
type: ConceptConcept
type: Concept
creator: Commission d'enrichissement de la langue française, FranceTerme
date parution JO: 2003-10-08
deconseille ou frequent: deutéron
deconseille ou frequent: proton
deconseille ou frequent: triton
equivalent EN: hydron @en
equivalent EN: hydron (en)
part of speech: nom masculin
definition: Nom du mélange des cations 1H+, 2H+ et 3H+ dans les proportions naturelles des isotopes de l'hydrogène, utilisé également lorsqu'il n'est pas nécessaire de distinguer les divers isotopes.
in scheme: Chimie
in scheme: concepts
notation: CHIM332
note: 1. Le terme « proton », réservé à la dénomination du cation 1H+ correspondant au seul isotope 1H (« protium »), est encore souvent utilisé à la place de « hydron ».
note: 2. Les cations 2H+ et 3H+ portent respectivement les noms de « deutéron » et de « triton ».
related: acide de Brønsted
related: base de Brønsted
related: protium
related: tampon
related: amphiprotique
related: protogène
related: protophile

protium
type: ConceptConcept
type: Concept
creator: Commission d'enrichissement de la langue française, FranceTerme
date parution JO: 2003-10-08
deconseille ou frequent: deutérium
deconseille ou frequent: hydrogène
deconseille ou frequent: tritium
equivalent EN: protium @en
equivalent EN: protium (en)
part of speech: nom masculin
definition: Dénomination de l'atome 1H.
in scheme: Chimie
in scheme: concepts
notation: CHIM335
note: 1. Le nom « hydrogène » désigne le mélange à l'état naturel des isotopes 1H, 2H et 3H ; il est également utilisé lorsqu'il n'est pas nécessaire de distinguer les divers isotopes.
note: 2. Les isotopes 2H et 3H portent respectivement les noms de « deutérium » et de « tritium ».
note: 3. « Protium » se prononce [prossium].
related: hydron

radical
type: ConceptConcept
type: Concept
creator: Commission d'enrichissement de la langue française, FranceTerme
date parution JO: 2003-10-08
deconseille ou frequent: groupe
deconseille ou frequent: radical libre
deconseille ou frequent: substituant
equivalent EN: radical @en
equivalent EN: radical (en)
part of speech: nom masculin
definition: Entité moléculaire possédant un ou plusieurs électrons non appariés, dits aussi « célibataires ».
in scheme: Chimie
in scheme: concepts
notation: CHIM336
note: 1. Dans une formule, l'électron non apparié est représenté par un point placé en exposant à droite du symbole de l'élément ou du groupe (exemple : CH3.).
note: 2. Il est recommandé de ne plus utiliser l'ancienne désignation de « radical libre ».
note: 3. En nomenclature, il est recommandé d'utiliser le terme « groupe » ou « substituant » pour désigner une fraction hydrocarbonée d'une molécule, de préférence à « radical », employé à l'origine.
related: entité moléculaire
related: formule développée
related: radicalaire
related: réaction en chaîne

radicalaire
type: ConceptConcept
type: Concept
creator: Commission d'enrichissement de la langue française, FranceTerme
date parution JO: 2003-10-08
equivalent EN: radical @en
equivalent EN: radical (en)
part of speech: adjectif
definition: Se dit de toute entité moléculaire, ou espèce chimique, ayant les propriétés d'un radical, ainsi que de toute réaction qui met en jeu un radical.
in scheme: Chimie
in scheme: concepts
notation: CHIM337
related: entité moléculaire
related: radical
related: réaction en chaîne

réaction chélotrope
type: ConceptConcept
type: Concept
creator: Commission d'enrichissement de la langue française, FranceTerme
date parution JO: 2003-10-08
deconseille ou frequent: chélétrope
deconseille ou frequent: élimination chélotrope
equivalent EN: cheletropic reaction @en
equivalent EN: cheletropic reaction (en)
equivalent EN: chelotropic reaction @en
equivalent EN: chelotropic reaction (en)
definition: Cycloaddition au cours de laquelle les atomes doublement liés situés aux extrémités d'un système conjugué se lient à un seul atome d'un réactif en formant deux nouvelles liaisons simples.
in scheme: Chimie
in scheme: concepts
notation: CHIM338
note: 1. Du grec khélé, « pince » ; ch se prononce k.
note: 2. On trouve également « chélétrope ».
note: 3. Un exemple d'une telle réaction est l'addition au butadiène du dioxyde de soufre, lequel se lie par l'atome de soufre aux atomes de carbone terminaux du diène.
note: 4. La réaction inverse est appelée « élimination chélotrope ».
related: conjugaison
related: cycloaddition

réaction électrocyclique
type: ConceptConcept
type: Concept
creator: Commission d'enrichissement de la langue française, FranceTerme
date parution JO: 2003-10-08
equivalent EN: electrocyclic reaction @en
equivalent EN: electrocyclic reaction (en)
definition: Réarrangement moléculaire qui comporte la formation d'une liaison simple entre les extrémités d'un système linéaire et totalement conjugué ainsi qu'une diminution d'une unité du nombre de doubles liaisons ; le réarrangement inverse s'accompagne de la disparition d'une liaison simple ainsi que d'une augmentation d'une unité du nombre de doubles liaisons.
in scheme: Chimie
in scheme: concepts
notation: CHIM339
note: On peut citer comme exemple d'une telle réaction la conversion de l'hexa-1,3,5-triène en cyclohexa-1,3-diène ou l'inverse.
related: conjugaison
related: réaction péricyclique

formule moléculaire
type: ConceptConcept
type: Concept
creator: Commission d'enrichissement de la langue française, FranceTerme
date parution JO: 2001-04-18
equivalent EN: molecular formula @en
equivalent EN: molecular formula (en)
definition: Formule indiquant la nature et le nombre de chacun des atomes d'une molécule, en accord avec la masse moléculaire effective, mais sans présumer du mode d'association de ces atomes.
in scheme: Chimie
in scheme: concepts
notation: CHIM34
note: 1. Par exemple, la formule moléculaire du glucose est C6H12O6.
note: 2. Certains auteurs utilisent de manière erronée l'expression « formule brute » pour désigner une telle formule.
related: formule brute
related: formule développée
related: formule stéréochimique

réaction élémentaire
type: ConceptConcept
type: Concept
creator: Commission d'enrichissement de la langue française, FranceTerme
date parution JO: 2003-10-08
equivalent EN: elementary reaction @en
equivalent EN: elementary reaction (en)
definition: Réaction chimique dans laquelle aucun intermédiaire réactionnel n'intervient au niveau moléculaire.
in scheme: Chimie
in scheme: concepts
notation: CHIM340
related: réaction en chaîne

réaction en chaîne
type: ConceptConcept
type: Concept
creator: Commission d'enrichissement de la langue française, FranceTerme
date parution JO: 2003-10-08
deconseille ou frequent: étape d'amorçage
deconseille ou frequent: étape de propagation
deconseille ou frequent: étape de terminaison
equivalent EN: chain reaction @en
equivalent EN: chain reaction (en)
definition: Réaction complexe au cours de laquelle un ou plusieurs intermédiaires réactionnels, qui sont souvent des radicaux, sont continuellement régénérés par la répétition d'un cycle d'étapes élémentaires, dites « étapes de propagation ».
in scheme: Chimie
in scheme: concepts
notation: CHIM341
note: La réaction comporte également une étape initiale, dite « d'amorçage », et une étape finale, dite « de terminaison ».
related: radical
related: radicalaire
related: réaction élémentaire

réaction péricyclique
type: ConceptConcept
type: Concept
creator: Commission d'enrichissement de la langue française, FranceTerme
date parution JO: 2003-10-08
equivalent EN: pericyclic reaction @en
equivalent EN: pericyclic reaction (en)
definition: Réaction chimique dans laquelle une réorganisation des liaisons passe par un ensemble cyclique d'atomes.
in scheme: Chimie
in scheme: concepts
notation: CHIM342
note: La réaction péricyclique désigne des processus variés, en particulier les réactions électrocycliques et les réarrangements sigmatropiques.
related: cycloaddition
related: réaction électrocyclique
related: réarrangement sigmatropique

réarrangement dégénéré
type: ConceptConcept
type: Concept
creator: Commission d'enrichissement de la langue française, FranceTerme
date parution JO: 2003-10-08
equivalent EN: degenerate rearrangement @en
equivalent EN: degenerate rearrangement (en)
definition: Réarrangement limité à un échange de liaisons interatomiques dans la molécule, sans modification des positions relatives des atomes.
in scheme: Chimie
in scheme: concepts
notation: CHIM343
note: Le réarrangement dégénéré peut être détecté par marquage isotopique ou par des techniques de résonance magnétique dynamique.
related: entité fluctuante
related: réarrangement sigmatropique
related: tautomérie de valence

réarrangement sigmatropique
type: ConceptConcept
type: Concept
creator: Commission d'enrichissement de la langue française, FranceTerme
date parution JO: 2003-10-08
equivalent EN: sigmatropic rearrangement @en
equivalent EN: sigmatropic rearrangement (en)
definition: Réarrangement moléculaire qui implique dans les espèces réagissantes à la fois la formation d'une nouvelle liaison simple entre atomes non liés et la coupure d'une liaison simple préexistante.
in scheme: Chimie
in scheme: concepts
notation: CHIM344
note: Habituellement, la localisation des doubles liaisons est modifiée, mais le nombre total de liaisons doubles et simples reste inchangé.
related: réaction péricyclique
related: réarrangement dégénéré

résonance
type: ConceptConcept
type: Concept
creator: Commission d'enrichissement de la langue française, FranceTerme
date parution JO: 2003-10-08
deconseille ou frequent: énergie de résonance
equivalent EN: resonance @en
equivalent EN: resonance (en)
part of speech: nom féminin
definition: Méthode ayant pour objet de décrire mathématiquement la répartition des électrons dans une entité moléculaire à liaisons délocalisées par une combinaison des répartitions électroniques dans des structures hypothétiques à liaisons localisées.
in scheme: Chimie
in scheme: concepts
notation: CHIM345
note: 1. Le terme « résonance » est maintenant plus utilisé que le terme « mésomérie », qui se réfère à la méthode de traitement des systèmes délocalisés utilisée à l'origine.
note: 2. La différence entre l'énergie de l'entité réelle et celle de la plus stable des structures hypothétiques à liaisons localisées est appelée « énergie de résonance ».
related: hyperconjugaison
related: aromatique
related: indice de liaison
related: conjugaison
related: mésomérie
related: orbitale
related: structure limite

solvolyse
type: ConceptConcept
type: Concept
creator: Commission d'enrichissement de la langue française, FranceTerme
date parution JO: 2003-10-08
equivalent EN: solvolysis @en
equivalent EN: solvolysis (en)
part of speech: nom féminin
definition: Réaction d'un solvant, ou d'un ion dérivé du solvant, avec un soluté, au cours de laquelle une liaison au moins du soluté est rompue.
in scheme: Chimie
in scheme: concepts
notation: CHIM346
note: On emploie plus spécifiquement ce terme pour désigner des réactions dans lesquelles le solvant, ou une espèce qui en dérive, intervient comme nucléophile.
related: nucléophile

structure limite
type: ConceptConcept
type: Concept
creator: Commission d'enrichissement de la langue française, FranceTerme
date parution JO: 2003-10-08
deconseille ou frequent: canonical form
deconseille ou frequent: forme canonique
equivalent EN: contributing structure @en
equivalent EN: contributing structure (en)
definition: Structure purement formelle ne contenant que des liaisons localisées, simples, doubles ou triples, covalentes ou ioniques, utilisée dans la représentation de la distribution électronique d'une entité moléculaire.
in scheme: Chimie
in scheme: concepts
notation: CHIM347
note: Les structures limites ont été désignées dans certains cas par l'expression « forme canonique » (en anglais : canonical form).
related: hyperconjugaison
related: aromatique
related: indice de liaison
related: mésomérie
related: résonance

superacide
type: ConceptConcept
type: Concept
creator: Commission d'enrichissement de la langue française, FranceTerme
date parution JO: 2003-10-08
equivalent EN: superacid @en
equivalent EN: superacid (en)
part of speech: nom masculin
definition: Espèce chimique, ou mélange d'espèces chimiques, d'acidité élevée, supérieure à celle de l'acide sulfurique pur.
in scheme: Chimie
in scheme: concepts
notation: CHIM348
related: acide de Lewis
related: acide de Brønsted
related: base de Lewis

supramoléculaire
type: ConceptConcept
type: Concept
creator: Commission d'enrichissement de la langue française, FranceTerme
date parution JO: 2003-10-08
equivalent EN: supramolecular @en
equivalent EN: supramolecular (en)
part of speech: adjectif
definition: Qualifie la branche de la chimie qui traite des systèmes comportant deux ou plusieurs entités moléculaires organisées et maintenues ensemble par des interactions intermoléculaires non covalentes.
in scheme: Chimie
in scheme: concepts
notation: CHIM349
note: De tels ensembles peuvent être qualifiés de « supramolécules ».

formule stéréochimique
type: ConceptConcept
type: Concept
creator: Commission d'enrichissement de la langue française, FranceTerme
date parution JO: 2001-04-18
equivalent EN: stereochemical formula @en
equivalent EN: stereochemical formula (en)
definition: Représentation tridimensionnelle d'une entité moléculaire soit comme telle, soit en projection sur un plan en utilisant conventionnellement des traits renforcés ou des traits pointillés pour indiquer l'orientation des liaisons respectivement vers l'avant ou vers l'arrière de ce plan.
in scheme: Chimie
in scheme: concepts
notation: CHIM35
related: formule développée
related: formule moléculaire

supramolécule
type: ConceptConcept
type: Concept
creator: Commission d'enrichissement de la langue française, FranceTerme
date parution JO: 2003-10-08
equivalent EN: supramolecule @en
equivalent EN: supramolecule (en)
part of speech: nom féminin
definition: Ensemble comportant deux ou plusieurs entités moléculaires organisées et maintenues ensemble par des interactions intermoléculaires non covalentes.
in scheme: Chimie
in scheme: concepts
notation: CHIM350

tautomérie de valence
type: ConceptConcept
type: Concept
creator: Commission d'enrichissement de la langue française, FranceTerme
date parution JO: 2003-10-08
equivalent EN: valence tautomerism @en
equivalent EN: valence tautomerism (en)
definition: Isomérisation ou réarrangement dégénéré, simple et généralement rapide, comportant la formation ou la rupture de liaisons simples ou doubles, sans migration d'atomes ou de groupes d'atomes.
in scheme: Chimie
in scheme: concepts
notation: CHIM351
note: Par exemple, le bicyclopentène est un tautomère de valence du cyclopenta-1,3-diène.
related: entité fluctuante
related: réarrangement dégénéré

zwitterion
type: ConceptConcept
type: Concept
creator: Commission d'enrichissement de la langue française, FranceTerme
date parution JO: 2003-10-08
deconseille ou frequent: ion hermaphrodite
equivalent EN: zwitterion @en
equivalent EN: zwitterion (en)
part of speech: nom masculin
definition: Composé neutre possédant en nombre égal des charges électriques formelles d'une unité et de signes opposés.
in scheme: Chimie
in scheme: concepts
notation: CHIM352
note: 1. De l'allemand Zwitter, « hermaphrodite » ; l'expression « ion hermaphrodite » a d'ailleurs été anciennement utilisée pour désigner ce type de composé.
note: 2. L'usage de ce terme est généralement restreint aux composés portant des charges sur des atomes qui ne sont pas adjacents.

désintégration radioactive
type: ConceptConcept
type: Concept
creator: Commission d'enrichissement de la langue française, FranceTerme
date parution JO: 2003-10-08
equivalent EN: radioactive disintegration @en
equivalent EN: radioactive disintegration (en)
in scheme: Chimie
in scheme: concept-SD-chimie-chimie-nucleaire
in scheme: concepts
notation: CHIM354
related: décroissance radioactive

blindage
type: ConceptConcept
type: Concept
creator: Commission d'enrichissement de la langue française, FranceTerme
date parution JO: 2005-09-22
equivalent EN: shielding @en
equivalent EN: shielding (en)
part of speech: nom masculin
definition: Effet d'écran résultant d'un affaiblissement local d'un champ magnétique externe, dû à la présence d'électrons circulant autour d'un noyau atomique, lesquels créent un faible champ antagoniste.
in scheme: Chimie
in scheme: concept-SD-chimie-chimie-physique
in scheme: concepts
notation: CHIM358
note: Le blindage est à la base des méthodes de résonance magnétique nucléaire appliquées à l'étude des molécules comportant au moins un noyau atomique de spin non nul.
related: déplacement chimique

blindage
type: ConceptConcept
type: Concept
creator: Commission d'enrichissement de la langue française, FranceTerme
date parution JO: 2005-09-22
deconseille ou frequent: écrantage
deconseille ou frequent: écranter
equivalent EN: screening @en
equivalent EN: screening (en)
part of speech: nom masculin
definition: Effet d'écran résultant d'un affaiblissement local d'un champ électrique exercé vers l'extérieur par une entité chargée (noyau atomique, ion ou assemblage moléculaire), dû à la présence d'électrons ou d'ions de charge opposée autour de cette entité.
in scheme: Chimie
in scheme: concept-SD-chimie-chimie-physique
in scheme: concepts
notation: CHIM359
note: L'emploi en ce sens du néologisme « écrantage », comme celui du verbe correspondant « écranter », est impropre.

hétérolyse
type: ConceptConcept
type: Concept
creator: Commission d'enrichissement de la langue française, FranceTerme
date parution JO: 2001-04-18
equivalent EN: heterolysis @en
equivalent EN: heterolysis (en)
part of speech: nom féminin
definition: Coupure d'une liaison covalente entre deux fragments dont l'un seulement conserve la totalité du doublet d'électrons liants.
in scheme: Chimie
in scheme: concepts
notation: CHIM36
related: homolyse
related: liaison covalente

coupleur
type: ConceptConcept
type: Concept
creator: Commission d'enrichissement de la langue française, FranceTerme
date parution JO: 2005-09-22
equivalent EN: linker @en
equivalent EN: linker (en)
part of speech: nom masculin
definition: Composé qui permet de greffer un autre composé sur un support, en général un polymère.
in scheme: Chimie
in scheme: concepts
notation: CHIM360

cyclophane
type: ConceptConcept
type: Concept
creator: Commission d'enrichissement de la langue française, FranceTerme
date parution JO: 2005-09-22
equivalent EN: cyclophane @en
equivalent EN: cyclophane (en)
part of speech: nom masculin
definition: Composé formé d'un grand cycle comportant en alternance, d'une part, des systèmes cycliques ayant le nombre maximal de doubles liaisons non contigües et, d'autre part, des atomes ou des chaînes saturées ou non.
in scheme: Chimie
in scheme: concept-SD-chimie-chimie-organique
in scheme: concepts
notation: CHIM361

dendrimère
type: ConceptConcept
type: Concept
creator: Commission d'enrichissement de la langue française, FranceTerme
date parution JO: 2005-09-22
deconseille ou frequent: coeur dendritique
deconseille ou frequent: cœur dendritique
equivalent EN: dendrimer @en
equivalent EN: dendrimer (en)
part of speech: nom masculin
definition: Molécule arborescente de grandes dimensions construite par des processus itératifs à partir d'une molécule comportant au moins trois sites réactifs.
in scheme: Chimie
in scheme: concepts
notation: CHIM362
note: 1. Du grec dendron, « arbre », et meros, « partie ».
note: 2. La molécule d'origine est souvent qualifiée de « cœur dendritique ».
related: dendron

dendron
type: ConceptConcept
type: Concept
creator: Commission d'enrichissement de la langue française, FranceTerme
date parution JO: 2005-09-22
equivalent EN: dendron @en
equivalent EN: dendron (en)
part of speech: nom masculin
definition: Molécule comportant, d'une part, un site branché muni d'extrémités réactives et, d'autre part, un site apte à se fixer sur un support moléculaire ou solide.
in scheme: Chimie
in scheme: concepts
notation: CHIM363
note: 1. Du grec dendron, « arbre ».
note: 2. Les dendrons sont utilisés comme des briques pour construire les dendrimères.
related: dendrimère

déplacement chimique
type: ConceptConcept
type: Concept
creator: Commission d'enrichissement de la langue française, FranceTerme
date parution JO: 2005-09-22
equivalent EN: chemical shift @en
equivalent EN: chemical shift (en)
definition: Changement de la fréquence de résonance magnétique d'un noyau atomique, dû au blindage associé à la circulation des électrons dans son environnement chimique.
in scheme: Chimie
in scheme: concept-SD-chimie-chimie-physique
in scheme: concepts
notation: CHIM364
related: blindage

endergonique
type: ConceptConcept
type: Concept
creator: Commission d'enrichissement de la langue française, FranceTerme
date parution JO: 2005-09-22
deconseille ou frequent: endothermique
equivalent EN: endergonic @en
equivalent EN: endergonic (en)
part of speech: adjectif
definition: Se dit d'une réaction qui ne peut se dérouler que si on lui fournit du travail, c'est-à-dire, au sens de la thermodynamique, de l'énergie sous une forme autre que de la chaleur.
in scheme: Chimie
in scheme: concept-SD-chimie-chimie-physique
in scheme: concepts
notation: CHIM365
note: 1. Du grec endon, « en dedans », et ergon, « travail ».
note: 2. Ce terme ne doit pas être confondu avec le qualificatif « endothermique », lequel se rapporte à la chaleur consommée par une réaction.
note: 3. La décomposition de l'eau en hydrogène et oxygène par électrolyse est un exemple de réaction endergonique. Il en est de même de la réduction du gaz carbonique, première étape de la photosynthèse des hydrates de carbone, qui nécessite l'énergie lumineuse absorbée par la chlorophylle.
related: exergonique

épitope
type: ConceptConcept
type: Concept
creator: Commission d'enrichissement de la langue française, FranceTerme
date parution JO: 2005-09-22
equivalent EN: epitope @en
equivalent EN: epitope (en)
part of speech: nom masculin
definition: Partie d'une molécule capable de stimuler la production d'un anticorps.
in scheme: Chimie
in scheme: concept-SD-chimie-biochimie
in scheme: concepts
notation: CHIM366
note: Une macromolécule peut contenir plusieurs épitopes, tous capables de stimuler la production d'anticorps.

exergonique
type: ConceptConcept
type: Concept
creator: Commission d'enrichissement de la langue française, FranceTerme
date parution JO: 2005-09-22
deconseille ou frequent: exothermique
equivalent EN: exergonic @en
equivalent EN: exergonic (en)
part of speech: adjectif
definition: Se dit d'une réaction qui peut se dérouler sans qu'on lui fournisse du travail - c'est-à-dire, au sens de la thermodynamique, de l'énergie sous une forme autre que de la chaleur - mais qui peut en produire.
in scheme: Chimie
in scheme: concept-SD-chimie-chimie-physique
in scheme: concepts
notation: CHIM367
note: 1. Du grec exô, « en dehors », et ergon, « travail ».
note: 2. Ce terme ne doit pas être confondu avec le qualificatif « exothermique », lequel se rapporte à la chaleur libérée par une réaction.
note: 3. Une réaction exergonique peut être simultanément endothermique ; un exemple d'une telle réaction est la dissociation d'une mole de tétroxyde de diazote pour former deux moles de dioxyde d'azote à faible pression.
related: endergonique

fullerène
type: ConceptConcept
type: Concept
creator: Commission d'enrichissement de la langue française, FranceTerme
date parution JO: 2005-09-22
equivalent EN: fullerene @en
equivalent EN: fullerene (en)
part of speech: nom masculin
definition: Composé constitué uniquement d'un nombre pair d'atomes de carbone triliés formant une structure en cage.
in scheme: Chimie
in scheme: concepts
notation: CHIM369
note: 1. Du nom de l'architecte américain R. Buckminster Fuller et de la désinence chimique « -ène ».
note: 2. L'exemple typique en est le [60]fullerène, lequel comporte soixante atomes de carbone.

homolyse
type: ConceptConcept
type: Concept
creator: Commission d'enrichissement de la langue française, FranceTerme
date parution JO: 2001-04-18
equivalent EN: homolysis @en
equivalent EN: homolysis (en)
part of speech: nom féminin
definition: Coupure d'une liaison covalente entre deux fragments, chacun retenant l'un des deux électrons du doublet d'électrons liants.
in scheme: Chimie
in scheme: concepts
notation: CHIM37
related: hétérolyse
related: liaison covalente

halochromie
type: ConceptConcept
type: Concept
creator: Commission d'enrichissement de la langue française, FranceTerme
date parution JO: 2005-09-22
equivalent EN: halochromism @en
equivalent EN: halochromism (en)
part of speech: nom féminin
definition: Phénomène par lequel une substance incolore ou faiblement colorée forme avec des acides ou des bases, eux-mêmes incolores, des sels de couleur vive.
in scheme: Chimie
in scheme: concept-SD-chimie-chimie-analytique
in scheme: concepts
notation: CHIM370
note: 1. Du grec halos, « sel », et khrôma, « couleur ».
note: 2. À titre d'exemples, on peut citer les nitrophénols, qui se dissolvent dans les alcalis en donnant des solutions intensément jaunes.

hapticité
type: ConceptConcept
type: Concept
creator: Commission d'enrichissement de la langue française, FranceTerme
date parution JO: 2005-09-22
deconseille ou frequent: indice d'hapticité
equivalent EN: hapticity @en
equivalent EN: hapticity (en)
part of speech: nom féminin
definition: Aptitude d'un ligand comportant deux ou plusieurs atomes consécutifs reliés par un système d'électrons π à s'attacher globalement, par une seule liaison impliquant les électrons π délocalisés, à l'atome central d'une entité de coordination.
in scheme: Chimie
in scheme: concept-SD-chimie-chimie-inorganique
in scheme: concept-SD-chimie-nomenclature
in scheme: concepts
notation: CHIM371
note: 1. Du grec haptein, « s'attacher ».
note: 2. Le nombre d'atomes contigus responsables de l'hapticité est appelé « indice d'hapticité » ou, plus simplement, « hapticité ».
related: denticité

polydenté, -e
type: ConceptConcept
type: Concept
creator: Commission d'enrichissement de la langue française, FranceTerme
date parution JO: 2005-09-22
deconseille ou frequent: bidenté
deconseille ou frequent: monodenté
equivalent EN: polydentate @en
equivalent EN: polydentate (en)
part of speech: adjectif
definition: Se dit d'un ligand qui peut contracter par l'intermédiaire d'atomes donneurs distincts plusieurs liaisons avec l'atome central d'une entité de coordination.
in scheme: Chimie
in scheme: concept-SD-chimie-chimie-inorganique
in scheme: concepts
notation: CHIM378
note: 1. Dans les cas où l'on souhaite préciser le nombre de liaisons éventuelles, le préfixe « poly- » peut être remplacé par un préfixe numérique approprié ; exemple : un ligand bidenté.
note: 2. Lorsque le ligand ne comporte qu'un atome donneur, on le qualifie parfois de « monodenté ».
related: denticité

reconnaissance moléculaire
type: ConceptConcept
type: Concept
creator: Commission d'enrichissement de la langue française, FranceTerme
date parution JO: 2005-09-22
equivalent EN: molecular recognition @en
equivalent EN: molecular recognition (en)
definition: Processus d'association sélective par complémentarité entre deux entités moléculaires complexes.
in scheme: Chimie
in scheme: concepts
notation: CHIM379
related: épitaxie

hypsochrome
type: ConceptConcept
type: Concept
creator: Commission d'enrichissement de la langue française, FranceTerme
antonym: bathochrome
date parution JO: 2001-04-18
equivalent EN: hypsochromic @en
equivalent EN: hypsochromic (en)
part of speech: adjectif
definition: Qualifie tout effet qui provoque un déplacement du spectre électronique d'absorption ou d'émission d'une entité moléculaire vers des fréquences plus élevées.
in scheme: Chimie
in scheme: concept-SD-chimie-spectroscopie
in scheme: concepts
notation: CHIM38
note: Du grec hypsos, « hauteur », et khrôma, « couleur ».
related: chromophore

synthèse combinatoire
type: ConceptConcept
type: Concept
creator: Commission d'enrichissement de la langue française, FranceTerme
date parution JO: 2005-09-22
equivalent EN: combinatorial synthesis @en
equivalent EN: combinatorial synthesis (en)
definition: Méthode de synthèse simultanée d'une famille de composés nouveaux à partir d'une famille de composés de départ et d'un réactif unique.
in scheme: Chimie
in scheme: concept-SD-chimie-biochimie
in scheme: concepts
notation: CHIM381
note: Associé à un criblage biologique à haut débit, ce type de synthèse est utilisé en particulier pour la recherche de molécules pharmacologiquement actives.
related: synthon
related: touche
related: criblage à haut débit

synthon
type: ConceptConcept
type: Concept
creator: Commission d'enrichissement de la langue française, FranceTerme
date parution JO: 2005-09-22
deconseille ou frequent: analyse rétrosynthétique
equivalent EN: building block @en
equivalent EN: building block (en)
equivalent EN: synthon @en
equivalent EN: synthon (en)
part of speech: nom masculin
definition: Entité moléculaire mise en œuvre dans la synthèse d'une molécule afin d'y introduire un motif structural donné.
in scheme: Chimie
in scheme: concept-SD-chimie-chimie-organique
in scheme: concepts
notation: CHIM382
note: Le terme trouve son origine dans la méthode dite de l'« analyse rétrosynthétique », qui consiste à concevoir un chemin de synthèse d'une molécule en la considérant comme la combinaison de fragments plus simples, réels ou hypothétiques, appelés « synthons », qui sont traduits ensuite en réactifs servant de points de départ à la synthèse réelle, souvent une synthèse combinatoire.
related: synthèse combinatoire

tampon
type: ConceptConcept
type: Concept
creator: Commission d'enrichissement de la langue française, FranceTerme
date parution JO: 2005-09-22
equivalent EN: buffer @en
equivalent EN: buffer (en)
part of speech: nom masculin
definition: Substance, ou mélange de substances, qui, par son aptitude à produire ou à consommer une espèce chimique, par exemple un hydron, maintient constante la concentration de cette espèce dans un solvant.
in scheme: Chimie
in scheme: concept-SD-chimie-chimie-analytique
in scheme: concepts
notation: CHIM383
note: L'exemple le plus courant est celui d'un tampon acide-base : mélange d'un acide faible AH et de la base conjuguée A- en proportions telles que le pH ne soit pas sensiblement modifié par dilution ou par addition en quantités relativement importantes d'acide ou de base.
related: acide de Brønsted
related: base de Brønsted
related: hydron

topomère
type: ConceptConcept
type: Concept
creator: Commission d'enrichissement de la langue française, FranceTerme
date parution JO: 2005-09-22
equivalent EN: topomer @en
equivalent EN: topomer (en)
part of speech: nom masculin
definition: Élément d'un ensemble de stéréo-isomères résultant d'échanges de ligands identiques entre deux positions chimiquement ou magnétiquement distinctes d'une molécule, sans modification de la structure chimique de celle-ci.
in scheme: Chimie
in scheme: concept-SD-chimie-chimie-organique
in scheme: concepts
notation: CHIM384
note: 1. Du grec topos, « lieu », et meros, « partie ».
note: 2. Les passages d'un topomère à l'autre peuvent être décelés et suivis par résonance magnétique nucléaire dynamique.
related: topomérisation

topomérisation
type: ConceptConcept
type: Concept
creator: Commission d'enrichissement de la langue française, FranceTerme
date parution JO: 2005-09-22
deconseille ou frequent: topomerisation
deconseille ou frequent: topomerization
equivalent EN: topomerisation (GB) @en
equivalent EN: topomerisation (en-GB)
equivalent EN: topomerization (US) @en
equivalent EN: topomerization (en-US)
part of speech: nom féminin
definition: Échange d'atomes ou de ligands identiques entre deux positions chimiquement ou magnétiquement distinctes d'une molécule, sans modification de la structure chimique de celle-ci.
in scheme: Chimie
in scheme: concept-SD-chimie-chimie-organique
in scheme: concepts
notation: CHIM385
note: 1. Du grec topos, « lieu », et meros, « partie ».
note: 2. De tels échanges peuvent être décelés et suivis par résonance magnétique nucléaire dynamique.
related: topomère

touche
type: ConceptConcept
type: Concept
creator: Commission d'enrichissement de la langue française, FranceTerme
date parution JO: 2005-09-22
deconseille ou frequent: analyse à la touche
equivalent EN: hit @en
equivalent EN: hit (en)
part of speech: nom féminin
definition: Réponse positive à un test spécifique, au cours du criblage analytique d'un mélange de composés de la même famille, qui décèle le caractère biologiquement actif de l'un d'entre eux.
in scheme: Chimie
in scheme: concept-SD-chimie-biochimie
in scheme: concepts
notation: CHIM386
note: Le terme se retrouve aussi dans l'expression « analyse à la touche ».
related: synthèse combinatoire
related: criblage à haut débit

isomère
type: ConceptConcept
type: Concept
creator: Commission d'enrichissement de la langue française, FranceTerme
date parution JO: 2001-04-18
equivalent EN: isomer @en
equivalent EN: isomer (en)
equivalent EN: isomeric @en
equivalent EN: isomeric (en)
part of speech: nom masculin
definition: Membre d'un ensemble de composés qui ont la même formule moléculaire, mais qui diffèrent par l'agencement des atomes dans la molécule.
in scheme: Chimie
in scheme: concepts
notation: CHIM39
note: Ce terme est également utilisé comme adjectif. Exemple : L'éthanol et l'oxyde de méthyle sont deux isomères ou encore deux composés isomères.
related: stéréo-isomère
related: isotopomère
related: tautomère

extensif, -ive
type: ConceptConcept
type: Concept
creator: Commission d'enrichissement de la langue française, FranceTerme
date parution JO: 2005-09-22
equivalent EN: extensive @en
equivalent EN: extensive (en)
part of speech: adjectif
definition: Se dit d'une grandeur physique qui dépend de la quantité de matière présente dans l'échantillon.
in scheme: Chimie
in scheme: concept-SD-chimie-chimie-physique
in scheme: concepts
notation: CHIM390
note: Parmi les propriétés extensives, on peut citer la masse et le volume.
related: intensif, -ive

intensif, -ive
type: ConceptConcept
type: Concept
creator: Commission d'enrichissement de la langue française, FranceTerme
date parution JO: 2005-09-22
equivalent EN: intensive @en
equivalent EN: intensive (en)
part of speech: adjectif
definition: Se dit d'une grandeur physique indépendante de la quantité de matière présente dans l'échantillon.
in scheme: Chimie
in scheme: concept-SD-chimie-chimie-physique
in scheme: concepts
notation: CHIM391
note: Parmi les propriétés intensives, on peut citer la température et la masse volumique.
related: extensif, -ive

adhésif thermofusible
type: ConceptConcept
type: Concept
creator: Commission d'enrichissement de la langue française, FranceTerme
abbreviation: hot-melt @en
date parution JO: 2011-10-16
equivalent EN: hot-melt @en
equivalent EN: hot-melt (en)
equivalent EN: hot-melt adhesive @en
equivalent EN: hot-melt adhesive (en)
definition: Préparation adhésive à base de polymères thermoplastiques, appliquée à l'état fondu sur les pièces à coller.
in scheme: Matériaux
in scheme: concept-SD-materiaux-polymeres
in scheme: concepts
notation: CHIM394

composat
type: ConceptConcept
type: Concept
creator: Commission d'enrichissement de la langue française, FranceTerme
date parution JO: 2011-10-16
equivalent EN: compound @en
equivalent EN: compound (en)
part of speech: nom masculin
definition: Mélange intime d'un ou de plusieurs polymères avec d'autres substances telles que des charges, des plastifiants ou des colorants, qui est utilisé comme matière première dans des machines destinées à fabriquer des objets en matière plastique.
in scheme: Matériaux
in scheme: concept-SD-materiaux-polymeres
in scheme: concepts
notation: CHIM395

résine
type: ConceptConcept
type: Concept
creator: Commission d'enrichissement de la langue française, FranceTerme
date parution JO: 2011-10-16
equivalent EN: resin @en
equivalent EN: resin (en)
part of speech: nom féminin
definition: Préparation réactive, qui est le précurseur d'un polymère thermodurcissable et se présente sous la forme d'un liquide ou d'un gel.
in scheme: Matériaux
in scheme: concept-SD-materiaux-polymeres
in scheme: concepts
notation: CHIM396
related: enduit gélifié
related: extrusion par tirage
related: moulage par compression
related: moulage en autoclave
related: moulage par projection simultanée

enduit gélifié
type: ConceptConcept
type: Concept
creator: Commission d'enrichissement de la langue française, FranceTerme
date parution JO: 2011-10-16
equivalent EN: gel coat @en
equivalent EN: gel coat (en)
definition: Couche de résine, souvent colorée, qui est déposée puis polymérisée sur la surface d'une pièce en polymère renforcé à laquelle elle adhère, afin d'en améliorer les propriétés de surface.
in scheme: Matériaux
in scheme: concept-SD-materiaux-polymeres
in scheme: concepts
notation: CHIM397
related: résine

polymère à cristaux liquides
type: ConceptConcept
type: Concept
creator: Commission d'enrichissement de la langue française, FranceTerme
abbreviation: LCP @en
abbreviation: PCL
date parution JO: 2011-10-16
equivalent EN: LCP @en
equivalent EN: LCP (en)
equivalent EN: liquid crystal polymer @en
equivalent EN: liquid crystal polymer (en)
definition: Polymère dont la structure chimique contient des motifs susceptibles de s'associer, à l'état fondu ou à l'état dissous, pour former des cristaux liquides.
in scheme: Matériaux
in scheme: concept-SD-materiaux-polymeres
in scheme: concepts
notation: CHIM398

préimprégné
type: ConceptConcept
type: Concept
creator: Commission d'enrichissement de la langue française, FranceTerme
date parution JO: 2011-10-16
equivalent EN: prepreg @en
equivalent EN: prepreg (en)
part of speech: nom masculin
definition: Semi-produit prêt à l'emploi, constitué d'un renfort fibreux mélangé soit à une résine thermodurcissable, soit à un polymère thermoplastique.
in scheme: Matériaux
in scheme: concept-SD-materiaux-polymeres
in scheme: concepts
notation: CHIM399
related: préimprégné en feuille
related: préimprégné en vrac
related: moulage en autoclave

amphiphile
type: ConceptConcept
type: Concept
creator: Commission d'enrichissement de la langue française, FranceTerme
date parution JO: 2001-04-18
equivalent EN: amphiphilic @en
equivalent EN: amphiphilic (en)
part of speech: adjectif
definition: Se dit d'une entité moléculaire qui présente une double affinité, à la fois hydrophile et lipophile (hydrophobe).
in scheme: Chimie
in scheme: concept-SD-chimie-chimie-physique
in scheme: concepts
notation: CHIM4
note: Du grec amphi, « des deux côtés », et philos, « ami ».
related: coétalement
related: composé semi-amphiphile
related: tensio-actif, -ive

liaison covalente
type: ConceptConcept
type: Concept
creator: Commission d'enrichissement de la langue française, FranceTerme
date parution JO: 2001-04-18
equivalent EN: covalent bond @en
equivalent EN: covalent bond (en)
definition: Liaison entre deux atomes résultant de la mise en commun de deux électrons provenant séparément de chacun d'eux.
in scheme: Chimie
in scheme: concepts
notation: CHIM40
related: hétérolyse
related: homolyse
related: liaison de coordination
related: liaison hydrogène
related: macrocycle
related: caténane
related: rotaxane
related: thermolyse

préimprégné en feuille
type: ConceptConcept
type: Concept
creator: Commission d'enrichissement de la langue française, FranceTerme
abbreviation: SMC @en
date parution JO: 2011-10-16
equivalent EN: SMC (GB) @en
equivalent EN: SMC (US) @en
equivalent EN: SMC (en-GB)
equivalent EN: SMC (en-US)
equivalent EN: sheet molding compound (US) @en
equivalent EN: sheet molding compound (en-US)
equivalent EN: sheet moulding compound (GB) @en
equivalent EN: sheet moulding compound (en-GB)
definition: Préimprégné destiné à être mis en œuvre par compression, constitué d'une nappe de fibres de verre non tissées, d'une résine thermodurcissable et de charges.
in scheme: Matériaux
in scheme: concept-SD-materiaux-polymeres
in scheme: concepts
notation: CHIM400
related: préimprégné
related: préimprégné en vrac

préimprégné en vrac
type: ConceptConcept
type: Concept
creator: Commission d'enrichissement de la langue française, FranceTerme
abbreviation: BMC @en
date parution JO: 2011-10-16
equivalent EN: BMC (GB) @en
equivalent EN: BMC (US) @en
equivalent EN: BMC (en-GB)
equivalent EN: BMC (en-US)
equivalent EN: bulk molding compound (US) @en
equivalent EN: bulk molding compound (en-US)
equivalent EN: bulk moulding compound (GB) @en
equivalent EN: bulk moulding compound (en-GB)
alternative label: prémix
definition: Préimprégné destiné à être mis en œuvre par compression, se présentant sous la forme d'une pâte constituée d'un renfort de fibres de verre coupées, d'une résine thermodurcissable et de charges.
in scheme: Matériaux
in scheme: concept-SD-materiaux-polymeres
in scheme: concepts
notation: CHIM401
related: préimprégné
related: préimprégné en feuille

stratifil
type: ConceptConcept
type: Concept
creator: Commission d'enrichissement de la langue française, FranceTerme
date parution JO: 2011-10-16
equivalent EN: roving @en
equivalent EN: roving (en)
part of speech: nom masculin
definition: Ensemble de fibres de verre continues disposées en parallèle, qui est utilisé comme armature pour les polymères stratifiés.
in scheme: Matériaux
in scheme: concept-SD-materiaux-polymeres
in scheme: concepts
notation: CHIM402

thermoplastique renforcé de mat de verre
type: ConceptConcept
type: Concept
creator: Commission d'enrichissement de la langue française, FranceTerme
abbreviation: GMT @en
abbreviation: TRE
date parution JO: 2011-10-16
equivalent EN: GMT @en
equivalent EN: GMT (en)
equivalent EN: glass mat thermoplastic @en
equivalent EN: glass mat thermoplastic (en)
alternative label: thermoplastique renforcé estampable
definition: Semi-produit destiné à être mis en forme par compression à chaud, généralement constitué de trois couches, une couche interne en renfort de fibres de verre et deux couches externes en polymère thermoplastique.
in scheme: Matériaux
in scheme: concept-SD-materiaux-polymeres
in scheme: concepts
notation: CHIM403
note: Il existe des produits contenant plus de trois couches, les couches de renfort et de polymère thermoplastique étant disposées de manière alternée.

indice de fluidité
type: ConceptConcept
type: Concept
creator: Commission d'enrichissement de la langue française, FranceTerme
abbreviation: MFI @en
abbreviation: MI @en
date parution JO: 2011-10-16
equivalent EN: MFI @en
equivalent EN: MFI (en)
equivalent EN: MI @en
equivalent EN: MI (en)
equivalent EN: melt-flow index @en
equivalent EN: melt-flow index (en)
equivalent EN: melt-index @en
equivalent EN: melt-index (en)
definition: Grandeur qui caractérise la fluidité à chaud d'un polymère thermoplastique, obtenue en mesurant la masse ou le volume de polymère fondu qui s'écoule à travers un orifice calibré, à une température donnée et pendant une période déterminée.
in scheme: Matériaux
in scheme: concept-SD-materiaux-polymeres
in scheme: concepts
notation: CHIM404

coextrusion
type: ConceptConcept
type: Concept
creator: Commission d'enrichissement de la langue française, FranceTerme
date parution JO: 2011-10-16
equivalent EN: coextrusion @en
equivalent EN: coextrusion (en)
part of speech: nom féminin
definition: Procédé consistant à extruder simultanément, à travers une seule filière et à l'aide de plusieurs extrudeuses, des polymères thermoplastiques différents qui se répartissent en couches superposées dans le produit élaboré.
in scheme: Matériaux
in scheme: concept-SD-materiaux-polymeres
in scheme: concepts
notation: CHIM405

enroulement filamentaire
type: ConceptConcept
type: Concept
creator: Commission d'enrichissement de la langue française, FranceTerme
date parution JO: 2011-10-16
equivalent EN: filament winding @en
equivalent EN: filament winding (en)
definition: Procédé de fabrication d'une pièce qui consiste à enrouler sur un mandrin, sous tension contrôlée, un matériau filamentaire de renforcement, imprégné de résine ou de polymère.
in scheme: Matériaux
in scheme: concept-SD-materiaux-polymeres
in scheme: concepts
notation: CHIM406

extrusion par tirage
type: ConceptConcept
type: Concept
creator: Commission d'enrichissement de la langue française, FranceTerme
date parution JO: 2011-10-16
equivalent EN: pultrusion @en
equivalent EN: pultrusion (en)
alternative label: pultrusion
definition: Procédé de fabrication en continu de profilés renforcés longitudinalement, consistant à tirer des renforts filamentaires imprégnés de résine ou de polymère thermoplastique à travers une filière chauffée, ce qui provoque la polymérisation de la résine ou la fusion du polymère et donne sa forme à la section du profilé.
in scheme: Matériaux
in scheme: concept-SD-materiaux-polymeres
in scheme: concepts
notation: CHIM407
related: résine

moulage par extrusion et soufflage
type: ConceptConcept
type: Concept
creator: Commission d'enrichissement de la langue française, FranceTerme
abbreviation: EBM @en
date parution JO: 2011-10-16
equivalent EN: EBM (GB) @en
equivalent EN: EBM (US) @en
equivalent EN: EBM (en-GB)
equivalent EN: EBM (en-US)
equivalent EN: extrusion blow molding (US) @en
equivalent EN: extrusion blow molding (en-US)
equivalent EN: extrusion blow moulding (GB) @en
equivalent EN: extrusion blow moulding (en-GB)
forme abregee: extrusion-soufflage, n.f.
definition: Procédé de fabrication de corps creux en matière plastique consistant à extruder un tube, puis à le gonfler à chaud dans un moule dont il prend la forme.
in scheme: Matériaux
in scheme: concept-SD-materiaux-polymeres
in scheme: concepts
notation: CHIM408

soufflage de gaine
type: ConceptConcept
type: Concept
creator: Commission d'enrichissement de la langue française, FranceTerme
date parution JO: 2011-10-16
equivalent EN: film blowing @en
equivalent EN: film blowing (en)
definition: Procédé de fabrication en continu de films minces en matière plastique, consistant à extruder une gaine à travers une filière annulaire, puis à la gonfler à chaud pour obtenir l'épaisseur souhaitée.
in scheme: Matériaux
in scheme: concept-SD-materiaux-polymeres
in scheme: concepts
notation: CHIM409

liaison de coordination
type: ConceptConcept
type: Concept
creator: Commission d'enrichissement de la langue française, FranceTerme
date parution JO: 2001-04-18
deconseille ou frequent: liaison dative
equivalent EN: coordination bond @en
equivalent EN: coordination bond (en)
definition: Liaison entre deux atomes dans laquelle le doublet d'électrons commun ne provient que de l'un des deux atomes liés.
in scheme: Chimie
in scheme: concepts
notation: CHIM41
note: 1. L'expression « liaison dative » n'est pas recommandée.
note: 2. On peut citer comme exemple la liaison N-B dans H3N-BF3.
related: acide de Lewis
related: complexe
related: adduit
related: liaison covalente
related: base de Lewis
related: macrocycle

rotomoulage
type: ConceptConcept
type: Concept
creator: Commission d'enrichissement de la langue française, FranceTerme
date parution JO: 2011-10-16
equivalent EN: rotational molding (US) @en
equivalent EN: rotational molding (en-US)
equivalent EN: rotational moulding (GB) @en
equivalent EN: rotational moulding (en-GB)
equivalent EN: rotomolding (US) @en
equivalent EN: rotomolding (en-US)
equivalent EN: rotomoulding (GB) @en
equivalent EN: rotomoulding (en-GB)
part of speech: nom masculin
definition: Procédé de fabrication de pièces creuses à partir d'un matériau polymère, le plus souvent en poudre fine, qui fond et qui se répartit de manière uniforme sur la paroi interne d'un moule chaud animé de mouvements de rotation autour de plusieurs axes.
in scheme: Matériaux
in scheme: concept-SD-materiaux-polymeres
in scheme: concepts
notation: CHIM410
related: moulage à peau préformée

moulage à peau préformée
type: ConceptConcept
type: Concept
creator: Commission d'enrichissement de la langue française, FranceTerme
date parution JO: 2011-10-16
equivalent EN: slush molding (US) @en
equivalent EN: slush molding (en-US)
equivalent EN: slush moulding (GB) @en
equivalent EN: slush moulding (en-GB)
definition: Procédé de fabrication d'une pièce moulée consistant à réaliser par rotomoulage la paroi externe de cette pièce, puis à injecter dans sa cavité un polymère expansible.
in scheme: Matériaux
in scheme: concept-SD-materiaux-polymeres
in scheme: concepts
notation: CHIM411
related: rotomoulage

moulage au contact
type: ConceptConcept
type: Concept
creator: Commission d'enrichissement de la langue française, FranceTerme
date parution JO: 2011-10-16
equivalent EN: lay-up molding (US) @en
equivalent EN: lay-up molding (en-US)
equivalent EN: lay-up moulding (GB) @en
equivalent EN: lay-up moulding (en-GB)
definition: Moulage consistant à imprégner de résine une ou plusieurs couches de renfort fibreux déposées manuellement sur la paroi d'un moule ouvert, puis à polymériser cette résine.
in scheme: Matériaux
in scheme: concept-SD-materiaux-polymeres
in scheme: concepts
notation: CHIM412

moulage par centrifugation
type: ConceptConcept
type: Concept
creator: Commission d'enrichissement de la langue française, FranceTerme
date parution JO: 2011-10-16
equivalent EN: centrifugal molding (US) @en
equivalent EN: centrifugal molding (en-US)
equivalent EN: centrifugal moulding (GB) @en
equivalent EN: centrifugal moulding (en-GB)
definition: Procédé de fabrication de pièces cylindriques creuses consistant à projeter sur la paroi chauffée d'un moule cylindrique tournant rapidement sur lui-même un mélange de fibres de renfort et de résine qui se polymérise.
in scheme: Matériaux
in scheme: concept-SD-materiaux-polymeres
in scheme: concepts
notation: CHIM413

moulage par co-injection
type: ConceptConcept
type: Concept
creator: Commission d'enrichissement de la langue française, FranceTerme
date parution JO: 2011-10-16
deconseille ou frequent: injection bi-matière
equivalent EN: co-injection molding (US) @en
equivalent EN: co-injection molding (en-US)
equivalent EN: co-injection moulding (GB) @en
equivalent EN: co-injection moulding (en-GB)
forme abregee: co-injection, n.f.
definition: Procédé consistant à injecter dans un seul moule, simultanément ou successivement, des polymères différents, à l'aide de plusieurs presses d'injection.
in scheme: Matériaux
in scheme: concept-SD-materiaux-polymeres
in scheme: concepts
notation: CHIM414
note: Dans le cas où l'on injecte deux polymères différents, on parle également d'« injection bi-matière ».

moulage par compression
type: ConceptConcept
type: Concept
creator: Commission d'enrichissement de la langue française, FranceTerme
date parution JO: 2011-10-16
equivalent EN: compression molding (US) @en
equivalent EN: compression molding (en-US)
equivalent EN: compression moulding (GB) @en
equivalent EN: compression moulding (en-GB)
definition: Procédé de moulage d'un polymère thermodurcissable consistant à comprimer une résine dans un moule fermé, puis à la chauffer pour la polymériser.
in scheme: Matériaux
in scheme: concept-SD-materiaux-polymeres
in scheme: concepts
notation: CHIM415
related: résine

moulage en autoclave
type: ConceptConcept
type: Concept
creator: Commission d'enrichissement de la langue française, FranceTerme
date parution JO: 2011-10-16
equivalent EN: autoclave molding (US) @en
equivalent EN: autoclave molding (en-US)
equivalent EN: autoclave moulding (GB) @en
equivalent EN: autoclave moulding (en-GB)
definition: Procédé de moulage en deux étapes consistant à tapisser un moule ouvert avec un préimprégné, puis à en polymériser la résine en plaçant le moule dans un autoclave.
in scheme: Matériaux
in scheme: concept-SD-materiaux-polymeres
in scheme: concepts
notation: CHIM416
related: résine
related: préimprégné

moulage par expansion
type: ConceptConcept
type: Concept
creator: Commission d'enrichissement de la langue française, FranceTerme
date parution JO: 2015-09-19
deconseille ou frequent: PSE
deconseille ou frequent: polystyrène expansé
equivalent EN: expansion molding (US) @en
equivalent EN: expansion molding (en-US)
equivalent EN: expansion moulding (GB) @en
equivalent EN: expansion moulding (en-GB)
definition: Procédé de fabrication d'une pièce en mousse de polymère consistant à provoquer l’expansion à chaud de billes de polymère contenant un additif volatil, puis à compacter ces billes expansées dans un moule dont elles prennent la forme.
in scheme: Matériaux
in scheme: concept-SD-materiaux-polymeres
in scheme: concepts
notation: CHIM417
note: Le moulage par expansion est notamment utilisé pour la production d’emballages ou d’isolants en polystyrène expansé (PSE).

moulage par infusion sous vide
type: ConceptConcept
type: Concept
creator: Commission d'enrichissement de la langue française, FranceTerme
date parution JO: 2011-10-16
equivalent EN: vacuum bag molding (US) @en
equivalent EN: vacuum bag molding (en-US)
equivalent EN: vacuum bag moulding (GB) @en
equivalent EN: vacuum bag moulding (en-GB)
equivalent EN: vacuum infusion molding (US) @en
equivalent EN: vacuum infusion molding (en-US)
equivalent EN: vacuum infusion moulding (GB) @en
equivalent EN: vacuum infusion moulding (en-GB)
definition: Procédé de moulage consistant à déposer un renfort fibreux sur la paroi d'un moule ouvert, à le recouvrir d'une couche de résine puis d'un film étanche, et à faire pénétrer cette résine par aspiration au cœur du renfort, avant de la polymériser.
in scheme: Matériaux
in scheme: concept-SD-materiaux-polymeres
in scheme: concepts
notation: CHIM418

moulage par injection capillaire
type: ConceptConcept
type: Concept
creator: Commission d'enrichissement de la langue française, FranceTerme
date parution JO: 2011-10-16
equivalent EN: pin-point injection molding (US) @en
equivalent EN: pin-point injection molding (en-US)
equivalent EN: pin-point injection moulding (GB) @en
equivalent EN: pin-point injection moulding (en-GB)
forme abregee: injection capillaire
definition: Procédé de moulage par injection utilisant un moule dans lequel l'orifice d'entrée du polymère est de faible diamètre, ce qui permet d'en réduire l'empreinte sur la pièce finie.
in scheme: Matériaux
in scheme: concept-SD-materiaux-polymeres
in scheme: concepts
notation: CHIM419

ligand
type: ConceptConcept
type: Concept
creator: Commission d'enrichissement de la langue française, FranceTerme
date parution JO: 2001-04-18
equivalent EN: ligand @en
equivalent EN: ligand (en)
part of speech: nom masculin
alternative label: coordinat
definition: Atome ou groupe d'atomes lié à un atome central, généralement métallique, dans une entité moléculaire polyatomique.
in scheme: Chimie
in scheme: concepts
notation: CHIM42
related: composé en couronne
related: cryptand
related: denticité

moulage par injection en canal chaud
type: ConceptConcept
type: Concept
creator: Commission d'enrichissement de la langue française, FranceTerme
date parution JO: 2011-10-16
equivalent EN: hot runner injection molding (US) @en
equivalent EN: hot runner injection molding (en-US)
equivalent EN: hot runner injection moulding (GB) @en
equivalent EN: hot runner injection moulding (en-GB)
forme abregee: injection canal chaud
definition: Procédé de moulage par injection dans lequel le canal d'alimentation du moule est chauffé afin que la carotte d'injection reste fluide et serve au moulage de la pièce suivante au lieu de rester solidaire de la pièce moulée.
in scheme: Matériaux
in scheme: concept-SD-materiaux-polymeres
in scheme: concepts
notation: CHIM420

moulage par injection et réaction
type: ConceptConcept
type: Concept
creator: Commission d'enrichissement de la langue française, FranceTerme
abbreviation: MIR
abbreviation: RIM @en
date parution JO: 2011-10-16
equivalent EN: RIM (GB) @en
equivalent EN: RIM (US) @en
equivalent EN: RIM (en-GB)
equivalent EN: RIM (en-US)
equivalent EN: reaction injection molding (US) @en
equivalent EN: reaction injection molding (en-US)
equivalent EN: reaction injection moulding (GB) @en
equivalent EN: reaction injection moulding (en-GB)
forme abregee: moulage par injection-réaction
definition: Procédé de moulage par injection consistant à mélanger intimement sous pression plusieurs composants réactifs, éventuellement additionnés de charges, avant de les introduire dans le moule où ils réagissent pour former l'objet fini.
in scheme: Matériaux
in scheme: concept-SD-materiaux-polymeres
in scheme: concepts
notation: CHIM421

moulage par injection sous-marine
type: ConceptConcept
type: Concept
creator: Commission d'enrichissement de la langue française, FranceTerme
date parution JO: 2011-10-16
equivalent EN: submarine gate molding (US) @en
equivalent EN: submarine gate molding (en-US)
equivalent EN: submarine gate moulding (GB) @en
equivalent EN: submarine gate moulding (en-GB)
equivalent EN: submarine injection molding (US) @en
equivalent EN: submarine injection molding (en-US)
equivalent EN: submarine injection moulding (GB) @en
equivalent EN: submarine injection moulding (en-GB)
equivalent EN: tunnel gate molding (US) @en
equivalent EN: tunnel gate molding (en-US)
equivalent EN: tunnel gate moulding (GB) @en
equivalent EN: tunnel gate moulding (en-GB)
forme abregee: injection sous-marine
definition: Procédé de moulage par injection utilisant un moule dont le canal d'alimentation est situé au-dessous du plan de joint de sorte que la carotte d'injection est séparée de la pièce lors de l'ouverture du moule.
in scheme: Matériaux
in scheme: concept-SD-materiaux-polymeres
in scheme: concepts
notation: CHIM422

moulage par projection simultanée
type: ConceptConcept
type: Concept
creator: Commission d'enrichissement de la langue française, FranceTerme
date parution JO: 2011-10-16
equivalent EN: spray-up molding (US) @en
equivalent EN: spray-up molding (en-US)
equivalent EN: spray-up moulding (GB) @en
equivalent EN: spray-up moulding (en-GB)
definition: Procédé de moulage consistant à projeter simultanément, sur la paroi d'un moule ouvert, des fibres coupées et de la résine qui est ensuite polymérisée.
in scheme: Matériaux
in scheme: concept-SD-materiaux-polymeres
in scheme: concepts
notation: CHIM423
related: résine

moulage par transfert de résine
type: ConceptConcept
type: Concept
creator: Commission d'enrichissement de la langue française, FranceTerme
abbreviation: MTR
abbreviation: RTM @en
date parution JO: 2011-10-16
equivalent EN: RTM (GB) @en
equivalent EN: RTM (US) @en
equivalent EN: RTM (en-GB)
equivalent EN: RTM (en-US)
equivalent EN: resin transfer molding (US) @en
equivalent EN: resin transfer molding (en-US)
equivalent EN: resin transfer moulding (GB) @en
equivalent EN: resin transfer moulding (en-GB)
definition: Procédé de moulage consistant à injecter sous faible pression une résine thermodurcissable dans un moule où un renfort fibreux a été préalablement disposé.
in scheme: Matériaux
in scheme: concept-SD-materiaux-polymeres
in scheme: concepts
notation: CHIM424

pelliplacage
type: ConceptConcept
type: Concept
creator: Commission d'enrichissement de la langue française, FranceTerme
date parution JO: 2011-10-16
deconseille ou frequent: skinpack
deconseille ou frequent: skinpackage
equivalent EN: skin pack @en
equivalent EN: skin pack (en) [emballage]
equivalent EN: skin package @en
equivalent EN: skin package (en) [emballage]
equivalent EN: skin packaging @en
equivalent EN: skin packaging (en)
part of speech: nom masculin
definition: Technique d'emballage consistant à plaquer sur un objet un film plastique souple par aspiration à travers un support poreux ; par extension, l'emballage lui-même.
in scheme: Matériaux
in scheme: concept-SD-materiaux-polymeres
in scheme: concepts
notation: CHIM425

revêtement en moule
type: ConceptConcept
type: Concept
creator: Commission d'enrichissement de la langue française, FranceTerme
abbreviation: IMC @en
date parution JO: 2011-10-16
equivalent EN: IMC (GB) @en
equivalent EN: IMC (US) @en
equivalent EN: IMC (en-GB)
equivalent EN: IMC (en-US)
equivalent EN: in-mold coating (US) @en
equivalent EN: in-mold coating (en-US)
equivalent EN: in-mould coating (GB) @en
equivalent EN: in-mould coating (en-GB)
definition: Procédé consistant à déposer, avant ou après l'injection du polymère constitutif d'une pièce moulée, une couche mince d'un autre polymère ou de peinture sur la paroi interne du moule, afin de modifier certaines propriétés de surface de la pièce, notamment sa couleur.
in scheme: Matériaux
in scheme: concept-SD-materiaux-polymeres
in scheme: concepts
notation: CHIM428

moulage par injection et soufflage
type: ConceptConcept
type: Concept
creator: Commission d'enrichissement de la langue française, FranceTerme
date parution JO: 2011-10-16
equivalent EN: injection blow molding (US) @en
equivalent EN: injection blow molding (en-US)
equivalent EN: injection blow moulding (GB) @en
equivalent EN: injection blow moulding (en-GB)
forme abregee: injection-soufflage, n.f.
definition: Procédé de fabrication de corps creux consistant à réaliser par injection une préforme tubulaire dans un premier moule puis à la gonfler, encore chaude ou réchauffée, dans un deuxième moule correspondant à la forme définitive de l'objet.
in scheme: Matériaux
in scheme: concept-SD-materiaux-polymeres
in scheme: concepts
notation: CHIM429

macromolécule
type: ConceptConcept
type: Concept
creator: Commission d'enrichissement de la langue française, FranceTerme
date parution JO: 2001-04-18
equivalent EN: macromolecule @en
equivalent EN: macromolecule (en)
equivalent EN: polymer molecule @en
equivalent EN: polymer molecule (en)
part of speech: nom féminin
definition: Molécule de masse moléculaire élevée, généralement constituée par la répétition en grand nombre d'atomes ou de groupes d'atomes, appelés « unités constitutives » et dérivant de molécules de faible masse moléculaire.
in scheme: Chimie
in scheme: concept-SD-chimie-chimie-macromoleculaire
in scheme: concepts
notation: CHIM43
note: Dans de nombreux cas, une molécule peut être considérée comme ayant une « masse moléculaire élevée » lorsque l'addition ou la suppression d'une ou de quelques unités n'a qu'un effet négligeable sur les propriétés moléculaires.
related: atactique
related: bicaténaire
related: bloc
related: chaîne
related: copolymère aléatoire
related: copolymère alterné
related: copolymère statistique
related: degré de polymérisation
related: dépropagation
related: échelle (en)
related: groupe terminal
related: irrégulier, -ière
related: isotactique
related: linéaire
related: monocaténaire
related: motif configurationnel
related: motif constitutif
related: motif de stéréorépétition
related: multicaténaire
related: polymère à blocs
related: polymère à stéréoblocs
related: polymère greffé
related: unité constitutive
related: régulier, -ière
related: stéréorégulier, -ière
related: prépolymère
related: réseau
related: spiro-
related: syndiotactique
related: tacticité
related: tactique
related: transfert de chaîne
related: unité configurationnelle
related: unité configurationnelle élémentaire
related: unité monomère
related: monomère
related: nœud de réticulation
related: polymère

amphiprotique
type: ConceptConcept
type: Concept
creator: Commission d'enrichissement de la langue française, FranceTerme
date parution JO: 2010-09-02
equivalent EN: amphiprotic @en
equivalent EN: amphiprotic (en)
part of speech: adjectif
definition: Se dit d'un solvant à la fois protogène et protophile.
in scheme: Chimie
in scheme: concepts
notation: CHIM430
note: L'eau est un exemple de solvant amphiprotique.
related: hydron
related: protogène
related: protophile

analyse calorimétrique
type: ConceptConcept
type: Concept
creator: Commission d'enrichissement de la langue française, FranceTerme
date parution JO: 2010-09-02
equivalent EN: scanning calorimetry @en
equivalent EN: scanning calorimetry (en)
definition: Analyse thermique consistant à mesurer, en fonction de la température, la chaleur produite ou consommée lors d'un changement d'état physique de la matière étudiée ou lors de sa transformation chimique.
in scheme: Chimie
in scheme: concept-SD-chimie-chimie-analytique
in scheme: concept-SD-chimie-chimie-physique
in scheme: concepts
notation: CHIM431
related: analyse calorimétrique différentielle
related: analyse thermique
related: analyse thermique différentielle

analyse calorimétrique différentielle
type: ConceptConcept
type: Concept
creator: Commission d'enrichissement de la langue française, FranceTerme
abbreviation: ACD
abbreviation: DSC @en
date parution JO: 2010-09-02
equivalent EN: DSC @en
equivalent EN: DSC (en)
equivalent EN: differential scanning calorimetry @en
equivalent EN: differential scanning calorimetry (en)
definition: Analyse thermique consistant à mesurer, en fonction de la température et par rapport à une matière de référence, la chaleur produite ou consommée lors d'un changement d'état physique de la matière étudiée ou lors de sa transformation chimique.
in scheme: Chimie
in scheme: concept-SD-chimie-chimie-analytique
in scheme: concept-SD-chimie-chimie-physique
in scheme: concepts
notation: CHIM432
related: analyse calorimétrique
related: analyse thermique
related: analyse thermique différentielle

analyse thermique
type: ConceptConcept
type: Concept
creator: Commission d'enrichissement de la langue française, FranceTerme
date parution JO: 2010-09-02
equivalent EN: thermal analysis @en
equivalent EN: thermal analysis (en)
definition: Étude de la relation entre l'une des propriétés d'un échantillon de matière et sa température lorsque cet échantillon est chauffé ou refroidi de manière contrôlée.
in scheme: Chimie
in scheme: concept-SD-chimie-chimie-analytique
in scheme: concept-SD-chimie-chimie-physique
in scheme: concepts
notation: CHIM433
related: analyse calorimétrique
related: analyse calorimétrique différentielle
related: analyse thermique différentielle

analyse thermique différentielle
type: ConceptConcept
type: Concept
creator: Commission d'enrichissement de la langue française, FranceTerme
abbreviation: ATD
abbreviation: DTA @en
date parution JO: 2010-09-02
equivalent EN: DTA @en
equivalent EN: DTA (en)
equivalent EN: differential thermal analysis @en
equivalent EN: differential thermal analysis (en)
definition: Analyse thermique consistant à mesurer la différence de température entre l'échantillon de la matière étudiée et celui d'une matière de référence, soumis l'un et l'autre à un même programme de chauffage ou de refroidissement.
in scheme: Chimie
in scheme: concept-SD-chimie-chimie-analytique
in scheme: concept-SD-chimie-chimie-physique
in scheme: concepts
notation: CHIM434
related: analyse calorimétrique
related: analyse calorimétrique différentielle
related: analyse thermique

analyte
type: ConceptConcept
type: Concept
creator: Commission d'enrichissement de la langue française, FranceTerme
date parution JO: 2010-09-02
equivalent EN: analyte @en
equivalent EN: analyte (en)
part of speech: nom masculin
definition: Espèce chimique recherchée, détectée et éventuellement dosée selon un protocole analytique.
in scheme: Chimie
in scheme: concept-SD-chimie-chimie-analytique
in scheme: concepts
notation: CHIM435
related: espèce chimique
related: capteur analytique

atomisation
type: ConceptConcept
type: Concept
creator: Commission d'enrichissement de la langue française, FranceTerme
date parution JO: 2010-09-02
equivalent EN: atomisation (GB) @en
equivalent EN: atomisation (en-GB)
equivalent EN: atomization (US) @en
equivalent EN: atomization (en-US)
part of speech: nom féminin
definition: Dissociation d'une espèce chimique en atomes libres.
in scheme: Chimie
in scheme: concept-SD-chimie-chimie-analytique
in scheme: concepts
notation: CHIM436
note: L'atomisation d'une espèce chimique est notamment pratiquée au cours d'une analyse par spectrométrie atomique.
related: espèce chimique

atomisation
type: ConceptConcept
type: Concept
creator: Commission d'enrichissement de la langue française, FranceTerme
date parution JO: 2010-09-02
equivalent EN: atomisation (GB) @en
equivalent EN: atomisation (en-GB)
equivalent EN: atomization (US) @en
equivalent EN: atomization (en-US)
part of speech: nom féminin
definition: Procédé physique de division d'une substance en fines gouttelettes.
in scheme: Chimie
in scheme: concept-SD-chimie-chimie-industrielle
in scheme: concepts
notation: CHIM437
note: La taille des gouttelettes obtenues par atomisation est généralement de l'ordre du micromètre.

cellule d'électrolyse
type: ConceptConcept
type: Concept
creator: Commission d'enrichissement de la langue française, FranceTerme
date parution JO: 2010-09-02
equivalent EN: electrolytic cell @en
equivalent EN: electrolytic cell (en)
definition: Cellule électrochimique dans laquelle se produit l'électrolyse d'une espèce chimique sous l'action d'un courant électrique continu.
in scheme: Chimie
in scheme: concept-SD-chimie-chimie-physique
in scheme: concepts
notation: CHIM438
note: Un accumulateur en cours de charge est une cellule d'électrolyse.
related: espèce chimique
related: cellule électrochimique
related: cellule galvanique
related: courant faradique
related: polarographie
related: voltampérométrie
related: électrolyse alcaline de l'eau
related: électrolyse de l'eau à membrane échangeuse de protons
related: électrolyse de la vapeur d'eau à haute température

cellule électrochimique
type: ConceptConcept
type: Concept
creator: Commission d'enrichissement de la langue française, FranceTerme
date parution JO: 2010-09-02
equivalent EN: electrochemical cell @en
equivalent EN: electrochemical cell (en)
definition: Dispositif constitué de deux électrodes séparées par un électrolyte, qui sont le siège de réactions d'oxydoréduction.
in scheme: Chimie
in scheme: concept-SD-chimie-chimie-physique
in scheme: concepts
notation: CHIM439
note: La cellule d'électrolyse et la cellule galvanique sont des exemples de cellule électrochimique.
related: cellule d'électrolyse
related: cellule galvanique
related: tension de cellule
related: électrosynthèse microbienne
related: pile à combustible microbienne
related: pile à combustible à hydrogène

marqueur de spin
type: ConceptConcept
type: Concept
creator: Commission d'enrichissement de la langue française, FranceTerme
date parution JO: 2001-04-18
deconseille ou frequent: aminoxyle
deconseille ou frequent: nitroxyle
equivalent EN: spin label @en
equivalent EN: spin label (en)
definition: Groupe portant un électron non apparié, fixé sur une partie d'une entité moléculaire dont on veut étudier l'environnement microscopique.
in scheme: Chimie
in scheme: concept-SD-chimie-biochimie
in scheme: concepts
notation: CHIM44
note: 1. Un exemple typique en est le radical « aminoxyle » (ou « nitroxyle »).
note: 2. Le spectre de résonance paramagnétique électronique de cette entité est alors caractéristique.

cellule galvanique
type: ConceptConcept
type: Concept
creator: Commission d'enrichissement de la langue française, FranceTerme
date parution JO: 2010-09-02
deconseille ou frequent: pile électrique
equivalent EN: galvanic battery @en
equivalent EN: galvanic battery (en)
equivalent EN: galvanic cell @en
equivalent EN: galvanic cell (en)
definition: Cellule électrochimique entre les électrodes de laquelle apparaît une tension électrique continue et qui, quand celles-ci sont reliées par un circuit conducteur extérieur, fournit un courant dû aux réactions d'oxydation ou de réduction se produisant aux électrodes.
in scheme: Chimie
in scheme: concept-SD-chimie-chimie-physique
in scheme: concepts
notation: CHIM440
note: 1. Du nom du physicien italien Luigi Galvani (1737-1798).
note: 2. On trouve aussi, dans le langage courant, le terme « pile électrique ».
note: 3. Un accumulateur en cours de décharge est une cellule galvanique.
related: cellule d'électrolyse
related: cellule électrochimique
related: courant faradique
related: courant galvanique

courant faradique
type: ConceptConcept
type: Concept
creator: Commission d'enrichissement de la langue française, FranceTerme
abbreviation: faradic current @en
date parution JO: 2010-09-02
equivalent EN: faradaic current @en
equivalent EN: faradaic current (en)
equivalent EN: faradic current @en
equivalent EN: faradic current (en)
definition: Fraction du courant électrique continu consommée par les réactions d'oxydation ou de réduction qui se produisent à l'électrode au cours d'une électrolyse.
in scheme: Chimie
in scheme: concept-SD-chimie-chimie-physique
in scheme: concepts
notation: CHIM441
note: Du nom du physicien anglais Michael Faraday (1791-1867).
related: cellule d'électrolyse
related: cellule galvanique
related: courant galvanique
related: voltampérométrie

courant galvanique
type: ConceptConcept
type: Concept
creator: Commission d'enrichissement de la langue française, FranceTerme
date parution JO: 2010-09-02
deconseille ou frequent: courant voltaïque
equivalent EN: galvanic current @en
equivalent EN: galvanic current (en)
definition: Courant électrique continu produit par les réactions d'oxydation ou de réduction ayant lieu dans une cellule galvanique lorsque les électrodes sont reliées par un circuit conducteur extérieur.
in scheme: Chimie
in scheme: concept-SD-chimie-chimie-physique
in scheme: concepts
notation: CHIM442
note: 1. Du nom du physicien italien Luigi Galvani (1737-1798).
note: 2. Le terme « courant galvanique » est préféré au terme « courant voltaïque », naguère en usage, pour éviter la confusion avec le terme « courant photovoltaïque ».
related: cellule galvanique
related: courant faradique

électrode de référence
type: ConceptConcept
type: Concept
creator: Commission d'enrichissement de la langue française, FranceTerme
date parution JO: 2010-09-02
equivalent EN: reference electrode @en
equivalent EN: reference electrode (en)
definition: Électrode dont le potentiel reste pratiquement constant dans les conditions d'une mesure électrochimique et qui sert de référence pour déterminer le potentiel d'une autre électrode.
in scheme: Chimie
in scheme: concept-SD-chimie-chimie-physique
in scheme: concepts
notation: CHIM443

entraîneur
type: ConceptConcept
type: Concept
creator: Commission d'enrichissement de la langue française, FranceTerme
date parution JO: 2010-09-02
deconseille ou frequent: entraîneur isotopique
equivalent EN: carrier @en
equivalent EN: carrier (en)
part of speech: nom masculin
definition: Substance qui permet d'extraire d'un mélange une espèce chimique, présente le plus souvent à l'état de traces, en assurant son transport au cours d'un processus physique ou chimique de séparation.
in scheme: Chimie
in scheme: concept-SD-chimie-chimie-analytique
in scheme: concepts
notation: CHIM444
note: Si l'entraîneur ne diffère de l'espèce considérée que par sa composition isotopique, on parle d'« entraîneur isotopique ».
related: espèce chimique

fluorimètre
type: ConceptConcept
type: Concept
creator: Commission d'enrichissement de la langue française, FranceTerme
date parution JO: 2010-09-02
equivalent EN: fluorimeter @en
equivalent EN: fluorimeter (en)
part of speech: nom masculin
definition: Appareil permettant de mesurer les propriétés de la lumière qu'émet une substance par fluorescence ou par phosphorescence.
in scheme: Chimie
in scheme: concept-SD-chimie-chimie-analytique
in scheme: concept-SD-chimie-chimie-physique
in scheme: concepts
notation: CHIM445

gaz vecteur
type: ConceptConcept
type: Concept
creator: Commission d'enrichissement de la langue française, FranceTerme
date parution JO: 2010-09-02
equivalent EN: carrier gas @en
equivalent EN: carrier gas (en)
alternative label: gaz porteur
definition: Gaz inerte introduit dans une colonne de chromatographie en phase gazeuse pour effectuer le transport physique des constituants d'un échantillon.
in scheme: Chimie
in scheme: concept-SD-chimie-chimie-analytique
in scheme: concepts
notation: CHIM446

isocratique
type: ConceptConcept
type: Concept
creator: Commission d'enrichissement de la langue française, FranceTerme
date parution JO: 2010-09-02
equivalent EN: isocratic @en
equivalent EN: isocratic (en)
part of speech: adjectif
definition: Se dit de l'élution au cours d'une séparation chromatographique en phase liquide, dans laquelle la composition du mélange des solvants constituant la phase éluante est gardée constante.
in scheme: Chimie
in scheme: concept-SD-chimie-chimie-analytique
in scheme: concepts
notation: CHIM447
note: Du grec isos, « égal », et kratos, « pouvoir ».

liaison hydrogène
type: ConceptConcept
type: Concept
creator: Commission d'enrichissement de la langue française, FranceTerme
date parution JO: 2010-09-02
equivalent EN: hydrogen bond @en
equivalent EN: hydrogen bond (en)
definition: Liaison de faible énergie mettant en jeu trois atomes, dont un atome d'hydrogène qui sert de pont entre les deux autres.
in scheme: Chimie
in scheme: concepts
notation: CHIM448
note: 1. L'espèce chimique, ou groupe, apportant l'atome d'hydrogène est appelée « donneur de liaisons hydrogène » et l'autre « accepteur de liaisons hydrogène ».
note: 2. L'énergie d'une liaison hydrogène est, sauf exception, au moins dix fois plus faible que celle d'une liaison covalente.
related: espèce chimique
related: liaison covalente
related: protogène
related: protophile

point isosbestique
type: ConceptConcept
type: Concept
creator: Commission d'enrichissement de la langue française, FranceTerme
date parution JO: 2010-09-02
deconseille ou frequent: isobestic point
deconseille ou frequent: point isobestique
equivalent EN: isosbestic point @en
equivalent EN: isosbestic point (en)
definition: Point d'intersection des spectres d'absorption de la lumière relatifs à des mélanges de plusieurs espèces chimiques dont les proportions sont différentes mais dont la somme des concentrations est constante.
in scheme: Chimie
in scheme: concept-SD-chimie-spectroscopie
in scheme: concepts
notation: CHIM449
note: Le mot « isosbestique » provient du grec isos, « égal », et sbèsis, « extinction ».
related: espèce chimique

métathèse
type: ConceptConcept
type: Concept
creator: Commission d'enrichissement de la langue française, FranceTerme
date parution JO: 2001-04-18
equivalent EN: metathesis @en
equivalent EN: metathesis (en)
part of speech: nom féminin
definition: Échange d'une ou de plusieurs liaisons ou groupes d'atomes entre espèces chimiques structuralement apparentées, conduisant sur le plan formel à des composés dans lesquels les liaisons des différents types sont en même nombre et de même nature, ou presque, que dans les réactifs.
in scheme: Chimie
in scheme: concepts
notation: CHIM45

polarographie
type: ConceptConcept
type: Concept
creator: Commission d'enrichissement de la langue française, FranceTerme
date parution JO: 2010-09-02
equivalent EN: polarography @en
equivalent EN: polarography (en)
part of speech: nom féminin
definition: Analyse voltampérométrique quantitative qui utilise une cellule d'électrolyse munie d'une électrode de mercure à gouttes tombantes et dans laquelle la solution n'est pas agitée.
in scheme: Chimie
in scheme: concept-SD-chimie-chimie-analytique
in scheme: concepts
notation: CHIM450
note: La polarographie permet par exemple le dosage de cations métalliques dissous.
related: cellule d'électrolyse
related: voltampérométrie

protogène
type: ConceptConcept
type: Concept
creator: Commission d'enrichissement de la langue française, FranceTerme
antonym: aprotique, adj.
date parution JO: 2010-09-02
equivalent EN: protic @en
equivalent EN: protic (en)
equivalent EN: protogenic @en
equivalent EN: protogenic (en)
part of speech: adjectif
alternative label: protique
definition: Se dit d'un solvant capable de donner des protons à une espèce chimique dissoute ; par extension, se dit d'un solvant donneur de liaisons hydrogène.
in scheme: Chimie
in scheme: concepts
notation: CHIM451
note: Le terme « protogène » est aussi utilisé quand il s'agit des analogues isotopiques du proton.
related: espèce chimique
related: hydron
related: amphiprotique
related: liaison hydrogène
related: protophile

protophile
type: ConceptConcept
type: Concept
creator: Commission d'enrichissement de la langue française, FranceTerme
date parution JO: 2010-09-02
equivalent EN: protophilic @en
equivalent EN: protophilic (en)
part of speech: adjectif
definition: Se dit d'un solvant capable d'accepter des protons d'une espèce chimique dissoute ; par extension, se dit d'un solvant accepteur de liaisons hydrogène.
in scheme: Chimie
in scheme: concepts
notation: CHIM452
note: Le terme « protophile » est aussi utilisé quand il s'agit des analogues isotopiques du proton.
related: espèce chimique
related: hydron
related: amphiprotique
related: liaison hydrogène
related: protogène

réaction isodesmique
type: ConceptConcept
type: Concept
creator: Commission d'enrichissement de la langue française, FranceTerme
date parution JO: 2010-09-02
equivalent EN: isodesmic reaction @en
equivalent EN: isodesmic reaction (en)
definition: Réaction quasi athermique dans laquelle les liaisons qui se forment dans les produits sont de même nombre, de même type et lient des atomes de même nature que les liaisons qui se brisent dans les réactifs.
in scheme: Chimie
in scheme: concepts
notation: CHIM453
note: Du grec isos, « égal », et desmos, « lien ».

voltampérométrie
type: ConceptConcept
type: Concept
creator: Commission d'enrichissement de la langue française, FranceTerme
date parution JO: 2010-09-02
equivalent EN: voltammetry @en
equivalent EN: voltammetry (en)
part of speech: nom féminin
definition: Mesure de l'intensité du courant faradique dans une cellule d'électrolyse, en fonction de la différence de potentiel électrique appliquée aux électrodes.
in scheme: Chimie
in scheme: concept-SD-chimie-chimie-physique
in scheme: concepts
notation: CHIM454
note: Le résultat de la mesure dépend du type d'électrode et de l'état d'agitation de la solution.
related: cellule d'électrolyse
related: courant faradique
related: polarographie

analogue chimique
type: ConceptConcept
type: Concept
creator: Commission d'enrichissement de la langue française, FranceTerme
date parution JO: 2012-07-18
equivalent EN: analogue @en
equivalent EN: analogue (en)
forme abregee: analogue, n.m.
definition: Espèce chimique qui ne diffère d'une autre espèce chimique que par le remplacement d'un atome ou d'un groupe d'atomes par un autre, et qui présente des propriétés physicochimiques et biologiques voisines.
in scheme: Chimie
in scheme: concept-SD-chimie-chimie-pharmaceutique
in scheme: concepts
notation: CHIM459
related: espèce chimique
related: bio-isostère
related: relation quantitative structure-activité

méthode par blocage de flux
type: ConceptConcept
type: Concept
creator: Commission d'enrichissement de la langue française, FranceTerme
date parution JO: 2001-04-18
equivalent EN: stopped-flow method @en
equivalent EN: stopped-flow method (en)
alternative label: méthode par blocage d'écoulement
alternative label: méthode par écoulement interrompu
definition: Méthode d'étude des réactions chimiques dans laquelle les réactifs sont très rapidement mélangés et le flux réactionnel brusquement bloqué après un très court intervalle de temps.
in scheme: Chimie
in scheme: concepts
notation: CHIM46

bio-isostère
type: ConceptConcept
type: Concept
creator: Commission d'enrichissement de la langue française, FranceTerme
abbreviation: bioisostere @en
date parution JO: 2012-07-18
equivalent EN: bio-isostere @en
equivalent EN: bio-isostere (en)
equivalent EN: bioisostere @en
equivalent EN: bioisostere (en)
part of speech: nom masculin
definition: Analogue d'une espèce chimique biologiquement active, dont la structure spatiale et le volume moléculaire sont proches de ceux de cette dernière et dont l'activité pharmacologique est voisine.
in scheme: Chimie
in scheme: concept-SD-chimie-chimie-pharmaceutique
in scheme: concepts
notation: CHIM460
note: La recherche de bio-isostères vise à améliorer l'activité pharmacologique des espèces chimiques ou à en réduire les effets toxiques.
related: analogue chimique

biotransformation
type: ConceptConcept
type: Concept
creator: Commission d'enrichissement de la langue française, FranceTerme
date parution JO: 2012-07-18
equivalent EN: biotransformation @en
equivalent EN: biotransformation (en)
part of speech: nom féminin
definition: Transformation in vivo ou in vitro d'une espèce chimique en une autre par des microorganismes ou des enzymes.
in scheme: Biologie
in scheme: Chimie
in scheme: concepts
notation: CHIM461
note: La biotransformation s'applique à la métabolisation in vivo des espèces chimiques. On l'utilise aussi dans certains procédés industriels de synthèse organique.
related: espèce chimique
related: précurseur de substance active
related: électrosynthèse microbienne
related: pile à combustible microbienne

chimie pharmaceutique
type: ConceptConcept
type: Concept
creator: Commission d'enrichissement de la langue française, FranceTerme
date parution JO: 2012-07-18
equivalent EN: pharmaceutical chemistry @en
equivalent EN: pharmaceutical chemistry (en)
broader: chimie thérapeutique
broader: concept-chimie
definition: Branch of chemistry aiming at defining and preparing chemical components- active substances and excipients- which are used in the composition of medicines. @en
definition: Branche de la chimie qui a pour objet la définition et la préparation de composés chimiques - substances actives et excipients - entrant dans la composition des médicaments.
in scheme: Chimie
in scheme: concept-SD-chimie-chimie-pharmaceutique
in scheme: concepts
notation: CHIM462
preferred label: pharmaceutical chemistry @en
related: chimie thérapeutique

chimie thérapeutique
type: ConceptConcept
type: Concept
creator: Commission d'enrichissement de la langue française, FranceTerme
date parution JO: 2012-07-18
equivalent EN: medicinal chemistry @en
equivalent EN: medicinal chemistry (en)
definition: Branche de la chimie qui a pour objet de concevoir des composés biologiquement actifs, d'étudier leur métabolisme et d'interpréter leur mode d'action à l'échelle moléculaire, en se fondant notamment sur des relations quantitatives structure-activité.
in scheme: Chimie
in scheme: concept-SD-chimie-chimie-pharmaceutique
in scheme: concepts
narrower: chimie pharmaceutique
notation: CHIM463
related: chimie pharmaceutique
related: relation quantitative structure-activité

ciblage pharmacologique
type: ConceptConcept
type: Concept
creator: Commission d'enrichissement de la langue française, FranceTerme
date parution JO: 2012-07-18
equivalent EN: drug targeting @en
equivalent EN: drug targeting (en)
definition: Conception et mise en œuvre de processus chimiques et physicochimiques permettant d'acheminer une substance active vers un organe cible.
in scheme: Chimie
in scheme: concept-SD-chimie-chimie-pharmaceutique
in scheme: concepts
notation: CHIM464
related: nanocapsule

criblage à haut débit
type: ConceptConcept
type: Concept
creator: Commission d'enrichissement de la langue française, FranceTerme
date parution JO: 2012-07-18
equivalent EN: high throughput screening @en
equivalent EN: high throughput screening (en)
definition: Opération consistant à faire réagir simultanément un grand nombre de molécules différentes avec un substrat donné, en vue d'identifier, en un minimum de temps, celles de ces molécules qui présentent un intérêt éventuel pour une application déterminée.
in scheme: Chimie
in scheme: concept-SD-chimie-chimie-pharmaceutique
in scheme: concepts
notation: CHIM465
note: 1. Le criblage à haut débit fait appel à différentes technologies telles que la robotique, l'automatique et la miniaturisation des équipements.
note: 2. La réussite d'un criblage s'évalue en nombre de touches.
related: synthèse combinatoire
related: touche

distomère
type: ConceptConcept
type: Concept
creator: Commission d'enrichissement de la langue française, FranceTerme
antonym: eutomère
date parution JO: 2012-07-18
equivalent EN: distomer @en
equivalent EN: distomer (en)
part of speech: nom masculin ou adjectif
definition: Celui des deux énantiomères d'un composé chiral pharmacologiquement actif qui n'a pas été retenu pour l'activité thérapeutique recherchée, parce que son action est moindre que celle de l'eutomère, contraire ou simplement différente.
in scheme: Chimie
in scheme: concept-SD-chimie-chimie-pharmaceutique
in scheme: concepts
notation: CHIM466
related: énantiomère
related: eutomère
related: chiral, -e

eutomère
type: ConceptConcept
type: Concept
creator: Commission d'enrichissement de la langue française, FranceTerme
antonym: distomère
date parution JO: 2012-07-18
equivalent EN: eutomer @en
equivalent EN: eutomer (en)
part of speech: nom masculin ou adjectif
definition: Celui des deux énantiomères d'un composé chiral pharmacologiquement actif qui est le plus apte à fournir l'activité thérapeutique recherchée.
in scheme: Chimie
in scheme: concept-SD-chimie-chimie-pharmaceutique
in scheme: concepts
notation: CHIM467
related: énantiomère
related: distomère
related: glissement chiral
related: chiral, -e

chimiothèque
type: ConceptConcept
type: Concept
creator: Commission d'enrichissement de la langue française, FranceTerme
abbreviation: library @en
date parution JO: 2012-07-18
equivalent EN: chemical library @en
equivalent EN: chemical library (en)
equivalent EN: library @en
equivalent EN: library (en)
part of speech: nom féminin
alternative label: échantillothèque chimique
definition: Collection d'échantillons de substances chimiques accompagnés d'une description de leurs caractéristiques.
in scheme: Chimie
in scheme: concept-SD-chimie-chimie-pharmaceutique
in scheme: concepts
notation: CHIM468

précurseur de substance active
type: ConceptConcept
type: Concept
creator: Commission d'enrichissement de la langue française, FranceTerme
date parution JO: 2012-07-18
deconseille ou frequent: prodrogue
deconseille ou frequent: promédicament
equivalent EN: prodrug @en
equivalent EN: prodrug (en)
definition: Substance qui, après avoir été introduite dans un organisme vivant, est transformée par voie métabolique en la substance active voulue.
in scheme: Chimie
in scheme: concept-SD-chimie-chimie-pharmaceutique
in scheme: concepts
notation: CHIM469
related: biotransformation

molécule hôte
type: ConceptConcept
type: Concept
creator: Commission d'enrichissement de la langue française, FranceTerme
date parution JO: 2001-04-18
equivalent EN: host molecule @en
equivalent EN: host molecule (en)
definition: Entité moléculaire dont la structure présente des cavités capables d'inclure des molécules avec lesquelles elle peut former des complexes.
in scheme: Chimie
in scheme: concepts
notation: CHIM47
related: complexe
related: composé d'inclusion
related: molécule incluse

relation quantitative structure-activité
type: ConceptConcept
type: Concept
creator: Commission d'enrichissement de la langue française, FranceTerme
abbreviation: QSAR @en
abbreviation: RQSA
date parution JO: 2012-07-18
equivalent EN: QSAR @en
equivalent EN: QSAR (en)
equivalent EN: quantitative structure-activity relationship @en
equivalent EN: quantitative structure-activity relationship (en)
definition: Relation empirique entre les valeurs prises par une grandeur caractérisant l'une des propriétés d'une série d'analogues chimiques et certains de leurs paramètres structuraux.
in scheme: Chimie
in scheme: concept-SD-chimie-chimie-pharmaceutique
in scheme: concepts
notation: CHIM470
note: En chimie thérapeutique, les relations quantitatives structure-activité sont couramment utilisées pour rechercher une activité optimale.
related: analogue chimique
related: chimie thérapeutique

xénobiotique
type: ConceptConcept
type: Concept
creator: Commission d'enrichissement de la langue française, FranceTerme
date parution JO: 2015-09-19
equivalent EN: xenobiotic @en
equivalent EN: xenobiotic (en)
definition: Se dit d’une substance étrangère à une espèce donnée ; se dit d’une substance étrangère à l’ensemble des organismes vivants.
in scheme: Biologie
in scheme: Chimie
in scheme: concepts
notation: CHIM471
note: Les pesticides et la plupart des médicaments sont des exemples de xénobiotiques.

cristallinité
type: ConceptConcept
type: Concept
creator: Commission d'enrichissement de la langue française, FranceTerme
date parution JO: 2010-09-02
equivalent EN: crystallinity @en
equivalent EN: crystallinity (en)
part of speech: nom féminin
definition: Qualité d'une substance dans laquelle tout ou partie des atomes, groupes d'atomes ou molécules qui la composent sont disposés dans l'espace de manière régulière et répétitive, comme c'est le cas dans un cristal.
in scheme: Chimie
in scheme: Matériaux
in scheme: concepts
notation: CHIM472
related: taux de cristallinité

taux de cristallinité
type: ConceptConcept
type: Concept
creator: Commission d'enrichissement de la langue française, FranceTerme
date parution JO: 2010-09-02
deconseille ou frequent: degré de cristallinité
equivalent EN: crystallinity @en
equivalent EN: crystallinity (en)
equivalent EN: degree of crystallinity @en
equivalent EN: degree of crystallinity (en)
definition: Proportion de matière cristalline présente dans un solide contenant à la fois des zones cristallines et des zones amorphes.
in scheme: Chimie
in scheme: Matériaux
in scheme: concepts
notation: CHIM473
note: 1. On évalue notamment le taux de cristallinité des polymères, dont les propriétés d'usage sont en général très dépendantes de cette caractéristique.
note: 2. L'expression « degré de cristallinité » est déconseillée.
related: cristallinité

denticité
type: ConceptConcept
type: Concept
creator: Commission d'enrichissement de la langue française, FranceTerme
date parution JO: 2010-09-02
equivalent EN: denticity @en
equivalent EN: denticity (en)
equivalent EN: ligand denticity @en
equivalent EN: ligand denticity (en)
part of speech: nom féminin
definition: Capacité d'un ligand à contracter, par l'intermédiaire d'atomes donneurs distincts, plusieurs liaisons avec l'atome central de l'entité de coordination ainsi formée.
in scheme: Chimie
in scheme: concept-SD-chimie-chimie-inorganique
in scheme: concepts
notation: CHIM474
note: La denticité d'un ligand est caractérisée par le nombre de ses sites de coordination.
related: hapticité
related: polydenté, -e
related: ligand

nombre d'états de spin
type: ConceptConcept
type: Concept
creator: Commission d'enrichissement de la langue française, FranceTerme
date parution JO: 2010-09-02
deconseille ou frequent: multiplicité de spin
equivalent EN: spin multiplicity @en
equivalent EN: spin multiplicity (en)
definition: Nombre d'orientations que peut prendre le spin d'une particule élémentaire ou composée, ou d'une entité moléculaire, par rapport à un axe de l'espace cartésien.
in scheme: Chimie
in scheme: Physique
in scheme: concepts
notation: CHIM475
note: 1. Selon le nombre d'états de spin, 1, 2, 3, etc., on parle d'état singulet, doublet, triplet, etc.
note: 2. Le nombre d'états de spin peut être rendu physiquement détectable par l'application d'un champ magnétique.
note: 3. On trouve aussi, dans le langage professionnel, l'expression « multiplicité de spin », qui est déconseillée.

spéciation
type: ConceptConcept
type: Concept
creator: Commission d'enrichissement de la langue française, FranceTerme
date parution JO: 2010-09-02
equivalent EN: speciation @en
equivalent EN: speciation (en)
part of speech: nom féminin
definition: Caractérisation des espèces chimiques sous la forme desquelles un élément se trouve présent dans une substance et plus généralement dans un environnement donné ; par extension, caractérisation du mode de fixation d'un élément ou d'une molécule sur des particules.
in scheme: Chimie
in scheme: concepts
notation: CHIM476
note: La spéciation d'un élément ou d'une molécule est indispensable pour évaluer son éventuelle toxicité.
related: espèce chimique

traitement par ultrasons
type: ConceptConcept
type: Concept
creator: Commission d'enrichissement de la langue française, FranceTerme
date parution JO: 2010-09-02
equivalent EN: sonication @en
equivalent EN: sonication (en)
definition: Application à un milieu liquide, qu'il soit homogène ou non, d'un rayonnement ultrasonique, afin de déclencher ou d'accélérer un processus donné.
in scheme: Chimie
in scheme: concepts
notation: CHIM477
note: 1. Le traitement par ultrasons permet notamment d'augmenter la vitesse de réactions chimiques, de préparer des émulsions ou de réduire la taille de particules solides en suspension.
note: 2. Le traitement par ultrasons est utilisé pour le nettoyage d'objets divers.

transition rotovibronique
type: ConceptConcept
type: Concept
creator: Commission d'enrichissement de la langue française, FranceTerme
date parution JO: 2010-09-02
deconseille ou frequent: transition rovibronique
equivalent EN: rovibronic transition @en
equivalent EN: rovibronic transition (en)
definition: Transition entre deux états énergétiques d'une entité moléculaire qui implique des changements des nombres quantiques électroniques ainsi que des nombres quantiques de vibration et de rotation.
in scheme: Chimie
in scheme: concepts
notation: CHIM478
note: On trouve aussi, dans le langage professionnel, le terme « transition rovibronique », qui est déconseillé.
related: entité moléculaire
related: transition vibronique

transition vibronique
type: ConceptConcept
type: Concept
creator: Commission d'enrichissement de la langue française, FranceTerme
date parution JO: 2010-09-02
equivalent EN: vibronic transition @en
equivalent EN: vibronic transition (en)
definition: Transition entre deux états énergétiques d'une entité moléculaire qui implique des changements à la fois des nombres quantiques électroniques et des nombres quantiques de vibration.
in scheme: Chimie
in scheme: concepts
notation: CHIM479
related: entité moléculaire
related: transition rotovibronique

molécule incluse
type: ConceptConcept
type: Concept
creator: Commission d'enrichissement de la langue française, FranceTerme
date parution JO: 2001-04-18
equivalent EN: guest molecule @en
equivalent EN: guest molecule (en)
definition: Molécule logée dans les cavités d'une autre molécule dite « molécule hôte ».
in scheme: Chimie
in scheme: concepts
notation: CHIM48
related: complexe
related: composé d'inclusion
related: molécule hôte

abusage
type: ConceptConcept
type: Concept
creator: Commission d'enrichissement de la langue française, FranceTerme
date parution JO: 2014-04-25
equivalent EN: scuffing @en
equivalent EN: scuffing (en)
part of speech: nom masculin
definition: Formation d’éraflures à la surface d’objets en verre, qui est due au frottement de ces objets entre eux ou se produit au contact des équipements de conditionnement ou de manutention.
in scheme: Matériaux
in scheme: concept-SD-materiaux-verre-et-ceramique
in scheme: concepts
notation: CHIM483

affinage
type: ConceptConcept
type: Concept
creator: Commission d'enrichissement de la langue française, FranceTerme
date parution JO: 2014-04-25
equivalent EN: fining @en
equivalent EN: fining (en)
equivalent EN: refining @en
equivalent EN: refining (en)
part of speech: nom masculin
definition: Phase de l’élaboration du verre pendant laquelle les bulles présentes dans le bain de verre sont éliminées à haute température.
in scheme: Matériaux
in scheme: concept-SD-materiaux-verre-et-ceramique
in scheme: concepts
notation: CHIM484
note: La température d’affinage est en général comprise entre 1 450 et 1 550 °C.
related: bain de verre
related: phase de braise

attrempage
type: ConceptConcept
type: Concept
creator: Commission d'enrichissement de la langue française, FranceTerme
date parution JO: 2014-04-25
equivalent EN: heat-up @en
equivalent EN: heat-up (en)
equivalent EN: heating-up @en
equivalent EN: heating-up (en)
equivalent EN: warming-up @en
equivalent EN: warming-up (en)
part of speech: nom masculin
definition: Chauffage progressif et contrôlé d’un four verrier lors de sa mise en service.
in scheme: Matériaux
in scheme: concept-SD-materiaux-verre-et-ceramique
in scheme: concepts
notation: CHIM485
note: À la différence de la trempe, l’attrempage permet d’éviter l’apparition, dans les matériaux réfractaires des parois du four, de contraintes internes dues à des variations trop rapides de la température.

bain de verre
type: ConceptConcept
type: Concept
creator: Commission d'enrichissement de la langue française, FranceTerme
date parution JO: 2014-04-25
equivalent EN: bath of glass @en
equivalent EN: bath of glass (en)
equivalent EN: molten glass @en
equivalent EN: molten glass (en)
definition: Verre à l’état fondu se trouvant dans le four verrier.
in scheme: Matériaux
in scheme: concept-SD-materiaux-verre-et-ceramique
in scheme: concepts
notation: CHIM486
related: affinage

phase de braise
type: ConceptConcept
type: Concept
creator: Commission d'enrichissement de la langue française, FranceTerme
date parution JO: 2014-04-25
equivalent EN: cooling-down period @en
equivalent EN: cooling-down period (en)
forme abregee: braise, n.f.
alternative label: conditionnement thermique
definition: Phase d’élaboration en continu du verre plat qui suit les phases de fusion et d’affinage et au cours de laquelle la température est abaissée et homogénéisée en vue d’ajuster la viscosité du verre aux contraintes de fabrication du produit final.
in scheme: Matériaux
in scheme: concept-SD-materiaux-verre-et-ceramique
in scheme: concepts
notation: CHIM487
note: Le terme « braise » trouve son origine dans les procédés d’élaboration en discontinu du verre artisanal et du cristal, qu’on laissait refroidir sur un lit de braises.
related: affinage

calcin
type: ConceptConcept
type: Concept
creator: Commission d'enrichissement de la langue française, FranceTerme
date parution JO: 2014-04-25
deconseille ou frequent: groisil
equivalent EN: cullet @en
equivalent EN: cullet (en)
part of speech: nom masculin
definition: Verre récupéré et recyclé, le plus souvent dans l’industrie verrière.
in scheme: Matériaux
in scheme: concept-SD-materiaux-verre-et-ceramique
in scheme: concepts
notation: CHIM488
note: 1. Dans l’industrie du verre, le terme « calcin » est préféré à « groisil ».
note: 2. Le terme « calcin » est aussi employé pour désigner le verre finement broyé utilisé dans la fabrication des émaux.

canal de distribution
type: ConceptConcept
type: Concept
creator: Commission d'enrichissement de la langue française, FranceTerme
date parution JO: 2014-04-25
equivalent EN: feeder @en
equivalent EN: feeder (en)
equivalent EN: feeder channel @en
equivalent EN: feeder channel (en)
definition: Partie aval d’un four verrier permettant l’alimentation en verre fondu d’une ou de plusieurs machines de mise en forme.
in scheme: Matériaux
in scheme: concept-SD-materiaux-verre-et-ceramique
in scheme: concepts
notation: CHIM489

monomère
type: ConceptConcept
type: Concept
creator: Commission d'enrichissement de la langue française, FranceTerme
date parution JO: 2001-04-18
equivalent EN: monomer @en
equivalent EN: monomer (en)
equivalent EN: monomeric @en
equivalent EN: monomeric (en)
part of speech: nom masculin
definition: Espèce chimique constituée d'entités moléculaires dont chacune peut conduire à une ou plusieurs unités constitutives d'un polymère.
in scheme: Chimie
in scheme: concept-SD-chimie-chimie-macromoleculaire
in scheme: concepts
notation: CHIM49
note: 1. Ce terme est également utilisé comme adjectif. Exemple : le chlorure de vinyle est une espèce monomère.
note: 2. Dans le domaine de la physicochimie, ce terme s'emploie également pour désigner les entités moléculaires participant à la formation d'agrégats.
related: copolymère à blocs
related: copolymère greffé
related: copolymère
related: dépolymérisation
related: homopolymère
related: oligomérisation
related: polymérisation en chaîne
related: unité monomère
related: macromolécule
related: oligomère
related: polymère
related: polymérisation

empilage
type: ConceptConcept
type: Concept
creator: Commission d'enrichissement de la langue française, FranceTerme
date parution JO: 2014-04-25
equivalent EN: brick checkers (US) @en
equivalent EN: brick checkers (en-US)
equivalent EN: brick chequers (GB) @en
equivalent EN: brick chequers (en-GB)
equivalent EN: checkers (US) @en
equivalent EN: checkers (en-US)
equivalent EN: chequers (GB) @en
equivalent EN: chequers (en-GB)
part of speech: nom masculin
definition: Assemblage, dans un four à régénération, d’éléments réfractaires disposés de façon à ménager des espaces permettant la circulation alternée du flux des fumées de combustion et du flux d’air froid qui est ainsi réchauffé.
in scheme: Matériaux
in scheme: concept-SD-materiaux-verre-et-ceramique
in scheme: concepts
notation: CHIM490
related: inversion
related: four à régénération

épreuve thermique du verre trempé
type: ConceptConcept
type: Concept
creator: Commission d'enrichissement de la langue française, FranceTerme
abbreviation: ETVT
abbreviation: HST @en
date parution JO: 2014-04-25
equivalent EN: HST @en
equivalent EN: HST (en)
equivalent EN: heat soak test @en
equivalent EN: heat soak test (en)
definition: Test effectué avant commercialisation, qui consiste à chauffer, dans des conditions contrôlées, des vitrages en verre trempé pour provoquer la casse de ceux qui présentent des défauts non décelables par d’autres méthodes.
in scheme: Matériaux
in scheme: concept-SD-materiaux-verre-et-ceramique
in scheme: concepts
notation: CHIM491
note: L’épreuve thermique du verre trempé vise à prévenir la casse spontanée des vitrages après leur commercialisation.

four journalier
type: ConceptConcept
type: Concept
creator: Commission d'enrichissement de la langue française, FranceTerme
date parution JO: 2014-04-25
equivalent EN: day tank @en
equivalent EN: day tank (en)
definition: Four verrier à cuve dans lequel l’élaboration du verre a lieu de manière discontinue selon un processus d’une durée de vingt-quatre heures.
in scheme: Matériaux
in scheme: concept-SD-materiaux-verre-et-ceramique
in scheme: concepts
notation: CHIM492
note: Le four journalier est destiné à la fabrication artisanale d’objets en verre.

four à régénération
type: ConceptConcept
type: Concept
creator: Commission d'enrichissement de la langue française, FranceTerme
date parution JO: 2014-04-25
equivalent EN: regenerative glass furnace @en
equivalent EN: regenerative glass furnace (en)
definition: Four verrier chauffé par un combustible hydrocarboné et comportant un système d’échange de chaleur constitué d’empilages.
in scheme: Matériaux
in scheme: concept-SD-materiaux-verre-et-ceramique
in scheme: concepts
notation: CHIM493
related: empilage
related: inversion

inversion
type: ConceptConcept
type: Concept
creator: Commission d'enrichissement de la langue française, FranceTerme
date parution JO: 2014-04-25
equivalent EN: Wechsel @de
equivalent EN: Wechsel (de)
equivalent EN: change-over (GB) @en
equivalent EN: change-over (en-GB)
equivalent EN: reversal (GB) @en
equivalent EN: reversal (en-GB)
part of speech: nom féminin
definition: Permutation du flux des fumées de combustion et du flux d’air froid dans les empilages d’un four à régénération.
in scheme: Matériaux
in scheme: concept-SD-materiaux-verre-et-ceramique
in scheme: concepts
notation: CHIM494
related: empilage
related: four à régénération

paraison
type: ConceptConcept
type: Concept
creator: Commission d'enrichissement de la langue française, FranceTerme
date parution JO: 2014-04-25
equivalent EN: gob @en
equivalent EN: gob (en)
equivalent EN: parison @en
equivalent EN: parison (en)
part of speech: nom féminin
definition: Masse calibrée de verre fondu destinée à être mise en forme.
in scheme: Matériaux
in scheme: concept-SD-materiaux-verre-et-ceramique
in scheme: concepts
notation: CHIM495

procédé sol-gel
type: ConceptConcept
type: Concept
creator: Commission d'enrichissement de la langue française, FranceTerme
date parution JO: 2014-04-25
equivalent EN: sol-gel process @en
equivalent EN: sol-gel process (en)
definition: Procédé de synthèse de matériaux verriers ou céramiques consistant à réaliser, sous la pression atmosphérique et à une température proche de la température ambiante, la polymérisation de précurseurs en solution, puis à effectuer un traitement thermique pour obtenir un produit solide.
in scheme: Matériaux
in scheme: concept-SD-materiaux-verre-et-ceramique
in scheme: concepts
notation: CHIM496
note: 1. Le nom de ce procédé vient du fait que la polymérisation produit successivement un sol, un gel et un solide vitreux.
note: 2. Le procédé sol-gel s’inspire du processus naturel par lequel certains organismes vivants élaborent des concrétions siliceuses.

surcombustion réductrice
type: ConceptConcept
type: Concept
creator: Commission d'enrichissement de la langue française, FranceTerme
date parution JO: 2014-04-25
deconseille ou frequent: recombustion
equivalent EN: reburning @en
equivalent EN: reburning (en)
definition: Procédé consistant à ajouter, dans les gaz brûlés résultant de la combustion à haute température d’un combustible fossile, une petite quantité de combustible, afin de provoquer la réduction en azote des oxydes d’azote présents dans ces gaz.
in scheme: Chimie
in scheme: Matériaux
in scheme: concepts
notation: CHIM497
note: On trouve aussi le terme « recombustion », qui est déconseillé.

verre à faible émissivité
type: ConceptConcept
type: Concept
creator: Commission d'enrichissement de la langue française, FranceTerme
date parution JO: 2014-04-25
deconseille ou frequent: verre de faible émissivité
deconseille ou frequent: verre low-e
equivalent EN: low emissivity glass @en
equivalent EN: low emissivity glass (en)
equivalent EN: low-E glass @en
equivalent EN: low-E glass (en)
definition: Verre ayant reçu un traitement de surface abaissant son émissivité, ce qui réduit les échanges thermiques par rayonnement.
in scheme: Matériaux
in scheme: concept-SD-materiaux-verre-et-ceramique
in scheme: concepts
notation: CHIM498
note: Les verres à faible émissivité sont utilisés principalement pour la fabrication de vitrages isolants.

verre expansé
type: ConceptConcept
type: Concept
creator: Commission d'enrichissement de la langue française, FranceTerme
date parution JO: 2014-04-25
deconseille ou frequent: verre cellulaire
deconseille ou frequent: verre mousse
deconseille ou frequent: verre multicellulaire
equivalent EN: expanded glass @en
equivalent EN: expanded glass (en)
definition: Matériau verrier de faible densité, dont la structure comporte de nombreuses bulles de gaz.
in scheme: Matériaux
in scheme: concept-SD-materiaux-verre-et-ceramique
in scheme: concepts
notation: CHIM499
note: 1. Le verre expansé est utilisé principalement comme isolant thermique ininflammable.
note: 2. On trouve aussi les expressions « verre mousse », « verre cellulaire », « verre multicellulaire ».

autocondensation
type: ConceptConcept
type: Concept
creator: Commission d'enrichissement de la langue française, FranceTerme
date parution JO: 2001-04-18
equivalent EN: self-condensation @en
equivalent EN: self-condensation (en)
part of speech: nom féminin
definition: Condensation d'un composé sur lui-même.
in scheme: Chimie
in scheme: concepts
notation: CHIM5
note: Par exemple, la condensation aldolique de l'acétaldéhyde est une autocondensation dans laquelle deux molécules de la même substance sont impliquées.
related: condensation
related: condensation croisée

nom fondamental
type: ConceptConcept
type: Concept
creator: Commission d'enrichissement de la langue française, FranceTerme
date parution JO: 2001-04-18
deconseille ou frequent: nom parent
equivalent EN: parent name @en
equivalent EN: parent name (en)
definition: Nom de la structure fondamentale à partir duquel le nom du composé est dérivé.
in scheme: Chimie
in scheme: concept-SD-chimie-nomenclature
in scheme: concepts
notation: CHIM50
note: « Nom fondamental » est l'expression traditionnellement utilisée. Le calque de l'anglais « nom parent » ne doit pas être utilisé.
related: nom semi-systématique
related: nom systématique
related: nom trivial
related: structure fondamentale

verre flotté
type: ConceptConcept
type: Concept
creator: Commission d'enrichissement de la langue française, FranceTerme
date parution JO: 2014-04-25
equivalent EN: float glass @en
equivalent EN: float glass (en)
broader: concept-materiaux
definition: Verre plat obtenu en continu par étalement et refroidissement d’une couche de verre fondu sur la surface d’un bain de métal liquide.
in scheme: Matériaux
in scheme: concept-SD-materiaux-verre-et-ceramique
in scheme: concepts
notation: CHIM500

vitrocéramique
type: ConceptConcept
type: Concept
creator: Commission d'enrichissement de la langue française, FranceTerme
date parution JO: 2014-04-25
equivalent EN: vitroceramic @en
equivalent EN: vitroceramic (en)
equivalent EN: vitroceramics @en
equivalent EN: vitroceramics (en)
part of speech: nom féminin
broader: concept-materiaux
definition: Matériau élaboré par des techniques verrières, constitué d’une phase vitreuse et de microcristaux dont la composition, le nombre, la taille, la répartition et l’orientation sont maîtrisés grâce à un traitement thermique approprié.
in scheme: Matériaux
in scheme: concept-SD-materiaux-verre-et-ceramique
in scheme: concepts
notation: CHIM501
note: 1.Les vitrocéramiques les plus utilisées possèdent un coefficient de dilatation thermique faible qui leur confère une grande résistance aux chocs thermiques.
note: 2. Le terme « vitrocéramique » est également utilisé comme adjectif.

diathermane
type: ConceptConcept
type: Concept
creator: Commission d'enrichissement de la langue française, FranceTerme
antonym: athermane
date parution JO: 2015-09-19
equivalent EN: diathermanous @en
equivalent EN: diathermanous (en)
equivalent EN: diathermic @en
equivalent EN: diathermic (en)
part of speech: adjectif
definition: Se dit d’un matériau, ou de la frontière d’un système thermodynamique, perméable à la chaleur si celle-ci est transmise par rayonnement.
in scheme: Chimie
in scheme: Matériaux
in scheme: concept-SD-chimie-thermodynamique
in scheme: concept-SD-materiaux-thermodynamique
in scheme: concepts
notation: CHIM502
related: diatherme

diatherme
type: ConceptConcept
type: Concept
creator: Commission d'enrichissement de la langue française, FranceTerme
antonym: adiabatique
date parution JO: 2015-09-19
equivalent EN: diathermal @en
equivalent EN: diathermal (en)
equivalent EN: diathermanous @en
equivalent EN: diathermanous (en)
equivalent EN: diathermic @en
equivalent EN: diathermic (en)
part of speech: adjectif
definition: Se dit d’un matériau, ou de la frontière d’un système thermodynamique, perméable à la chaleur quel que soit son mode de transmission.
in scheme: Chimie
in scheme: Matériaux
in scheme: concept-SD-chimie-thermodynamique
in scheme: concept-SD-materiaux-thermodynamique
in scheme: concepts
notation: CHIM503
related: diathermane

adiabatique
type: ConceptConcept
type: Concept
creator: Commission d'enrichissement de la langue française, FranceTerme
antonym: diatherme
date parution JO: 2015-09-19
equivalent EN: adiabatic @en
equivalent EN: adiabatic (en)
equivalent EN: athermal @en
equivalent EN: athermal (en)
part of speech: adjectif
alternative label: atherme
definition: Se dit d’un matériau, ou de la frontière d’un système thermodynamique, imperméable à la chaleur quel que soit son mode de transmission.
in scheme: Chimie
in scheme: Matériaux
in scheme: concept-SD-chimie-thermodynamique
in scheme: concept-SD-materiaux-thermodynamique
in scheme: concepts
notation: CHIM504
related: athermane
related: adiabatique

athermane
type: ConceptConcept
type: Concept
creator: Commission d'enrichissement de la langue française, FranceTerme
antonym: diathermane
date parution JO: 2015-09-19
equivalent EN: athermanous @en
equivalent EN: athermanous (en)
equivalent EN: athermic @en
equivalent EN: athermic (en)
part of speech: adjectif
definition: Se dit d’un matériau, ou de la frontière d’un système thermodynamique, imperméable à la chaleur si celle-ci est transmise par rayonnement.
in scheme: Chimie
in scheme: Matériaux
in scheme: concept-SD-chimie-thermodynamique
in scheme: concept-SD-materiaux-thermodynamique
in scheme: concepts
notation: CHIM505
related: adiabatique
related: athermique
scope note: Cette publication annule et remplace celle du Journal officiel du 22 septembre 2000.

athermique
type: ConceptConcept
type: Concept
creator: Commission d'enrichissement de la langue française, FranceTerme
date parution JO: 2015-09-19
equivalent EN: athermal @en
equivalent EN: athermal (en)
part of speech: adjectif
definition: Se dit d’une transformation de la matière sans production ni consommation de chaleur.
in scheme: Chimie
in scheme: Matériaux
in scheme: concept-SD-chimie-thermodynamique
in scheme: concept-SD-materiaux-thermodynamique
in scheme: concepts
notation: CHIM506
related: athermane
related: adiabatique

transformation monotherme
type: ConceptConcept
type: Concept
creator: Commission d'enrichissement de la langue française, FranceTerme
date parution JO: 2015-09-19
equivalent EN: monothermal change @en
equivalent EN: monothermal change (en)
equivalent EN: monothermal transformation @en
equivalent EN: monothermal transformation (en)
definition: Changement de l’état thermodynamique d’un système au cours duquel celui-ci n’échange de la chaleur qu’avec une seule source, la température du système étant la même au début et à la fin de la transformation.
in scheme: Chimie
in scheme: Physique
in scheme: concept-SD-chimie-thermodynamique
in scheme: concept-SD-physique-thermodynamique
in scheme: concepts
notation: CHIM507
note: Lors d’une transformation monotherme, la température du système peut varier au cours de l’opération ; en général, ce processus n’est donc pas isotherme.
related: transformation isotherme

transformation isotherme
type: ConceptConcept
type: Concept
creator: Commission d'enrichissement de la langue française, FranceTerme
date parution JO: 2015-09-19
equivalent EN: isothermal change @en
equivalent EN: isothermal change (en)
equivalent EN: isothermal transformation @en
equivalent EN: isothermal transformation (en)
definition: Changement de l’état thermodynamique d’un système dont la température reste constante tout au long du processus.
in scheme: Chimie
in scheme: Physique
in scheme: concept-SD-chimie-thermodynamique
in scheme: concept-SD-physique-thermodynamique
in scheme: concepts
notation: CHIM508
related: transformation monotherme

dégoulottage
type: ConceptConcept
type: Concept
creator: Commission d'enrichissement de la langue française, FranceTerme
date parution JO: 2015-09-19
equivalent EN: debottlenecking @en
equivalent EN: debottlenecking (en)
part of speech: nom masculin
definition: Suppression d’un goulot d’étranglement dans la chaîne des opérations d’une installation industrielle afin d’en augmenter la capacité de production.
in scheme: Économie générale
in scheme: Industrie
in scheme: concepts
notation: CHIM509

nom semi-systématique
type: ConceptConcept
type: Concept
creator: Commission d'enrichissement de la langue française, FranceTerme
date parution JO: 2001-04-18
deconseille ou frequent: calciférol
deconseille ou frequent: méthane
deconseille ou frequent: nom semi-trivial
equivalent EN: semi-systematic name @en
equivalent EN: semi-systematic name (en)
equivalent EN: semi-trivial name @en
equivalent EN: semi-trivial name (en)
definition: Nom d'un composé dont une partie seulement a une signification structurale.
in scheme: Chimie
in scheme: concept-SD-chimie-nomenclature
in scheme: concepts
notation: CHIM51
note: 1. Exemples de noms semi-systématiques : méthane, calciférol.
note: 2. L'emploi de l'expression « nom semi-trivial » est déconseillé.
related: nom fondamental
related: nom systématique
related: nom trivial
related: structure fondamentale

intensification des procédés
type: ConceptConcept
type: Concept
creator: Commission d'enrichissement de la langue française, FranceTerme
abbreviation: PI @en
date parution JO: 2015-09-19
equivalent EN: PI @en
equivalent EN: PI (en)
equivalent EN: process intensification @en
equivalent EN: process intensification (en)
alternative label: optimisation des procédés
definition: Mise en œuvre, dans les procédés industriels, de nouvelles technologies visant à économiser les ressources ou à minimiser les impacts environnementaux, tout en maintenant, voire en améliorant, le rendement et la qualité de la production.
in scheme: Économie générale
in scheme: Industrie
in scheme: concepts
notation: CHIM510

modernisation
type: ConceptConcept
type: Concept
creator: Commission d'enrichissement de la langue française, FranceTerme
date parution JO: 2015-09-19
equivalent EN: revamping @en
equivalent EN: revamping (en)
part of speech: nom féminin
definition: Remplacement d’éléments d’une installation industrielle par des éléments plus modernes, qui vise à améliorer les performances de cette installation sans en modifier la conception de base.
in scheme: Économie générale
in scheme: Industrie
in scheme: concepts
notation: CHIM511
related: rénovation
scope note: Cette publication annule et remplace celle du Journal officiel du 12 janvier 1999.

adiabatique
type: ConceptConcept
type: Concept
creator: Commission d'enrichissement de la langue française, FranceTerme
date parution JO: 2015-09-19
equivalent EN: adiabatic @en
equivalent EN: adiabatic (en)
part of speech: adjectif
definition: Se dit de la transformation d’un système thermodynamique s’effectuant sans échange de chaleur avec le milieu extérieur.
in scheme: Chimie
in scheme: Matériaux
in scheme: concept-SD-chimie-thermodynamique
in scheme: concept-SD-materiaux-thermodynamique
in scheme: concepts
notation: CHIM512
related: adiabatique
related: athermique

laveur
type: ConceptConcept
type: Concept
creator: Commission d'enrichissement de la langue française, FranceTerme
abbreviation: wet scrubber @en
date parution JO: 2015-09-19
equivalent EN: gas scrubber @en
equivalent EN: gas scrubber (en)
equivalent EN: wet scrubber @en
equivalent EN: wet scrubber (en)
part of speech: nom masculin
definition: Colonne dans laquelle un gaz est débarrassé de ses impuretés par un liquide circulant à contre-courant.
in scheme: Chimie
in scheme: concept-SD-chimie-genie-chimique
in scheme: concepts
notation: CHIM513

adsorption à pression modulée
type: ConceptConcept
type: Concept
creator: Commission d'enrichissement de la langue française, FranceTerme
abbreviation: APM
abbreviation: PSA @en
date parution JO: 2015-09-19
deconseille ou frequent: adsorption modulée en pression
equivalent EN: PSA @en
equivalent EN: PSA (en)
equivalent EN: pressure swing adsorption @en
equivalent EN: pressure swing adsorption (en)
definition: Processus cyclique au cours duquel ont lieu alternativement l’adsorption d’un gaz par un solide ou un liquide à une pression donnée, puis sa désorption à une pression plus faible.
in scheme: Chimie
in scheme: concept-SD-chimie-genie-chimique
in scheme: concepts
notation: CHIM514
note: On trouve aussi, dans le langage professionnel, l'expression « adsorption modulée en pression », qui est déconseillée.
related: adsorption à température modulée

adsorption à température modulée
type: ConceptConcept
type: Concept
creator: Commission d'enrichissement de la langue française, FranceTerme
abbreviation: ATM
abbreviation: TSA @en
date parution JO: 2015-09-19
deconseille ou frequent: adsorption modulée en température
equivalent EN: TSA @en
equivalent EN: TSA (en)
equivalent EN: temperature swing adsorption @en
equivalent EN: temperature swing adsorption (en)
definition: Processus cyclique au cours duquel ont lieu alternativement l’adsorption d’un gaz par un solide ou un liquide à une température donnée, puis sa désorption à une température plus élevée.
in scheme: Chimie
in scheme: concept-SD-chimie-genie-chimique
in scheme: concepts
notation: CHIM515
note: On trouve aussi, dans le langage professionnel, l'expression « adsorption modulée en température », qui est déconseillée.
related: adsorption à pression modulée

sorption
type: ConceptConcept
type: Concept
creator: Commission d'enrichissement de la langue française, FranceTerme
antonym: désorption, n.f.
date parution JO: 2015-09-19
equivalent EN: sorption @en
equivalent EN: sorption (en)
part of speech: nom féminin
definition: Phénomène physicochimique au cours duquel une espèce chimique se concentre à la surface d’un solide ou d’un liquide, ou pénètre dans celui-ci.
in scheme: Chimie
in scheme: Matériaux
in scheme: concept-SD-chimie-chimie-physique
in scheme: concept-SD-materiaux-chimie-physique
in scheme: concepts
notation: CHIM516
note: La sorption comprend l’absorption et l’adsorption.
related: adsorption physique
related: adsorption chimique
related: stockage de l'hydrogène dans un solide

adsorption physique
type: ConceptConcept
type: Concept
creator: Commission d'enrichissement de la langue française, FranceTerme
date parution JO: 2015-09-19
equivalent EN: physical adsorption @en
equivalent EN: physical adsorption (en)
equivalent EN: physisorption @en
equivalent EN: physisorption (en)
definition: Adsorption faisant intervenir exclusivement des forces intermoléculaires entre les espèces chimiques adsorbées et l’adsorbant, sans formation de liaisons chimiques covalentes, ioniques ou métalliques.
in scheme: Chimie
in scheme: Matériaux
in scheme: concept-SD-chimie-chimie-physique
in scheme: concept-SD-materiaux-chimie-physique
in scheme: concepts
notation: CHIM517
note: On trouve aussi, dans le langage professionnel, le terme « physisorption », qui est déconseillé.
related: sorption
related: adsorption chimique

adsorption chimique
type: ConceptConcept
type: Concept
creator: Commission d'enrichissement de la langue française, FranceTerme
date parution JO: 2015-09-19
deconseille ou frequent: chimisorption
equivalent EN: chemical adsorption @en
equivalent EN: chemical adsorption (en)
equivalent EN: chemisorption @en
equivalent EN: chemisorption (en)
definition: Adsorption faisant intervenir des liaisons chimiques covalentes, ioniques ou métalliques entre les espèces chimiques adsorbées et l’adsorbant.
in scheme: Chimie
in scheme: Matériaux
in scheme: concept-SD-chimie-chimie-physique
in scheme: concept-SD-materiaux-chimie-physique
in scheme: concepts
notation: CHIM518
note: On trouve aussi, dans le langage professionnel, le terme « chimisorption », qui est déconseillé.
related: sorption
related: adsorption physique

nom systématique
type: ConceptConcept
type: Concept
creator: Commission d'enrichissement de la langue française, FranceTerme
date parution JO: 2001-04-18
equivalent EN: systematic name @en
equivalent EN: systematic name (en)
definition: Nom d'un composé dont les différentes parties ont une signification structurale précise.
in scheme: Chimie
in scheme: concept-SD-chimie-nomenclature
in scheme: concepts
notation: CHIM52
note: Le nom systématique peut comporter ou non des préfixes ou des infixes numériques. Exemples de noms systématiques : pentane, 1,3-thiazole.
related: nom fondamental
related: nom semi-systématique
related: nom trivial
related: structure fondamentale

pégosité
type: ConceptConcept
type: Concept
creator: Commission d'enrichissement de la langue française, FranceTerme
date parution JO: 2015-09-19
equivalent EN: tack @en
equivalent EN: tack (en)
equivalent EN: tackiness @en
equivalent EN: tackiness (en)
part of speech: nom féminin
definition: Capacité d’un matériau à adhérer à un support par simple contact.
in scheme: Chimie
in scheme: Matériaux
in scheme: concepts
notation: CHIM524

énergie d'extraction d'un électron
type: ConceptConcept
type: Concept
creator: Commission d'enrichissement de la langue française, FranceTerme
date parution JO: 2015-09-19
deconseille ou frequent: fonction de travail
deconseille ou frequent: travail d'extraction d'un électron
deconseille ou frequent: travail de sortie d'un électron
equivalent EN: electron work function @en
equivalent EN: electron work function (en)
equivalent EN: work function @en
equivalent EN: work function (en)
definition: Énergie minimale qu’il est nécessaire de fournir à un solide pour en extraire un électron.
in scheme: Chimie
in scheme: Physique
in scheme: concepts
notation: CHIM525
note: 1. L’énergie est généralement apportée par le bombardement de la surface du solide par des particules, telles que des électrons ou des photons.
note: 2. On trouve aussi, dans le langage professionnel, les expressions « travail de sortie d’un électron », « travail d’extraction d’un électron » et « fonction de travail », qui sont déconseillées.

tension de cellule
type: ConceptConcept
type: Concept
creator: Commission d'enrichissement de la langue française, FranceTerme
date parution JO: 2015-09-19
deconseille ou frequent: force électromotrice
deconseille ou frequent: potentiel de cellule
equivalent EN: cell potential @en
equivalent EN: cell potential (en)
equivalent EN: cell voltage @en
equivalent EN: cell voltage (en)
equivalent EN: potential difference of an electrochemical cell @en
equivalent EN: potential difference of an electrochemical cell (en)
forme abregee: ddp de cellule
alternative label: différence de potentiel électrique de cellule
definition: Différence de potentiel électrique existant entre les deux électrodes d’une cellule électrochimique quand le circuit est ouvert.
in scheme: Chimie
in scheme: concept-SD-chimie-chimie-physique
in scheme: concepts
notation: CHIM526
note: On trouve aussi les expressions « force électromotrice » et « potentiel de cellule », qui sont déconseillées.
related: cellule électrochimique

rendement quantique
type: ConceptConcept
type: Concept
creator: Commission d'enrichissement de la langue française, FranceTerme
date parution JO: 2015-09-19
deconseille ou frequent: quantum d’énergie
equivalent EN: quantum efficiency @en
equivalent EN: quantum efficiency (en)
equivalent EN: quantum yield @en
equivalent EN: quantum yield (en)
definition: Rapport entre le nombre effectif de photons émis, absorbés ou utilisés au cours d'un processus photophysique ou photochimique et le nombre théorique associé à ce processus.
in scheme: Chimie
in scheme: Physique
in scheme: concepts
notation: CHIM528
note: On parle, par exemple, du « rendement quantique » d'une réaction de fluorescence.

rendement faradique
type: ConceptConcept
type: Concept
creator: Commission d'enrichissement de la langue française, FranceTerme
date parution JO: 2015-09-19
equivalent EN: coulombic yield @en
equivalent EN: coulombic yield (en)
equivalent EN: faradic yield @en
equivalent EN: faradic yield (en)
definition: Rapport entre la quantité d’électricité effectivement produite, absorbée ou utilisée au cours d’un processus électrochimique et la quantité théorique associée à ce processus.
in scheme: Chimie
in scheme: concept-SD-chimie-chimie-physique
in scheme: concepts
notation: CHIM529
note: On parle, par exemple, du « rendement faradique » d’un accumulateur d’électricité, d’une cellule galvanique ou d’une cellule d’électrolyse.

nom trivial
type: ConceptConcept
type: Concept
creator: Commission d'enrichissement de la langue française, FranceTerme
date parution JO: 2001-04-18
equivalent EN: trivial name @en
equivalent EN: trivial name (en)
definition: Nom d'un composé dont aucune partie n'a de signification structurale.
in scheme: Chimie
in scheme: concept-SD-chimie-nomenclature
in scheme: concepts
notation: CHIM53
note: Dans ce domaine, le qualificatif « trivial » est traditionnellement utilisé dans son acception ancienne de familier ou banal, par opposition au terme « systématique ».
related: nom fondamental
related: nom semi-systématique
related: nom systématique
related: chromine
related: structure fondamentale

rénovation
type: ConceptConcept
type: Concept
creator: Commission d'enrichissement de la langue française, FranceTerme
date parution JO: 2015-09-19
deconseille ou frequent: rétrofit
deconseille ou frequent: rétrofitting
equivalent EN: retrofit @en
equivalent EN: retrofit (en)
equivalent EN: retrofitting @en
equivalent EN: retrofitting (en)
part of speech: nom féminin
definition: Remplacement de pièces ou d’éléments, usagés ou non, dans une machine ou un équipement industriel, qui vise à en améliorer les performances.
in scheme: Économie générale
in scheme: Industrie
in scheme: concepts
notation: CHIM531
related: modernisation

mécanosynthèse
type: ConceptConcept
type: Concept
creator: Commission d'enrichissement de la langue française, FranceTerme
date parution JO: 2016-05-07
equivalent EN: mechanical alloying @en
equivalent EN: mechanical alloying (en)
part of speech: nom féminin
definition: Procédé consistant à broyer ensemble des métaux différents jusqu’à la formation d’un alliage qui n’est pas dans un état d’équilibre thermodynamique.
in scheme: Matériaux
in scheme: concept-SD-materiaux-metallurgie
in scheme: concepts
notation: CHIM532
note: La mécanosynthèse s’applique également aux céramiques.
related: broyage nanométrique

décomposition spinodale
type: ConceptConcept
type: Concept
creator: Commission d'enrichissement de la langue française, FranceTerme
date parution JO: 2016-05-07
equivalent EN: spinodal decomposition @en
equivalent EN: spinodal decomposition (en)
definition: Transformation spontanée sans germination, par fluctuation de composition, d’une phase solide ou liquide en un mélange de deux phases de composition différente.
in scheme: Matériaux
in scheme: concepts
notation: CHIM533
note: Dans le cas d’un solide cristallin, les deux phases présentent la même structure cristallographique que la phase initiale.
related: courbe spinodale

courbe spinodale
type: ConceptConcept
type: Concept
creator: Commission d'enrichissement de la langue française, FranceTerme
date parution JO: 2016-05-07
equivalent EN: spinodal curve @en
equivalent EN: spinodal curve (en)
definition: Courbe délimitant, dans un diagramme de phases, le domaine de composition et de température dans lequel peut se produire une décomposition spinodale.
in scheme: Matériaux
in scheme: concepts
notation: CHIM534
related: décomposition spinodale

joint de grains
type: ConceptConcept
type: Concept
creator: Commission d'enrichissement de la langue française, FranceTerme
date parution JO: 2016-05-07
equivalent EN: grain boundary @en
equivalent EN: grain boundary (en)
definition: Interface, dans un solide cristallin, entre deux cristaux de même structure cristallographique et de même composition, mais d’orientation différente.
in scheme: Matériaux
in scheme: concepts
notation: CHIM535
related: polycristal
related: jonction triple

macle
type: ConceptConcept
type: Concept
creator: Commission d'enrichissement de la langue française, FranceTerme
equivalent EN: twin @en
equivalent EN: twin (en)
part of speech: nom féminin
definition: Zone d’un cristal dont l’orientation cristalline se déduit de celle des zones voisines, d’orientation différente, par une opération de symétrie.
in scheme: Matériaux
in scheme: concepts
notation: CHIM536

broyage nanométrique
type: ConceptConcept
type: Concept
creator: Commission d'enrichissement de la langue française, FranceTerme
date parution JO: 2016-05-07
equivalent EN: high-energy milling @en
equivalent EN: high-energy milling (en)
definition: Procédé consistant à broyer un matériau cristallin jusqu’à obtenir des grains nanométriques.
in scheme: Matériaux
in scheme: concepts
notation: CHIM537
related: mécanosynthèse

solution solide
type: ConceptConcept
type: Concept
creator: Commission d'enrichissement de la langue française, FranceTerme
date parution JO: 2016-05-07
equivalent EN: solid solution @en
equivalent EN: solid solution (en)
definition: Phase cristalline incluant, dans un réseau cristallin de solvant, un ou plusieurs solutés dans des proportions variables.
in scheme: Matériaux
in scheme: concepts
notation: CHIM538

solution solide de substitution
type: ConceptConcept
type: Concept
creator: Commission d'enrichissement de la langue française, FranceTerme
date parution JO: 2016-05-07
equivalent EN: substitution solid solution @en
equivalent EN: substitution solid solution (en)
equivalent EN: substitutional solid solution @en
equivalent EN: substitutional solid solution (en)
definition: Solution solide dans laquelle des atomes, des ions ou des molécules de soluté prennent dans la maille cristalline la place d’atomes, d’ions ou de molécules du solvant.
in scheme: Matériaux
in scheme: concepts
notation: CHIM539

nucléofuge
type: ConceptConcept
type: Concept
creator: Commission d'enrichissement de la langue française, FranceTerme
date parution JO: 2001-04-18
equivalent EN: nucleofugal @en
equivalent EN: nucleofugal (en)
equivalent EN: nucleofuge @en
equivalent EN: nucleofuge (en)
part of speech: adjectif
definition: Se dit d'un atome ou d'un groupe d'atomes qui, dans une réaction hétérolytique, part en emportant le doublet d'électrons de la liaison covalente ; par extension, qualifie également toute transformation impliquant un tel processus.
in scheme: Chimie
in scheme: concepts
notation: CHIM54
note: Ce terme est également employé comme substantif. Exemple : L'anion Cl- est le nucléofuge dans l'hydrolyse d'un chlorure d'alkyle.
related: électrofuge
related: nucléophile

solution solide d'insertion
type: ConceptConcept
type: Concept
creator: Commission d'enrichissement de la langue française, FranceTerme
date parution JO: 2016-05-07
equivalent EN: interstitial solid solution @en
equivalent EN: interstitial solid solution (en)
definition: Solution solide dans laquelle les atomes de soluté se placent dans des sites interstitiels de la maille cristalline du solvant.
in scheme: Matériaux
in scheme: concepts
notation: CHIM540

tavelure
type: ConceptConcept
type: Concept
creator: Commission d'enrichissement de la langue française, FranceTerme
date parution JO: 2016-05-07
equivalent EN: speckle @en
equivalent EN: speckle (en)
equivalent EN: speckle pattern @en
equivalent EN: speckle pattern (en)
part of speech: nom féminin
definition: Ensemble de petites taches qui apparaissent sur une image, dues soit à l’observation, à l’aide d’un faisceau cohérent, d’une surface présentant des irrégularités à l’échelle de la longueur d’onde, soit à la propagation d’un rayonnement dans une atmosphère présentant des variations aléatoires d’indice de réfraction ; par extension, chacune de ces petites taches.
in scheme: Physique
in scheme: Spatiologie
in scheme: concepts
notation: CHIM542
related: concept-SPAT1752

acier autopatinable
type: ConceptConcept
type: Concept
creator: Commission d'enrichissement de la langue française, FranceTerme
date parution JO: 2016-05-07
equivalent EN: cor-ten steel @en
equivalent EN: cor-ten steel (en)
equivalent EN: corten steel @en
equivalent EN: corten steel (en)
equivalent EN: weathering steel @en
equivalent EN: weathering steel (en)
alternative label: acier corten
definition: Acier dont on a accru la résistance à la corrosion par l’ajout d'un certain nombre d’éléments permettant la formation, au contact de l’atmosphère, d’une couche protectrice d’oxydes.
in scheme: Matériaux
in scheme: concept-SD-materiaux-metallurgie
in scheme: concepts
notation: CHIM543
note: Les éléments ajoutés peuvent être le phosphore, le cuivre, le chrome, le nickel ou le molybdène.

cermet
type: ConceptConcept
type: Concept
creator: Commission d'enrichissement de la langue française, FranceTerme
date parution JO: 2016-05-07
equivalent EN: cermet @en
equivalent EN: cermet (en)
part of speech: nom masculin
definition: Matériau constitué d’un mélange de céramique et de métal, généralement obtenu par frittage.
in scheme: Matériaux
in scheme: concepts
notation: CHIM544
note: 1. Le plus souvent, la phase métallique constitue le liant entre les grains de céramique ; plus rarement, elle peut se trouver sous forme d’inclusions dans une phase céramique.
note: 2. Un cermet peut être constitué de plusieurs métaux et de plusieurs céramiques.
related: cermet de carbure métallique

cermet de carbure métallique
type: ConceptConcept
type: Concept
creator: Commission d'enrichissement de la langue française, FranceTerme
date parution JO: 2016-05-07
deconseille ou frequent: carbure cémenté
deconseille ou frequent: métal dur
equivalent EN: cemented carbide @en
equivalent EN: cemented carbide (en)
equivalent EN: hardmetal @en
equivalent EN: hardmetal (en)
forme abregee: cermet-carbure, n.m.
definition: Cermet obtenu par frittage d’un carbure métallique et d'un métal.
in scheme: Matériaux
in scheme: concepts
notation: CHIM545
note: 1. Le cermet de carbure de tungstène est très utilisé pour la fabrication d’outils d’usinage, en raison de sa dureté élevée.
note: 2. On trouve aussi les expressions « métal dur » et « carbure cémenté », qui sont déconseillées.
related: cermet

schoopage
type: ConceptConcept
type: Concept
creator: Commission d'enrichissement de la langue française, FranceTerme
date parution JO: 2016-05-07
deconseille ou frequent: shoopage
equivalent EN: hot metal spraying @en
equivalent EN: hot metal spraying (en)
part of speech: nom masculin
alternative label: métallisation par projection à chaud
definition: Traitement anticorrosion d’une pièce en alliage ferreux consistant à projeter sur sa surface un métal ou un alliage fondus, à l’aide d’un arc électrique ou d’un chalumeau.
in scheme: Matériaux
in scheme: concept-SD-materiaux-metallurgie
in scheme: concepts
notation: CHIM546
note: 1. Le métal projeté peut être du zinc, de l’aluminium ou du cuivre.
note: 2. Le terme « schoopage » vient du nom de l’inventeur de cette technique, le Suisse Max Ulrich Schoop.
note: 3. On trouve aussi le terme « shoopage ».

à-coup
type: ConceptConcept
type: Concept
creator: Commission d'enrichissement de la langue française, FranceTerme
date parution JO: 2016-05-07
equivalent EN: pop-in @en
equivalent EN: pop-in (en)
part of speech: nom masculin
definition: Diminution brusque et de faible amplitude de la rigidité d’une éprouvette, due à la propagation instantanée et limitée d’une fissure dans une zone fragile de cette éprouvette au cours d’un essai de détermination de la ténacité d’un matériau.
in scheme: Matériaux
in scheme: concepts
notation: CHIM547

amorçage de fissuration
type: ConceptConcept
type: Concept
creator: Commission d'enrichissement de la langue française, FranceTerme
date parution JO: 2016-05-07
deconseille ou frequent: initiation de fissuration
equivalent EN: crack initiation @en
equivalent EN: crack initiation (en)
definition: Première étape de la formation de fissures dans un matériau.
in scheme: Matériaux
in scheme: concepts
notation: CHIM548
note: On trouve aussi l’expression « initiation de fissuration », qui est déconseillée.
related: écartement de fissure
related: ouverture de fissure

craquelure
type: ConceptConcept
type: Concept
creator: Commission d'enrichissement de la langue française, FranceTerme
date parution JO: 2016-05-07
equivalent EN: craze @en
equivalent EN: craze (en)
equivalent EN: crazing @en
equivalent EN: crazing (en)
part of speech: nom féminin
definition: Fissure de petites dimensions qui se forme dans un matériau polymère et dont les parois restent reliées par des filaments.
in scheme: Matériaux
in scheme: concept-SD-materiaux-polymeres
in scheme: concepts
notation: CHIM549

nucléophile
type: ConceptConcept
type: Concept
creator: Commission d'enrichissement de la langue française, FranceTerme
date parution JO: 2001-04-18
equivalent EN: nucleophile @en
equivalent EN: nucleophile (en)
equivalent EN: nucleophilic @en
equivalent EN: nucleophilic (en)
part of speech: adjectif
definition: Se dit d'un réactif qui forme avec un autre réactif, l'électrophile, une liaison en apportant le doublet d'électrons liants ; par extension, qualifie également toute transformation impliquant un tel processus.
in scheme: Chimie
in scheme: concepts
notation: CHIM55
note: 1. Ce terme est également employé comme substantif. Exemple : L'ion OH- peut être le nucléophile dans l'hydrolyse d'un chlorure d'alkyle.
note: 2. Les réactifs nucléophiles sont des bases de Lewis.
related: électrophile
related: assistance anchimère
related: solvolyse
related: nucléofuge
related: base de Lewis

cupule
type: ConceptConcept
type: Concept
creator: Commission d'enrichissement de la langue française, FranceTerme
date parution JO: 2016-05-07
equivalent EN: dimple @en
equivalent EN: dimple (en)
part of speech: nom féminin
definition: Creux microscopique observé sur la surface de rupture d’un matériau ductile soumis à une déformation plastique, qui résulte de la croissance et de la jonction de microcavités.
in scheme: Matériaux
in scheme: concepts
notation: CHIM550

écartement de fissure
type: ConceptConcept
type: Concept
creator: Commission d'enrichissement de la langue française, FranceTerme
date parution JO: 2016-05-07
equivalent EN: CTOD @en
equivalent EN: CTOD (en)
equivalent EN: crack tip opening displacement @en
equivalent EN: crack tip opening displacement (en)
definition: Distance séparant les deux parois d’une fissure, mesurée à une distance du fond de la fissure fixée par convention selon la nature de l’étude.
in scheme: Matériaux
in scheme: concepts
notation: CHIM551
related: amorçage de fissuration
related: ouverture de fissure

ouverture de fissure
type: ConceptConcept
type: Concept
creator: Commission d'enrichissement de la langue française, FranceTerme
date parution JO: 2016-05-07
equivalent EN: COD @en
equivalent EN: COD (en)
equivalent EN: crack opening displacement @en
equivalent EN: crack opening displacement (en)
definition: Accroissement de la distance entre deux points situés de part et d’autre d’une fissure lorsqu’un effort en écarte les parois.
in scheme: Matériaux
in scheme: concepts
notation: CHIM552
related: amorçage de fissuration
related: écartement de fissure

clinchage
type: ConceptConcept
type: Concept
creator: Commission d'enrichissement de la langue française, FranceTerme
date parution JO: 2016-05-07
equivalent EN: clinching @en
equivalent EN: clinching (en)
part of speech: nom masculin
alternative label: assemblage-emboutissage
definition: Procédé d'assemblage de deux tôles minces consistant à les emboutir simultanément entre un poinçon et une matrice pour former un point de jonction par déformation plastique.
in scheme: Matériaux
in scheme: concept-SD-materiaux-metallurgie
in scheme: concepts
notation: CHIM553

déliantage
type: ConceptConcept
type: Concept
creator: Commission d'enrichissement de la langue française, FranceTerme
date parution JO: 2016-05-07
equivalent EN: debinding @en
equivalent EN: debinding (en)
part of speech: nom masculin
definition: Élimination, par un traitement thermique ou par l’action d’un solvant, du liant présent dans une pièce préalablement obtenue par mise en forme d’un mélange de poudre métallique ou céramique et de liant polymère.
in scheme: Matériaux
in scheme: concepts
notation: CHIM554
related: moulage par injection de poudre

moulage à mousse perdue
type: ConceptConcept
type: Concept
creator: Commission d'enrichissement de la langue française, FranceTerme
date parution JO: 2016-05-07
deconseille ou frequent: moulage à cire perdue
equivalent EN: lost-foam casting @en
equivalent EN: lost-foam casting (en)
definition: Procédé de fonderie dans lequel un modèle en mousse de polystyrène de la pièce à réaliser, noyé dans un bac de sable, est remplacé lors de la coulée par du métal fondu.
in scheme: Matériaux
in scheme: concept-SD-materiaux-metallurgie
in scheme: concepts
notation: CHIM555
note: Le moulage à mousse perdue reprend le principe du moulage à cire perdue.

moulage en mottes
type: ConceptConcept
type: Concept
creator: Commission d'enrichissement de la langue française, FranceTerme
date parution JO: 2016-05-07
deconseille ou frequent: procédé Disamatic
equivalent EN: boxless molding (US) @en
equivalent EN: boxless molding (en-US)
equivalent EN: boxless moulding (GB) @en
equivalent EN: boxless moulding (en-GB)
equivalent EN: disamatic molding process (US) @en
equivalent EN: disamatic molding process (en-US)
equivalent EN: disamatic moulding process (GB) @en
equivalent EN: disamatic moulding process (en-GB)
definition: Procédé de fonderie associant en continu, sur la même chaîne de fabrication, la réalisation de moules en sable sans châssis et la coulée de métal dans ces moules.
in scheme: Matériaux
in scheme: concept-SD-materiaux-metallurgie
in scheme: concepts
notation: CHIM556
note: On trouve aussi l’expression « procédé Disamatic », qui n’est pas recommandée.

moulage par injection de poudre
type: ConceptConcept
type: Concept
creator: Commission d'enrichissement de la langue française, FranceTerme
abbreviation: MIP
date parution JO: 2016-05-07
deconseille ou frequent: moulage par injection de céramique
deconseille ou frequent: moulage par injection de métal
equivalent EN: CIM (GB) @en
equivalent EN: CIM (US) @en
equivalent EN: CIM (en-GB)
equivalent EN: CIM (en-US)
equivalent EN: MIM (GB) @en
equivalent EN: MIM (US) @en
equivalent EN: MIM (en-GB)
equivalent EN: MIM (en-US)
equivalent EN: PIM (GB) @en
equivalent EN: PIM (US) @en
equivalent EN: PIM (en-GB)
equivalent EN: PIM (en-US)
equivalent EN: ceramic injection molding (US) @en
equivalent EN: ceramic injection molding (en-US) [poudre céramique]
equivalent EN: ceramic injection moulding (GB) @en
equivalent EN: ceramic injection moulding (en-GB) [poudre céramique]
equivalent EN: metal injection molding (US) @en
equivalent EN: metal injection molding (en-US) [poudre métallique]
equivalent EN: metal injection moulding (GB) @en
equivalent EN: metal injection moulding (en-GB) [poudre métallique]
equivalent EN: powder injection molding (US) @en
equivalent EN: powder injection molding (en-US)
equivalent EN: powder injection moulding (GB) @en
equivalent EN: powder injection moulding (en-GB)
definition: Procédé de fabrication d’une pièce consistant à injecter dans un moule un mélange de poudre métallique ou céramique et de liant polymère, à effectuer le déliantage de la pièce, puis à consolider celle-ci par frittage.
in scheme: Matériaux
in scheme: concept-SD-materiaux-metallurgie
in scheme: concept-SD-materiaux-verre-et-ceramique
in scheme: concepts
notation: CHIM557
related: déliantage

moulage sous pression
type: ConceptConcept
type: Concept
creator: Commission d'enrichissement de la langue française, FranceTerme
date parution JO: 2016-05-07
equivalent EN: pressure die casting @en
equivalent EN: pressure die casting (en)
equivalent EN: squeeze casting @en
equivalent EN: squeeze casting (en)
definition: Procédé de fonderie consistant à injecter un métal liquide dans un moule à l’aide d’un piston qui maintient ce métal sous pression au cours de la solidification.
in scheme: Matériaux
in scheme: concept-SD-materiaux-metallurgie
in scheme: concepts
notation: CHIM558

procédé à forte déformation
type: ConceptConcept
type: Concept
creator: Commission d'enrichissement de la langue française, FranceTerme
date parution JO: 2016-05-07
equivalent EN: SPD @en
equivalent EN: SPD (en)
equivalent EN: severe plastic deformation @en
equivalent EN: severe plastic deformation (en)
definition: Écrouissage dans lequel le métal est soumis à des déformations plastiques de grande amplitude.
in scheme: Matériaux
in scheme: concept-SD-materiaux-metallurgie
in scheme: concepts
notation: CHIM559
note: 1. Le procédé à forte déformation permet, après recristallisation, d’obtenir un matériau à taille de grains submicronique dont les propriétés mécaniques sont améliorées.
note: 2. Un exemple de procédé à forte déformation est l’extrusion en canal coudé.
related: extrusion en canal coudé

oligomère
type: ConceptConcept
type: Concept
creator: Commission d'enrichissement de la langue française, FranceTerme
date parution JO: 2001-04-18
equivalent EN: oligomer @en
equivalent EN: oligomer (en)
part of speech: nom masculin
definition: Substance composée de molécules de masse moléculaire intermédiaire essentiellement constituées par la répétition en petit nombre d'atomes ou de groupes d'atomes, appelés « unités constitutives » et dérivant de molécules de faible masse moléculaire.
in scheme: Chimie
in scheme: concept-SD-chimie-chimie-macromoleculaire
in scheme: concepts
notation: CHIM56
note: Une molécule est considérée comme ayant une « masse moléculaire intermédiaire » si ses propriétés varient notablement par addition ou par suppression d'une ou de quelques unités constitutives.
related: copolymère
related: oligomérisation
related: régulier, -ière
related: prépolymère
related: téléchélique
related: monomère
related: polymère

extrusion en canal coudé
type: ConceptConcept
type: Concept
creator: Commission d'enrichissement de la langue française, FranceTerme
date parution JO: 2016-05-07
equivalent EN: ECAE @en
equivalent EN: ECAE (en)
equivalent EN: ECAP @en
equivalent EN: ECAP (en)
equivalent EN: equal-channel angular extrusion @en
equivalent EN: equal-channel angular extrusion (en)
equivalent EN: equal-channel angular pressing @en
equivalent EN: equal-channel angular pressing (en)
definition: Procédé à forte déformation consistant à forcer par compression un matériau métallique à passer à travers un coude dont l’angle peut atteindre 90°.
in scheme: Matériaux
in scheme: concept-SD-materiaux-metallurgie
in scheme: concepts
notation: CHIM560
related: procédé à forte déformation

extrusion par choc
type: ConceptConcept
type: Concept
creator: Commission d'enrichissement de la langue française, FranceTerme
date parution JO: 2016-05-07
equivalent EN: impact extrusion @en
equivalent EN: impact extrusion (en)
forme abregee: extrusion-choc, n.f.
definition: Procédé de mise en forme de corps creux consistant à faire pénétrer à grande vitesse, dans une matrice, à l’aide d’un poinçon, une ébauche en métal malléable.
in scheme: Matériaux
in scheme: concept-SD-materiaux-metallurgie
in scheme: concepts
notation: CHIM561

soudage par colaminage
type: ConceptConcept
type: Concept
creator: Commission d'enrichissement de la langue française, FranceTerme
date parution JO: 2016-05-07
equivalent EN: roll bond @en
equivalent EN: roll bond (en)
definition: Procédé consistant à souder deux tôles face contre face en les soumettant ensemble à un laminage à chaud.
in scheme: Matériaux
in scheme: concept-SD-materiaux-metallurgie
in scheme: concepts
notation: CHIM562
note: Le soudage peut être évité sur certaines parties de la surface des tôles en les isolant par une couche protectrice. Par gonflage de ces parties non soudées, il est alors possible de réaliser des corps partiellement creux, comme par exemple des échangeurs de chaleur.

oxyfragmentable
type: ConceptConcept
type: Concept
creator: Commission d'enrichissement de la langue française, FranceTerme
date parution JO: 2016-12-22
deconseille ou frequent: oxofragmentable
deconseille ou frequent: oxy-fragmentable
deconseille ou frequent: plastique oxyfragmentable
equivalent EN: oxo-fragmentable @en
equivalent EN: oxo-fragmentable (en)
part of speech: adjectif
definition: Se dit d’un matériau qui se fragmente en présence d’oxygène et sans l’intervention d’organismes vivants, grâce à l’addition d’agents facilitant l’oxydation.
in scheme: Chimie
in scheme: Matériaux
in scheme: concept-SD-chimie-polymeres
in scheme: concept-SD-materiaux-polymeres
in scheme: concepts
notation: CHIM564
note: 1. Les fragments ainsi obtenus sont généralement de taille macroscopique.
note: 2. On parle, par exemple, de « plastique oxyfragmentable ».
note: 3. On trouve aussi le terme « oxofragmentable », qui est déconseillé.
related: oxybiodégradable
related: polymère

oxybiodégradable
type: ConceptConcept
type: Concept
creator: Commission d'enrichissement de la langue française, FranceTerme
date parution JO: 2016-12-22
deconseille ou frequent: oxo-biodégradable
deconseille ou frequent: oxobiodegradable
deconseille ou frequent: oxobiodégradable
deconseille ou frequent: oxy-biodégradable
equivalent EN: oxo-biodegradable @en
equivalent EN: oxo-biodegradable (en)
part of speech: adjectif
definition: Se dit d’un matériau qui est rendu biodégradable en présence d’oxygène grâce à l’addition d’agents facilitant l’oxydation.
in scheme: Chimie
in scheme: Matériaux
in scheme: concepts
notation: CHIM565
note: On trouve aussi le terme « oxobiodégradable », qui est déconseillé.
related: oxyfragmentable
related: biodégradable

biosourcé, -e
type: ConceptConcept
type: Concept
creator: Commission d'enrichissement de la langue française, FranceTerme
date parution JO: 2016-12-22
deconseille ou frequent: bio-sourcé
deconseille ou frequent: matériau de construction biosourcé
deconseille ou frequent: plastique biosourcé
deconseille ou frequent: teneur biosourcée
deconseille ou frequent: teneur en matière biosourcée
equivalent EN: bio-based @en
equivalent EN: bio-based (en)
equivalent EN: biobased @en
equivalent EN: biobased (en)
part of speech: adjectif
definition: Se dit d’un produit ou d’un matériau entièrement ou partiellement fabriqué à partir de matières d’origine biologique.
in scheme: Environnement
in scheme: Matériaux
in scheme: concepts
notation: CHIM567
note: 1. Les matières d’origine biologique font généralement l’objet d’un ou de plusieurs traitements physiques, chimiques ou biologiques au cours du processus de fabrication.
note: 2. On parle notamment de « plastique biosourcé » ou de « matériau de construction biosourcé », voire de « teneur en matière biosourcée » d’un produit.
related: bioplastique
related: concept-PETR218

polycristal
type: ConceptConcept
type: Concept
creator: Commission d'enrichissement de la langue française, FranceTerme
date parution JO: 2017-07-01
equivalent EN: polycrystal @en
equivalent EN: polycrystal (en)
part of speech: nom masculin
definition: Solide constitué d’un ensemble de cristaux de taille, de forme et d’orientation variées, séparés par des joints de grains.
in scheme: Matériaux
in scheme: concepts
notation: CHIM568
note: Les matériaux cristallins, à l’état naturel ou élaborés industriellement, sont en majorité des polycristaux.
related: joint de grains
related: monocristal
related: jonction triple

monocristal
type: ConceptConcept
type: Concept
creator: Commission d'enrichissement de la langue française, FranceTerme
date parution JO: 2017-07-01
equivalent EN: single crystal @en
equivalent EN: single crystal (en)
part of speech: nom masculin
definition: Solide constitué d’un unique cristal, formé à partir d’un seul germe.
in scheme: Matériaux
in scheme: concepts
notation: CHIM569
related: polycristal

photolyse
type: ConceptConcept
type: Concept
creator: Commission d'enrichissement de la langue française, FranceTerme
date parution JO: 2001-04-18
equivalent EN: photolysis @en
equivalent EN: photolysis (en)
part of speech: nom féminin
definition: Coupure d'une ou de plusieurs liaisons d'une entité moléculaire consécutive à une absorption de lumière, ou tout processus photochimique dans lequel une telle coupure joue un rôle essentiel.
in scheme: Chimie
in scheme: concept-SD-chimie-photochimie
in scheme: concepts
notation: CHIM57
related: photolyse éclair
related: thermolyse
related: décomposition de l'eau

jonction triple
type: ConceptConcept
type: Concept
creator: Commission d'enrichissement de la langue française, FranceTerme
date parution JO: 2017-07-01
definition: Ligne commune à trois cristaux contigus dans un polycristal.
in scheme: Matériaux
in scheme: concepts
notation: CHIM570
related: joint de grains
related: polycristal

dômage
type: ConceptConcept
type: Concept
creator: Commission d'enrichissement de la langue française, FranceTerme
date parution JO: 2017-07-01
equivalent EN: doming @en
equivalent EN: doming (en)
part of speech: nom masculin
definition: Dépôt, sur un support imprimé, d’une couche de résine transparente qui forme en se solidifiant une surface bombée, créant ainsi un effet de relief.
in scheme: Matériaux
in scheme: concepts
notation: CHIM571

isolation hydrique
type: ConceptConcept
type: Concept
creator: Commission d'enrichissement de la langue française, FranceTerme
date parution JO: 2017-07-01
equivalent EN: water insulation @en
equivalent EN: water insulation (en)
definition: Ensemble des dispositions prises en vue de protéger un bâtiment contre les infiltrations d’eau et la condensation de vapeur d’eau ; par extension, résultat de ces dispositions.
in scheme: Habitat et construction
in scheme: Matériaux
in scheme: concepts
notation: CHIM572
related: isolation thermique

puits quantique
type: ConceptConcept
type: Concept
creator: Commission d'enrichissement de la langue française, FranceTerme
date parution JO: 2022-03-31
equivalent EN: quantum potential well @en
equivalent EN: quantum potential well (en)
equivalent EN: quantum well @en
equivalent EN: quantum well (en)
definition: Puits de potentiel dans lequel une particule est en confinement quantique.
in scheme: Chimie
in scheme: Physique
in scheme: concept-SD-chimie-mecanique-quantique
in scheme: concept-SD-physique-mecanique-quantique
in scheme: concepts
notation: CHIM574
related: confinement quantique
related: boîte quantique
related: fil quantique
related: feuillet quantique
related: puits de potentiel

thiocarbonyle
type: ConceptConcept
type: Concept
creator: Commission d'enrichissement de la langue française, FranceTerme
date parution JO: 2017-07-01
equivalent EN: thiocarbonyl @en
equivalent EN: thiocarbonyl (en)
part of speech: nom masculin
definition: Groupe fonctionnel comportant un atome de carbone doublement lié à un atome de soufre.
in scheme: Chimie
in scheme: concepts
notation: CHIM575
related: thionation

thionation
type: ConceptConcept
type: Concept
creator: Commission d'enrichissement de la langue française, FranceTerme
date parution JO: 2017-07-01
equivalent EN: thionation @en
equivalent EN: thionation (en)
part of speech: nom féminin
definition: Conversion d’un groupe fonctionnel carbonyle en groupe thiocarbonyle.
in scheme: Chimie
in scheme: concepts
notation: CHIM576
related: thiocarbonyle

vitrisoudage
type: ConceptConcept
type: Concept
creator: Commission d'enrichissement de la langue française, FranceTerme
date parution JO: 2017-07-01
equivalent EN: fusing @en
equivalent EN: fusing (en)
part of speech: nom masculin
definition: Procédé verrier consistant à souder, par un traitement thermique approprié, une ou plusieurs feuilles de verre superposées à un substrat de verre, le plus souvent afin d’obtenir un produit décoratif.
in scheme: Matériaux
in scheme: concept-SD-materiaux-verre-et-ceramique
in scheme: concepts
notation: CHIM577
note: Le vitrisoudage nécessite l’utilisation de verres ayant des coefficients de dilatation très proches

vitrimère
type: ConceptConcept
type: Concept
creator: Commission d'enrichissement de la langue française, FranceTerme
date parution JO: 2017-07-01
equivalent EN: vitrimer @en
equivalent EN: vitrimer (en)
part of speech: nom masculin
definition: Polymère réticulé qui, à froid, présente les caractéristiques d’un polymère thermodurcissable mais qui, à chaud, peut être mis en forme comme un polymère thermoplastique grâce une redistribution des nœuds de réticulation, ce qui lui confère un comportement analogue à celui du verre.
in scheme: Chimie
in scheme: Matériaux
in scheme: concept-SD-chimie-polymeres
in scheme: concept-SD-materiaux-polymeres
in scheme: concepts
notation: CHIM578
note: Les vitrimères font partie des polymères qui ont la propriété de se ressouder au niveau moléculaire après déchirure.
related: nœud de réticulation
related: réticulation

nœud de réticulation
type: ConceptConcept
type: Concept
creator: Commission d'enrichissement de la langue française, FranceTerme
date parution JO: 2017-07-01
equivalent EN: cross-linking point @en
equivalent EN: cross-linking point (en)
equivalent EN: crosslink @en
equivalent EN: crosslink (en)
definition: Point de jonction de chaînes macromoléculaires dans un polymère réticulé.
in scheme: Chimie
in scheme: Matériaux
in scheme: concept-SD-chimie-polymeres
in scheme: concept-SD-materiaux-polymeres
in scheme: concepts
notation: CHIM579
related: chaîne
related: macromolécule
related: vitrimère
related: réticulation
scope note: Cette publication annule et remplace celle du Journal officiel du 1er mars 2002.

photolyse éclair
type: ConceptConcept
type: Concept
creator: Commission d'enrichissement de la langue française, FranceTerme
date parution JO: 2001-04-18
equivalent EN: flash photolysis @en
equivalent EN: flash photolysis (en)
definition: Méthode d'irradiation au moyen d'une source de lumière produisant des éclairs de forte intensité et de très courte durée, capables de provoquer la photolyse d'entités moléculaires.
in scheme: Chimie
in scheme: concept-SD-chimie-photochimie
in scheme: concepts
notation: CHIM58
related: photolyse

carbomère
type: ConceptConcept
type: Concept
creator: Commission d'enrichissement de la langue française, FranceTerme
date parution JO: 2017-07-01
deconseille ou frequent: carbo-mère
deconseille ou frequent: carbomère partiel
equivalent EN: carbomer @en
equivalent EN: carbomer (en)
part of speech: nom masculin
definition: Structure moléculaire dérivée d’une structure moléculaire mère par insertion d’un même nombre d’unités dicarbone dans chacune des liaisons de cette structure.
in scheme: Chimie
in scheme: concepts
notation: CHIM580
note: 1. On parle de « carbomère partiel » si l’insertion est limitée à un seul type de liaisons, par exemple les liaisons carbone-carbone ou les liaisons endocycliques.
note: 2. Le terme « carbomère » est également utilisé comme adjectif. Ainsi, on dit que l’éthyne est la molécule carbomère du dihydrogène.

fabrication additive
type: ConceptConcept
type: Concept
creator: Commission d'enrichissement de la langue française, FranceTerme
abbreviation: FA
date parution JO: 2017-07-01
equivalent EN: AM @en
equivalent EN: AM (en)
equivalent EN: additive manufacturing @en
equivalent EN: additive manufacturing (en)
alternative label: fabrication par addition
definition: Méthode de fabrication d’un objet consistant à superposer des couches de matière à partir des données d’un modèle numérique tridimensionnel.
in scheme: Matériaux
in scheme: concepts
notation: CHIM581
note: 1. L’impression tridimensionnelle, le frittage par laser et la fusion sur lit de poudre sont des exemples de procédés de fabrication additive.
note: 2. La fabrication additive est souvent utilisée pour le prototypage rapide de certains objets.
related: impression tridimensionnelle
related: fusion sur lit de poudre
related: frittage par laser

impression tridimensionnelle
type: ConceptConcept
type: Concept
creator: Commission d'enrichissement de la langue française, FranceTerme
date parution JO: 2017-07-01
equivalent EN: 3D printing @en
equivalent EN: 3D printing (en)
equivalent EN: three-dimensional printing @en
equivalent EN: three-dimensional printing (en)
forme abregee: impression 3D
definition: Procédé de fabrication additive consistant à déposer ou à projeter un matériau au moyen d’un dispositif pouvant se déplacer dans les trois dimensions.
in scheme: Matériaux
in scheme: concepts
notation: CHIM582
related: fabrication additive
related: technologie de la mode

fusion sur lit de poudre
type: ConceptConcept
type: Concept
creator: Commission d'enrichissement de la langue française, FranceTerme
date parution JO: 2017-07-01
equivalent EN: powder bed fusion @en
equivalent EN: powder bed fusion (en)
definition: Procédé de fabrication additive dans lequel l’objet est obtenu par la fusion sélective de certaines zones d’un lit de poudre.
in scheme: Matériaux
in scheme: concepts
notation: CHIM583
note: L’énergie thermique nécessaire à la fusion sur lit de poudre est notamment fournie par un faisceau laser ou un faisceau d’électrons.
related: fabrication additive
related: frittage par laser

frittage par laser
type: ConceptConcept
type: Concept
creator: Commission d'enrichissement de la langue française, FranceTerme
abbreviation: FL
date parution JO: 2017-07-01
equivalent EN: SLS @en
equivalent EN: SLS (en)
equivalent EN: laser sintering @en
equivalent EN: laser sintering (en)
equivalent EN: selective laser sintering @en
equivalent EN: selective laser sintering (en)
forme abregee: frittage laser
definition: Fusion sur lit de poudre partielle dans laquelle l’énergie thermique est fournie par un ou plusieurs faisceaux laser.
in scheme: Matériaux
in scheme: concepts
notation: CHIM584
related: fabrication additive
related: fusion sur lit de poudre

carbophile
type: ConceptConcept
type: Concept
creator: Commission d'enrichissement de la langue française, FranceTerme
date parution JO: 2017-07-01
equivalent EN: carbophile @de
equivalent EN: carbophile (de)
equivalent EN: carbophilic @en
equivalent EN: carbophilic (en)
part of speech: adjectif
definition: Se dit d’un composé présentant une affinité pour un atome de carbone insaturé, en particulier dans un alcyne.
in scheme: Chimie
in scheme: concepts
notation: CHIM587
note: Certains composés carbophiles de l’or et du cuivre sont utilisés en synthèse organique.
related: acide de Lewis
related: acide mou
related: oxophile
related: azophile

oxophile
type: ConceptConcept
type: Concept
creator: Commission d'enrichissement de la langue française, FranceTerme
date parution JO: 2017-07-01
equivalent EN: oxophile @en
equivalent EN: oxophile (en)
equivalent EN: oxophilic @en
equivalent EN: oxophilic (en)
part of speech: adjectif
definition: Se dit d’un composé présentant une affinité pour un atome d’oxygène.
in scheme: Chimie
in scheme: concepts
notation: CHIM588
note: Certains composés du phosphore, du silicium et du bore, particulièrement oxophiles, sont utilisés en synthèse organique.
related: acide de Lewis
related: carbophile
related: azophile

azophile
type: ConceptConcept
type: Concept
creator: Commission d'enrichissement de la langue française, FranceTerme
date parution JO: 2017-07-01
deconseille ou frequent: azaphile
equivalent EN: azaphilic @en
equivalent EN: azaphilic (en)
equivalent EN: azophilic @en
equivalent EN: azophilic (en)
part of speech: adjectif
definition: Se dit d’un composé présentant une affinité pour un atome d’azote.
in scheme: Chimie
in scheme: concepts
notation: CHIM589
note: Certains composés du bore, particulièrement azophiles, sont utilisés en synthèse organique.
related: acide de Lewis
related: carbophile
related: oxophile

photosensibilisateur
type: ConceptConcept
type: Concept
creator: Commission d'enrichissement de la langue française, FranceTerme
date parution JO: 2001-04-18
deconseille ou frequent: photosensitiser
deconseille ou frequent: photosensitizer
equivalent EN: photosensitiser (GB) @en
equivalent EN: photosensitiser (en-GB)
equivalent EN: photosensitizer (US) @en
equivalent EN: photosensitizer (en-US)
part of speech: nom masculin
definition: Composé qui, sous irradiation, a la capacité de transférer son énergie d'excitation électronique à un autre composé.
in scheme: Chimie
in scheme: concept-SD-chimie-photochimie
in scheme: concepts
notation: CHIM59

moscovium
type: ConceptConcept
type: Concept
creator: Commission d'enrichissement de la langue française, FranceTerme
date parution JO: 2017-06-27
equivalent EN: moscovium @en
equivalent EN: moscovium (en)
part of speech: nom masculin
definition: Élément chimique de numéro atomique 115.
in scheme: Chimie
in scheme: concepts
notation: CHIM590
note: De « Moscou ».

nihonium
type: ConceptConcept
type: Concept
creator: Commission d'enrichissement de la langue française, FranceTerme
date parution JO: 2017-06-27
equivalent EN: nihonium @en
equivalent EN: nihonium (en)
part of speech: nom masculin
definition: Élément chimique de numéro atomique 113.
in scheme: Chimie
in scheme: concepts
notation: CHIM591
note: De Nihon (« Japon » en japonais).

oganesson
type: ConceptConcept
type: Concept
creator: Commission d'enrichissement de la langue française, FranceTerme
date parution JO: 2017-06-27
equivalent EN: oganesson @en
equivalent EN: oganesson (en)
part of speech: nom masculin
definition: Élément chimique de numéro atomique 118.
in scheme: Chimie
in scheme: concepts
notation: CHIM592
note: Du nom du physicien Yuri T. Oganessian.

tennesse
type: ConceptConcept
type: Concept
creator: Commission d'enrichissement de la langue française, FranceTerme
date parution JO: 2017-06-27
equivalent EN: tennessine @en
equivalent EN: tennessine (en)
part of speech: nom masculin
definition: Élément chimique de numéro atomique 117.
in scheme: Chimie
in scheme: concepts
notation: CHIM594
note: De « Tennessee », État des États-Unis.

nanomatériau
type: ConceptConcept
type: Concept
creator: Commission d'enrichissement de la langue française, FranceTerme
date parution JO: 2019-03-22
equivalent EN: nanomaterial @en
equivalent EN: nanomaterial (en)
part of speech: nom masculin
definition: Matériau dont tous les constituants ou certains éléments structuraux sont de dimension nanométrique.
in scheme: Chimie
in scheme: Matériaux
in scheme: concepts
notation: CHIM595
note: Les nanomatériaux sont soit des matériaux entièrement constitués de nanoobjets, soit des matériaux nanostructurés.
related: nanoobjet
related: matériau nanostructuré
related: nanoparticule
related: nanotube
related: confinement quantique

nanoobjet
type: ConceptConcept
type: Concept
creator: Commission d'enrichissement de la langue française, FranceTerme
date parution JO: 2019-03-22
deconseille ou frequent: nano-objet
deconseille ou frequent: nanoobject
deconseille ou frequent: objet nanométrique
equivalent EN: nano-object @en
equivalent EN: nano-object (en)
part of speech: nom masculin
definition: Assemblage d’atomes ou de molécules, dont au moins une dimension externe est nanométrique.
in scheme: Chimie
in scheme: Matériaux
in scheme: concepts
notation: CHIM596
note: 1. Les nanoobjets sont les constituants de certains nanomatériaux.
note: 2. Les nanotubes, les nanoparticules et les machines moléculaires sont des exemples de nanoobjets.
related: nanomatériau
related: nanoparticule
related: nanotube
related: graphène
related: machine moléculaire

matériau nanostructuré
type: ConceptConcept
type: Concept
creator: Commission d'enrichissement de la langue française, FranceTerme
date parution JO: 2019-03-22
deconseille ou frequent: nanomatériau structuré
equivalent EN: nanostructured material @en
equivalent EN: nanostructured material (en)
definition: Nanomatériau dont certains éléments structuraux sont de dimension nanométrique.
in scheme: Chimie
in scheme: Matériaux
in scheme: concepts
notation: CHIM597
note: 1. Les éléments structuraux d’un matériau nanostructuré sont, par exemple, des pores, des feuillets ou des fibres.
note: 2. Les nanocomposites et les nanoporeux sont des exemples de matériaux nanostructurés.
related: nanomatériau
related: matériau nanocomposite
related: matériau nanoporeux

matériau nanocomposite
type: ConceptConcept
type: Concept
creator: Commission d'enrichissement de la langue française, FranceTerme
date parution JO: 2019-03-22
equivalent EN: nanocomposite @en
equivalent EN: nanocomposite (en)
forme abregee: nanocomposite, n.m.
definition: Matériau nanostructuré composé de plusieurs phases dont une au moins présente des éléments structuraux de dimension nanométrique.
in scheme: Chimie
in scheme: Matériaux
in scheme: concepts
notation: CHIM599
note: Les os des vertébrés ainsi que les polymères renforcés par des nanotubes de carbone sont des exemples de matériaux nanocomposites.
related: matériau nanostructuré
related: nanomatériau hybride minéral-organique
related: nanotube

base de Lewis
type: ConceptConcept
type: Concept
creator: Commission d'enrichissement de la langue française, FranceTerme
date parution JO: 2001-04-18
equivalent EN: Lewis base @en
equivalent EN: Lewis base (en)
definition: Entité moléculaire, ou l'espèce chimique correspondante, capable de fournir un doublet d'électrons.
in scheme: Chimie
in scheme: concepts
notation: CHIM6
note: Une base de Lewis est donc capable de réagir avec un acide de Lewis pour former un adduit par mise en commun du doublet de la base. On peut citer comme exemples l'ammoniac et l'oxyde de diéthyle.
related: acide de Lewis
related: adduit
related: base de Brønsted
related: base dure
related: base molle
related: superacide
related: liaison de coordination
related: nucléophile

matériau nanoporeux
type: ConceptConcept
type: Concept
creator: Commission d'enrichissement de la langue française, FranceTerme
date parution JO: 2019-03-22
equivalent EN: nanoporous @en
equivalent EN: nanoporous (en)
forme abregee: nanoporeux, n.m.
definition: Matériau nanostructuré qui présente des pores de dimension nanométrique.
in scheme: Chimie
in scheme: Matériaux
in scheme: concepts
notation: CHIM600
note: Certaines zéolithes, utilisées dans la séparation des gaz, sont des exemples de matériaux nanoporeux.
related: matériau nanostructuré

nanomatériau hybride minéral-organique
type: ConceptConcept
type: Concept
creator: Commission d'enrichissement de la langue française, FranceTerme
date parution JO: 2019-03-22
deconseille ou frequent: hybride organique-inorganique
deconseille ou frequent: matériau hybride organo-minéral
equivalent EN: organic-inorganic hybrid material @en
equivalent EN: organic-inorganic hybrid material (en)
forme abregee: matériau hybride minéral-organique
definition: Matériau nanocomposite constitué d’au moins une phase minérale et une phase organique.
in scheme: Chimie
in scheme: Matériaux
in scheme: concepts
notation: CHIM601
note: 1. Les os des vertébrés ainsi que les caoutchoucs renforcés par des nanoparticules de silice, qui sont utilisés dans les pneumatiques, sont des exemples de nanomatériaux hybrides minéraux-organiques.
note: 2. On trouve aussi le terme « matériau hybride organo-minéral ».
related: matériau nanocomposite
related: nanoparticule

nanoparticule
type: ConceptConcept
type: Concept
creator: Commission d'enrichissement de la langue française, FranceTerme
date parution JO: 2019-03-22
equivalent EN: nanoparticle @en
equivalent EN: nanoparticle (en)
part of speech: nom féminin
definition: Nanoobjet dont toutes les dimensions externes sont nanométriques.
in scheme: Chimie
in scheme: Matériaux
in scheme: concepts
notation: CHIM602
note: 1. Les nanocapsules sont des nanoparticules.
note: 2. Les nanoparticules d’argent sont utilisées pour leurs propriétés bactéricides dans certains textiles.
related: nanomatériau
related: nanoobjet
related: nanomatériau hybride minéral-organique
related: nanocapsule

nanocapsule
type: ConceptConcept
type: Concept
creator: Commission d'enrichissement de la langue française, FranceTerme
date parution JO: 2019-03-22
deconseille ou frequent: capsule nano
equivalent EN: nanocapsule @en
equivalent EN: nanocapsule (en)
part of speech: nom féminin
definition: Nanoparticule qui présente une cavité destinée à contenir une substance chimique ou biochimique, libérée ensuite au niveau d’une cible.
in scheme: Chimie
in scheme: Matériaux
in scheme: concept-SD-chimie-chimie-pharmaceutique
in scheme: concept-SD-materiaux-chimie-pharmaceutique
in scheme: concepts
notation: CHIM603
note: Les nanocapsules sont utilisées principalement pour le ciblage pharmacologique.
related: ciblage pharmacologique
related: nanoparticule

nanotube
type: ConceptConcept
type: Concept
creator: Commission d'enrichissement de la langue française, FranceTerme
date parution JO: 2019-03-22
equivalent EN: nanotube @en
equivalent EN: nanotube (en)
part of speech: nom masculin
definition: Nanoobjet tubulaire dont le diamètre est de dimension nanométrique.
in scheme: Chimie
in scheme: Matériaux
in scheme: concepts
notation: CHIM604
note: 1. La paroi d’un nanotube est constituée soit d’une couche monomoléculaire, soit de plusieurs couches monomoléculaires cylindriques coaxiales.
note: 2. Les nanotubes de carbone présentent une résistance mécanique très élevée.
related: couche monomoléculaire
related: nanomatériau
related: nanoobjet
related: matériau nanocomposite
related: fil quantique

graphène
type: ConceptConcept
type: Concept
creator: Commission d'enrichissement de la langue française, FranceTerme
date parution JO: 2019-03-22
equivalent EN: graphene @en
equivalent EN: graphene (en)
part of speech: nom masculin
definition: Variété allotropique du carbone, qui se présente sous la forme d’un feuillet constitué d’un pavage hexagonal régulier d’atomes de carbone.
in scheme: Chimie
in scheme: Matériaux
in scheme: concepts
notation: CHIM605
note: 1. Un feuillet de graphène est un nanoobjet.
note: 2. Un feuillet de graphène est un système conjugué.
note: 3. L’extension du terme « graphène » à un empilement de quelques feuillets de graphène est à proscrire.
related: conjugaison
related: nanoobjet
related: graphite

macrocycle
type: ConceptConcept
type: Concept
creator: Commission d'enrichissement de la langue française, FranceTerme
date parution JO: 2019-03-22
equivalent EN: macrocycle @en
equivalent EN: macrocycle (en)
equivalent EN: molecular ring @en
equivalent EN: molecular ring (en)
part of speech: nom masculin
definition: Longue chaîne fermée d’atomes liés entre eux par des liaisons covalentes ou des liaisons de coordination ; par extension, molécule qui contient une telle chaîne.
in scheme: Chimie
in scheme: concepts
notation: CHIM606
note: Les composés en couronne sont des macrocycles.
related: composé en couronne
related: liaison covalente
related: liaison de coordination
related: caténane
related: rotaxane
scope note: Cette publication annule et remplace celle du Journal officiel du 1er mars 2002.

caténane
type: ConceptConcept
type: Concept
creator: Commission d'enrichissement de la langue française, FranceTerme
date parution JO: 2019-03-22
equivalent EN: catenane @en
equivalent EN: catenane (en)
part of speech: nom masculin
definition: Assemblage moléculaire constitué de macrocycles engagés les uns dans les autres à la manière des maillons d’une chaîne.
in scheme: Chimie
in scheme: concepts
notation: CHIM607
note: 1. Un caténane constitué de n macrocycles est noté « [n]caténane ».
note: 2. Les macrocycles d’un caténane ne peuvent être séparés que par coupure d’une liaison covalente.
related: liaison covalente
related: macrocycle
related: machine moléculaire

rotaxane
type: ConceptConcept
type: Concept
creator: Commission d'enrichissement de la langue française, FranceTerme
date parution JO: 2019-03-22
equivalent EN: rotaxane @en
equivalent EN: rotaxane (en)
part of speech: nom masculin
definition: Assemblage constitué d’au moins un macrocycle et d’une entité moléculaire en forme d’haltère qui le traverse, sans lui être liée de façon covalente, et qui ne peut s’en dégager en raison de la forme et de la dimension de ses extrémités.
in scheme: Chimie
in scheme: concepts
notation: CHIM608
note: L’entité moléculaire peut tourner et glisser à l’intérieur du macrocycle.
related: entité moléculaire
related: liaison covalente
related: macrocycle
related: machine moléculaire

cage moléculaire
type: ConceptConcept
type: Concept
creator: Commission d'enrichissement de la langue française, FranceTerme
date parution JO: 2019-03-22
deconseille ou frequent: capsule moléculaire
equivalent EN: molecular cage @en
equivalent EN: molecular cage (en)
definition: Arrangement d’entités moléculaires liées de façon à définir un espace clos pouvant contenir un atome, un ion ou une petite molécule.
in scheme: Chimie
in scheme: concepts
notation: CHIM609
note: On trouve aussi, dans le langage professionnel, le terme « capsule moléculaire ».

machine moléculaire
type: ConceptConcept
type: Concept
creator: Commission d'enrichissement de la langue française, FranceTerme
date parution JO: 2019-03-22
deconseille ou frequent: nanomachine
equivalent EN: molecular machine @en
equivalent EN: molecular machine (en)
definition: Nanoobjet que sa composition chimique rend sensible à un stimulus externe déclenchant des mouvements.
in scheme: Chimie
in scheme: Matériaux
in scheme: concepts
notation: CHIM610
note: 1. Des machines moléculaires peuvent être construites à partir de caténanes ou de rotaxanes.
note: 2. Les stimulus les plus utilisés sont la lumière, un courant électrique, un réactif chimique ou un changement de température.
note: 3. On trouve aussi, dans l’usage, le terme « nanomachine ».
related: nanoobjet
related: caténane
related: rotaxane
related: muscle moléculaire

muscle moléculaire
type: ConceptConcept
type: Concept
creator: Commission d'enrichissement de la langue française, FranceTerme
date parution JO: 2019-03-22
equivalent EN: molecular muscle @en
equivalent EN: molecular muscle (en)
definition: Machine moléculaire capable de se contracter ou de s’étirer sous l’action d’un stimulus externe.
in scheme: Chimie
in scheme: concepts
notation: CHIM611
related: machine moléculaire

chimie biomimétique
type: ConceptConcept
type: Concept
creator: Commission d'enrichissement de la langue française, FranceTerme
date parution JO: 2020-01-28
deconseille ou frequent: biomimétique
deconseille ou frequent: photosynthèse artificielle
equivalent EN: biomimetic chemistry @en
equivalent EN: biomimetic chemistry (en)
definition: Branche de la chimie qui imite les processus réactionnels se déroulant dans les milieux biologiques.
in scheme: Chimie
in scheme: concept-SD-chimie-biochimie
in scheme: concepts
notation: CHIM612
note: 1. La chimie biomimétique vise, par exemple, à imiter les réactions enzymatiques au moyen de catalyseurs synthétiques.
note: 2. La photosynthèse artificielle est un exemple de chimie biomimétique.
related: biomimétisme
related: biomimétique

chimie non biologique in vivo
type: ConceptConcept
type: Concept
creator: Commission d'enrichissement de la langue française, FranceTerme
date parution JO: 2020-01-28
deconseille ou frequent: bio-orthogonal chemistry
deconseille ou frequent: chimie bio-orthogonale
equivalent EN: bioorthogonal chemistry @en
equivalent EN: bioorthogonal chemistry (en)
alternative label: chimie bioorthogonale
definition: Branche de la chimie traitant des réactions chimiques qui se produisent dans les milieux biologiques sans interférer avec les réactions enzymatiques propres à ceux-ci.
in scheme: Chimie
in scheme: concept-SD-chimie-biochimie
in scheme: concepts
notation: CHIM613
note: La chimie non biologique in vivo permet, par exemple, de marquer des biomolécules in vivo afin de suivre un médicament ou de localiser une cible en imagerie médicale.

glissement chiral
type: ConceptConcept
type: Concept
creator: Commission d'enrichissement de la langue française, FranceTerme
date parution JO: 2020-01-28
equivalent EN: chiral switch @en
equivalent EN: chiral switch (en)
definition: Remplacement, dans un médicament, d’un principe actif initialement racémique par son eutomère.
in scheme: Chimie
in scheme: concept-SD-chimie-chimie-pharmaceutique
in scheme: concepts
notation: CHIM614
related: racémique
related: eutomère
related: chiral, -e

conception de substance active
type: ConceptConcept
type: Concept
creator: Commission d'enrichissement de la langue française, FranceTerme
date parution JO: 2020-01-28
equivalent EN: drug design @en
equivalent EN: drug design (en)
in scheme: Chimie
in scheme: concept-SD-chimie-chimie-pharmaceutique
in scheme: concepts
notation: CHIM615
related: tête de série
related: concept-SANT258

tête de série
type: ConceptConcept
type: Concept
creator: Commission d'enrichissement de la langue française, FranceTerme
date parution JO: 2020-01-28
equivalent EN: lead @en
equivalent EN: lead (en)
equivalent EN: lead compound @en
equivalent EN: lead compound (en)
alternative label: chef de file
definition: Substance pharmacologiquement active dont la structure chimique est modifiée de façon à engendrer une famille de substances pharmacologiquement plus actives ou mieux tolérées.
in scheme: Chimie
in scheme: concept-SD-chimie-chimie-pharmaceutique
in scheme: concepts
notation: CHIM616
related: conception de substance active
related: concept-SANT258

chimioinformatique
type: ConceptConcept
type: Concept
creator: Commission d'enrichissement de la langue française, FranceTerme
date parution JO: 2021-03-19
deconseille ou frequent: chemio informatics
deconseille ou frequent: chemo informatics
deconseille ou frequent: chimie informatique
deconseille ou frequent: chimie-informatique
equivalent EN: chemical informatics @en
equivalent EN: chemical informatics (en)
equivalent EN: cheminformatics @en
equivalent EN: cheminformatics (en)
equivalent EN: chemioinformatics @en
equivalent EN: chemioinformatics (en)
equivalent EN: chemoinformatics @en
equivalent EN: chemoinformatics (en)
part of speech: nom féminin
definition: Discipline scientifique dont l’objet est la conception et l’utilisation d’outils informatiques destinés à traiter des questions posées par la chimie et ses applications.
in scheme: Chimie
in scheme: Informatique
in scheme: concepts
notation: CHIM617
note: On trouve aussi, dans l’usage, le terme « chimie informatique ».
related: bioinformatique

bioinformatique
type: ConceptConcept
type: Concept
creator: Commission d'enrichissement de la langue française, FranceTerme
date parution JO: 2021-03-19
deconseille ou frequent: bio informatics
deconseille ou frequent: bioinformatic
equivalent EN: bioinformatics @en
equivalent EN: bioinformatics (en)
part of speech: nom féminin
definition: Discipline scientifique dont l’objet est la conception et l’utilisation d’outils informatiques destinés à traiter des questions posées par la biologie et ses applications.
in scheme: Biologie
in scheme: Chimie
in scheme: concept-SD-biologie-bioinformatique
in scheme: concept-SD-chimie-bioinformatique
in scheme: concepts
notation: CHIM619
related: chimioinformatique

polymère
type: ConceptConcept
type: Concept
creator: Commission d'enrichissement de la langue française, FranceTerme
date parution JO: 2001-04-18
equivalent EN: polymer @en
equivalent EN: polymer (en)
equivalent EN: polymeric @en
equivalent EN: polymeric (en)
part of speech: nom masculin
definition: Substance composée de macromolécules.
in scheme: Chimie
in scheme: concept-SD-chimie-chimie-macromoleculaire
in scheme: concept-SD-chimie-polymeres
in scheme: concepts
notation: CHIM62
note: Ce terme est également employé comme adjectif. Exemple : le polystyrène est un composé polymère.
related: atactique
related: bicaténaire
related: copolymère
related: dépolymérisation
related: échelle (en)
related: homopolymère
related: irrégulier, -ière
related: isotactique
related: linéaire
related: monocaténaire
related: multicaténaire
related: polymère à blocs
related: polymère à stéréoblocs
related: polymère greffé
related: polymère non uniforme
related: régulier, -ière
related: stéréorégulier, -ière
related: polymérisation en chaîne
related: prépolymère
related: spiro-
related: syndiotactique
related: tactique
related: téléchélique
related: unité configurationnelle élémentaire
related: macromolécule
related: monomère
related: oligomère
related: oxyfragmentable
related: polymérisation

carburation pulvérisante
type: ConceptConcept
type: Concept
creator: Commission d'enrichissement de la langue française, FranceTerme
date parution JO: 2020-01-28
deconseille ou frequent: carburation pulvérulente
equivalent EN: metal dusting @en
equivalent EN: metal dusting (en)
definition: Carburation d’un matériau métallique dans une atmosphère riche en monoxyde de carbone, qui conduit à sa désintégration en une fine poussière de particules métalliques et de graphite.
in scheme: Chimie
in scheme: Matériaux
in scheme: concepts
notation: CHIM620
note: 1. La désintégration du matériau s’amorce sous forme de piqûres ou de crevasses.
note: 2. La carburation pulvérisante est un processus de corrosion sévère, qui s’observe dans les industries chimiques de production d’hydrocarbures et dans les sites de traitement de minerai de fer.
related: graphite

microscopie à sonde locale
type: ConceptConcept
type: Concept
creator: Commission d'enrichissement de la langue française, FranceTerme
abbreviation: MCP
abbreviation: MSL
date parution JO: 2020-01-28
equivalent EN: SPM @en
equivalent EN: SPM (en)
equivalent EN: scanning probe microscopy @en
equivalent EN: scanning probe microscopy (en)
alternative label: microscopie en champ proche
definition: Technique qui permet d’obtenir une image à très haute résolution de la surface d’un échantillon, en balayant cette surface avec une pointe fine.
in scheme: Chimie
in scheme: Matériaux
in scheme: concept-SD-chimie-chimie-physique
in scheme: concept-SD-materiaux-chimie-physique
in scheme: concepts
notation: CHIM621
note: 1. La limite de résolution de la microscopie à sonde locale peut être inférieure à cent picomètres, ce qui permet de visualiser les atomes.
note: 2. La microscopie à effet tunnel, la microscopie à force atomique et la microscopie optique en champ proche sont des exemples de microscopie à sonde locale.
related: microscopie à force atomique
related: microscopie à effet tunnel
related: microscopie optique en champ proche

microscopie à force atomique
type: ConceptConcept
type: Concept
creator: Commission d'enrichissement de la langue française, FranceTerme
abbreviation: MFA
date parution JO: 2020-01-28
equivalent EN: AFM @en
equivalent EN: AFM (en)
equivalent EN: atomic force microscopy @en
equivalent EN: atomic force microscopy (en)
definition: Microscopie à sonde locale qui utilise la mesure des variations des forces attractives et répulsives s’exerçant entre les atomes de la pointe de la sonde et ceux de la surface de l’échantillon.
in scheme: Chimie
in scheme: Matériaux
in scheme: concept-SD-chimie-chimie-physique
in scheme: concept-SD-materiaux-chimie-physique
in scheme: concepts
notation: CHIM622
related: microscopie à sonde locale
related: microscopie à effet tunnel
related: microscopie optique en champ proche

microscopie à effet tunnel
type: ConceptConcept
type: Concept
creator: Commission d'enrichissement de la langue française, FranceTerme
abbreviation: MET
date parution JO: 2020-01-28
deconseille ou frequent: scanning tunneling electron microscopy
deconseille ou frequent: scanning tunneling microscopy
equivalent EN: STEM @en
equivalent EN: STEM (en)
equivalent EN: STM @en
equivalent EN: STM (en)
equivalent EN: scanning tunnelling electron microscopy @en
equivalent EN: scanning tunnelling electron microscopy (en)
equivalent EN: scanning tunnelling microscopy @en
equivalent EN: scanning tunnelling microscopy (en)
definition: Microscopie à sonde locale qui utilise la mesure de l’intensité du courant électrique dû au passage des électrons par effet tunnel entre la pointe de la sonde et la surface de l’échantillon.
in scheme: Chimie
in scheme: Matériaux
in scheme: concept-SD-chimie-chimie-physique
in scheme: concept-SD-materiaux-chimie-physique
in scheme: concepts
notation: CHIM624
note: La microscopie à effet tunnel nécessite que la pointe de la sonde et la surface de l’échantillon soient toutes deux conductrices.
related: microscopie à sonde locale
related: microscopie à force atomique
related: microscopie optique en champ proche

microscopie optique en champ proche
type: ConceptConcept
type: Concept
creator: Commission d'enrichissement de la langue française, FranceTerme
abbreviation: MOCP
abbreviation: MOSL
date parution JO: 2020-01-28
equivalent EN: NSOM @en
equivalent EN: NSOM (en)
equivalent EN: SNOM @en
equivalent EN: SNOM (en)
equivalent EN: near-field scanning optical microscopy @en
equivalent EN: near-field scanning optical microscopy (en)
equivalent EN: scanning near-field optical microscopy @en
equivalent EN: scanning near-field optical microscopy (en)
alternative label: microscopie optique à sonde locale
definition: Microscopie à sonde locale qui utilise une sonde dont la pointe est l’extrémité effilée d’une fibre optique capable de détecter le champ électromagnétique de faible portée présent à la surface de l’échantillon.
in scheme: Chimie
in scheme: Matériaux
in scheme: concept-SD-chimie-chimie-physique
in scheme: concept-SD-materiaux-chimie-physique
in scheme: concepts
notation: CHIM625
note: 1. La fibre optique peut également servir à créer le champ électromagnétique à la surface de l’échantillon.
note: 2. La limite de résolution de la microscopie optique en champ proche est de l’ordre de la longueur d’onde du rayonnement électromagnétique créant le champ électromagnétique à la surface.
related: microscopie à sonde locale
related: microscopie à force atomique
related: microscopie à effet tunnel

graphite
type: ConceptConcept
type: Concept
creator: Commission d'enrichissement de la langue française, FranceTerme
date parution JO: 2019-03-22
equivalent EN: graphite @en
equivalent EN: graphite (en)
part of speech: nom masculin
definition: Variété allotropique du carbone, qui se présente sous la forme d’un empilement d’un grand nombre de feuillets de graphène.
in scheme: Chimie
in scheme: Matériaux
in scheme: concepts
notation: CHIM626
related: graphène
related: carburation pulvérisante

piège
type: ConceptConcept
type: Concept
creator: Commission d'enrichissement de la langue française, FranceTerme
date parution JO: 2021-03-19
equivalent EN: trap @en
equivalent EN: trap (en)
part of speech: nom masculin
definition: Dispositif ou substance utilisés pour procéder à un piégeage.
in scheme: Chimie
in scheme: concepts
notation: CHIM627
note: Les zéolithes sont utilisées comme pièges pour le dioxyde de carbone et les ions métalliques.
related: piégeage
related: piège chimique
scope note: Cette publication annule et remplace celle du Journal officiel du 18 avril 2001.

piégeage
type: ConceptConcept
type: Concept
creator: Commission d'enrichissement de la langue française, FranceTerme
date parution JO: 2021-03-19
equivalent EN: trapping @en
equivalent EN: trapping (en)
part of speech: nom masculin
definition: Procédé consistant à inactiver, de façon temporaire ou définitive, ou à éliminer une entité moléculaire.
in scheme: Chimie
in scheme: concepts
notation: CHIM628
related: entité moléculaire
related: piège
related: piège chimique
scope note: Cette publication annule et remplace celle du Journal officiel du 18 avril 2001.

piège chimique
type: ConceptConcept
type: Concept
creator: Commission d'enrichissement de la langue française, FranceTerme
date parution JO: 2021-03-19
deconseille ou frequent: capteur chimique
equivalent EN: scavenger @en
equivalent EN: scavenger (en)
definition: Substance chimique qui inactive, de façon temporaire ou définitive, ou élimine une entité moléculaire par une réaction chimique.
in scheme: Chimie
in scheme: concepts
notation: CHIM629
note: 1. Un piège chimique est souvent utilisé pour piéger des intermédiaires réactionnels, tels des radicaux, afin de modifier le déroulement d’une réaction.
note: 2. Les cryptands sont des pièges chimiques.
note: 3. On trouve aussi le terme « capteur chimique », qui est déconseillé dans ce sens.
related: entité moléculaire
related: cryptand
related: piège
related: piégeage
scope note: Cette publication annule et remplace celle du terme « capteur » au Journal officiel du 18 avril 2001.

polymérisation
type: ConceptConcept
type: Concept
creator: Commission d'enrichissement de la langue française, FranceTerme
date parution JO: 2001-04-18
deconseille ou frequent: polymerisation
deconseille ou frequent: polymerization
equivalent EN: polymerisation (GB) @en
equivalent EN: polymerisation (en-GB)
equivalent EN: polymerization (US) @en
equivalent EN: polymerization (en-US)
part of speech: nom féminin
definition: Processus de transformation d'un monomère, ou d'un mélange de monomères, en polymère.
in scheme: Chimie
in scheme: concept-SD-chimie-chimie-macromoleculaire
in scheme: concepts
notation: CHIM63
related: copolymérisation
related: dépolymérisation
related: homopolymérisation
related: oligomérisation
related: polyaddition
related: polycondensation
related: polymérisation en chaîne
related: prépolymère
related: téléchélique
related: télomérisation
related: monomère
related: polymère

capteur analytique
type: ConceptConcept
type: Concept
creator: Commission d'enrichissement de la langue française, FranceTerme
date parution JO: 2021-03-19
deconseille ou frequent: senseur
deconseille ou frequent: senseur analytique
equivalent EN: analytical sensor @en
equivalent EN: analytical sensor (en)
equivalent EN: sensor @en
equivalent EN: sensor (en)
forme abregee: capteur, n.m.
definition: Dispositif d’analyse chimique spécifique qui permet de mesurer la concentration d’un analyte sans qu’il soit nécessaire d’ajouter de réactif à l’échantillon analysé.
in scheme: Chimie
in scheme: concept-SD-chimie-chimie-analytique
in scheme: concepts
notation: CHIM630
note: 1. Les capteurs analytiques effectuent généralement des mesures électrochimiques, par exemple ampérométriques ou potentiométriques, ainsi que des mesures colorimétriques ou piézoélectriques.
note: 2. On trouve aussi le terme « senseur », qui est à proscrire.
related: analyte
related: biocapteur

biocapteur
type: ConceptConcept
type: Concept
creator: Commission d'enrichissement de la langue française, FranceTerme
date parution JO: 2021-03-19
deconseille ou frequent: bio-capteur
deconseille ou frequent: bio-senser
deconseille ou frequent: bio-senseur
deconseille ou frequent: biocapteur à glucose
deconseille ou frequent: biosenseur
deconseille ou frequent: capteur biologique
equivalent EN: biosensor @en
equivalent EN: biosensor (en)
part of speech: nom masculin
definition: Dispositif d’analyse chimique qui comprend une molécule ou un complexe moléculaire biologiques reconnaissant un composé minéral ou organique, puis le transformant en une espèce chimique, ainsi qu’un capteur analytique détectant et quantifiant cette espèce.
in scheme: Biologie
in scheme: Chimie
in scheme: concept-SD-biologie-chimie-analytique
in scheme: concept-SD-chimie-chimie-analytique
in scheme: concepts
notation: CHIM631
note: 1. Dans le biocapteur à glucose, par exemple, de la glucose oxydase immobilisée sur une membrane produit localement de l’eau oxygénée qui est détectée par un capteur ampérométrique.
note: 2. Un biocapteur à glucose peut, par exemple, être implanté en sous-cutané chez un diabétique pour l’aider à surveiller sa glycémie.
note: 3. On trouve aussi le terme « biosenseur », qui est à proscrire.
related: capteur analytique

chromine
type: ConceptConcept
type: Concept
creator: Commission d'enrichissement de la langue française, FranceTerme
date parution JO: 2021-03-19
equivalent EN: chromina @en
equivalent EN: chromina (en)
equivalent EN: chromine @en
equivalent EN: chromine (en)
part of speech: nom féminin
definition: Nom trivial donné à l’oxyde de chrome III de structure cristalline rhomboédrique.
in scheme: Chimie
in scheme: concepts
notation: CHIM632
related: nom trivial
related: chrominoformeur, -euse

chrominoformeur, -euse
type: ConceptConcept
type: Concept
creator: Commission d'enrichissement de la langue française, FranceTerme
date parution JO: 2021-03-19
deconseille ou frequent: chromiaforming
deconseille ou frequent: chromina-forming
deconseille ou frequent: chromino-formeur
equivalent EN: chromia-forming @en
equivalent EN: chromia-forming (en)
part of speech: adjectif
definition: Se dit d’un alliage contenant suffisamment de chrome pour former à sa surface, lorsqu’il s’oxyde, une couche continue protectrice, composée majoritairement de chromine.
in scheme: Chimie
in scheme: concepts
notation: CHIM633
related: chromine

microplastique
type: ConceptConcept
type: Concept
creator: Commission d'enrichissement de la langue française, FranceTerme
date parution JO: 2021-03-19
deconseille ou frequent: micro plastique
deconseille ou frequent: microplastics
equivalent EN: microplastic @en
equivalent EN: microplastic (en)
part of speech: nom masculin
definition: Objet ou fragment de plastique dont la plus grande dimension externe est au moins micrométrique et au plus millimétrique.
in scheme: Environnement
in scheme: Matériaux
in scheme: concepts
notation: CHIM634
note: 1. Les microplastiques peuvent être des déchets ou des débris et deviennent une source de pollution quand ils se retrouvent dans l’environnement.
note: 2. Les microplastiques peuvent être des billes, des films, des fibres.
related: nanoplastique
related: macroplastique
related: continent de plastique

nanoplastique
type: ConceptConcept
type: Concept
creator: Commission d'enrichissement de la langue française, FranceTerme
date parution JO: 2021-03-19
deconseille ou frequent: nano plastique
deconseille ou frequent: nanoplastics
equivalent EN: nanoplastic @en
equivalent EN: nanoplastic (en)
part of speech: nom masculin
definition: Objet ou fragment de plastique dont la plus grande dimension externe est au moins nanométrique et au plus micrométrique.
in scheme: Environnement
in scheme: Matériaux
in scheme: concepts
notation: CHIM635
note: Les nanoplastiques peuvent être des déchets ou des débris et deviennent une source de pollution quand ils se retrouvent dans l’environnement.
related: microplastique
related: macroplastique

macroplastique
type: ConceptConcept
type: Concept
creator: Commission d'enrichissement de la langue française, FranceTerme
date parution JO: 2021-03-19
deconseille ou frequent: macro plastique
deconseille ou frequent: macroplastics
equivalent EN: macroplastic @en
equivalent EN: macroplastic (en)
part of speech: nom masculin
definition: Objet ou fragment de plastique dont la plus grande dimension externe est au moins millimétrique.
in scheme: Environnement
in scheme: Matériaux
in scheme: concepts
notation: CHIM636
note: Les macroplastiques peuvent être des déchets ou des débris et deviennent une source de pollution quand ils se retrouvent dans l’environnement.
related: microplastique
related: nanoplastique

plaxage
type: ConceptConcept
type: Concept
creator: Commission d'enrichissement de la langue française, FranceTerme
date parution JO: 2021-03-19
deconseille ou frequent: contre-collage
deconseille ou frequent: plastage
deconseille ou frequent: plaxé
equivalent EN: lamination @en
equivalent EN: lamination (en)
part of speech: nom masculin
definition: Procédé de collage à chaud et sous pression d’un film plastique sur un profilé ou une plaque.
in scheme: Matériaux
in scheme: concept-SD-materiaux-polymeres
in scheme: concepts
notation: CHIM637
note: Le plaxage est largement utilisé pour la fabrication de fenêtres, de portes ou de volets.

confinement quantique
type: ConceptConcept
type: Concept
creator: Commission d'enrichissement de la langue française, FranceTerme
date parution JO: 2022-03-31
equivalent EN: quantum confinement @en
equivalent EN: quantum confinement (en)
definition: Situation dans laquelle se trouve une particule lorsque, dans une, deux ou trois des dimensions de l’espace, ses déplacements sont restreints à des distances plus petites ou du même ordre de grandeur que la longueur d’onde associée, par la relation de de Broglie, à la quantité de mouvement de cette particule.
in scheme: Chimie
in scheme: Physique
in scheme: concept-SD-chimie-mecanique-quantique
in scheme: concept-SD-physique-mecanique-quantique
in scheme: concepts
notation: CHIM639
note: Le confinement quantique confère aux nanomatériaux semiconducteurs leurs propriétés électriques et optiques spécifiques.
related: puits quantique
related: nanomatériau
related: boîte quantique
related: fil quantique
related: feuillet quantique
related: puits de potentiel

réacteur discontinu
type: ConceptConcept
type: Concept
creator: Commission d'enrichissement de la langue française, FranceTerme
date parution JO: 2001-04-18
equivalent EN: batch reactor @en
equivalent EN: batch reactor (en)
definition: Réacteur dans lequel s'effectuent des transformations chimiques de durée limitée et par lots.
in scheme: Chimie
in scheme: concept-SD-chimie-chimie-industrielle
in scheme: concepts
notation: CHIM64

boîte quantique
type: ConceptConcept
type: Concept
creator: Commission d'enrichissement de la langue française, FranceTerme
date parution JO: 2022-03-31
deconseille ou frequent: boîte à photons
deconseille ou frequent: point quantique
equivalent EN: quantum dot @en
equivalent EN: quantum dot (en)
definition: Région de l’espace dans laquelle une particule est en confinement quantique dans les trois dimensions de l’espace.
in scheme: Chimie
in scheme: Physique
in scheme: concept-SD-chimie-mecanique-quantique
in scheme: concept-SD-physique-mecanique-quantique
in scheme: concepts
notation: CHIM640
note: 1. Un cristal nanométrique de semiconducteur peut être une boîte quantique pour les électrons.
note: 2. On trouve aussi l’expression « point quantique », qui est déconseillée.
related: puits quantique
related: confinement quantique
related: fil quantique
related: feuillet quantique
related: puits de potentiel
scope note: Cette publication annule et remplace celle du Journal officiel du 19 septembre 2015.

fil quantique
type: ConceptConcept
type: Concept
creator: Commission d'enrichissement de la langue française, FranceTerme
date parution JO: 2022-03-31
deconseille ou frequent: quantum string
equivalent EN: quantum wire @en
equivalent EN: quantum wire (en)
definition: Région de l’espace dans laquelle une particule est en confinement quantique dans deux des dimensions de l’espace.
in scheme: Chimie
in scheme: Physique
in scheme: concept-SD-chimie-mecanique-quantique
in scheme: concept-SD-physique-mecanique-quantique
in scheme: concepts
notation: CHIM642
note: Des atomes métalliques contenus dans un nanotube de carbone peuvent constituer un fil quantique pour les électrons.
related: puits quantique
related: nanotube
related: confinement quantique
related: boîte quantique
related: feuillet quantique
related: puits de potentiel

feuillet quantique
type: ConceptConcept
type: Concept
creator: Commission d'enrichissement de la langue française, FranceTerme
date parution JO: 2022-03-31
deconseille ou frequent: couche quantique
deconseille ou frequent: feuille quantique
equivalent EN: quantum sheet @en
equivalent EN: quantum sheet (en)
definition: Région de l’espace dans laquelle une particule est en confinement quantique dans une des dimensions de l’espace.
in scheme: Chimie
in scheme: Physique
in scheme: concept-SD-chimie-mecanique-quantique
in scheme: concept-SD-physique-mecanique-quantique
in scheme: concepts
notation: CHIM643
note: La couche centrale de certains semiconducteurs multicouches, par exemple une couche de silicium entre deux couches d’un alliage silicium-germanium, peut être un feuillet quantique pour les électrons.
related: puits quantique
related: confinement quantique
related: boîte quantique
related: fil quantique
related: puits de potentiel

puits de potentiel
type: ConceptConcept
type: Concept
creator: Commission d'enrichissement de la langue française, FranceTerme
date parution JO: 2022-03-31
deconseille ou frequent: potential trough
equivalent EN: potential well @en
equivalent EN: potential well (en)
definition: Région de l’espace à une, deux ou trois dimensions, où le potentiel associé à un champ de force présente un minimum notable.
in scheme: Chimie
in scheme: Physique
in scheme: concepts
notation: CHIM644
related: puits quantique
related: confinement quantique
related: boîte quantique
related: fil quantique
related: feuillet quantique

case quantique
type: ConceptConcept
type: Concept
creator: Commission d'enrichissement de la langue française, FranceTerme
date parution JO: 2022-03-31
equivalent EN: orbital box @en
equivalent EN: orbital box (en)
definition: Élément graphique schématique, généralement un carré ou un cercle, qui est associé à une orbitale atomique et permet de représenter l’état d’occupation, par les électrons, de la région de l’espace correspondant à cette orbitale.
in scheme: Chimie
in scheme: Physique
in scheme: concept-SD-chimie-mecanique-quantique
in scheme: concept-SD-physique-mecanique-quantique
in scheme: concepts
notation: CHIM645
note: 1. La configuration électronique d’un atome ou d’un ion est décrite par un ensemble de cases quantiques.
note: 2. Une case quantique est vide ou occupée par un ou deux électrons, figurés par des flèches dirigées vers le haut ou vers le bas selon le moment cinétique de spin de ces électrons dans un champ magnétique.
note: 3. Une case quantique est caractérisée par trois nombres quantiques qui résultent de la quantification, pour les électrons qui l’occupent, de l’énergie, du module du moment cinétique orbital et de la direction spatiale de ce dernier.
related: orbitale

réactif
type: ConceptConcept
type: Concept
creator: Commission d'enrichissement de la langue française, FranceTerme
date parution JO: 2001-04-18
equivalent EN: reactive @en
equivalent EN: reactive (en)
equivalent EN: reagent @en
equivalent EN: reagent (en)
part of speech: nom masculin
definition: Substance introduite pour prendre part à une réaction chimique.
in scheme: Chimie
in scheme: concepts
notation: CHIM65
note: 1. Le réactif n'est pas obligatoirement l'espèce réagissante ; ainsi, dans la nitration du benzène, HNO3 est le réactif et le cation NO2+ l'espèce réagissante.
note: 2. Le terme « réactif » s'emploie également comme adjectif pour indiquer une plus ou moins grande aptitude à participer à une réaction.
related: entité réagissante

réaction monotope
type: ConceptConcept
type: Concept
creator: Commission d'enrichissement de la langue française, FranceTerme
date parution JO: 2001-04-18
equivalent EN: one-pot reaction @en
equivalent EN: one-pot reaction (en)
definition: Réaction en plusieurs étapes successives effectuées dans le même récipient, sans isolement de produits intermédiaires.
in scheme: Chimie
in scheme: concepts
notation: CHIM66

relargage
type: ConceptConcept
type: Concept
creator: Commission d'enrichissement de la langue française, FranceTerme
date parution JO: 2001-04-18
equivalent EN: salting-out @en
equivalent EN: salting-out (en)
part of speech: nom masculin
definition: Séparation d'une substance en solution aqueuse provoquée par addition d'un électrolyte, généralement un sel.
in scheme: Chimie
in scheme: concepts
notation: CHIM67
note: Ce terme provient d'un mot provençal, relargar, qui signifie en ancien français « rélargir » ou « étendre ». Limité à l'origine à la savonnerie, il désignait l'action de verser une lessive dans l'huile afin de provoquer la coagulation des particules de savon.

réticulation
type: ConceptConcept
type: Concept
creator: Commission d'enrichissement de la langue française, FranceTerme
date parution JO: 2001-04-18
equivalent EN: cross-linkage @en
equivalent EN: cross-linkage (en)
equivalent EN: cross-linking @en
equivalent EN: cross-linking (en)
part of speech: nom féminin
definition: Formation d'un réseau tridimensionnel par création de liaisons entre les chaînes macromoléculaires d'un polymère.
in scheme: Chimie
in scheme: concept-SD-chimie-chimie-macromoleculaire
in scheme: concepts
notation: CHIM68
related: vitrimère
related: nœud de réticulation

structure fondamentale
type: ConceptConcept
type: Concept
creator: Commission d'enrichissement de la langue française, FranceTerme
date parution JO: 2001-04-18
deconseille ou frequent: structure parentale
equivalent EN: parent structure @en
equivalent EN: parent structure (en)
definition: Structure possédant un nom systématique, semi-systématique ou trivial, servant de base à la construction du nom d'un dérivé.
in scheme: Chimie
in scheme: concepts
notation: CHIM69
note: L'expression « structure parentale » est déconseillée.
related: indice de valence formelle
related: nom fondamental
related: nom semi-systématique
related: nom systématique
related: nom trivial

bathochrome
type: ConceptConcept
type: Concept
creator: Commission d'enrichissement de la langue française, FranceTerme
antonym: hypsochrome
date parution JO: 2001-04-18
equivalent EN: bathochromic @en
equivalent EN: bathochromic (en)
part of speech: adjectif
definition: Qui provoque un déplacement du spectre électronique d'absorption, ou d'émission, d'une entité moléculaire vers des fréquences plus basses.
in scheme: Chimie
in scheme: concept-SD-chimie-spectroscopie
in scheme: concepts
notation: CHIM7
note: Du grec bathos, « profondeur » et khrôma, « couleur ».
related: chromophore

tautomère
type: ConceptConcept
type: Concept
creator: Commission d'enrichissement de la langue française, FranceTerme
date parution JO: 2001-04-18
equivalent EN: tautomer @en
equivalent EN: tautomer (en)
equivalent EN: tautomeric @en
equivalent EN: tautomeric (en)
part of speech: nom masculin
definition: L'un des isomères dont les structures diffèrent par la position d'un atome, en général d'hydrogène, et d'une ou de plusieurs liaisons multiples et qui sont capables de se transformer facilement et réversiblement l'un en l'autre.
in scheme: Chimie
in scheme: concepts
notation: CHIM70
note: 1. Ce terme est également employé comme adjectif. Exemple : l'acétone et l'énol dérivé de l'acétone sont des composés tautomères.
note: 2. L'équilibre qui s'établit peut être déplacé plus ou moins complètement vers l'un ou l'autre des participants.
related: stéréo-isomère
related: isomère

tensio-actif, -ive
type: ConceptConcept
type: Concept
creator: Commission d'enrichissement de la langue française, FranceTerme
date parution JO: 2001-04-18
deconseille ou frequent: agent tensio-actif
deconseille ou frequent: tensioactif
deconseille ou frequent: tensioactive
equivalent EN: surface active agent @en
equivalent EN: surface active agent (en)
equivalent EN: surfactant @en
equivalent EN: surfactant (en)
part of speech: adjectif
alternative label: surfactif, -ive
definition: Se dit d'un agent chimique dont la présence à une interface entre deux fluides entraîne l'abaissement de la tension interfaciale.
in scheme: Chimie
in scheme: concepts
notation: CHIM71
note: Ce terme est également employé comme nom (forme abrégée d'« agent tensio-actif »). Exemple : Les savons sont des tensio-actifs.
related: amphiphile

tension
type: ConceptConcept
type: Concept
creator: Commission d'enrichissement de la langue française, FranceTerme
date parution JO: 2001-04-18
equivalent EN: strain @en
equivalent EN: strain (en)
part of speech: nom féminin
definition: Augmentation de l'énergie potentielle d'une entité moléculaire due à une déviation d'angles de liaisons, à des conformations défavorables ou à d'autres interactions répulsives à travers l'espace.
in scheme: Chimie
in scheme: concepts
notation: CHIM72
note: Une évaluation quantitative de la tension est fournie par la différence entre l'enthalpie de la structure concernée et celle d'une structure de référence non contrainte, réelle ou hypothétique, constituée par les mêmes atomes liés par des liaisons du même type.

thermolyse
type: ConceptConcept
type: Concept
creator: Commission d'enrichissement de la langue française, FranceTerme
date parution JO: 2001-04-18
equivalent EN: thermolysis @en
equivalent EN: thermolysis (en)
part of speech: nom féminin
definition: Rupture d'une ou de plusieurs liaisons covalentes, consécutive à l'exposition d'un composé à une élévation de température, ou tout processus dans lequel une telle rupture joue un rôle essentiel.
in scheme: Chimie
in scheme: concepts
notation: CHIM73
related: liaison covalente
related: photolyse
related: décomposition de l'eau
related: décomposition thermique de la biomasse

traitement conclusif
type: ConceptConcept
type: Concept
creator: Commission d'enrichissement de la langue française, FranceTerme
date parution JO: 2001-04-18
equivalent EN: work up @en
equivalent EN: work up (en)
alternative label: traitement final
definition: Traitement d'un mélange issu d'une réaction dans la phase finale d'une préparation en vue de l'isolement du ou des composés formés.
in scheme: Chimie
in scheme: concepts
notation: CHIM74

transitoire
type: ConceptConcept
type: Concept
creator: Commission d'enrichissement de la langue française, FranceTerme
date parution JO: 2001-04-18
equivalent EN: transient @en
equivalent EN: transient (en)
part of speech: adjectif
definition: Se dit d'une entité moléculaire à courte durée de vie.
in scheme: Chimie
in scheme: concepts
notation: CHIM75

achiral, -e
type: ConceptConcept
type: Concept
creator: Commission d'enrichissement de la langue française, FranceTerme
date parution JO: 2001-04-18
equivalent EN: achiral @en
equivalent EN: achiral (en)
part of speech: adjectif
definition: Se dit d'un objet, en particulier d'une entité moléculaire, superposable à son image dans un miroir.
in scheme: Chimie
in scheme: concept-SD-chimie-stereochimie
in scheme: concepts
notation: CHIM76
note: « Ch » se prononce [k].
related: prochiralité
related: chiral, -e
related: chiralité

activité optique
type: ConceptConcept
type: Concept
creator: Commission d'enrichissement de la langue française, FranceTerme
date parution JO: 2001-04-18
equivalent EN: optical activity @en
equivalent EN: optical activity (en)
definition: Propriété qu'a une entité chimique ou physique chirale de faire tourner le plan de polarisation d'un faisceau de lumière polarisée plane.
in scheme: Chimie
in scheme: concept-SD-chimie-stereochimie
in scheme: concepts
notation: CHIM77
note: L’activité optique se manifeste aussi par la dispersion rotatoire, le dichroïsme circulaire et la polarisation circulaire d'émission.
related: dextrogyre
related: lévogyre
related: pouvoir rotatoire
related: chiralité
related: chiroptique

angle de torsion
type: ConceptConcept
type: Concept
creator: Commission d'enrichissement de la langue française, FranceTerme
date parution JO: 2001-04-18
equivalent EN: torsion angle @en
equivalent EN: torsion angle (en)
definition: Dans un enchaînement non linéaire d'atomes A-B-C-D, angle dièdre formé par le plan contenant les atomes A, B, C et celui qui contient les atomes B, C, D.
in scheme: Chimie
in scheme: concept-SD-chimie-stereochimie
in scheme: concepts
notation: CHIM78
note: L'enchaînement étant regardé dans l'axe de la liaison B-C, l'angle de torsion entre les liaisons A-B et C-D est considéré comme positif si la liaison A-B est tournée dans le sens des aiguilles d'une montre de moins de 180° en vue d'éclipser la liaison C-D ; un angle de torsion négatif nécessite une rotation dans le sens opposé.
related: conformation gauche
related: conformation synclinale
related: conformation synpériplanaire
related: barrière de rotation
related: conformation anticlinale
related: conformation antipériplanaire
related: conformation décalée
related: conformation éclipsée

anomère
type: ConceptConcept
type: Concept
creator: Commission d'enrichissement de la langue française, FranceTerme
date parution JO: 2001-04-18
equivalent EN: anomer @en
equivalent EN: anomer (en)
equivalent EN: anomeric @en
equivalent EN: anomeric (en)
part of speech: adjectif
alternative label: anomérique
definition: Se dit de chacun des diastéréo-isomères de glycosides, d'hémiacétals cycliques, de formes également cycliques de sucres, ou de molécules apparentées qui ne diffèrent que par la configuration du C-1 dans le cas d'un aldose, du C-2 dans le cas d'un 2-cétose, etc.
in scheme: Chimie
in scheme: concept-SD-chimie-stereochimie
in scheme: concepts
notation: CHIM79
note: 1. Le terme « anomère » est également employé comme substantif.
note: 2. Du grec ano, « en tête », et meros, « partie ».
related: épimère

atropisomère
type: ConceptConcept
type: Concept
creator: Commission d'enrichissement de la langue française, FranceTerme
date parution JO: 2001-04-18
equivalent EN: atropisomer @en
equivalent EN: atropisomer (en)
part of speech: nom masculin
definition: Conformère pouvant être isolé sous forme d'espèce chimique distincte et résultant d'une rotation restreinte autour d'une liaison simple.
in scheme: Chimie
in scheme: concept-SD-chimie-stereochimie
in scheme: concepts
notation: CHIM80
note: 1. Du grec a, privatif, tropein, « tourner », et meros, « partie ».
note: 2. Se rencontre, par exemple, chez les biphényles ortho-disubstitués.
related: conformère

barrière de rotation
type: ConceptConcept
type: Concept
creator: Commission d'enrichissement de la langue française, FranceTerme
date parution JO: 2001-04-18
equivalent EN: rotational barrier @en
equivalent EN: rotational barrier (en)
definition: Différence entre un minimum donné et un maximum voisin de l'énergie potentielle d'une entité moléculaire dans une modification conformationnelle résultant d'une rotation autour d'une liaison.
in scheme: Chimie
in scheme: concept-SD-chimie-stereochimie
in scheme: concepts
notation: CHIM81
related: angle de torsion

centre chiral
type: ConceptConcept
type: Concept
creator: Commission d'enrichissement de la langue française, FranceTerme
date parution JO: 2001-04-18
deconseille ou frequent: chiral center
deconseille ou frequent: chiral centre
equivalent EN: chiral center (US) @en
equivalent EN: chiral center (en-US)
equivalent EN: chiral centre (GB) @en
equivalent EN: chiral centre (en-GB)
definition: Atome maintenant un ensemble d'atomes ou de groupes d'atomes dans une disposition non superposable à son image dans un miroir.
in scheme: Chimie
in scheme: concept-SD-chimie-stereochimie
in scheme: concepts
notation: CHIM82
note: 1. L'exemple classique de centre chiral est l'atome de carbone asymétrique Cabcd.
note: 2. Cette expression peut s'appliquer à des structures tétraédriques, octaédriques ou à des pyramides trigonales.
note: 3. « Ch » se prononce [k].
related: stéréogène
related: chiralité
related: configuration absolue

chiral, -e
type: ConceptConcept
type: Concept
creator: Commission d'enrichissement de la langue française, FranceTerme
date parution JO: 2001-04-18
equivalent EN: chiral @en
equivalent EN: chiral (en)
part of speech: adjectif
definition: Se dit d'un objet, en particulier d'une entité moléculaire, non superposable à son image dans un miroir.
in scheme: Chimie
in scheme: concept-SD-chimie-stereochimie
in scheme: concepts
notation: CHIM83
note: 1. Le terme a été étendu improprement à des substances dont toutes les molécules sont chirales même si l'assemblage macroscopique de ces molécules est racémique.
note: 2. « Ch » se prononce [k].
related: distomère
related: eutomère
related: glissement chiral
related: achiral, -e
related: chiralité

chiralité
type: ConceptConcept
type: Concept
creator: Commission d'enrichissement de la langue française, FranceTerme
date parution JO: 2001-04-18
equivalent EN: chirality @en
equivalent EN: chirality (en)
equivalent EN: handedness @en
equivalent EN: handedness (en)
part of speech: nom féminin
definition: Propriété géométrique d'un objet, en particulier d'une entité moléculaire, non superposable à son image dans un miroir.
in scheme: Chimie
in scheme: concept-SD-chimie-stereochimie
in scheme: concepts
notation: CHIM84
note: « Ch » se prononce [k].
related: énantiomère
related: énantiomorphe
related: induction asymétrique
related: prochiral, -e
related: prochiralité
related: achiral, -e
related: activité optique
related: centre chiral
related: chiral, -e
related: configuration absolue

chiroptique
type: ConceptConcept
type: Concept
creator: Commission d'enrichissement de la langue française, FranceTerme
date parution JO: 2001-04-18
equivalent EN: chiroptic @en
equivalent EN: chiroptic (en)
equivalent EN: chiroptical @en
equivalent EN: chiroptical (en)
part of speech: adjectif
definition: Qualifie les techniques optiques utilisées pour l'étude de la chiralité des molécules.
in scheme: Chimie
in scheme: concept-SD-chimie-stereochimie
in scheme: concepts
notation: CHIM85
note: 1. S'applique, par exemple, à la polarimétrie, aux mesures de la dispersion rotatoire optique et du dichroïsme circulaire.
note: 2. « Ch » se prononce [k].
related: activité optique

composé méso
type: ConceptConcept
type: Concept
creator: Commission d'enrichissement de la langue française, FranceTerme
date parution JO: 2001-04-18
equivalent EN: meso-compound @en
equivalent EN: meso-compound (en)
definition: Espèce chimique constituée d'entités moléculaires achirales du fait de la présence, par paires, de groupes énantiotopes.
in scheme: Chimie
in scheme: concept-SD-chimie-stereochimie
in scheme: concepts
notation: CHIM86
note: 1. Du grec mesos, « situé au milieu ».
note: 2. « Méso » a pour origine le qualificatif « mésotartrique » attribué à l'acide tartrique optiquement inactif, indédoublable, découvert par Pasteur.
note: 3. « Méso » est à considérer comme le stéréodescripteur attribué à un membre achiral d'un ensemble de diastéréo-isomères comportant au moins un membre chiral.
related: dédoublement d'un racémique
related: énantiotope
related: stéréodescripteur

composé racémique
type: ConceptConcept
type: Concept
creator: Commission d'enrichissement de la langue française, FranceTerme
date parution JO: 2001-04-18
equivalent EN: racemic compound @en
equivalent EN: racemic compound (en)
definition: Composé cristallin homogène formé par deux énantiomères présents en quantités égales dans la maille élémentaire.
in scheme: Chimie
in scheme: concept-SD-chimie-stereochimie
in scheme: concepts
notation: CHIM87
related: conglomérat racémique
related: énantiomère
related: racémique

configuration
type: ConceptConcept
type: Concept
creator: Commission d'enrichissement de la langue française, FranceTerme
date parution JO: 2001-04-18
equivalent EN: configuration @en
equivalent EN: configuration (en)
part of speech: nom féminin
definition: Disposition spatiale des atomes ou des groupes d'atomes d'une entité moléculaire, propre aux stéréo-isomères dont l'isomérie n'est pas due à des différences de conformation.
in scheme: Chimie
in scheme: concept-SD-chimie-stereochimie
in scheme: concepts
notation: CHIM88
related: constitution d'une entité moléculaire
related: configurationnel, -elle
related: conformation

configuration absolue
type: ConceptConcept
type: Concept
creator: Commission d'enrichissement de la langue française, FranceTerme
date parution JO: 2001-04-18
equivalent EN: absolute configuration @en
equivalent EN: absolute configuration (en)
definition: Disposition spatiale des atomes ou des groupes d'atomes d'une entité moléculaire chirale ou d'un groupe chiral qui distingue cette entité ou ce groupe de son image dans un miroir.
in scheme: Chimie
in scheme: concept-SD-chimie-stereochimie
in scheme: concepts
notation: CHIM89
note: La configuration absolue peut être décrite par des stéréodescripteurs conventionnels tels que R ou S.
related: règles séquentielles
related: stéréodescripteur
related: centre chiral
related: chiralité
related: configuration relative

chimie médicolégale
type: ConceptConcept
type: Concept
creator: Commission d'enrichissement de la langue française, FranceTerme
date parution JO: 2001-04-18
equivalent EN: forensic chemistry @en
equivalent EN: forensic chemistry (en)
equivalent EN: legal chemistry @en
equivalent EN: legal chemistry (en)
definition: Partie de la chimie et de la toxicologie qui traite des procédés utilisés pour aider la justice dans ses investigations.
in scheme: Chimie
in scheme: concept-SD-chimie-chimie-analytique
in scheme: concepts
notation: CHIM9

configurationnel, -elle
type: ConceptConcept
type: Concept
creator: Commission d'enrichissement de la langue française, FranceTerme
date parution JO: 2001-04-18
equivalent EN: configurational @en
equivalent EN: configurational (en)
part of speech: adjectif
definition: Qui est relatif à la configuration.
in scheme: Chimie
in scheme: concept-SD-chimie-stereochimie
in scheme: concepts
notation: CHIM90
note: Exemple : isomère configurationnel.
related: configuration

configuration relative
type: ConceptConcept
type: Concept
creator: Commission d'enrichissement de la langue française, FranceTerme
date parution JO: 2001-04-18
equivalent EN: relative configuration @en
equivalent EN: relative configuration (en)
definition: Configuration de tout centre stéréogène par rapport à tout autre centre stéréogène contenu dans la même entité moléculaire.
in scheme: Chimie
in scheme: concept-SD-chimie-stereochimie
in scheme: concepts
notation: CHIM91
note: À la différence de la configuration absolue, la configuration relative demeure inchangée par réflexion.
related: stéréogène
related: configuration absolue

conformation
type: ConceptConcept
type: Concept
creator: Commission d'enrichissement de la langue française, FranceTerme
date parution JO: 2001-04-18
equivalent EN: conformation @en
equivalent EN: conformation (en)
part of speech: nom féminin
definition: Disposition spatiale des atomes ou des groupes d'atomes d'une entité moléculaire s'appliquant à des structures stéréo-isomères qui peuvent être interconverties par des rotations autour de liaisons simples.
in scheme: Chimie
in scheme: concept-SD-chimie-stereochimie
in scheme: concepts
notation: CHIM92
related: conformationnel, -elle
related: conformère
related: constitution d'une entité moléculaire
related: configuration

conformation anticlinale
type: ConceptConcept
type: Concept
creator: Commission d'enrichissement de la langue française, FranceTerme
date parution JO: 2001-04-18
equivalent EN: anticlinal conformation @en
equivalent EN: anticlinal conformation (en)
definition: Conformation d'un édifice moléculaire dans laquelle les trois liaisons formées par deux atomes ou groupes attachés à deux atomes adjacents forment un angle de torsion compris entre + 90° et + 150° ou entre - 90° et - 150°.
in scheme: Chimie
in scheme: concept-SD-chimie-stereochimie
in scheme: concepts
notation: CHIM93
note: 1. Du grec antiklinein, « faire pencher en sens contraire ».
note: 2. Une telle conformation peut être décrite par le symbole ac.
related: conformation synclinale
related: conformation synpériplanaire
related: angle de torsion
related: conformation antipériplanaire
related: conformation décalée

conformation antipériplanaire
type: ConceptConcept
type: Concept
creator: Commission d'enrichissement de la langue française, FranceTerme
date parution JO: 2001-04-18
equivalent EN: antiperiplanar conformation @en
equivalent EN: antiperiplanar conformation (en)
definition: Conformation d'un édifice moléculaire dans laquelle les trois liaisons formées par deux atomes ou groupes attachés à deux atomes adjacents forment un angle de torsion compris entre + 150° et + 180° ou entre - 150° et - 180°.
in scheme: Chimie
in scheme: concept-SD-chimie-stereochimie
in scheme: concepts
notation: CHIM94
note: 1. Du grec anti, « en opposition », et peri, « autour de », et du latin planus, « plan ».
note: 2. Une telle conformation peut être décrite par le symbole ap.
related: conformation synclinale
related: conformation synpériplanaire
related: angle de torsion
related: conformation anticlinale
related: conformation éclipsée

conformation croisée
type: ConceptConcept
type: Concept
creator: Commission d'enrichissement de la langue française, FranceTerme
date parution JO: 2001-04-18
deconseille ou frequent: conformation en bateau-croisé
deconseille ou frequent: conformation flexible
deconseille ou frequent: conformation torsadée
equivalent EN: skew conformation @en
equivalent EN: skew conformation (en)
equivalent EN: twist conformation @en
equivalent EN: twist conformation (en)
definition: Conformation intermédiaire du cyclohexane de symétrie D2 observée dans l'interconversion de deux conformations en chaise.
in scheme: Chimie
in scheme: concept-SD-chimie-stereochimie
in scheme: concepts
notation: CHIM95
note: Elle est également qualifiée de « conformation en bateau-croisé », « conformation flexible » ou « conformation torsadée ».
related: conformation en bateau
related: conformation en chaise

conformation décalée
type: ConceptConcept
type: Concept
creator: Commission d'enrichissement de la langue française, FranceTerme
date parution JO: 2001-04-18
equivalent EN: staggered conformation @en
equivalent EN: staggered conformation (en)
definition: Conformation d'un édifice moléculaire dans laquelle les trois liaisons formées par deux atomes ou groupes attachés à deux atomes adjacents forment un angle de torsion tel que les atomes ou groupes ne présentent pas d'interactions éclipsées.
in scheme: Chimie
in scheme: concept-SD-chimie-stereochimie
in scheme: concepts
notation: CHIM96
note: Les angles de torsion sont alors égaux à (ou voisins de) + ou - 60°, + ou - 120° ou 180°.
related: conformation gauche
related: conformation synclinale
related: angle de torsion
related: conformation anticlinale
related: conformation éclipsée

conformation éclipsée
type: ConceptConcept
type: Concept
creator: Commission d'enrichissement de la langue française, FranceTerme
date parution JO: 2001-04-18
equivalent EN: eclipsed conformation @en
equivalent EN: eclipsed conformation (en)
definition: Conformation d'un édifice moléculaire dans laquelle les trois liaisons formées par deux atomes ou groupes attachés à deux atomes adjacents forment un angle de torsion égal à (ou voisin de) 0° et, de ce fait, dans laquelle les atomes ou groupes apparaissent comme plus ou moins superposés.
in scheme: Chimie
in scheme: concept-SD-chimie-stereochimie
in scheme: concepts
notation: CHIM97
note: Cette conformation correspond sensiblement à celle définie par l'expression « conformation synpériplanaire ».
related: conformation synpériplanaire
related: angle de torsion
related: conformation antipériplanaire
related: conformation décalée

conformation en bateau
type: ConceptConcept
type: Concept
creator: Commission d'enrichissement de la langue française, FranceTerme
date parution JO: 2001-04-18
equivalent EN: boat conformation @en
equivalent EN: boat conformation (en)
forme abregee: conformation bateau
definition: Conformation du cyclohexane de symétrie C2v dans laquelle les atomes de carbone 1, 2, 4 et 5 occupent des positions coplanaires tandis que les atomes de carbone 3 et 6 se situent du même côté du plan ainsi défini.
in scheme: Chimie
in scheme: concept-SD-chimie-stereochimie
in scheme: concepts
notation: CHIM98
note: Une conformation similaire peut se rencontrer également chez certains composés à grands cycles.
related: liaison de type beaupré
related: liaison de type mât
related: conformation croisée
related: conformation en chaise

conformation en chaise
type: ConceptConcept
type: Concept
creator: Commission d'enrichissement de la langue française, FranceTerme
date parution JO: 2001-04-18
equivalent EN: chair conformation @en
equivalent EN: chair conformation (en)
forme abregee: conformation chaise
definition: Conformation du cyclohexane de symétrie D3d dans laquelle les atomes de carbone 1, 2, 4 et 5 occupent des positions coplanaires tandis que les atomes de carbone 3 et 6 se situent de part et d'autre du plan ainsi défini.
in scheme: Chimie
in scheme: concept-SD-chimie-stereochimie
in scheme: concepts
notation: CHIM99
note: Une conformation similaire peut se rencontrer également chez certains composés à grands cycles.
related: liaison axiale
related: liaison équatoriale
related: conformation croisée
related: conformation en bateau

atténuation
type: ConceptConcept
type: Concept
creator: Commission d'enrichissement de la langue française, FranceTerme
date parution JO: 2011-09-18
equivalent EN: attenuation @en
equivalent EN: attenuation (en)
part of speech: nom féminin
definition: Diminution, artificiellement provoquée, de la virulence d'une bactérie ou d'un virus, permettant d'utiliser comme vaccin la souche ainsi traitée.
in scheme: Biologie
in scheme: concept-SD-biologie-bacteriologie
in scheme: concept-SD-biologie-virologie
in scheme: concepts
notation: COGB1

anti-hormone
type: ConceptConcept
type: Concept
creator: Commission d'enrichissement de la langue française, FranceTerme
date parution JO: 2011-09-18
equivalent EN: anti-hormone @en
equivalent EN: anti-hormone (en)
part of speech: nom féminin
definition: Molécule qui se fixe sur les récepteurs d'une hormone et agit comme antagoniste.
in scheme: Biologie
in scheme: concept-SD-biologie-biochimie-et-biologie-moleculaire
in scheme: concepts
notation: COGB10
related: récepteur
related: antagoniste

point chaud de recombinaison
type: ConceptConcept
type: Concept
creator: Commission d'enrichissement de la langue française, FranceTerme
date parution JO: 2012-06-10
equivalent EN: recombination hot spot @en
equivalent EN: recombination hot spot (en)
equivalent EN: recombination hotspot @en
equivalent EN: recombination hotspot (en)
definition: Site d'une molécule d'ADN où les recombinaisons surviennent beaucoup plus souvent qu'aux autres sites.
in scheme: Biologie
in scheme: concept-SD-biologie-biochimie-et-biologie-moleculaire
in scheme: concept-SD-biologie-genetique
in scheme: concepts
notation: COGB100
related: recombinaison génétique
related: recombinaison homologue
related: recombinaison hétérologue

polymorphisme de l'ADN révélé par amplification aléatoire
type: ConceptConcept
type: Concept
creator: Commission d'enrichissement de la langue française, FranceTerme
abbreviation: RAPD @en
date parution JO: 2012-06-10
equivalent EN: RAPD @en
equivalent EN: RAPD (en)
equivalent EN: random amplified polymorphic DNA @en
equivalent EN: random amplified polymorphic DNA (en)
definition: Polymorphisme de séquences dispersées dans le génome, qui est révélé par une amplification en chaîne par polymérase à l'aide de courtes amorces de 10 bases arbitraires allant se fixer au hasard sur l'ADN cible.
in scheme: Biologie
in scheme: concept-SD-biologie-biochimie-et-biologie-moleculaire
in scheme: concepts
notation: COGB101
note: L'analyse du polymorphisme de l'ADN révélé par amplification aléatoire permet d'établir des cartes génétiques et d'obtenir des marqueurs pour l'examen de certains caractères.
related: amplification en chaîne par polymérase
related: amorce

polymorphisme de site de restriction
type: ConceptConcept
type: Concept
creator: Commission d'enrichissement de la langue française, FranceTerme
abbreviation: RSP @en
date parution JO: 2012-06-10
equivalent EN: RSP @en
equivalent EN: RSP (en)
equivalent EN: restriction site polymorphism @en
equivalent EN: restriction site polymorphism (en)
definition: Polymorphisme concernant deux allèles dont l'un possède un site de restriction spécifique, l'autre non.
in scheme: Biologie
in scheme: concept-SD-biologie-biochimie-et-biologie-moleculaire
in scheme: concepts
notation: COGB102
related: site de restriction

prémunition
type: ConceptConcept
type: Concept
creator: Commission d'enrichissement de la langue française, FranceTerme
date parution JO: 2012-06-10
equivalent EN: premunition @en
equivalent EN: premunition (en)
part of speech: nom féminin
definition: Absence de symptômes chez une plante infectée par une souche forte d'un virus, due à l'infection préalable par une souche faible d'un même type de virus.
in scheme: Biologie
in scheme: concept-SD-biologie-biologie-vegetale
in scheme: concept-SD-biologie-virologie
in scheme: concepts
notation: COGB103

protéine de coup de chaleur
type: ConceptConcept
type: Concept
creator: Commission d'enrichissement de la langue française, FranceTerme
abbreviation: HSP @en
date parution JO: 2012-06-10
equivalent EN: HSP @en
equivalent EN: HSP (en)
equivalent EN: heat shock protein @en
equivalent EN: heat shock protein (en)
definition: Protéine de stress que synthétisent les plantes, les animaux et les microorganismes soumis à une température supérieure de 5 à 15 °C à leur température normale de croissance.
in scheme: Biologie
in scheme: concept-SD-biologie-biochimie-et-biologie-moleculaire
in scheme: concepts
notation: COGB104
note: La plupart des protéines de coup de chaleur sont des protéines chaperons.
related: protéine de coup de froid
related: protéine de stress
related: protéine chaperon

protéine de coup de froid
type: ConceptConcept
type: Concept
creator: Commission d'enrichissement de la langue française, FranceTerme
abbreviation: CSP @en
date parution JO: 2012-06-10
equivalent EN: CSP @en
equivalent EN: CSP (en)
equivalent EN: cold shock protein @en
equivalent EN: cold shock protein (en)
definition: Protéine de stress qui se lie aux acides nucléiques et se comporte comme un activateur de la transcription chez les plantes, les animaux et les microorganismes exposés à une chute brutale de température.
in scheme: Biologie
in scheme: concept-SD-biologie-biochimie-et-biologie-moleculaire
in scheme: concepts
notation: COGB105
related: protéine de coup de chaleur
related: protéine de stress

protéine de stress
type: ConceptConcept
type: Concept
creator: Commission d'enrichissement de la langue française, FranceTerme
date parution JO: 2012-06-10
equivalent EN: stress protein @en
equivalent EN: stress protein (en)
definition: Protéine dont la synthèse est accélérée chez les plantes, les animaux et les microorganismes, en réponse à des situations défavorables d'origine très diverse.
in scheme: Biologie
in scheme: concept-SD-biologie-biochimie-et-biologie-moleculaire
in scheme: concepts
notation: COGB106
note: 1. L'anoxie, l'élévation ou la chute brutale de la température, la sécheresse, la salinité ou l'exposition aux UV, à des toxines, à des virus, aux radicaux libres, aux analogues d'acides aminés sont des exemples de situation défavorable.
note: 2. Les protéines de stress se comportent comme des protéines chaperons et peuvent donc limiter la dénaturation des protéines provoquée par le stress.
related: protéine de coup de chaleur
related: protéine de coup de froid
related: protéine chaperon

protéine de liaison avec la boîte TATA
type: ConceptConcept
type: Concept
creator: Commission d'enrichissement de la langue française, FranceTerme
abbreviation: TBP @en
date parution JO: 2012-06-10
equivalent EN: TATA-box-binding protein @en
equivalent EN: TATA-box-binding protein (en)
equivalent EN: TBP @en
equivalent EN: TBP (en)
definition: Protéine qui reconnaît la boîte TATA et, en se liant à elle, détermine le site d'initiation de la transcription.
in scheme: Biologie
in scheme: concept-SD-biologie-biochimie-et-biologie-moleculaire
in scheme: concepts
notation: COGB107
related: promoteur
related: site d'initiation de la transcription

protéine de liaison avec l'ADN simple brin
type: ConceptConcept
type: Concept
creator: Commission d'enrichissement de la langue française, FranceTerme
abbreviation: SSB protein @en
date parution JO: 2012-06-10
deconseille ou frequent: protéine SSB
equivalent EN: SSB protein @en
equivalent EN: SSB protein (en)
equivalent EN: single-strand binding protein @en
equivalent EN: single-strand binding protein (en)
definition: Protéine qui, en se liant à chacun des brins d'ADN parental au niveau de la fourche de réplication, empêche que ceux-ci ne s'apparient avant leur copie.
in scheme: Biologie
in scheme: concept-SD-biologie-biochimie-et-biologie-moleculaire
in scheme: concepts
notation: COGB108
note: On trouve aussi, dans le langage professionnel, l'expression « protéine SSB », qui n'est pas recommandée.
related: fourche de réplication

protéine-kinase
type: ConceptConcept
type: Concept
creator: Commission d'enrichissement de la langue française, FranceTerme
abbreviation: PK
date parution JO: 2012-06-10
equivalent EN: PK @en
equivalent EN: PK (en)
equivalent EN: protein-kinase @en
equivalent EN: protein-kinase (en)
part of speech: nom féminin
alternative label: kinase de protéine
definition: Enzyme qui phosphoryle les résidus sérine, thréonine ou tyrosine présents dans les protéines.
in scheme: Biologie
in scheme: concept-SD-biologie-biochimie-et-biologie-moleculaire
in scheme: concepts
notation: COGB109
related: facteur promoteur de la mitose
related: kinase dépendante des cyclines

récepteur
type: ConceptConcept
type: Concept
creator: Commission d'enrichissement de la langue française, FranceTerme
date parution JO: 2011-09-18
equivalent EN: receptor @en
equivalent EN: receptor (en)
part of speech: nom masculin
definition: Protéine qui, en fixant un ligand, déclenche la transmission d'un signal et une réponse intracellulaire.
in scheme: Biologie
in scheme: concept-SD-biologie-biochimie-et-biologie-moleculaire
in scheme: concepts
notation: COGB11
note: Il existe une vingtaine de familles différentes de récepteurs protéiques qui sont intégrés aux membranes plasmiques ou intracellulaires, ou qui agissent sous forme soluble.
related: exposition sur phage
related: puce à protéines
related: anti-hormone
related: ligand
related: cellule tueuse naturelle
related: xénophagie
related: récepteur transmembranaire

sélectine
type: ConceptConcept
type: Concept
creator: Commission d'enrichissement de la langue française, FranceTerme
date parution JO: 2012-06-10
equivalent EN: selectin @en
equivalent EN: selectin (en)
part of speech: nom féminin
definition: Molécule d'adhérence cellulaire exprimée à la surface des cellules endothéliales et des leucocytes, qui, par son domaine protéique de type lectine, assure une liaison, généralement avec des glucides spécifiques.
in scheme: Biologie
in scheme: concept-SD-biologie-biochimie-et-biologie-moleculaire
in scheme: concept-SD-biologie-biologie-cellulaire
in scheme: concepts
notation: COGB110
related: domaine protéique
related: lectine
related: molécule d'adhérence cellulaire

séquence cognate
type: ConceptConcept
type: Concept
creator: Commission d'enrichissement de la langue française, FranceTerme
date parution JO: 2012-06-10
equivalent EN: cognate DNA @en
equivalent EN: cognate DNA (en)
equivalent EN: cognate clone @en
equivalent EN: cognate clone (en)
equivalent EN: cognate sequence @en
equivalent EN: cognate sequence (en)
definition: Chacune des séquences d'ADN qui proviennent d'un même locus et contiennent la même information génétique, mais font partie de génomes différents après manipulation génétique.
in scheme: Biologie
in scheme: concept-SD-biologie-biochimie-et-biologie-moleculaire
in scheme: concepts
notation: COGB111
note: L'ADN complémentaire d'une β-globuline de mammifère portée par un clone bactérien dans un plasmide et la même séquence portée par une levure dans un chromosome artificiel sont des séquences cognates.
related: chromosome artificiel de levure

télomérase
type: ConceptConcept
type: Concept
creator: Commission d'enrichissement de la langue française, FranceTerme
date parution JO: 2012-06-10
equivalent EN: telomerase @en
equivalent EN: telomerase (en)
part of speech: nom féminin
definition: Enzyme qui ajoute des nucléotides aux extrémités des chromosomes pour former des télomères ou ralentir l'érosion de ces derniers au cours des divisions successives des cellules et de leur vieillissement.
in scheme: Biologie
in scheme: concept-SD-biologie-biochimie-et-biologie-moleculaire
in scheme: concepts
notation: COGB112

transduction d'énergie
type: ConceptConcept
type: Concept
creator: Commission d'enrichissement de la langue française, FranceTerme
date parution JO: 2012-06-10
equivalent EN: energy transduction @en
equivalent EN: energy transduction (en)
definition: Conversion, au niveau cellulaire, d'un type d'énergie en un autre.
in scheme: Biologie
in scheme: concept-SD-biologie-biochimie-et-biologie-moleculaire
in scheme: concepts
notation: COGB113
note: Par exemple, l'énergie des flux de protons est convertie en énergie chimique, qui est stockée sous la forme d'adénosine triphosphate (ATP).

transduction du signal
type: ConceptConcept
type: Concept
creator: Commission d'enrichissement de la langue française, FranceTerme
date parution JO: 2012-06-10
equivalent EN: signal transduction @en
equivalent EN: signal transduction (en)
definition: Phénomène par lequel des protéines sont phosphorylées en cascade, ce qui stimule des gènes spécifiques, transformant un stimulus en réponse cellulaire.
in scheme: Biologie
in scheme: concept-SD-biologie-biochimie-et-biologie-moleculaire
in scheme: concepts
notation: COGB114
related: cascade de signaux

translocateur
type: ConceptConcept
type: Concept
creator: Commission d'enrichissement de la langue française, FranceTerme
date parution JO: 2012-06-10
equivalent EN: translocon @en
equivalent EN: translocon (en)
part of speech: nom masculin
alternative label: translocon
definition: Complexe multiprotéique qui forme des pores dans la membrane plasmique et dans celle du réticulum endoplasmique, favorisant le transport de protéines à travers ces membranes.
in scheme: Biologie
in scheme: concept-SD-biologie-biochimie-et-biologie-moleculaire
in scheme: concepts
notation: COGB116

tubuline
type: ConceptConcept
type: Concept
creator: Commission d'enrichissement de la langue française, FranceTerme
date parution JO: 2012-06-10
equivalent EN: tubulin @en
equivalent EN: tubulin (en)
part of speech: nom féminin
definition: Principale protéine constitutive des cils, des flagelles et des microtubules.
in scheme: Biologie
in scheme: concept-SD-biologie-biochimie-et-biologie-moleculaire
in scheme: concepts
notation: COGB117
note: Il existe deux types de tubuline désignés par α et β, qui, associés en dimères α/β, forment de longues chaînes édifiant les microtubules.

valeur C
type: ConceptConcept
type: Concept
creator: Commission d'enrichissement de la langue française, FranceTerme
date parution JO: 2012-06-10
equivalent EN: C-value @en
equivalent EN: C-value (en)
definition: Quantité d'ADN que contient un lot haploïde de chromosomes.
in scheme: Biologie
in scheme: concept-SD-biologie-biochimie-et-biologie-moleculaire
in scheme: concepts
notation: COGB118
related: paradoxe de la valeur C

ligand
type: ConceptConcept
type: Concept
creator: Commission d'enrichissement de la langue française, FranceTerme
date parution JO: 2011-09-18
equivalent EN: ligand @en
equivalent EN: ligand (en)
part of speech: nom masculin
definition: Molécule qui se lie par complémentarité de structure à un site spécifique d'une protéine.
in scheme: Biologie
in scheme: concept-SD-biologie-biochimie-et-biologie-moleculaire
in scheme: concepts
notation: COGB12
related: exposition sur phage
related: puce à protéines
related: récepteur
related: récepteur transmembranaire

lignée cellulaire
type: ConceptConcept
type: Concept
creator: Commission d'enrichissement de la langue française, FranceTerme
date parution JO: 2013-09-15
equivalent EN: cell line @en
equivalent EN: cell line (en)
definition: Ensemble des cellules issues d'une cellule originelle par mitoses successives, présentant les mêmes caractères structurels et fonctionnels, et dont le devenir est identique pour un nombre limité et génétiquement programmé de divisions.
in scheme: Biologie
in scheme: concept-SD-biologie-biologie-cellulaire
in scheme: concept-SD-biologie-biologie-du-developpement
in scheme: concepts
notation: COGB125
note: Les lignées cellulaires cultivées in vitro, qui sont le plus souvent issues de cellules tumorales, ont un potentiel de division illimité.
related: cellule souche
related: cellule souche embryonnaire
related: cellule souche du cordon ombilical
related: clone cellulaire
related: cellule progénitrice

cellule souche
type: ConceptConcept
type: Concept
creator: Commission d'enrichissement de la langue française, FranceTerme
abbreviation: CS
abbreviation: SC @en
date parution JO: 2013-09-15
equivalent EN: SC @en
equivalent EN: SC (en)
equivalent EN: stem cell @en
equivalent EN: stem cell (en)
definition: Cellule animale ou humaine qui possède les capacités de prolifération, d'autorenouvellement et de différenciation, et qui est à l'origine de lignées cellulaires différenciées.
in scheme: Biologie
in scheme: concept-SD-biologie-biologie-cellulaire
in scheme: concept-SD-biologie-biologie-du-developpement
in scheme: concepts
notation: COGB126
note: Les cellules souches comprennent plusieurs types de cellules, dont la localisation et le devenir diffèrent.
related: lignée cellulaire
related: cellule souche embryonnaire
related: cellule souche adulte
related: cellule souche du cordon ombilical
related: cellule souche tumorale
related: autorenouvellement
related: niche cellulaire
related: division cellulaire asymétrique
related: concept-SANT80

cellule souche embryonnaire
type: ConceptConcept
type: Concept
creator: Commission d'enrichissement de la langue française, FranceTerme
abbreviation: CSE
abbreviation: ESC @en
date parution JO: 2014-09-16
equivalent EN: ES cell @en
equivalent EN: ES cell (en)
equivalent EN: ESC @en
equivalent EN: ESC (en)
equivalent EN: embryonic stem cell @en
equivalent EN: embryonic stem cell (en)
definition: Cellule qui, présente in vivo dans le bouton embryonnaire, conserve la faculté de se diviser ainsi que sa pluripotence, jusqu’à ce que des signaux déclenchent une différenciation.
in scheme: Biologie
in scheme: concept-SD-biologie-biologie-cellulaire
in scheme: concept-SD-biologie-biologie-du-developpement
in scheme: concepts
notation: COGB127
note: La cellule souche embryonnaire peut conserver sa pluripotence lorsqu’elle est cultivée in vitro sous forme de lignée cellulaire.
related: lignée cellulaire
related: cellule souche
related: cellule pluripotente
related: bouton embryonnaire

cellule souche adulte
type: ConceptConcept
type: Concept
creator: Commission d'enrichissement de la langue française, FranceTerme
abbreviation: ASC @en
abbreviation: CSA
date parution JO: 2013-09-15
equivalent EN: ASC @en
equivalent EN: ASC (en)
equivalent EN: adult stem cell @en
equivalent EN: adult stem cell (en)
definition: Cellule souche présente dans un tissu adulte différencié de l'organisme, qui est capable d'assurer le renouvellement, la réparation et la régénération de ce tissu.
in scheme: Biologie
in scheme: concept-SD-biologie-biologie-cellulaire
in scheme: concept-SD-biologie-biologie-du-developpement
in scheme: concepts
notation: COGB128
note: Une cellule souche adulte est une cellule multipotente.
related: cellule souche
related: cellule multipotente

cellule souche du cordon ombilical
type: ConceptConcept
type: Concept
creator: Commission d'enrichissement de la langue française, FranceTerme
abbreviation: CSCO
abbreviation: USCC @en
date parution JO: 2013-09-15
equivalent EN: USCC @en
equivalent EN: USCC (en)
equivalent EN: umbilical stem cord cell @en
equivalent EN: umbilical stem cord cell (en)
forme abregee: cellule souche du cordon
definition: Cellule souche issue du cordon ombilical, qui permet de créer des lignées cellulaires elles-mêmes capables de produire des tissus différents, et dont le faible risque de rejet favorise l'utilisation dans le traitement de diverses pathologies.
in scheme: Biologie
in scheme: concept-SD-biologie-biologie-cellulaire
in scheme: concept-SD-biologie-biologie-du-developpement
in scheme: concepts
notation: COGB129
note: Les premières cellules souches ont été identifiées dans le sang du cordon ombilical.
related: lignée cellulaire
related: cellule souche

riborégulateur
type: ConceptConcept
type: Concept
creator: Commission d'enrichissement de la langue française, FranceTerme
date parution JO: 2011-09-18
equivalent EN: riboswitch @en
equivalent EN: riboswitch (en)
part of speech: nom masculin
definition: ARN qui assure la régulation de l'expression des gènes lors de la traduction ou de la transcription.
in scheme: Biologie
in scheme: concept-SD-biologie-biochimie-et-biologie-moleculaire
in scheme: concepts
notation: COGB13
note: Les riborégulateurs sont les micro-ARN, les petits ARN interférents des eucaryotes et les ARN régulateurs de type bactérien.
related: riborégulateur bactérien
related: micro-ARN
related: petit ARN interférent

cellule souche tumorale
type: ConceptConcept
type: Concept
creator: Commission d'enrichissement de la langue française, FranceTerme
abbreviation: CSC @en
abbreviation: CST
abbreviation: TSC @en
date parution JO: 2013-09-15
equivalent EN: CSC @en
equivalent EN: CSC (en)
equivalent EN: TSC @en
equivalent EN: TSC (en)
equivalent EN: cancer stem cell @en
equivalent EN: cancer stem cell (en)
equivalent EN: tumoral stem cell @en
equivalent EN: tumoral stem cell (en)
alternative label: cellule souche cancéreuse
definition: Cellule souche appartenant à une population cellulaire minoritaire de différents cancers humains et murins, dont l'injection avec un petit nombre de cellules de même nature provoque une nouvelle tumeur.
in scheme: Biologie
in scheme: concept-SD-biologie-biologie-cellulaire
in scheme: concept-SD-biologie-biologie-du-developpement
in scheme: concepts
notation: COGB130
related: cellule souche

cellule totipotente
type: ConceptConcept
type: Concept
creator: Commission d'enrichissement de la langue française, FranceTerme
date parution JO: 2013-09-15
equivalent EN: totipotent cell @en
equivalent EN: totipotent cell (en)
definition: Cellule capable d'engendrer un organisme entier.
in scheme: Biologie
in scheme: concept-SD-biologie-biologie-cellulaire
in scheme: concept-SD-biologie-biologie-du-developpement
in scheme: concepts
notation: COGB131
note: Le zygote des mammifères et les premières cellules issues de ses divisions sont des cellules totipotentes.

cellule multipotente
type: ConceptConcept
type: Concept
creator: Commission d'enrichissement de la langue française, FranceTerme
date parution JO: 2013-09-15
equivalent EN: multipotent cell @en
equivalent EN: multipotent cell (en)
definition: Cellule capable de se différencier en cellules constitutives de plusieurs types de tissus.
in scheme: Biologie
in scheme: concept-SD-biologie-biologie-cellulaire
in scheme: concept-SD-biologie-biologie-du-developpement
in scheme: concepts
notation: COGB132
related: cellule souche adulte
related: cellule progénitrice

cellule pluripotente
type: ConceptConcept
type: Concept
creator: Commission d'enrichissement de la langue française, FranceTerme
date parution JO: 2013-09-15
equivalent EN: pluripotent cell @en
equivalent EN: pluripotent cell (en)
definition: Cellule capable de se différencier en cellules constitutives de tout type de tissus.
in scheme: Biologie
in scheme: concept-SD-biologie-biologie-cellulaire
in scheme: concept-SD-biologie-biologie-du-developpement
in scheme: concepts
notation: COGB133
related: cellule souche embryonnaire
related: cellule souche pluripotente induite

cellule dendritique tueuse
type: ConceptConcept
type: Concept
creator: Commission d'enrichissement de la langue française, FranceTerme
abbreviation: CDT
date parution JO: 2016-10-01
equivalent EN: IKDC @en
equivalent EN: IKDC (en)
equivalent EN: interferon-producing killer dendritic cell @en
equivalent EN: interferon-producing killer dendritic cell (en)
definition: Cellule dendritique qui, par l’intermédiaire de l’interféron gamma qu’elle produit en présence de cellules cancéreuses, s’attaque aux tumeurs en bloquant leur irrigation sanguine, puis en développant à leur encontre une activité cytotoxique et une activité présentatrice d’antigènes.
in scheme: Biologie
in scheme: concept-SD-biologie-biochimie-et-biologie-moleculaire
in scheme: concept-SD-biologie-biologie-cellulaire
in scheme: concepts
notation: COGB135
related: cellule dendritique
related: cellule dendritique interdigitée
related: présentation de l'antigène

cellule tueuse naturelle
type: ConceptConcept
type: Concept
creator: Commission d'enrichissement de la langue française, FranceTerme
abbreviation: NKC @en
abbreviation: NKcell @en
date parution JO: 2013-09-15
deconseille ou frequent: NK cell
deconseille ou frequent: cellule NK
deconseille ou frequent: lymphocyte NK
equivalent EN: NKC @en
equivalent EN: NKC (en)
equivalent EN: NKcell @en
equivalent EN: NKcell (en)
equivalent EN: natural killer cell @en
equivalent EN: natural killer cell (en)
definition: Grand lymphocyte issu d'une lignée différente de celle des lymphocytes B et T, qui détruit les cellules anormales, tumorales ou infectées par un virus, ou encore celles sur lesquelles se sont fixées des immunoglobulines reconnues par leurs récepteurs.
in scheme: Biologie
in scheme: concept-SD-biologie-biochimie-et-biologie-moleculaire
in scheme: concept-SD-biologie-biologie-cellulaire
in scheme: concepts
notation: COGB136
note: On trouve aussi, dans le langage professionnel, les termes « cellule NK » et « lymphocyte NK ».
related: récepteur

clonage
type: ConceptConcept
type: Concept
creator: Commission d'enrichissement de la langue française, FranceTerme
date parution JO: 2013-09-15
equivalent EN: cloning @en
equivalent EN: cloning (en)
part of speech: nom masculin
definition: Technique de reproduction ou de multiplication à l'identique d'un fragment d'ADN, d'une cellule ou d'un organisme animal ou végétal.
in scheme: Biologie
in scheme: concept-SD-biologie-biochimie-et-biologie-moleculaire
in scheme: concept-SD-biologie-biologie-cellulaire
in scheme: concepts
notation: COGB137
related: clonage cellulaire
related: clonage reproductif par transfert nucléaire
related: scission embryonnaire
related: clone
related: concept-SANT80
scope note: Cette publication annule et remplace celle du Journal officiel du 22 septembre 2000.

clone cellulaire
type: ConceptConcept
type: Concept
creator: Commission d'enrichissement de la langue française, FranceTerme
date parution JO: 2013-09-15
equivalent EN: cell clone @en
equivalent EN: cell clone (en)
definition: Ensemble de cellules de même patrimoine génétique, obtenu in vitro par mitoses successives, à partir d'une seule cellule somatique originelle.
in scheme: Biologie
in scheme: concept-SD-biologie-biochimie-et-biologie-moleculaire
in scheme: concept-SD-biologie-biologie-cellulaire
in scheme: concepts
notation: COGB138
note: Le patrimoine génétique d'un clone cellulaire est difficile à maintenir en raison des mutations qui l'affectent au fur et à mesure des divisions.
related: lignée cellulaire
related: clonage cellulaire
related: clone

clonage cellulaire
type: ConceptConcept
type: Concept
creator: Commission d'enrichissement de la langue française, FranceTerme
date parution JO: 2013-09-15
equivalent EN: cell cloning @en
equivalent EN: cell cloning (en)
definition: Technique de production d'un clone cellulaire.
in scheme: Biologie
in scheme: concept-SD-biologie-biochimie-et-biologie-moleculaire
in scheme: concept-SD-biologie-biologie-cellulaire
in scheme: concepts
notation: COGB139
related: clonage
related: clone cellulaire

riborégulateur bactérien
type: ConceptConcept
type: Concept
creator: Commission d'enrichissement de la langue française, FranceTerme
date parution JO: 2011-09-18
equivalent EN: bacterial riboswitch @en
equivalent EN: bacterial riboswitch (en)
alternative label: ARN régulateur de type bactérien
definition: ARN messager d'une bactérie qui, selon les domaines de sa séquence non codante, détermine ou non, en fonction des besoins de la cellule, sa transcription, sa traduction ou son autodestruction.
in scheme: Biologie
in scheme: concept-SD-biologie-biochimie-et-biologie-moleculaire
in scheme: concepts
notation: COGB14
note: Une dizaine de classes de tels ARN messagers est connue chez les bactéries, une seule chez les eucaryotes.
related: riborégulateur
related: aptamère de riborégulateur bactérien

clonage reproductif par transfert nucléaire
type: ConceptConcept
type: Concept
creator: Commission d'enrichissement de la langue française, FranceTerme
date parution JO: 2013-09-15
equivalent EN: reproduction cloning @en
equivalent EN: reproduction cloning (en)
equivalent EN: reproductive cloning @en
equivalent EN: reproductive cloning (en)
forme abregee: clonage reproductif
definition: Transfert nucléaire dans un ovocyte énucléé suivi de l'implantation de l'embryon dans un utérus maternel en vue de la naissance d'un individu cloné.
in scheme: Biologie
in scheme: concept-SD-biologie-biologie-cellulaire
in scheme: concept-SD-biologie-biologie-du-developpement
in scheme: concepts
notation: COGB140
note: L'embryon obtenu est le clone de l'animal qui a fourni le noyau somatique transféré dans l'ovocyte énucléé.
related: clonage
related: clone
related: transfert nucléaire

scission embryonnaire
type: ConceptConcept
type: Concept
creator: Commission d'enrichissement de la langue française, FranceTerme
date parution JO: 2013-09-15
equivalent EN: embryonic scission @en
equivalent EN: embryonic scission (en)
equivalent EN: gemellary scission @en
equivalent EN: gemellary scission (en)
alternative label: séparation blastomérique
definition: Séparation des cellules issues de la deuxième ou de la troisième division de l'embryon des mammifères, qui peuvent se développer en autant d'individus génétiquement identiques.
in scheme: Biologie
in scheme: concept-SD-biologie-biologie-cellulaire
in scheme: concept-SD-biologie-biologie-du-developpement
in scheme: concepts
notation: COGB141
note: 1. Le procédé est couramment appliqué à différentes espèces d'élevage.
note: 2. La scission embryonnaire n'est pas un clonage.
related: clonage

matrice extracellulaire
type: ConceptConcept
type: Concept
creator: Commission d'enrichissement de la langue française, FranceTerme
abbreviation: MEC
date parution JO: 2013-09-15
equivalent EN: extracellular matrix @en
equivalent EN: extracellular matrix (en)
definition: Réseau de macromolécules excrétées par les cellules des organismes pluricellulaires, qui forme un espace extracellulaire assurant le soutien, la protection mécanique et chimique, l'organisation tissulaire, la migration et la communication de ces cellules.
in scheme: Biologie
in scheme: concept-SD-biologie-biochimie-et-biologie-moleculaire
in scheme: concept-SD-biologie-biologie-cellulaire
in scheme: concepts
notation: COGB142
related: protéase de surface

reprogrammation
type: ConceptConcept
type: Concept
creator: Commission d'enrichissement de la langue française, FranceTerme
date parution JO: 2013-09-15
equivalent EN: reprogramming @en
equivalent EN: reprogramming (en)
part of speech: nom féminin
definition: Ensemble des processus naturels débutant dès la fécondation, qui nécessitent l'activation ou l'inhibition de gènes et orientent ou réorientent en permanence le développement de l'organisme.
in scheme: Biologie
in scheme: concept-SD-biologie-biochimie-et-biologie-moleculaire
in scheme: concept-SD-biologie-biologie-cellulaire
in scheme: concepts
notation: COGB143
related: facteur général de transcription

reprogrammation cellulaire
type: ConceptConcept
type: Concept
creator: Commission d'enrichissement de la langue française, FranceTerme
date parution JO: 2013-09-15
equivalent EN: cell reprogramming @en
equivalent EN: cell reprogramming (en)
definition: Déclenchement d'un nouveau programme de synthèse, de différenciation, de dédifférenciation ou de développement, qui est provoqué artificiellement au sein de bactéries ou de cellules somatiques animales, végétales ou humaines.
in scheme: Biologie
in scheme: concept-SD-biologie-biochimie-et-biologie-moleculaire
in scheme: concept-SD-biologie-biologie-cellulaire
in scheme: concepts
notation: COGB144
note: Appliquée à l'homme à des fins thérapeutiques, la reprogrammation cellulaire des cellules somatiques adultes permet notamment d'obtenir des cellules dont les propriétés sont celles des cellules souches embryonnaires.
related: cellule souche pluripotente induite

symplasme
type: ConceptConcept
type: Concept
creator: Commission d'enrichissement de la langue française, FranceTerme
date parution JO: 2014-09-16
equivalent EN: symplast @en
equivalent EN: symplast (en)
part of speech: nom masculin
definition: Ensemble des cytoplasmes des cellules végétales qui communiquent grâce aux plasmodesmes.
in scheme: Biologie
in scheme: concept-SD-biologie-biologie-cellulaire
in scheme: concept-SD-biologie-biologie-vegetale
in scheme: concepts
notation: COGB145
related: apoplasme
related: plasmodesme

transdifférenciation
type: ConceptConcept
type: Concept
creator: Commission d'enrichissement de la langue française, FranceTerme
date parution JO: 2013-09-15
equivalent EN: transdifferentiation @en
equivalent EN: transdifferentiation (en)
part of speech: nom féminin
definition: Procédé de conversion directe d'un type de cellule différenciée en un autre type.
in scheme: Biologie
in scheme: concept-SD-biologie-biochimie-et-biologie-moleculaire
in scheme: concept-SD-biologie-biologie-cellulaire
in scheme: concepts
notation: COGB146
note: 1. La transdifférenciation consiste en l'annulation d'une voie de différenciation d'un ensemble cellulaire puis en la réorientation de son devenir.
note: 2. La transdifférenciation ouvre de nouvelles perspectives pour la médecine régénératrice.

monosomie
type: ConceptConcept
type: Concept
creator: Commission d'enrichissement de la langue française, FranceTerme
date parution JO: 2013-09-15
equivalent EN: monosomy @en
equivalent EN: monosomy (en)
part of speech: nom féminin
definition: Absence d'un des deux chromosomes d'une paire dans une cellule ou un organisme diploïde.
in scheme: Biologie
in scheme: concept-SD-biologie-genetique
in scheme: concepts
notation: COGB147
note: La monosomie est une anomalie chromosomique.
related: disomie uniparentale

disomie uniparentale
type: ConceptConcept
type: Concept
creator: Commission d'enrichissement de la langue française, FranceTerme
abbreviation: DUP
abbreviation: UPD @en
date parution JO: 2013-09-15
deconseille ou frequent: disomie maternelle
deconseille ou frequent: disomie paternelle
equivalent EN: UPD @en
equivalent EN: UPD (en)
equivalent EN: uniparental disomy @en
equivalent EN: uniparental disomy (en)
definition: Présence, dans une cellule ou un organisme diploïde, d'une paire de chromosomes provenant d'un seul parent.
in scheme: Biologie
in scheme: concept-SD-biologie-genetique
in scheme: concepts
notation: COGB148
note: Selon l'origine parentale, la disomie est dite paternelle ou maternelle.
related: monosomie
related: hétérodisomie
related: isodisomie

métabolite primaire
type: ConceptConcept
type: Concept
creator: Commission d'enrichissement de la langue française, FranceTerme
date parution JO: 2013-09-15
equivalent EN: primary metabolite @en
equivalent EN: primary metabolite (en)
definition: Molécule présente dans toutes les cellules d'une espèce végétale ou fongique, qui est indispensable à la croissance, au développement et à la reproduction de cette espèce.
in scheme: Biologie
in scheme: concept-SD-biologie-biochimie-et-biologie-moleculaire
in scheme: concept-SD-biologie-biologie-vegetale
in scheme: concepts
notation: COGB149
note: Les acides aminés, les protéines, les acides nucléiques, les lipides et les glucides simples sont des métabolites primaires.
related: métabolite secondaire

aptamère de riborégulateur bactérien
type: ConceptConcept
type: Concept
creator: Commission d'enrichissement de la langue française, FranceTerme
date parution JO: 2011-09-18
equivalent EN: bacterial riboswitch aptamer @en
equivalent EN: bacterial riboswitch aptamer (en)
definition: Région non codante d'un ARN messager d'une bactérie qui, lorsqu'elle détecte une molécule cible, régule les stocks de nutriments en supprimant la traduction ou la transcription de cet ARN.
in scheme: Biologie
in scheme: concept-SD-biologie-biochimie-et-biologie-moleculaire
in scheme: concepts
notation: COGB15
related: ARN messager
related: riborégulateur bactérien
related: aptamère

métabolite secondaire
type: ConceptConcept
type: Concept
creator: Commission d'enrichissement de la langue française, FranceTerme
date parution JO: 2013-09-15
equivalent EN: secondary metabolite @en
equivalent EN: secondary metabolite (en)
definition: Molécule, souvent spécifique d'une espèce végétale ou fongique, qui est synthétisée en dehors des voies métaboliques essentielles par des cellules spécialisées, à certains moments du développement ou en réponse à une agression.
in scheme: Biologie
in scheme: concept-SD-biologie-biochimie-et-biologie-moleculaire
in scheme: concept-SD-biologie-biologie-vegetale
in scheme: concepts
notation: COGB150
note: Les métabolites secondaires jouent un rôle primordial dans les relations entre le végétal et son milieu : ils assurent, par exemple, une défense contre des compétiteurs, des herbivores ou des agents pathogènes, ou encore permettent d'attirer les pollinisateurs en déterminant la coloration des pétales des fleurs.
related: allélopathie
related: compétiteur
related: phytoalexine
related: métabolite primaire
related: extrolite

métabolome
type: ConceptConcept
type: Concept
creator: Commission d'enrichissement de la langue française, FranceTerme
date parution JO: 2013-09-15
equivalent EN: metabolome @en
equivalent EN: metabolome (en)
part of speech: nom masculin
definition: Ensemble des métabolites présents dans un système biologique tel qu'une cellule, un tissu, un organe ou un organisme.
in scheme: Biologie
in scheme: concept-SD-biologie-biochimie-et-biologie-moleculaire
in scheme: concepts
notation: COGB151
related: carte d'identité moléculaire
related: métabolomique

métabolomique
type: ConceptConcept
type: Concept
creator: Commission d'enrichissement de la langue française, FranceTerme
date parution JO: 2013-09-15
equivalent EN: metabolomics @en
equivalent EN: metabolomics (en)
part of speech: nom féminin
definition: Discipline qui étudie les processus chimiques affectant les métabolites.
in scheme: Biologie
in scheme: concept-SD-biologie-biochimie-et-biologie-moleculaire
in scheme: concepts
notation: COGB152
note: La métabolomique nécessite de répertorier au préalable l'ensemble des métabolites présents dans une cellule.
related: métabolome

endométabolome
type: ConceptConcept
type: Concept
creator: Commission d'enrichissement de la langue française, FranceTerme
date parution JO: 2013-09-15
equivalent EN: endometabolome @en
equivalent EN: endometabolome (en)
part of speech: nom masculin
definition: Ensemble des métabolites intracellulaires présents à un moment donné dans un système biologique tel qu'une cellule, un tissu, un organe ou un organisme.
in scheme: Biologie
in scheme: concept-SD-biologie-biochimie-et-biologie-moleculaire
in scheme: concepts
notation: COGB153
related: exométabolome

exométabolome
type: ConceptConcept
type: Concept
creator: Commission d'enrichissement de la langue française, FranceTerme
date parution JO: 2013-09-15
equivalent EN: exometabolome @en
equivalent EN: exometabolome (en)
part of speech: nom masculin
definition: Ensemble des métabolites d'un système biologique tel qu'une cellule, un tissu, un organe ou un organisme excrétés dans le milieu extracellulaire ou dans le milieu de culture.
in scheme: Biologie
in scheme: concept-SD-biologie-biochimie-et-biologie-moleculaire
in scheme: concepts
notation: COGB154
related: endométabolome

cellule souche pluripotente induite
type: ConceptConcept
type: Concept
creator: Commission d'enrichissement de la langue française, FranceTerme
abbreviation: CSPI
abbreviation: iPSC @en
date parution JO: 2013-09-15
equivalent EN: iPS cell @en
equivalent EN: iPS cell (en)
equivalent EN: iPSC @en
equivalent EN: iPSC (en)
equivalent EN: induced pluripotent stem cell @en
equivalent EN: induced pluripotent stem cell (en)
alternative label: cellule souche pluripotente reprogrammée
definition: Cellule souche pluripotente qui résulte de la reprogrammation par transgénèse d'une cellule somatique d'un organisme humain adulte.
in scheme: Biologie
in scheme: concept-SD-biologie-biologie-cellulaire
in scheme: concept-SD-biologie-biologie-du-developpement
in scheme: concepts
notation: COGB155
related: transgénèse
related: cellule pluripotente
related: reprogrammation cellulaire

clone
type: ConceptConcept
type: Concept
creator: Commission d'enrichissement de la langue française, FranceTerme
date parution JO: 2013-09-15
equivalent EN: clone @en
equivalent EN: clone (en)
part of speech: nom masculin
definition: Ensemble des êtres vivants issus, par voie asexuée, d'un seul individu et possédant son patrimoine génétique ; par extension, chacun de ces êtres vivants.
in scheme: Biologie
in scheme: concept-SD-biologie-biochimie-et-biologie-moleculaire
in scheme: concept-SD-biologie-biologie-cellulaire
in scheme: concepts
notation: COGB156
related: clonage
related: clone cellulaire
related: clonage reproductif par transfert nucléaire
scope note: Cette publication annule et remplace celle du Journal officiel du 18 septembre 2011.

transfert nucléaire
type: ConceptConcept
type: Concept
creator: Commission d'enrichissement de la langue française, FranceTerme
date parution JO: 2013-09-15
equivalent EN: nuclear transfer @en
equivalent EN: nuclear transfer (en)
alternative label: transfert du noyau cellulaire
definition: Transplantation d'un noyau de cellule somatique, notamment dans un ovocyte énucléé.
in scheme: Biologie
in scheme: concept-SD-biologie-biologie-cellulaire
in scheme: concept-SD-biologie-biologie-du-developpement
in scheme: concepts
notation: COGB157
related: clonage reproductif par transfert nucléaire
related: concept-SANT95
scope note: Cette publication annule et remplace celle du Journal officiel du 6 septembre 2008.

alignement de séquences
type: ConceptConcept
type: Concept
creator: Commission d'enrichissement de la langue française, FranceTerme
date parution JO: 2014-09-16
equivalent EN: alignment @en
equivalent EN: alignment (en)
equivalent EN: sequence alignment @en
equivalent EN: sequence alignment (en)
forme abregee: alignement, n.m.
definition: Procédé qui consiste à disposer des séquences de nucléotides ou d’acides aminés les unes au-dessous des autres afin de les comparer.
in scheme: Biologie
in scheme: concept-SD-biologie-biochimie-et-biologie-moleculaire
in scheme: concept-SD-biologie-bioinformatique
in scheme: concepts
notation: COGB158
note: L’alignement de séquences permet notamment de repérer des régions identiques ou des variations dues à des mutations, et d’identifier les régions conservées au cours de l’évolution.

annotation structurale
type: ConceptConcept
type: Concept
creator: Commission d'enrichissement de la langue française, FranceTerme
date parution JO: 2016-10-01
equivalent EN: structural annotation @en
equivalent EN: structural annotation (en)
alternative label: annotation syntaxique
definition: Opération qui consiste, en analysant la séquence d’un génome, à identifier et à localiser les séquences remarquables de celui-ci.
in scheme: Biologie
in scheme: concept-SD-biologie-biochimie-et-biologie-moleculaire
in scheme: concept-SD-biologie-bioinformatique
in scheme: concepts
notation: COGB159
note: 1. L’annotation structurale utilise essentiellement l’analogie entre des motifs d’ADN pour reconnaître les séquences remarquables du génome.
note: 2. L’annotation structurale permet, par exemple, d’identifier des séquences codantes, des motifs régulateurs, des transposons, des virus intégrés ou des séquences répétées.
related: génomique structurale
related: annotation fonctionnelle

biophotonique
type: ConceptConcept
type: Concept
creator: Commission d'enrichissement de la langue française, FranceTerme
date parution JO: 2011-09-18
equivalent EN: biophotonics @en
equivalent EN: biophotonics (en)
part of speech: nom féminin
definition: Discipline utilisant les rayonnements électromagnétiques, visibles, ultraviolets, infrarouges ou X, pour analyser et traiter des tissus ou des organes.
in scheme: Santé et médecine
in scheme: concept-SD-sante-et-medecine-imagerie
in scheme: concepts
notation: COGB16

annotation fonctionnelle
type: ConceptConcept
type: Concept
creator: Commission d'enrichissement de la langue française, FranceTerme
date parution JO: 2016-10-01
equivalent EN: functional annotation @en
equivalent EN: functional annotation (en)
definition: Opération qui consiste à assigner des fonctions biologiques aux séquences du génome identifiées lors de l’annotation structurale.
in scheme: Biologie
in scheme: concept-SD-biologie-biochimie-et-biologie-moleculaire
in scheme: concept-SD-biologie-bioinformatique
in scheme: concepts
notation: COGB160
related: génomique fonctionnelle
related: annotation structurale

fluorochrome
type: ConceptConcept
type: Concept
creator: Commission d'enrichissement de la langue française, FranceTerme
date parution JO: 2014-09-16
equivalent EN: fluorochrome @en
equivalent EN: fluorochrome (en)
equivalent EN: fluorophore @en
equivalent EN: fluorophore (en)
part of speech: nom masculin
definition: Substance qui produit une fluorescence et qui, liée à une sonde nucléique ou à un anticorps, permet de repérer un objet biologique tel qu’une séquence d’acides nucléiques ou un antigène.
in scheme: Biologie
in scheme: concept-SD-biologie-biochimie-et-biologie-moleculaire
in scheme: concepts
notation: COGB161
related: sonde nucléique
related: hybridation fluorescente in situ

bouton embryonnaire
type: ConceptConcept
type: Concept
creator: Commission d'enrichissement de la langue française, FranceTerme
abbreviation: ICM @en
date parution JO: 2014-09-16
deconseille ou frequent: MCI
deconseille ou frequent: masse cellulaire interne
equivalent EN: ICM @en
equivalent EN: ICM (en)
equivalent EN: embryoblast @en
equivalent EN: embryoblast (en)
equivalent EN: inner cell mass @en
equivalent EN: inner cell mass (en)
alternative label: embryoblaste
definition: Masse cellulaire adhérant à la paroi interne du blastocyste des mammifères quelques jours après la fécondation, à partir de laquelle se forme l’organisme.
in scheme: Biologie
in scheme: concept-SD-biologie-biologie-cellulaire
in scheme: concept-SD-biologie-biologie-du-developpement
in scheme: concepts
notation: COGB163
note: 1. Les cellules souches embryonnaires sont dérivées du bouton embryonnaire.
note: 2. On trouve aussi, dans le langage professionnel, le terme « masse cellulaire interne (MCI) ».
related: cellule souche embryonnaire

autorenouvellement
type: ConceptConcept
type: Concept
creator: Commission d'enrichissement de la langue française, FranceTerme
date parution JO: 2014-09-16
equivalent EN: autorenewing @en
equivalent EN: autorenewing (en)
equivalent EN: self-renewal @en
equivalent EN: self-renewal (en)
part of speech: nom masculin
definition: Capacité d’une cellule souche à donner, lors de la mitose, deux cellules de devenir différent, l’une qui en est la stricte copie et maintient ainsi le nombre des cellules souches, l’autre qui se différencie.
in scheme: Biologie
in scheme: concept-SD-biologie-biologie-cellulaire
in scheme: concept-SD-biologie-biologie-du-developpement
in scheme: concepts
notation: COGB164
related: cellule souche
related: cellule progénitrice

embryon cybride homme-animal
type: ConceptConcept
type: Concept
creator: Commission d'enrichissement de la langue française, FranceTerme
date parution JO: 2014-09-16
equivalent EN: human-animal cybrid embryo @en
equivalent EN: human-animal cybrid embryo (en)
equivalent EN: human-animal hybrid embryo @en
equivalent EN: human-animal hybrid embryo (en)
forme abregee: embryon cybride
definition: Embryon obtenu in vitro par transfert d’un noyau somatique humain dans un ovocyte animal énucléé.
in scheme: Biologie
in scheme: concept-SD-biologie-biochimie-et-biologie-moleculaire
in scheme: concept-SD-biologie-biologie-cellulaire
in scheme: concepts
notation: COGB165
related: hybride cytoplasmique

niche cellulaire
type: ConceptConcept
type: Concept
creator: Commission d'enrichissement de la langue française, FranceTerme
date parution JO: 2014-09-16
equivalent EN: niche @en
equivalent EN: niche (en)
equivalent EN: stem cell niche @en
equivalent EN: stem cell niche (en)
forme abregee: niche, n.f.
definition: Microenvironnement cellulaire qui protège les cellules souches des influences extérieures et maintient leur état indifférencié.
in scheme: Biologie
in scheme: concept-SD-biologie-biochimie-et-biologie-moleculaire
in scheme: concept-SD-biologie-biologie-cellulaire
in scheme: concepts
notation: COGB166
related: cellule souche

molécule de signalisation
type: ConceptConcept
type: Concept
creator: Commission d'enrichissement de la langue française, FranceTerme
date parution JO: 2014-09-16
equivalent EN: signaling molecule (US) @en
equivalent EN: signaling molecule (en-US)
equivalent EN: signalling molecule (GB) @en
equivalent EN: signalling molecule (en-GB)
definition: Molécule informative produite par une cellule émettrice, qui assure une communication cellulaire en déclenchant une cascade de signaux dans une cellule cible.
in scheme: Biologie
in scheme: concept-SD-biologie-biochimie-et-biologie-moleculaire
in scheme: concept-SD-biologie-biologie-cellulaire
in scheme: concepts
notation: COGB168
related: cascade de signaux
related: messager
related: facteur de survie

cascade de signaux
type: ConceptConcept
type: Concept
creator: Commission d'enrichissement de la langue française, FranceTerme
date parution JO: 2014-09-16
equivalent EN: signals cascade @en
equivalent EN: signals cascade (en)
definition: Activation en série de molécules, notamment de protéines, qui est déclenchée à l’intérieur d’une cellule par une molécule de signalisation ou un agent extracellulaires.
in scheme: Biologie
in scheme: concept-SD-biologie-biochimie-et-biologie-moleculaire
in scheme: concept-SD-biologie-biologie-cellulaire
in scheme: concepts
notation: COGB169
related: transduction du signal
related: molécule de signalisation

canalisation
type: ConceptConcept
type: Concept
creator: Commission d'enrichissement de la langue française, FranceTerme
date parution JO: 2011-09-18
equivalent EN: channeling @en
equivalent EN: channeling (en)
part of speech: nom féminin
definition: Formation d'un complexe entre les diverses enzymes d'une voie métabolique, qui permet le passage ultrarapide du produit d'une réaction à la réaction suivante.
in scheme: Biologie
in scheme: concept-SD-biologie-biochimie-et-biologie-moleculaire
in scheme: concepts
notation: COGB17

aptamère
type: ConceptConcept
type: Concept
creator: Commission d'enrichissement de la langue française, FranceTerme
date parution JO: 2014-09-16
equivalent EN: aptamer @en
equivalent EN: aptamer (en)
part of speech: nom masculin
definition: Brin court d’acide nucléique ou d’acide peptidonucléique, ou encore molécule peptidique, qui se lie spécifiquement à une molécule cible.
in scheme: Biologie
in scheme: concept-SD-biologie-biochimie-et-biologie-moleculaire
in scheme: concepts
notation: COGB172
related: aptamère de riborégulateur bactérien
related: acide peptidonucléique

origine de réplication
type: ConceptConcept
type: Concept
creator: Commission d'enrichissement de la langue française, FranceTerme
date parution JO: 2014-09-16
deconseille ou frequent: ori
equivalent EN: replication origin @en
equivalent EN: replication origin (en)
definition: Séquence spécifique ou ensemble de séquences d’ADN reconnues par un complexe protéique, où s’amorce la réplication de la molécule d’ADN.
in scheme: Biologie
in scheme: concept-SD-biologie-biochimie-et-biologie-moleculaire
in scheme: concepts
notation: COGB173
note: On trouve aussi, dans le langage professionnel, l’abréviation « ori ».
related: fourche de réplication
related: phasmide
related: vecteur navette
related: complexe de reconnaissance de l'origine
related: amorce

géminine
type: ConceptConcept
type: Concept
creator: Commission d'enrichissement de la langue française, FranceTerme
date parution JO: 2015-09-19
equivalent EN: geminin @en
equivalent EN: geminin (en)
part of speech: nom féminin
definition: Protéine des organismes animaux pluricellulaires, qui concourt à ce qu’une seule réplication de l’ADN ait lieu au cours du cycle cellulaire.
in scheme: Biologie
in scheme: concept-SD-biologie-biochimie-et-biologie-moleculaire
in scheme: concepts
notation: COGB174
note: La géminine intervient dans le contrôle de la prolifération, de la croissance et du développement des cellules, notamment des cellules neuronales et cancéreuses.

désacétylation
type: ConceptConcept
type: Concept
creator: Commission d'enrichissement de la langue française, FranceTerme
date parution JO: 2014-09-16
equivalent EN: deacetylation @en
equivalent EN: deacetylation (en)
part of speech: nom féminin
definition: Élimination des groupes acétyle de molécules biologiques, qui a pour effet de moduler l’activité de celles-ci.
in scheme: Biologie
in scheme: concept-SD-biologie-biochimie-et-biologie-moleculaire
in scheme: concepts
notation: COGB175
note: La désacétylation intervient notamment dans la transcription et la duplication de l’ADN.
related: histone-désacétylase

chaperonine
type: ConceptConcept
type: Concept
creator: Commission d'enrichissement de la langue française, FranceTerme
abbreviation: CPN @en
date parution JO: 2014-09-16
equivalent EN: CPN @en
equivalent EN: CPN (en)
equivalent EN: chaperonin @en
equivalent EN: chaperonin (en)
part of speech: nom féminin
definition: Protéine de la famille des protéines chaperon, formant un complexe macromoléculaire en cylindre creux à l’intérieur duquel des chaînes polypeptidiques naissantes et des protéines mal repliées acquièrent une conformation fonctionnelle.
in scheme: Biologie
in scheme: concept-SD-biologie-biochimie-et-biologie-moleculaire
in scheme: concepts
notation: COGB177
related: protéine chaperon

protéasome
type: ConceptConcept
type: Concept
creator: Commission d'enrichissement de la langue française, FranceTerme
date parution JO: 2014-09-16
equivalent EN: proteasome @en
equivalent EN: proteasome (en)
part of speech: nom masculin
definition: Complexe protéique qui hydrolyse, au moyen de ses peptidases, des protéines mal repliées, dénaturées ou en surplus qu’il reconnaît grâce à leur liaison avec des molécules d’ubiquitine.
in scheme: Biologie
in scheme: concept-SD-biologie-biochimie-et-biologie-moleculaire
in scheme: concepts
notation: COGB178
related: ubiquitine
related: agrésome

ubiquitine
type: ConceptConcept
type: Concept
creator: Commission d'enrichissement de la langue française, FranceTerme
date parution JO: 2014-09-16
equivalent EN: ubiquitin @en
equivalent EN: ubiquitin (en)
part of speech: nom féminin
definition: Petite protéine qui se lie à des protéines mal repliées, dénaturées ou en surplus, afin de permettre leur dégradation par le protéasome.
in scheme: Biologie
in scheme: concept-SD-biologie-biochimie-et-biologie-moleculaire
in scheme: concepts
notation: COGB179
related: protéasome

ciblage de lésions locales dans les génomes
type: ConceptConcept
type: Concept
creator: Commission d'enrichissement de la langue française, FranceTerme
abbreviation: TILLING @en
date parution JO: 2011-09-18
equivalent EN: TILLING @en
equivalent EN: TILLING (en)
equivalent EN: targeting induced local lesions in genomes @en
equivalent EN: targeting induced local lesions in genomes (en)
alternative label: technique de Tilling
definition: Identification, au sein d'une population, des individus qui présentent, dans des séquences connues de l'ADN, des lésions locales du génome, induites ou spontanées, détectées par des enzymes qui reconnaissent la formation d'hétéroduplex consécutive à ces altérations.
in scheme: Biologie
in scheme: concept-SD-biologie-biochimie-et-biologie-moleculaire
in scheme: concepts
notation: COGB18
note: L'acronyme « Tilling » repose sur un jeu de mots en anglais, Till étant le nom de l'inventeur de cette technique.
related: hétéroduplex

protéine associée aux microtubules
type: ConceptConcept
type: Concept
creator: Commission d'enrichissement de la langue française, FranceTerme
abbreviation: MAP @en
abbreviation: PAM
date parution JO: 2014-09-16
equivalent EN: MAP @en
equivalent EN: MAP (en)
equivalent EN: microtubule-associated protein @en
equivalent EN: microtubule-associated protein (en)
definition: Protéine appartenant à un ensemble de protéines dont la fonction est liée aux microtubules et qui peuvent, selon leur nature, réunir les microtubules en faisceaux par des ponts, accroître leur stabilité, altérer leur rigidité ou encore influencer la vitesse de leur assemblage.
in scheme: Biologie
in scheme: concept-SD-biologie-biochimie-et-biologie-moleculaire
in scheme: concepts
notation: COGB180
related: protéine tau

protéine tau
type: ConceptConcept
type: Concept
creator: Commission d'enrichissement de la langue française, FranceTerme
date parution JO: 2014-09-16
equivalent EN: tau protein @en
equivalent EN: tau protein (en)
equivalent EN: tubulin-associated unit protein @en
equivalent EN: tubulin-associated unit protein (en)
definition: Protéine associée aux microtubules, abondante dans les axones, qui stabilise les microtubules et les réunit en faisceaux parallèles.
in scheme: Biologie
in scheme: concept-SD-biologie-biochimie-et-biologie-moleculaire
in scheme: concepts
notation: COGB181
note: Dans la maladie d’Alzheimer, la protéine tau, anormalement phosphorylée et glycosylée, s’accumule dans le corps et les dendrites des neurones.
related: protéine associée aux microtubules

facteur de croissance de l'endothélium vasculaire
type: ConceptConcept
type: Concept
creator: Commission d'enrichissement de la langue française, FranceTerme
abbreviation: FCEV
abbreviation: VEGF @en
date parution JO: 2014-09-16
deconseille ou frequent: facteur de croissance endothélial vasculaire
equivalent EN: VEGF @en
equivalent EN: VEGF (en)
equivalent EN: vascular endothelial growth factor @en
equivalent EN: vascular endothelial growth factor (en)
definition: Protéine qui induit la formation de néovaisseaux dans les tissus en croissance.
in scheme: Biologie
in scheme: concept-SD-biologie-biochimie-et-biologie-moleculaire
in scheme: concept-SD-biologie-biologie-du-developpement
in scheme: concepts
notation: COGB183
note: Le facteur de croissance de l’endothélium vasculaire est notamment indispensable au développement du système vasculaire des mammifères durant l’embryogenèse. Il participe par ailleurs à la croissance des tumeurs cancéreuses.
related: néovaisseau

néovaisseau
type: ConceptConcept
type: Concept
creator: Commission d'enrichissement de la langue française, FranceTerme
date parution JO: 2014-09-16
equivalent EN: neovessel @en
equivalent EN: neovessel (en)
equivalent EN: new blood vessel @en
equivalent EN: new blood vessel (en)
equivalent EN: new vessel @en
equivalent EN: new vessel (en)
part of speech: nom masculin
definition: Capillaire sanguin nouvellement formé à partir de l’endothélium vasculaire sous l’effet du facteur de croissance de cet endothélium.
in scheme: Biologie
in scheme: concept-SD-biologie-biochimie-et-biologie-moleculaire
in scheme: concept-SD-biologie-biologie-du-developpement
in scheme: concepts
notation: COGB184
note: La formation de néovaisseaux accompagne l’augmentation de la masse musculaire. Elle s’observe aussi lors du développement de tumeurs, ou encore dans certaines pathologies de l’œil dont la dégénérescence maculaire.
related: facteur de croissance de l'endothélium vasculaire

protéase de surface
type: ConceptConcept
type: Concept
creator: Commission d'enrichissement de la langue française, FranceTerme
abbreviation: FAPa @en
date parution JO: 2014-09-16
equivalent EN: FAPa @en
equivalent EN: FAPa (en)
equivalent EN: fibroblast activation protein alpha @en
equivalent EN: fibroblast activation protein alpha (en)
equivalent EN: seprase @en
equivalent EN: seprase (en)
equivalent EN: surface expressed protease @en
equivalent EN: surface expressed protease (en)
definition: Protéase à sérine, intégrée à la membrane cellulaire, qui forme des complexes avec d’autres composants membranaires et exerce son activité protéolytique à la surface cellulaire.
in scheme: Biologie
in scheme: concept-SD-biologie-biochimie-et-biologie-moleculaire
in scheme: concept-SD-biologie-biologie-cellulaire
in scheme: concepts
notation: COGB185
note: La protéase de surface dégage de la matrice extracellulaire des composants indispensables à la migration des cellules malignes.
related: matrice extracellulaire

composé sémiochimique
type: ConceptConcept
type: Concept
creator: Commission d'enrichissement de la langue française, FranceTerme
date parution JO: 2014-09-16
equivalent EN: semiochemical compound @en
equivalent EN: semiochemical compound (en)
definition: Substance émise dans l’environnement par un organisme, qui joue le rôle de signal chimique entre individus d’une même espèce ou entre individus d’espèces différentes.
in scheme: Biologie
in scheme: concept-SD-biologie-biochimie-et-biologie-moleculaire
in scheme: concept-SD-biologie-biologie-cellulaire
in scheme: concepts
notation: COGB186
note: Les allomones, les kairomones, les synomones et les phéromones sont des composés sémiochimiques.
related: allomone
related: kairomone
related: synomone

apoplasme
type: ConceptConcept
type: Concept
creator: Commission d'enrichissement de la langue française, FranceTerme
date parution JO: 2014-09-16
equivalent EN: apoplast @en
equivalent EN: apoplast (en)
part of speech: nom masculin
definition: Région de la cellule végétale située à l’extérieur de la membrane plasmique, qui comprend la paroi, les espaces intercellulaires et les cellules mortes du xylème.
in scheme: Biologie
in scheme: concept-SD-biologie-biologie-cellulaire
in scheme: concept-SD-biologie-biologie-vegetale
in scheme: concepts
notation: COGB187
related: symplasme

plasmodesme
type: ConceptConcept
type: Concept
creator: Commission d'enrichissement de la langue française, FranceTerme
date parution JO: 2014-09-16
equivalent EN: plasmodesma @en
equivalent EN: plasmodesma (en)
part of speech: nom masculin
definition: Canal très fin traversant la paroi végétale et bordé par la membrane plasmique, qui permet la circulation d’éléments divers entre les cytoplasmes de cellules voisines et, partant, dans l’ensemble de la plante.
in scheme: Biologie
in scheme: concept-SD-biologie-biologie-cellulaire
in scheme: concept-SD-biologie-biologie-vegetale
in scheme: concepts
notation: COGB188
note: Les plasmodesmes permettent notamment le passage de l’eau, des ions, des métabolites, des substances de croissance, des facteurs de transcription et des virus.
related: symplasme
related: jonction communicante

cible biologique
type: ConceptConcept
type: Concept
creator: Commission d'enrichissement de la langue française, FranceTerme
date parution JO: 2011-09-18
equivalent EN: biological target @en
equivalent EN: biological target (en)
definition: Microorganisme parasite ou molécule intrinsèque, pathogène pour l'homme et l'animal, dont la nuisance est contrôlée ou supprimée par un médicament.
in scheme: Santé et médecine
in scheme: concept-SD-sante-et-medecine-pharmacologie
in scheme: concept-SD-sante-et-medecine-toxicologie
in scheme: concepts
notation: COGB19
note: Une molécule intrinsèque peut être soit une protéine, telle qu'une enzyme ou un récepteur, soit un acide nucléique de l'organisme malade.
related: pharmacorésistance
related: pharmacosensibilité
related: concept-SANT177

trichoblaste
type: ConceptConcept
type: Concept
creator: Commission d'enrichissement de la langue française, FranceTerme
date parution JO: 2014-09-16
equivalent EN: trichoblast @en
equivalent EN: trichoblast (en)
part of speech: nom masculin
definition: Cellule de l’assise superficielle des organes des végétaux supérieurs, qui forme, au niveau racinaire, un poil absorbant, et, au niveau aérien, un des poils spécifiques de l’espèce et de l’organe.
in scheme: Biologie
in scheme: concept-SD-biologie-biologie-du-developpement
in scheme: concept-SD-biologie-biologie-vegetale
in scheme: concepts
notation: COGB190
related: trichome

rhizoxine
type: ConceptConcept
type: Concept
creator: Commission d'enrichissement de la langue française, FranceTerme
date parution JO: 2014-09-16
deconseille ou frequent: rhizotoxin
deconseille ou frequent: rhizotoxine
equivalent EN: rhizoxin @en
equivalent EN: rhizoxin (en)
part of speech: nom féminin
definition: Toxine synthétisée par une bactérie symbiotique d’un champignon pathogène, qui détruit les racines des semis.
in scheme: Biologie
in scheme: concept-SD-biologie-bacteriologie
in scheme: concept-SD-biologie-biochimie-et-biologie-moleculaire
in scheme: concepts
notation: COGB191

phycotoxine
type: ConceptConcept
type: Concept
creator: Commission d'enrichissement de la langue française, FranceTerme
date parution JO: 2014-09-16
equivalent EN: phycotoxin @en
equivalent EN: phycotoxin (en)
part of speech: nom féminin
definition: Substance toxique produite par des microalgues unicellulaires.
in scheme: Biologie
in scheme: concept-SD-biologie-biochimie-et-biologie-moleculaire
in scheme: concept-SD-biologie-biologie-vegetale
in scheme: concepts
notation: COGB192
note: Ingérée par les poissons, les mollusques et les crustacés, la phycotoxine peut contaminer la chaîne alimentaire jusqu’à l’homme et entraîner de graves intoxications.

pyrophile
type: ConceptConcept
type: Concept
creator: Commission d'enrichissement de la langue française, FranceTerme
date parution JO: 2014-09-16
equivalent EN: pyrophitic @en
equivalent EN: pyrophitic (en)
part of speech: adjectif
alternative label: pyrophytique
definition: Se dit d’une plante qui se développe sur un substrat ayant subi un incendie.
in scheme: Biologie
in scheme: concept-SD-biologie-biologie-vegetale
in scheme: concepts
notation: COGB193
note: Le feu provoque la libération des graines contenues dans des fruits solidement clos, et certains stimulants chimiques présents dans la fumée peuvent favoriser la germination.

mycotoxine
type: ConceptConcept
type: Concept
creator: Commission d'enrichissement de la langue française, FranceTerme
date parution JO: 2014-09-16
equivalent EN: mycotoxin @en
equivalent EN: mycotoxin (en)
part of speech: nom féminin
definition: Substance toxique produite par des champignons, qui peut être excrétée dans le milieu environnant.
in scheme: Biologie
in scheme: concept-SD-biologie-biochimie-et-biologie-moleculaire
in scheme: concept-SD-biologie-biologie-vegetale
in scheme: concepts
notation: COGB194

trichome
type: ConceptConcept
type: Concept
creator: Commission d'enrichissement de la langue française, FranceTerme
date parution JO: 2014-09-16
equivalent EN: trichome @en
equivalent EN: trichome (en)
part of speech: nom masculin
definition: Ensemble du revêtement pileux d’un végétal.
in scheme: Biologie
in scheme: concept-SD-biologie-biologie-vegetale
in scheme: concepts
notation: COGB195
related: trichoblaste

test d'alimentarité
type: ConceptConcept
type: Concept
creator: Commission d'enrichissement de la langue française, FranceTerme
date parution JO: 2016-01-31
equivalent EN: alimentarity test @en
equivalent EN: alimentarity test (en)
definition: Évaluation, dans les conditions d’élevage, des effets d’un nouvel aliment sur la croissance et la santé d’animaux destinés à la consommation humaine.
in scheme: Agriculture
in scheme: Alimentation
in scheme: concepts
notation: COGB196
note: 1. Le test d'alimentarité est réalisé aux fins d’une autorisation de commercialisation de l’aliment évalué.
note: 2. Les tests d'alimentarité sont en particulier effectués pour des aliments issus d’organismes génétiquement modifiés.
related: compatibilité alimentaire

protéine ingéniérisée
type: ConceptConcept
type: Concept
creator: Commission d'enrichissement de la langue française, FranceTerme
date parution JO: 2015-09-19
deconseille ou frequent: ingéniérisé
equivalent EN: engineered protein @en
equivalent EN: engineered protein (en)
definition: Protéine qui a été modifiée par des opérations d’ingénierie moléculaire lui conférant des propriétés nouvelles.
in scheme: Biologie
in scheme: concepts
notation: COGB197

messager
type: ConceptConcept
type: Concept
creator: Commission d'enrichissement de la langue française, FranceTerme
date parution JO: 2015-09-19
equivalent EN: messenger @en
equivalent EN: messenger (en)
part of speech: nom masculin
definition: Molécule qui intervient dans la régulation des processus physiologiques en véhiculant une information, notamment en participant à la signalisation cellulaire.
in scheme: Biologie
in scheme: concept-SD-biologie-biochimie-et-biologie-moleculaire
in scheme: concept-SD-biologie-biologie-cellulaire
in scheme: concepts
notation: COGB198
related: molécule de signalisation

réplication en cercle roulant
type: ConceptConcept
type: Concept
creator: Commission d'enrichissement de la langue française, FranceTerme
date parution JO: 2016-01-31
equivalent EN: rolling-circle replication @en
equivalent EN: rolling-circle replication (en)
alternative label: réplication par déroulement
definition: Mécanisme de réplication de certains acides nucléiques par lequel une molécule circulaire sert de matrice pour la synthèse d’un brin complémentaire linéaire, lequel sera dupliqué puis circularisé.
in scheme: Biologie
in scheme: concept-SD-biologie-biochimie-et-biologie-moleculaire
in scheme: concepts
notation: COGB199
note: Lors de la réplication en cercle roulant de l’ADN, les deux brins d’ADN ne sont pas répliqués simultanément, comme c’est habituellement le cas, mais successivement.
related: matrice
related: ADN circulaire
related: géminivirus
related: viroïde
related: hélitron
scope note: Cette publication annule et remplace celle du terme « cercle roulant » au Journal officiel du 22 septembre 2000.

atténuation virale
type: ConceptConcept
type: Concept
creator: Commission d'enrichissement de la langue française, FranceTerme
date parution JO: 2011-09-18
equivalent EN: viral attenuation @en
equivalent EN: viral attenuation (en)
definition: Procédé de culture qui, en favorisant les mutations d'un virus, permet à celui-ci de croître dans les cellules originelles, mais avec une plus faible virulence.
in scheme: Biologie
in scheme: concept-SD-biologie-virologie
in scheme: concepts
notation: COGB2

clonage moléculaire
type: ConceptConcept
type: Concept
creator: Commission d'enrichissement de la langue française, FranceTerme
date parution JO: 2011-09-18
equivalent EN: molecular cloning @en
equivalent EN: molecular cloning (en)
definition: Isolement et amplification de fragments d'ADN identiques, dans un clone cellulaire ou viral.
in scheme: Biologie
in scheme: concept-SD-biologie-biochimie-et-biologie-moleculaire
in scheme: concepts
notation: COGB20

géminivirus
type: ConceptConcept
type: Concept
creator: Commission d'enrichissement de la langue française, FranceTerme
date parution JO: 2015-09-19
equivalent EN: geminivirus @en
equivalent EN: geminivirus (en)
part of speech: nom masculin
definition: Virus présent chez les plantes, dont la capside, formée de deux icosaèdres jumelés, contient une ou deux molécules d’ADN circulaire simple brin qui se répliquent en cercle roulant.
in scheme: Biologie
in scheme: concept-SD-biologie-biologie-vegetale
in scheme: concept-SD-biologie-virologie
in scheme: concepts
notation: COGB200
related: ADN circulaire
related: réplication en cercle roulant

virion
type: ConceptConcept
type: Concept
creator: Commission d'enrichissement de la langue française, FranceTerme
date parution JO: 2015-09-19
equivalent EN: virion @en
equivalent EN: virion (en)
part of speech: nom masculin
definition: Particule extracellulaire sans activité métabolique, qui sert au transport du matériel génétique d’un virus avant l’intégration de celui-ci dans une cellule.
in scheme: Biologie
in scheme: concept-SD-biologie-virologie
in scheme: concepts
notation: COGB201

viroïde
type: ConceptConcept
type: Concept
creator: Commission d'enrichissement de la langue française, FranceTerme
date parution JO: 2016-01-31
equivalent EN: viroid @en
equivalent EN: viroid (en)
part of speech: nom masculin
definition: Agent infectieux sans capside, formé d’un ARN simple brin circulaire se répliquant en cercle roulant, qui est responsable de graves maladies des plantes.
in scheme: Biologie
in scheme: concept-SD-biologie-biologie-vegetale
in scheme: concept-SD-biologie-virologie
in scheme: concepts
notation: COGB202
note: Les viroïdes sont transmis de plante à plante par des moyens mécaniques ou par le pollen et les ovules.
related: réplication en cercle roulant

protéine argonaute
type: ConceptConcept
type: Concept
creator: Commission d'enrichissement de la langue française, FranceTerme
date parution JO: 2015-09-19
equivalent EN: Argonaute @en
equivalent EN: Argonaute (en)
equivalent EN: Argonaute protein @en
equivalent EN: Argonaute protein (en)
forme abregee: argonaute, n.f.
definition: Protéine appartenant à une famille dont les membres participent au blocage de l’expression de certains gènes en hydrolysant leurs ARN messagers.
in scheme: Biologie
in scheme: concept-SD-biologie-biochimie-et-biologie-moleculaire
in scheme: concepts
notation: COGB203
related: complexe de blocage de l'expression génique par des ARN

hélitron
type: ConceptConcept
type: Concept
creator: Commission d'enrichissement de la langue française, FranceTerme
date parution JO: 2015-09-19
equivalent EN: helitron @en
equivalent EN: helitron (en)
part of speech: nom masculin
definition: Grand transposon présent chez les eucaryotes, qui se réplique en cercle roulant et qui emporte et insère dans le génome des séquences, parfois fonctionnelles, de gènes différents.
in scheme: Biologie
in scheme: concept-SD-biologie-biochimie-et-biologie-moleculaire
in scheme: concepts
notation: COGB205
related: réplication en cercle roulant
related: transposon

virophage spoutnik
type: ConceptConcept
type: Concept
creator: Commission d'enrichissement de la langue française, FranceTerme
date parution JO: 2015-09-19
equivalent EN: sputnik @en
equivalent EN: sputnik (en)
forme abregee: spoutnik, n.m.
definition: Virophage à capside icosaédrale surmontée de fibrilles, capable d’infecter les virus géants.
in scheme: Biologie
in scheme: concept-SD-biologie-virologie
in scheme: concepts
notation: COGB206
note: Le génome du virophage spoutnik présente des homologies avec celui des mimivirus ou celui de virus infectant des archées, des bactéries ou des eucaryotes.

caspase
type: ConceptConcept
type: Concept
creator: Commission d'enrichissement de la langue française, FranceTerme
date parution JO: 2015-09-19
equivalent EN: caspase @en
equivalent EN: caspase (en)
equivalent EN: cysteine-containing aspartate-specific protease @en
equivalent EN: cysteine-containing aspartate-specific protease (en)
part of speech: nom féminin
definition: Protéase à cystéine qui, en hydrolysant des liaisons peptidiques qui sont situées après un aspartate, joue un rôle essentiel dans l’apoptose, dans les phénomènes inflammatoires ou dans la réponse immunitaire.
in scheme: Biologie
in scheme: concept-SD-biologie-biochimie-et-biologie-moleculaire
in scheme: concepts
notation: COGB207

chromatide
type: ConceptConcept
type: Concept
creator: Commission d'enrichissement de la langue française, FranceTerme
date parution JO: 2015-09-19
deconseille ou frequent: chromatide homologue
deconseille ou frequent: chromatide soeur
equivalent EN: chromatid @en
equivalent EN: chromatid (en)
part of speech: nom féminin
definition: Chacune des deux copies issues de la réplication d’un chromosome au cours du cycle cellulaire et réunies au moins au niveau du centromère avant leur séparation.
in scheme: Biologie
in scheme: concept-SD-biologie-biochimie-et-biologie-moleculaire
in scheme: concept-SD-biologie-biologie-cellulaire
in scheme: concepts
notation: COGB208
note: Dans une cellule diploïde, les deux chromatides issues d’un même chromosome sont appelées « chromatides sœurs » ; les deux chromatides issues chacune d’un des deux chromosomes de la même paire sont appelées « chromatides homologues ».
related: complexe cohésine

domaine modifiant la chromatine
type: ConceptConcept
type: Concept
creator: Commission d'enrichissement de la langue française, FranceTerme
date parution JO: 2015-09-19
deconseille ou frequent: chromatin organisation modifier domain
equivalent EN: chromatin organization modifier domain @en
equivalent EN: chromatin organization modifier domain (en)
equivalent EN: chromodomain @en
equivalent EN: chromodomain (en)
alternative label: chromodomaine
definition: Domaine d’une protéine nucléaire qui, en modulant la structure de la chromatine, modifie localement l’expression de certains gènes.
in scheme: Biologie
in scheme: concept-SD-biologie-biochimie-et-biologie-moleculaire
in scheme: concepts
notation: COGB209

complexe cohésine
type: ConceptConcept
type: Concept
creator: Commission d'enrichissement de la langue française, FranceTerme
date parution JO: 2015-09-19
equivalent EN: cohesin @en
equivalent EN: cohesin (en)
equivalent EN: cohesin complex @en
equivalent EN: cohesin complex (en)
forme abregee: cohésine, n.f.
definition: Complexe protéique qui assure la cohésion des chromatides sœurs entre elles durant la méïose et la mitose.
in scheme: Biologie
in scheme: concept-SD-biologie-biochimie-et-biologie-moleculaire
in scheme: concepts
notation: COGB210
related: chromatide

complexe de blocage transcriptionnel par des ARN
type: ConceptConcept
type: Concept
creator: Commission d'enrichissement de la langue française, FranceTerme
date parution JO: 2015-09-19
deconseille ou frequent: complexe RITS
equivalent EN: RITS complex @en
equivalent EN: RITS complex (en)
equivalent EN: RNA-induced transcriptional silencing complex @en
equivalent EN: RNA-induced transcriptional silencing complex (en)
definition: Complexe protéique nucléaire qui, en se liant à de petits ARN interférents, inhibe la transcription de séquences génomiques cibles par la formation et le maintien d’hétérochromatine, et entraîne simultanément la dégradation d’ARN messagers naissants.
in scheme: Biologie
in scheme: concept-SD-biologie-biochimie-et-biologie-moleculaire
in scheme: concepts
notation: COGB212
related: ARN messager
related: complexe de blocage de l'expression génique par des ARN
related: ARN guide
related: interférence par ARN
related: petit ARN interférent

désoxyribozyme
type: ConceptConcept
type: Concept
creator: Commission d'enrichissement de la langue française, FranceTerme
date parution JO: 2015-09-19
equivalent EN: DNA enzyme @en
equivalent EN: DNA enzyme (en)
equivalent EN: DNA-zyme @en
equivalent EN: DNA-zyme (en)
equivalent EN: catalytic DNA @en
equivalent EN: catalytic DNA (en)
equivalent EN: deoxyribozyme @en
equivalent EN: deoxyribozyme (en)
part of speech: nom masculin
alternative label: ADN catalytique
alternative label: ADN-enzyme
definition: ADN artificiel simple brin présentant de multiples propriétés catalytiques.
in scheme: Biologie
in scheme: concept-SD-biologie-biochimie-et-biologie-moleculaire
in scheme: concepts
notation: COGB213
related: ribozyme

domaine de mort cellulaire
type: ConceptConcept
type: Concept
creator: Commission d'enrichissement de la langue française, FranceTerme
abbreviation: DD @en
date parution JO: 2015-09-19
equivalent EN: DD @en
equivalent EN: DD (en)
equivalent EN: death domain @en
equivalent EN: death domain (en)
forme abregee: domaine de mort
definition: Séquence protéique située dans les régions cytoplasmiques des récepteurs de mort cellulaire, qui est nécessaire au déclenchement de l’apoptose.
in scheme: Biologie
in scheme: concept-SD-biologie-biochimie-et-biologie-moleculaire
in scheme: concepts
notation: COGB214
note: Par leurs interactions avec d’autres protéines, certains domaines de mort cellulaire, inclus dans de nombreuses protéines de mammifères, interviennent aussi dans les phénomènes inflammatoires, dans la nécrose et dans la réponse immunitaire innée.
related: récepteur de mort cellulaire

récepteur de mort cellulaire
type: ConceptConcept
type: Concept
creator: Commission d'enrichissement de la langue française, FranceTerme
abbreviation: DR @en
date parution JO: 2015-09-19
equivalent EN: DR @en
equivalent EN: DR (en)
equivalent EN: death receptor @en
equivalent EN: death receptor (en)
forme abregee: récepteur de mort
definition: Protéine transmembranaire ubiquitaire qui, grâce à son domaine extracellulaire, reçoit les signaux de l’apoptose, lesquels sont ensuite transmis aux domaines de mort intracellulaires.
in scheme: Biologie
in scheme: concept-SD-biologie-biochimie-et-biologie-moleculaire
in scheme: concepts
notation: COGB215
related: domaine de mort cellulaire

facteur de survie
type: ConceptConcept
type: Concept
creator: Commission d'enrichissement de la langue française, FranceTerme
date parution JO: 2016-01-31
equivalent EN: survival factor @en
equivalent EN: survival factor (en)
definition: Molécule de signalisation extracellulaire qui empêche l’apoptose.
in scheme: Biologie
in scheme: concept-SD-biologie-biochimie-et-biologie-moleculaire
in scheme: concept-SD-biologie-biologie-cellulaire
in scheme: concepts
notation: COGB218
related: molécule de signalisation

gène suppresseur de tumeur
type: ConceptConcept
type: Concept
creator: Commission d'enrichissement de la langue française, FranceTerme
date parution JO: 2016-01-31
equivalent EN: tumor suppressing gene @en
equivalent EN: tumor suppressing gene (en)
alternative label: gène anti-oncogène
definition: Gène qui inhibe la prolifération et la dédifférenciation des cellules.
in scheme: Biologie
in scheme: concept-SD-biologie-biochimie-et-biologie-moleculaire
in scheme: concept-SD-biologie-biologie-cellulaire
in scheme: concepts
notation: COGB219
note: L’inactivation des deux allèles d’un gène suppresseur de tumeur contribue à la cancérisation des cellules.

compétition
type: ConceptConcept
type: Concept
creator: Commission d'enrichissement de la langue française, FranceTerme
date parution JO: 2011-09-18
equivalent EN: competition @en
equivalent EN: competition (en)
part of speech: nom féminin
definition: Concurrence existant entre des individus d'une même espèce ou des individus d'espèces différentes qui utilisent les mêmes ressources nutritives ou énergétiques de leur milieu.
in scheme: Agriculture
in scheme: Biologie
in scheme: concepts
notation: COGB22
note: La compétition peut entraîner l'élimination d'une ou de plusieurs espèces, ce qui modifie la communauté d'un biotope.
related: compétiteur
related: espèce envahissante
related: biotope

brassage d'exons
type: ConceptConcept
type: Concept
creator: Commission d'enrichissement de la langue française, FranceTerme
date parution JO: 2016-01-31
equivalent EN: exon shuffle @en
equivalent EN: exon shuffle (en)
equivalent EN: exon shuffling @en
equivalent EN: exon shuffling (en)
definition: Association spontanée et aléatoire d’exons issus de gènes préexistants, qui conduit à la formation naturelle d’un nouveau gène.
in scheme: Biologie
in scheme: concept-SD-biologie-biochimie-et-biologie-moleculaire
in scheme: concepts
notation: COGB220
note: Dans un gène formé par brassage d’exons, chaque exon code un des domaines de la protéine nouvellement produite.
related: exon

morphogène
type: ConceptConcept
type: Concept
creator: Commission d'enrichissement de la langue française, FranceTerme
date parution JO: 2016-01-31
equivalent EN: morphogen @en
equivalent EN: morphogen (en)
part of speech: nom masculin
definition: Substance qui se diffuse dans un milieu à partir d’une source et à laquelle les cellules répondent, à certaines valeurs seuils de concentration, en formant des structures particulières.
in scheme: Biologie
in scheme: concept-SD-biologie-biochimie-et-biologie-moleculaire
in scheme: concept-SD-biologie-biologie-cellulaire
in scheme: concepts
notation: COGB221

néocentromère
type: ConceptConcept
type: Concept
creator: Commission d'enrichissement de la langue française, FranceTerme
date parution JO: 2016-01-31
equivalent EN: neocentromere @en
equivalent EN: neocentromere (en)
part of speech: nom masculin
definition: Centromère secondaire qui, avant, pendant ou après la destruction d’un centromère originel, se forme spontanément dans une position nouvelle, le plus souvent dans une région dépourvue de séquences d’ADN répétées en tandem.
in scheme: Biologie
in scheme: concept-SD-biologie-biologie-cellulaire
in scheme: concepts
notation: COGB222
related: séquences répétées en tandem

nucléoline
type: ConceptConcept
type: Concept
creator: Commission d'enrichissement de la langue française, FranceTerme
date parution JO: 2016-01-31
equivalent EN: nucleolin @en
equivalent EN: nucleolin (en)
part of speech: nom féminin
definition: Phosphoprotéine du nucléole, qui intervient dans la maturation des pré-ARN ribosomaux et dans l’assemblage des sous-unités des ribosomes.
in scheme: Biologie
in scheme: concept-SD-biologie-biochimie-et-biologie-moleculaire
in scheme: concept-SD-biologie-biologie-cellulaire
in scheme: concepts
notation: COGB223

récepteur transmembranaire de fusion sélective
type: ConceptConcept
type: Concept
creator: Commission d'enrichissement de la langue française, FranceTerme
date parution JO: 2016-01-31
deconseille ou frequent: protéine SNARE
equivalent EN: SNAP receptor @en
equivalent EN: SNAP receptor (en)
equivalent EN: SNARE @en
equivalent EN: SNARE (en)
equivalent EN: soluble NSF attachment protein receptor @en
equivalent EN: soluble NSF attachment protein receptor (en)
forme abregee: récepteur de fusion sélective, n.f.
definition: Protéine transmembranaire assurant la fusion d’une membrane donneuse avec une membrane cible.
in scheme: Biologie
in scheme: concept-SD-biologie-biochimie-et-biologie-moleculaire
in scheme: concept-SD-biologie-biologie-cellulaire
in scheme: concepts
notation: COGB224
note: 1. Le récepteur transmembranaire de fusion sélective est localisé dans les membranes plasmiques, ainsi que dans les membranes des organites et des vésicules qui en dérivent.
note: 2. On trouve aussi, dans le langage professionnel, l’expression « protéine SNARE », qui est déconseillée.
related: récepteur transmembranaire

subtilisine
type: ConceptConcept
type: Concept
creator: Commission d'enrichissement de la langue française, FranceTerme
date parution JO: 2016-01-31
equivalent EN: subtilisin @en
equivalent EN: subtilisin (en)
part of speech: nom féminin
definition: Protéase, issue du Bacillus subtilis, rendue insensible à l’oxydation par mutagénèse afin d’en permettre la production industrielle dans des bactéries transgéniques.
in scheme: Biologie
in scheme: concept-SD-biologie-biochimie-et-biologie-moleculaire
in scheme: concepts
notation: COGB225
note: La subtilisine est notamment utilisée dans les lessives et comme agent de préstérilisation dans les hôpitaux.
related: transgénèse

homéose
type: ConceptConcept
type: Concept
creator: Commission d'enrichissement de la langue française, FranceTerme
date parution JO: 2016-01-31
equivalent EN: homeosis @en
equivalent EN: homeosis (en)
part of speech: nom féminin
definition: Anomalie du développement dans laquelle un organe est remplacé par un autre, de constitution normale, après mutation d’un homéogène.
in scheme: Biologie
in scheme: concept-SD-biologie-biologie-du-developpement
in scheme: concepts
notation: COGB226
note: Le remplacement, chez une plante, d’une étamine par un pétale ou, chez la drosophile, des antennes par des pattes sont des exemples d’homéose.
related: homéogène

actinorhize
type: ConceptConcept
type: Concept
creator: Commission d'enrichissement de la langue française, FranceTerme
date parution JO: 2016-01-31
equivalent EN: actinorhiza @en
equivalent EN: actinorhiza (en)
part of speech: nom féminin
definition: Association symbiotique entre la racine d’une angiosperme arbustive ou buissonnante et un actinomycète, fixateur d’azote.
in scheme: Biologie
in scheme: concept-SD-biologie-biologie-vegetale
in scheme: concepts
notation: COGB227
note: L’actinorhize concerne en particulier certaines espèces de plantes vivant sur des sols pauvres en azote ; elle conduit alors à la formation de nodules.
related: noduline

noduline
type: ConceptConcept
type: Concept
creator: Commission d'enrichissement de la langue française, FranceTerme
date parution JO: 2016-01-31
equivalent EN: nodulin @en
equivalent EN: nodulin (en)
part of speech: nom féminin
definition: Protéine qui est synthétisée dans les nodules de certaines plantes en réponse à une infection par un microorganisme fixateur d’azote, et qui est impliquée dans le développement et le fonctionnement de ces nodules.
in scheme: Biologie
in scheme: concept-SD-biologie-biochimie-et-biologie-moleculaire
in scheme: concept-SD-biologie-biologie-vegetale
in scheme: concepts
notation: COGB228
note: Les nodulines sont notamment observées dans les associations d’une légumineuse et d’un rhizobium spécifique ; on en trouve également dans les actinorhizes.
related: actinorhize

résistance systémique acquise
type: ConceptConcept
type: Concept
creator: Commission d'enrichissement de la langue française, FranceTerme
abbreviation: RSA
date parution JO: 2016-01-31
equivalent EN: SAR @en
equivalent EN: SAR (en)
equivalent EN: systemic acquired resistance @en
equivalent EN: systemic acquired resistance (en)
definition: Ensemble des phénomènes qui se produisent dans la plante entière après la réaction d’hypersensibilité, en réponse à une attaque parasitaire, et qui se manifestent notamment par l’activation de gènes de défense.
in scheme: Biologie
in scheme: concept-SD-biologie-biologie-vegetale
in scheme: concepts
notation: COGB229
related: phytoalexine
related: réaction d'hypersensibilité
related: résistance

complexe de blocage de l'expression génique par des ARN
type: ConceptConcept
type: Concept
creator: Commission d'enrichissement de la langue française, FranceTerme
abbreviation: RISC @en
date parution JO: 2011-09-18
deconseille ou frequent: complexe RISC
equivalent EN: RISC @en
equivalent EN: RISC (en)
equivalent EN: RNA-induced silencing complex @en
equivalent EN: RNA-induced silencing complex (en)
definition: Complexe de protéines s'associant à un micro-ARN ou à un petit ARN interférent, qui intervient dans l'interférence par ARN en bloquant les ARN messagers cibles complémentaires ou en les hydrolysant.
in scheme: Biologie
in scheme: concept-SD-biologie-biochimie-et-biologie-moleculaire
in scheme: concepts
notation: COGB23
note: On trouve aussi, dans le langage professionnel, le terme « complexe RISC ».
related: protéine argonaute
related: complexe de blocage transcriptionnel par des ARN
related: ARN guide
related: interférence par ARN
related: micro-ARN
related: petit ARN interférent

bioenrichissement génétique
type: ConceptConcept
type: Concept
creator: Commission d'enrichissement de la langue française, FranceTerme
date parution JO: 2016-10-01
equivalent EN: biofortification @en
equivalent EN: biofortification (en)
equivalent EN: genetic biofortification @en
equivalent EN: genetic biofortification (en)
definition: Amélioration de la richesse nutritionnelle des plantes alimentaires par sélection génétique ou par transfert de gènes.
in scheme: Agriculture
in scheme: Biologie
in scheme: concepts
notation: COGB230
note: 1. Le bioenrichissement génétique permet d’augmenter la teneur des plantes en minéraux, en vitamines ou en provitamines, en acides gras et en acides aminés essentiels, ainsi que leur biodisponibilité.
note: 2. Le riz doré, contenant du bêtacarotène précurseur de la vitamine A, est un exemple de plante issue d’un bioenrichissement génétique par transfert de gènes.

acide jasmonique
type: ConceptConcept
type: Concept
creator: Commission d'enrichissement de la langue française, FranceTerme
date parution JO: 2016-10-01
equivalent EN: jasmonic acid @en
equivalent EN: jasmonic acid (en)
definition: Phytohormone dont la concentration augmente en réponse à divers stress, tels qu’une agression parasitaire ou une blessure.
in scheme: Biologie
in scheme: concept-SD-biologie-biochimie-et-biologie-moleculaire
in scheme: concept-SD-biologie-biologie-vegetale
in scheme: concepts
notation: COGB231
note: 1. L’acide jasmonique a différents effets physiologiques et peut notamment stimuler la formation des tubercules ou l’inhibition de la germination des graines.
note: 2. L’acide jasmonique a été isolé à partir du jasmin.
related: systémine

anisocaryose
type: ConceptConcept
type: Concept
creator: Commission d'enrichissement de la langue française, FranceTerme
date parution JO: 2016-10-01
equivalent EN: anisokaryosis @en
equivalent EN: anisokaryosis (en)
equivalent EN: anisonucleosis @en
equivalent EN: anisonucleosis (en)
part of speech: nom féminin
definition: Présence, dans une population cellulaire déterminée, de cellules dont les noyaux sont de dimensions très inégales.
in scheme: Biologie
in scheme: concept-SD-biologie-biologie-cellulaire
in scheme: concepts
notation: COGB232
note: L’anisocaryose se rencontre notamment dans les tissus cancéreux.
related: anisocytose

anisocytose
type: ConceptConcept
type: Concept
creator: Commission d'enrichissement de la langue française, FranceTerme
date parution JO: 2016-10-01
equivalent EN: anisocytosis @en
equivalent EN: anisocytosis (en)
part of speech: nom féminin
definition: Présence, dans une population cellulaire déterminée, de cellules de dimensions très inégales.
in scheme: Biologie
in scheme: concept-SD-biologie-biologie-cellulaire
in scheme: concepts
notation: COGB233
note: L’anisocytose se rencontre notamment dans les tissus cancéreux.
related: anisocaryose

cavéole
type: ConceptConcept
type: Concept
creator: Commission d'enrichissement de la langue française, FranceTerme
date parution JO: 2016-10-01
equivalent EN: caveola @en
equivalent EN: caveola (en)
part of speech: nom féminin
definition: Petite invagination de la membrane plasmique qui assure une pinocytose, et qui contient de nombreux récepteurs et transporteurs.
in scheme: Biologie
in scheme: concept-SD-biologie-biochimie-et-biologie-moleculaire
in scheme: concept-SD-biologie-biologie-cellulaire
in scheme: concepts
notation: COGB234
note: Les cavéoles sont notamment très nombreuses dans les cellules des endothéliums vasculaires et dans la cellule musculaire lisse.
related: cavéoline
related: pinocytose

cavéoline
type: ConceptConcept
type: Concept
creator: Commission d'enrichissement de la langue française, FranceTerme
date parution JO: 2016-10-01
equivalent EN: caveolin @en
equivalent EN: caveolin (en)
part of speech: nom féminin
definition: Protéine qui tapisse la face cytoplasmique des cavéoles.
in scheme: Biologie
in scheme: concept-SD-biologie-biochimie-et-biologie-moleculaire
in scheme: concept-SD-biologie-biologie-cellulaire
in scheme: concepts
notation: COGB235
related: cavéole

apprêtement de l'antigène
type: ConceptConcept
type: Concept
creator: Commission d'enrichissement de la langue française, FranceTerme
date parution JO: 2016-10-01
equivalent EN: antigen processing @en
equivalent EN: antigen processing (en)
definition: Processus consistant en la fragmentation partielle d’un antigène protéique en peptides antigéniques, puis en l’association de chacun de ces peptides à une molécule du complexe majeur d’histocompatibilité.
in scheme: Biologie
in scheme: concept-SD-biologie-biochimie-et-biologie-moleculaire
in scheme: concept-SD-biologie-biologie-cellulaire
in scheme: concepts
notation: COGB236
related: cellule dendritique
related: cellule dendritique interdigitée
related: cellule dendritique folliculaire
related: présentation de l'antigène
related: complexe majeur d'histocompatibilité

cellule dendritique
type: ConceptConcept
type: Concept
creator: Commission d'enrichissement de la langue française, FranceTerme
abbreviation: CD
date parution JO: 2016-10-01
equivalent EN: DC @en
equivalent EN: DC (en)
equivalent EN: dendritic cell @en
equivalent EN: dendritic cell (en)
definition: Cellule du système immunitaire inné des vertébrés, pourvue à certains stades de son évolution de prolongements, qui est spécialisée, selon sa nature, dans la capture, le transport, l’apprêtement de l’antigène, ou encore dans la présentation de celui-ci aux lymphocytes.
in scheme: Biologie
in scheme: concept-SD-biologie-biochimie-et-biologie-moleculaire
in scheme: concept-SD-biologie-biologie-cellulaire
in scheme: concepts
notation: COGB237
note: 1. Les prolongements des cellules dendritiques présentent une similitude avec les dendrites des neurones.
note: 2. Les cellules dendritiques se répartissent en de nombreuses sous-populations différentes, mais qui interviennent toutes dans le déclenchement d’une réponse immunitaire.
related: cellule dendritique tueuse
related: apprêtement de l'antigène
related: cellule dendritique interdigitée
related: cellule dendritique folliculaire
related: cellule de Langerhans
related: présentation de l'antigène

cellule dendritique interdigitée
type: ConceptConcept
type: Concept
creator: Commission d'enrichissement de la langue française, FranceTerme
abbreviation: CDI
date parution JO: 2016-10-01
equivalent EN: IDC @en
equivalent EN: IDC (en)
equivalent EN: interdigitated dendritic cell @en
equivalent EN: interdigitated dendritic cell (en)
equivalent EN: interdigitating dendritic cell @en
equivalent EN: interdigitating dendritic cell (en)
alternative label: cellule dendritique interdigitante
definition: Cellule dendritique qui présente l’antigène aux lymphocytes T dans les organes lymphoïdes périphériques où, parvenue à maturité, elle établit par ses prolongements de nombreux contacts entre les cellules de même nature, les lymphocytes T et les vaisseaux sanguins.
in scheme: Biologie
in scheme: concept-SD-biologie-biochimie-et-biologie-moleculaire
in scheme: concept-SD-biologie-biologie-cellulaire
in scheme: concepts
notation: COGB238
related: cellule dendritique tueuse
related: apprêtement de l'antigène
related: cellule dendritique
related: cellule de Langerhans
related: présentation de l'antigène

cellule dendritique folliculaire
type: ConceptConcept
type: Concept
creator: Commission d'enrichissement de la langue française, FranceTerme
abbreviation: CDF
abbreviation: CFD
date parution JO: 2016-10-01
equivalent EN: FDC @en
equivalent EN: FDC (en)
equivalent EN: follicular dendritic cell @en
equivalent EN: follicular dendritic cell (en)
alternative label: cellule folliculaire dendritique
definition: Cellule dendritique des centres germinatifs des follicules lymphoïdes, qui porte en surface des récepteurs piégeant des complexes antigène-anticorps, et qui, même des années après, peut transmettre ces complexes à des lymphocytes B.
in scheme: Biologie
in scheme: concept-SD-biologie-biochimie-et-biologie-moleculaire
in scheme: concept-SD-biologie-biologie-cellulaire
in scheme: concepts
notation: COGB239
note: Dans le processus impliquant une cellule dendritique folliculaire, ce sont les lymphocytes B qui apprêtent l’antigène et le présentent aux lymphocytes T.
related: apprêtement de l'antigène
related: cellule dendritique
related: présentation de l'antigène

cellule de Langerhans
type: ConceptConcept
type: Concept
creator: Commission d'enrichissement de la langue française, FranceTerme
date parution JO: 2016-10-01
equivalent EN: Langerhans cell @en
equivalent EN: Langerhans cell (en)
definition: Cellule dendritique présente dans l’épiderme et les épithéliums des muqueuses, qui, après capture d’un antigène et migration dans les ganglions lymphatiques où elle acquiert sa maturité, se transforme en cellule dendritique interdigitée.
in scheme: Biologie
in scheme: concept-SD-biologie-biochimie-et-biologie-moleculaire
in scheme: concept-SD-biologie-biologie-cellulaire
in scheme: concepts
notation: COGB240
related: cellule dendritique
related: cellule dendritique interdigitée

cellule progénitrice
type: ConceptConcept
type: Concept
creator: Commission d'enrichissement de la langue française, FranceTerme
date parution JO: 2016-10-01
equivalent EN: progenitor @en
equivalent EN: progenitor (en)
equivalent EN: progenitor cell @en
equivalent EN: progenitor cell (en)
alternative label: progéniteur
definition: Cellule issue d’une cellule souche multipotente, qui ne présente pas encore de signe de différenciation mais qui, après trois ou quatre divisions, donne naissance à une ou plusieurs lignées cellulaires.
in scheme: Biologie
in scheme: concept-SD-biologie-biochimie-et-biologie-moleculaire
in scheme: concept-SD-biologie-biologie-cellulaire
in scheme: concepts
notation: COGB241
note: Contrairement à la cellule souche multipotente dont elle est issue, la cellule progénitrice n’a pas de capacité d’autorenouvellement.
related: lignée cellulaire
related: cellule multipotente
related: autorenouvellement

épimorphose
type: ConceptConcept
type: Concept
creator: Commission d'enrichissement de la langue française, FranceTerme
date parution JO: 2016-10-01
equivalent EN: epimorphosis @en
equivalent EN: epimorphosis (en)
part of speech: nom féminin
definition: Régénération, chez certains animaux, d’un organe après son amputation, par multiplication au niveau de la section d’un groupe de cellules indifférenciées préexistantes ou de cellules différenciées qui se dédifférencient.
in scheme: Biologie
in scheme: concept-SD-biologie-biologie-cellulaire
in scheme: concept-SD-biologie-biologie-du-developpement
in scheme: concepts
notation: COGB242
note: La régénération de la queue d’un lézard ou celle de la tête d’une planaire sont des exemples d’épimorphose.
related: morphallaxie

morphallaxie
type: ConceptConcept
type: Concept
creator: Commission d'enrichissement de la langue française, FranceTerme
date parution JO: 2016-10-01
equivalent EN: morphallaxis @en
equivalent EN: morphallaxis (en)
part of speech: nom féminin
definition: Régénération, chez certains animaux, d’un organe après son amputation, par migration de cellules venant d’autres régions, qui se différencient sans multiplication cellulaire.
in scheme: Biologie
in scheme: concept-SD-biologie-biologie-cellulaire
in scheme: concept-SD-biologie-biologie-du-developpement
in scheme: concepts
notation: COGB243
note: L’hydre est capable de morphallaxie.
related: épimorphose

facteur nécessaire à la réplication
type: ConceptConcept
type: Concept
creator: Commission d'enrichissement de la langue française, FranceTerme
date parution JO: 2016-10-01
deconseille ou frequent: facteur autorisant
equivalent EN: RLF @en
equivalent EN: RLF (en)
equivalent EN: licensing factor @en
equivalent EN: licensing factor (en)
equivalent EN: replication licensing factor @en
equivalent EN: replication licensing factor (en)
alternative label: facteur de réplication
definition: Protéine ou ensemble de protéines qui permettent d’amorcer la réplication de l’ADN pendant la phase de synthèse du cycle cellulaire, mais sont détruites ou inactivées au cours de cette phase, ce qui évite une nouvelle réplication.
in scheme: Biologie
in scheme: concept-SD-biologie-biochimie-et-biologie-moleculaire
in scheme: concepts
notation: COGB244

haplosuffisance
type: ConceptConcept
type: Concept
creator: Commission d'enrichissement de la langue française, FranceTerme
date parution JO: 2016-10-01
equivalent EN: haplo-sufficiency @en
equivalent EN: haplo-sufficiency (en)
equivalent EN: haplosufficiency @en
equivalent EN: haplosufficiency (en)
part of speech: nom féminin
definition: Situation dans laquelle le produit d’un seul allèle est synthétisé en quantité suffisante pour permettre le fonctionnement normal de la cellule.
in scheme: Biologie
in scheme: concept-SD-biologie-biochimie-et-biologie-moleculaire
in scheme: concept-SD-biologie-biologie-cellulaire
in scheme: concepts
notation: COGB245
note: On parle, par exemple, de l’haplosuffisance d’un allèle dominant.
related: haplo-insuffisance

métagénome
type: ConceptConcept
type: Concept
creator: Commission d'enrichissement de la langue française, FranceTerme
date parution JO: 2016-10-01
equivalent EN: metagenome @en
equivalent EN: metagenome (en)
part of speech: nom masculin
definition: Ensemble des génomes des microorganismes d’un milieu donné.
in scheme: Biologie
in scheme: concept-SD-biologie-biochimie-et-biologie-moleculaire
in scheme: concept-SD-biologie-biologie-cellulaire
in scheme: concepts
notation: COGB246
note: On parle par exemple du métagénome de la flore intestinale de l’homme ou d’un animal, du métagénome d’un milieu marin ou lacustre, ou encore du métagénome d’un sol.
related: génome

gène mutateur
type: ConceptConcept
type: Concept
creator: Commission d'enrichissement de la langue française, FranceTerme
date parution JO: 2016-10-01
equivalent EN: mutator @en
equivalent EN: mutator (en)
equivalent EN: mutator gene @en
equivalent EN: mutator gene (en)
forme abregee: mutateur, n.m.
definition: Gène de procaryote dont l’expression, stimulée quand ce procaryote est soumis à des conditions défavorables, entraîne une augmentation du taux de mutations.
in scheme: Biologie
in scheme: concept-SD-biologie-biochimie-et-biologie-moleculaire
in scheme: concept-SD-biologie-genetique
in scheme: concepts
notation: COGB247
note: Certaines de ces mutations permettent à l’organisme porteur du gène de s’adapter à ces conditions.
related: phénotype mutateur

phénotype mutateur
type: ConceptConcept
type: Concept
creator: Commission d'enrichissement de la langue française, FranceTerme
date parution JO: 2016-10-01
equivalent EN: mutator phenotype @en
equivalent EN: mutator phenotype (en)
definition: Phénotype dans lequel la fréquence des mutations est plus élevée que dans le phénotype normal.
in scheme: Biologie
in scheme: concept-SD-biologie-biochimie-et-biologie-moleculaire
in scheme: concept-SD-biologie-genetique
in scheme: concepts
notation: COGB248
related: gène mutateur

protéine gardienne du génome
type: ConceptConcept
type: Concept
creator: Commission d'enrichissement de la langue française, FranceTerme
date parution JO: 2016-10-01
deconseille ou frequent: protéine 53
equivalent EN: p53 @en
equivalent EN: p53 (en)
equivalent EN: protein 53 @en
equivalent EN: protein 53 (en)
definition: Protéine ubiquitaire qui, en réponse à un stress génotoxique, active l’expression de gènes contrôlant l’intégrité de l’ADN, le cycle cellulaire, l’apoptose et la recombinaison homologue.
in scheme: Biologie
in scheme: concept-SD-biologie-biochimie-et-biologie-moleculaire
in scheme: concepts
notation: COGB249
note: On trouve aussi, dans le langage professionnel, l’expression « protéine 53 ».

criblage
type: ConceptConcept
type: Concept
creator: Commission d'enrichissement de la langue française, FranceTerme
date parution JO: 2011-09-18
equivalent EN: screening @en
equivalent EN: screening (en)
part of speech: nom masculin
definition: Tri effectué, au sein d'une population, afin d'isoler les individus qui possèdent des caractères particuliers.
in scheme: Biologie
in scheme: concept-SD-biologie-biochimie-et-biologie-moleculaire
in scheme: concept-SD-biologie-genetique
in scheme: concepts
notation: COGB25
note: Le criblage permet notamment de sélectionner, dans des cultures cellulaires, des gènes conférant l'auxotrophie ou la résistance aux antibiotiques, dans une population végétale, des plantes résistant à certaines maladies et, dans une population animale, des individus choisis pour leur groupe sanguin.
scope note: Cette publication annule et remplace celle du Journal officiel du 22 septembre 2000.

strigolactone
type: ConceptConcept
type: Concept
creator: Commission d'enrichissement de la langue française, FranceTerme
date parution JO: 2016-10-01
equivalent EN: strigolactone @en
equivalent EN: strigolactone (en)
part of speech: nom féminin
definition: Phytohormone dérivée des caroténoïdes, qui contrôle la ramification des plantes, entraîne la germination des graines de phanérogames parasites et stimule la croissance des champignons symbiotiques mycorhiziens.
in scheme: Biologie
in scheme: concept-SD-biologie-biochimie-et-biologie-moleculaire
in scheme: concept-SD-biologie-biologie-vegetale
in scheme: concepts
notation: COGB250
note: La strigolactone a été découverte en étudiant la germination du Striga.

transposon créateur de gènes
type: ConceptConcept
type: Concept
creator: Commission d'enrichissement de la langue française, FranceTerme
date parution JO: 2016-10-01
deconseille ou frequent: transposon Pack-MULE
equivalent EN: Pack-MULE transposable element @en
equivalent EN: Pack-MULE transposable element (en)
equivalent EN: pack-mutator like transposable element @en
equivalent EN: pack-mutator like transposable element (en)
definition: Transposon assemblant des fragments de gènes issus de différents sites chromosomiques, qui est ainsi à l’origine de nouveaux gènes et de transcrits chimériques.
in scheme: Biologie
in scheme: concept-SD-biologie-biochimie-et-biologie-moleculaire
in scheme: concept-SD-biologie-biologie-vegetale
in scheme: concepts
notation: COGB251
note: 1. Les transposons créateurs de gènes, découverts chez des plantes, jouent un rôle capital dans l’évolution des génomes.
note: 2. On trouve aussi, dans le langage professionnel, l’expression « transposon Pack-MULE », qui est déconseillée.
related: transposon mutateur
related: transposon

transposon mutateur
type: ConceptConcept
type: Concept
creator: Commission d'enrichissement de la langue française, FranceTerme
date parution JO: 2016-10-01
equivalent EN: Mu @en
equivalent EN: Mu (en)
equivalent EN: Mu element @en
equivalent EN: Mu element (en)
equivalent EN: Mu transposable element @en
equivalent EN: Mu transposable element (en)
equivalent EN: Mu transposon @en
equivalent EN: Mu transposon (en)
equivalent EN: mutator system @en
equivalent EN: mutator system (en)
equivalent EN: mutator transposon @en
equivalent EN: mutator transposon (en)
definition: Transposon, appartenant à une famille très diversifiée, qui est à l’origine d’un nombre élevé de mutations par transposition.
in scheme: Biologie
in scheme: concept-SD-biologie-biochimie-et-biologie-moleculaire
in scheme: concept-SD-biologie-biologie-vegetale
in scheme: concepts
notation: COGB252
note: Le transposon mutateur a été découvert chez le maïs.
related: transposon créateur de gènes
related: transposon

absorbotrophie
type: ConceptConcept
type: Concept
creator: Commission d'enrichissement de la langue française, FranceTerme
date parution JO: 2017-06-14
equivalent EN: absorbotrophy @en
equivalent EN: absorbotrophy (en)
part of speech: nom féminin
definition: Mode de nutrition des champignons saprophytes qui, après avoir sécrété des enzymes dans leur substrat, peuvent absorber, au travers de leur paroi, les molécules organiques simples ainsi libérées du substrat.
in scheme: Biologie
in scheme: concept-SD-biologie-biologie-vegetale
in scheme: concepts
notation: COGB253

osmotrophie
type: ConceptConcept
type: Concept
creator: Commission d'enrichissement de la langue française, FranceTerme
date parution JO: 2017-06-14
part of speech: nom féminin
definition: Mode de nutrition des protistes, des métazoaires et des bactéries vivant dans un milieu liquide qui absorbent des nutriments solubles présents dans ce milieu.
in scheme: Biologie
in scheme: concept-SD-biologie-biologie-vegetale
in scheme: concepts
notation: COGB254

calcineurine
type: ConceptConcept
type: Concept
creator: Commission d'enrichissement de la langue française, FranceTerme
date parution JO: 2017-06-14
equivalent EN: calcineurin @en
equivalent EN: calcineurin (en)
part of speech: nom féminin
definition: Protéine-phosphatase qui, une fois activée par les ions calcium du cytosol, déphosphoryle certaines phosphoprotéines, notamment des facteurs de transcription ainsi que des protéines membranaires intervenant dans la communication entre neurones, et en régule ainsi l’activité.
in scheme: Biologie
in scheme: concept-SD-biologie-biochimie-et-biologie-moleculaire
in scheme: concepts
notation: COGB255
related: protéine-phosphatase

agrésome
type: ConceptConcept
type: Concept
creator: Commission d'enrichissement de la langue française, FranceTerme
date parution JO: 2017-06-14
equivalent EN: aggresome @en
equivalent EN: aggresome (en)
part of speech: nom masculin
definition: Agrégat cytoplasmique de protéines mal repliées et accumulées en si grande quantité que le protéasome ne peut plus les hydrolyser.
in scheme: Biologie
in scheme: concept-SD-biologie-biochimie-et-biologie-moleculaire
in scheme: concept-SD-biologie-biologie-cellulaire
in scheme: concepts
notation: COGB257
related: protéasome

criblage de mutants
type: ConceptConcept
type: Concept
creator: Commission d'enrichissement de la langue française, FranceTerme
date parution JO: 2011-09-18
equivalent EN: mutant screening @en
equivalent EN: mutant screening (en)
definition: Sélection des individus porteurs d'un caractère particulier résultant de mutations induites notamment par un agent chimique ou par des radiations.
in scheme: Biologie
in scheme: concept-SD-biologie-biochimie-et-biologie-moleculaire
in scheme: concept-SD-biologie-genetique
in scheme: concepts
notation: COGB26
related: mutation

conversion génique
type: ConceptConcept
type: Concept
creator: Commission d'enrichissement de la langue française, FranceTerme
date parution JO: 2017-06-14
equivalent EN: gene conversion @en
equivalent EN: gene conversion (en)
definition: Modification spontanée ou expérimentale d’un gène par remplacement d’un segment d’ADN par un autre segment provenant d’un gène différent apparenté ou d’un allèle de ce gène.
in scheme: Biologie
in scheme: concept-SD-biologie-biochimie-et-biologie-moleculaire
in scheme: concepts
notation: COGB260
note: La conversion génique non allélique est observée chez la levure et les lymphocytes B des oiseaux ; la conversion génique allélique est observée au cours de la méiose, qu’il y ait ou non enjambement.
related: concept-SANT8

division cellulaire asymétrique
type: ConceptConcept
type: Concept
creator: Commission d'enrichissement de la langue française, FranceTerme
abbreviation: DCA
date parution JO: 2017-06-14
deconseille ou frequent: division asymétrique
equivalent EN: ACD @en
equivalent EN: ACD (en)
equivalent EN: asymmetric cell division @en
equivalent EN: asymmetric cell division (en)
equivalent EN: asymmetric division @en
equivalent EN: asymmetric division (en)
definition: Formation, à l’issue de la mitose, de deux cellules filles de devenir différent.
in scheme: Biologie
in scheme: concept-SD-biologie-biologie-cellulaire
in scheme: concepts
notation: COGB262
note: La division cellulaire d’une cellule souche est un exemple de division cellulaire asymétrique.
related: cellule souche

expressivité
type: ConceptConcept
type: Concept
creator: Commission d'enrichissement de la langue française, FranceTerme
date parution JO: 2017-06-14
equivalent EN: expressivity @en
equivalent EN: expressivity (en)
part of speech: nom féminin
definition: Capacité d’un gène ou d’un génotype à exprimer différents phénotypes en fonction de son environnement.
in scheme: Biologie
in scheme: concept-SD-biologie-biochimie-et-biologie-moleculaire
in scheme: concept-SD-biologie-genetique
in scheme: concepts
notation: COGB263

famille de protéines
type: ConceptConcept
type: Concept
creator: Commission d'enrichissement de la langue française, FranceTerme
date parution JO: 2017-06-14
equivalent EN: protein family @en
equivalent EN: protein family (en)
definition: Ensemble de protéines dont les séquences ont un degré de similarité laissant supposer une origine évolutive commune, des structures tertiaires voisines et des fonctions analogues.
in scheme: Biologie
in scheme: concept-SD-biologie-biochimie-et-biologie-moleculaire
in scheme: concepts
notation: COGB264
note: Les protéines sont regroupées dans une même famille lorsque 50 % au moins de leurs séquences sont identiques.
related: famille de gènes
related: connexine

protéine à fluorescence verte
type: ConceptConcept
type: Concept
creator: Commission d'enrichissement de la langue française, FranceTerme
date parution JO: 2017-06-14
deconseille ou frequent: protéine fluorescente verte
deconseille ou frequent: protéine verte fluorescente
equivalent EN: GFP @en
equivalent EN: GFP (en)
equivalent EN: green fluorescent protein @en
equivalent EN: green fluorescent protein (en)
definition: Protéine qui, par exposition à un rayonnement ultraviolet proche du visible, émet une fluorescence verte, ce qui permet l’examen de cellules vivantes et l’utilisation de son gène comme gène rapporteur.
in scheme: Biologie
in scheme: concept-SD-biologie-biochimie-et-biologie-moleculaire
in scheme: concept-SD-biologie-biologie-cellulaire
in scheme: concepts
notation: COGB265
related: gène rapporteur

gène rapporteur
type: ConceptConcept
type: Concept
creator: Commission d'enrichissement de la langue française, FranceTerme
date parution JO: 2017-06-14
equivalent EN: reporter gene @en
equivalent EN: reporter gene (en)
definition: Gène qui code une protéine détectable in situ et qui, utilisé comme transgène, sert à marquer des cellules dont on veut suivre le devenir, à confirmer l’expression d’un autre transgène ou à évaluer la puissance d’un promoteur.
in scheme: Biologie
in scheme: concept-SD-biologie-biochimie-et-biologie-moleculaire
in scheme: concept-SD-biologie-biologie-cellulaire
in scheme: concepts
notation: COGB266
related: promoteur
related: transgénèse
related: protéine à fluorescence verte

mosaïque génétique
type: ConceptConcept
type: Concept
creator: Commission d'enrichissement de la langue française, FranceTerme
date parution JO: 2017-06-14
equivalent EN: genetic mosaic @en
equivalent EN: genetic mosaic (en)
definition: Structure d’un organisme constitué de cellules ayant des génotypes différents, apparus par mutation au cours du développement de cet organisme.
in scheme: Biologie
in scheme: concept-SD-biologie-biochimie-et-biologie-moleculaire
in scheme: concept-SD-biologie-biologie-cellulaire
in scheme: concepts
notation: COGB267
related: mutation

peptidoglycane
type: ConceptConcept
type: Concept
creator: Commission d'enrichissement de la langue française, FranceTerme
abbreviation: PG
date parution JO: 2017-06-14
equivalent EN: PG @en
equivalent EN: PG (en)
equivalent EN: peptidoglycan @en
equivalent EN: peptidoglycan (en)
part of speech: nom masculin
definition: Polymère de la paroi des bactéries, constitué de longues chaînes de dérivés glucidiques reliées par des unités tétrapeptidiques.
in scheme: Biologie
in scheme: concept-SD-biologie-biochimie-et-biologie-moleculaire
in scheme: concept-SD-biologie-biologie-cellulaire
in scheme: concepts
notation: COGB269
note: 1. Le peptidoglycane assure la résistance mécanique de la paroi et permet des échanges avec le milieu.
note: 2. Les constituants du peptidoglycane stimulent la réaction immunitaire d’un hôte infecté et annulent, par des modifications de leur structure chimique, l’effet de certains antibiotiques.

criblage différentiel
type: ConceptConcept
type: Concept
creator: Commission d'enrichissement de la langue française, FranceTerme
date parution JO: 2011-09-18
equivalent EN: differential display @en
equivalent EN: differential display (en)
equivalent EN: mRNA differential display @en
equivalent EN: mRNA differential display (en)
forme abregee: tri d'ARNm
alternative label: tri d'ARN messager
definition: Opération consistant à obtenir par transcription inverse, à l'aide d'amorces spécifiques, des séquences partielles d'ADN complémentaire correspondant à certains ARN messagers.
in scheme: Biologie
in scheme: concept-SD-biologie-biochimie-et-biologie-moleculaire
in scheme: concepts
notation: COGB27
related: ARN messager
related: amorce
related: ADN complémentaire

empreinte génomique parentale
type: ConceptConcept
type: Concept
creator: Commission d'enrichissement de la langue française, FranceTerme
date parution JO: 2011-09-18
equivalent EN: parental genomic imprinting @en
equivalent EN: parental genomic imprinting (en)
definition: Expression exclusive, pour certains gènes, soit de l'allèle maternel, soit de l'allèle paternel.
in scheme: Biologie
in scheme: concept-SD-biologie-biochimie-et-biologie-moleculaire
in scheme: concepts
notation: COGB28
note: 1. L'empreinte génomique parentale est due à l'inactivation des gènes lors de la formation des gamètes, inactivation qui persiste plus ou moins longtemps après la fécondation.
note: 2. On qualifiera l'empreinte génomique parentale tantôt de « maternelle », tantôt de « paternelle ».

haplo-insuffisance
type: ConceptConcept
type: Concept
creator: Commission d'enrichissement de la langue française, FranceTerme
date parution JO: 2016-10-01
equivalent EN: haplo-insufficiency @en
equivalent EN: haplo-insufficiency (en)
equivalent EN: haploinsufficiency @en
equivalent EN: haploinsufficiency (en)
part of speech: nom féminin
definition: Situation dans laquelle le produit d’un seul allèle, bien qu’actif, est synthétisé en quantité insuffisante pour permettre le fonctionnement normal de la cellule.
in scheme: Biologie
in scheme: concept-SD-biologie-biochimie-et-biologie-moleculaire
in scheme: concept-SD-biologie-biologie-cellulaire
in scheme: concepts
notation: COGB281
related: haplosuffisance

présentation de l'antigène
type: ConceptConcept
type: Concept
creator: Commission d'enrichissement de la langue française, FranceTerme
date parution JO: 2016-10-01
equivalent EN: antigen presentation @en
equivalent EN: antigen presentation (en)
definition: Processus au cours duquel un peptide antigénique apprêté est transporté et ancré à la surface de la membrane cellulaire où il pourra être reconnu par un récepteur d’un lymphocyte T.
in scheme: Biologie
in scheme: concept-SD-biologie-biochimie-et-biologie-moleculaire
in scheme: concept-SD-biologie-biologie-cellulaire
in scheme: concepts
notation: COGB282
related: cellule dendritique tueuse
related: apprêtement de l'antigène
related: cellule dendritique
related: cellule dendritique interdigitée
related: cellule dendritique folliculaire
related: complexe majeur d'histocompatibilité

guidage génétique
type: ConceptConcept
type: Concept
creator: Commission d'enrichissement de la langue française, FranceTerme
date parution JO: 2018-03-28
deconseille ou frequent: forçage génétique
deconseille ou frequent: genetic drive
equivalent EN: gene drive @en
equivalent EN: gene drive (en)
definition: Procédé qui consiste à modifier la transmission héréditaire de certains gènes par génie génétique afin d’agir, au cours des générations, sur la composition de populations.
in scheme: Biologie
in scheme: concept-SD-biologie-biochimie-et-biologie-moleculaire
in scheme: concept-SD-biologie-genetique
in scheme: concepts
notation: COGB284
note: 1. Le guidage génétique peut être utilisé pour tenter d’éradiquer certaines populations d’organismes nuisibles, envahissants ou vecteurs de maladie, telles des espèces de moustiques.
note: 2. Le guidage génétique recourt notamment à la réécriture génomique.
note: 3. On trouve aussi, dans le langage professionnel, l’expression « forçage génétique », qui n’est pas recommandée.
related: espèce envahissante

mutagénèse dirigée
type: ConceptConcept
type: Concept
creator: Commission d'enrichissement de la langue française, FranceTerme
date parution JO: 2018-03-28
equivalent EN: SDM @en
equivalent EN: SDM (en)
equivalent EN: site-directed mutagenesis @en
equivalent EN: site-directed mutagenesis (en)
equivalent EN: site-specific mutagenesis @en
equivalent EN: site-specific mutagenesis (en)
definition: Procédé qui consiste à introduire une mutation précise dans un site déterminé d’un génome.
in scheme: Biologie
in scheme: concept-SD-biologie-biochimie-et-biologie-moleculaire
in scheme: concept-SD-biologie-genetique
in scheme: concepts
notation: COGB285
note: La mutagénèse dirigée peut recourir à la réécriture génomique.
related: mutation
scope note: Cette publication annule et remplace celle du Journal officiel du 22 septembre 2000.

groupement d'éléments palindromiques et d'espaceurs
type: ConceptConcept
type: Concept
creator: Commission d'enrichissement de la langue française, FranceTerme
abbreviation: GEPE
date parution JO: 2018-03-28
deconseille ou frequent: RSCP
deconseille ou frequent: répétition de séquences du chromosome procaryote
equivalent EN: CRISPR @en
equivalent EN: CRISPR (en)
equivalent EN: clustered regularly interspaced short palindromic repeats @en
equivalent EN: clustered regularly interspaced short palindromic repeats (en)
definition: Série de courtes répétitions palindromiques nucléotidiques, régulièrement séparées par des espaceurs et présentes dans le chromosome de nombreuses archées et bactéries.
in scheme: Biologie
in scheme: concept-SD-biologie-biochimie-et-biologie-moleculaire
in scheme: concepts
notation: COGB286
note: Le groupement d’éléments palindromiques et d’espaceurs joue un rôle majeur dans le mécanisme naturel de défense des archées et des bactéries contre les phages à ADN et les plasmides invasifs.
related: ARN guide
related: proto-espaceur
related: espaceur
related: motif de reconnaissance du proto-espaceur
related: endodésoxyribonucléase 9

ARN guide
type: ConceptConcept
type: Concept
creator: Commission d'enrichissement de la langue française, FranceTerme
date parution JO: 2018-03-28
equivalent EN: gRNA @en
equivalent EN: gRNA (en)
equivalent EN: guide RNA @en
equivalent EN: guide RNA (en)
definition: ARN s’associant à une enzyme ou à un complexe protéique, qui, lorsqu’il s’apparie à une séquence d’ARN ou d’ADN complémentaire, permet à l’enzyme ou au complexe protéique de se positionner sur cet ARN ou ADN complémentaire.
in scheme: Biologie
in scheme: concept-SD-biologie-biochimie-et-biologie-moleculaire
in scheme: concepts
notation: COGB287
note: 1. Il existe des ARN guides d’endodésoxyribonucléases ou de la télomérase, ainsi que des ARN guides qui interviennent dans l’interférence par ARN ou dans la maturation de l’ARN ribosomique.
note: 2. Dans le cas des ARN guides d’endodésoxyribonucléases, la transcription des groupements d’éléments palindromiques et d’espaceurs aboutit à un long ARN précurseur, ensuite découpé en plusieurs ARN guides plus petits.
related: ARN précurseur
related: complexe de blocage transcriptionnel par des ARN
related: complexe de blocage de l'expression génique par des ARN
related: groupement d'éléments palindromiques et d'espaceurs
related: motif de reconnaissance du proto-espaceur
related: interférence par ARN
related: ciseaux moléculaires
related: endodésoxyribonucléase 9

enzyme éminceuse
type: ConceptConcept
type: Concept
creator: Commission d'enrichissement de la langue française, FranceTerme
date parution JO: 2011-09-18
equivalent EN: dicer @en
equivalent EN: dicer (en)
equivalent EN: dicer enzyme @en
equivalent EN: dicer enzyme (en)
definition: Enzyme qui clive de longs ARN double brin en un ou plusieurs fragments de même taille, eux-mêmes à l'origine des micro-ARN ou des petits ARN interférents.
in scheme: Biologie
in scheme: concept-SD-biologie-biochimie-et-biologie-moleculaire
in scheme: concepts
notation: COGB29
related: interférence par ARN
related: précurseur de micro-ARN
related: précurseur de petits ARN interférents
related: micro-ARN
related: petit ARN interférent

protéine-phosphatase
type: ConceptConcept
type: Concept
creator: Commission d'enrichissement de la langue française, FranceTerme
abbreviation: PP
date parution JO: 2017-06-14
equivalent EN: PP @en
equivalent EN: PP (en)
equivalent EN: protein phosphatase @en
equivalent EN: protein phosphatase (en)
part of speech: nom féminin
alternative label: phosphatase de protéine
definition: Enzyme qui déphosphoryle les résidus sérine, thréonine ou tyrosine préalablement phosphorylés, présents dans les protéines.
in scheme: Biologie
in scheme: concept-SD-biologie-biochimie-et-biologie-moleculaire
in scheme: concepts
notation: COGB290
related: calcineurine

proto-espaceur
type: ConceptConcept
type: Concept
creator: Commission d'enrichissement de la langue française, FranceTerme
date parution JO: 2018-03-28
equivalent EN: protospacer @en
equivalent EN: protospacer (en)
part of speech: nom masculin
definition: Séquence d’ADN de phage ou de plasmide invasifs qui, chez les procaryotes pourvus de groupements d’éléments palindromiques et d’espaceurs, comporte un motif de reconnaissance et la séquence qui deviendra l’espaceur.
in scheme: Biologie
in scheme: concept-SD-biologie-biochimie-et-biologie-moleculaire
in scheme: concepts
notation: COGB291
related: groupement d'éléments palindromiques et d'espaceurs
related: espaceur
related: motif de reconnaissance du proto-espaceur

espaceur
type: ConceptConcept
type: Concept
creator: Commission d'enrichissement de la langue française, FranceTerme
date parution JO: 2018-03-28
equivalent EN: spacer @en
equivalent EN: spacer (en)
part of speech: nom masculin
definition: Fragment d’ADN de phage ou de plasmide invasifs, inséré entre deux courtes répétitions palindromiques successives du chromosome de nombreuses archées et bactéries.
in scheme: Biologie
in scheme: concept-SD-biologie-biochimie-et-biologie-moleculaire
in scheme: concepts
notation: COGB292
related: groupement d'éléments palindromiques et d'espaceurs
related: proto-espaceur
related: motif de reconnaissance du proto-espaceur
related: endodésoxyribonucléase 9

motif de reconnaissance du proto-espaceur
type: ConceptConcept
type: Concept
creator: Commission d'enrichissement de la langue française, FranceTerme
date parution JO: 2018-03-28
equivalent EN: PAM @en
equivalent EN: PAM (en)
equivalent EN: protospacer adjacent motif @en
equivalent EN: protospacer adjacent motif (en)
forme abregee: motif de reconnaissance
definition: Séquence de 2 à 6 paires de bases qui doit être préalablement reconnue par une endodésoxyribonucléase pour que celle-ci opère la coupure de l’ADN.
in scheme: Biologie
in scheme: concept-SD-biologie-biochimie-et-biologie-moleculaire
in scheme: concepts
notation: COGB293
note: 1. Chez les archées et les bactéries porteuses de groupements d’éléments palindromiques et d’espaceurs, le chromosome ne contient pas de motif de reconnaissance du proto-espaceur, ce qui le met à l’abri d’une coupure par une endodésoxyribonucléase.
note: 2. La réécriture génomique nécessite que la cible des ARN guides artificiels comporte un motif de reconnaissance du proto-espaceur.
related: groupement d'éléments palindromiques et d'espaceurs
related: ARN guide
related: proto-espaceur
related: espaceur
related: endodésoxyribonucléase 9
related: réécriture génomique
related: paire de bases

nucléase-effecteur de type activateur de transcription
type: ConceptConcept
type: Concept
creator: Commission d'enrichissement de la langue française, FranceTerme
abbreviation: NETAT
date parution JO: 2018-03-28
equivalent EN: TALEN @en
equivalent EN: TALEN (en)
equivalent EN: transcription activator-like effector nuclease @en
equivalent EN: transcription activator-like effector nuclease (en)
definition: Enzyme de restriction artificielle, utilisée dans la réécriture génomique, obtenue en combinant une endodésoxyribonucléase et le domaine de liaison à l’ADN d’un effecteur de type activateur de transcription.
in scheme: Biologie
in scheme: concept-SD-biologie-biochimie-et-biologie-moleculaire
in scheme: concept-SD-biologie-biologie-cellulaire
in scheme: concepts
notation: COGB294
related: restriction
related: domaine de liaison à l'ADN
related: réécriture génomique

interférence par ARN
type: ConceptConcept
type: Concept
creator: Commission d'enrichissement de la langue française, FranceTerme
date parution JO: 2018-03-28
equivalent EN: RNA interference @en
equivalent EN: RNA interference (en)
equivalent EN: RNAi @en
equivalent EN: RNAi (en)
definition: Suppression de l’action de certains gènes par de petits ARN simple brin, qui, formant un complexe avec une machinerie protéique spécifique, empêchent la transcription ou la traduction des ARN messagers de ces gènes.
in scheme: Biologie
in scheme: concept-SD-biologie-biochimie-et-biologie-moleculaire
in scheme: concepts
notation: COGB295
note: Les petits ARN simple brin sont des ARN guides.
related: ARN messager
related: complexe de blocage transcriptionnel par des ARN
related: complexe de blocage de l'expression génique par des ARN
related: ARN guide
related: enzyme éminceuse
related: micro-ARN
related: petit ARN interférent
scope note: Cette publication annule et remplace celle du Journal officiel du 18 septembre 2011.

domaine de liaison à l'ADN
type: ConceptConcept
type: Concept
creator: Commission d'enrichissement de la langue française, FranceTerme
date parution JO: 2018-03-28
equivalent EN: DNA-binding domain @en
equivalent EN: DNA-binding domain (en)
definition: Séquence d’acides aminés d’une protéine qui permet à celle-ci de reconnaître une séquence d’ADN particulière dans un ADN double brin et de se lier à elle.
in scheme: Biologie
in scheme: concept-SD-biologie-biochimie-et-biologie-moleculaire
in scheme: concept-SD-biologie-biologie-cellulaire
in scheme: concepts
notation: COGB296
related: nucléase-effecteur de type activateur de transcription

lysosome
type: ConceptConcept
type: Concept
creator: Commission d'enrichissement de la langue française, FranceTerme
date parution JO: 2019-09-12
deconseille ou frequent: lysosomal
deconseille ou frequent: lysosomale
deconseille ou frequent: lysosomial
deconseille ou frequent: lysosomiale
deconseille ou frequent: lysosomique
equivalent EN: lysosome @en
equivalent EN: lysosome (en)
part of speech: nom masculin
definition: Organite présent dans la plupart des cellules eucaryotes, qui est entouré d’une seule membrane et dans lequel des hydrolases actives à pH acide digèrent de nombreux types de macromolécules.
in scheme: Biologie
in scheme: concept-SD-biologie-biochimie-et-biologie-moleculaire
in scheme: concept-SD-biologie-biologie-cellulaire
in scheme: concepts
notation: COGB297
note: 1. Les fonctions du lysosome sont assurées par la vacuole chez les végétaux et les champignons.
note: 2. La forme adjective de « lysosome » est « lysosomal, -e ».
related: autophagie
related: macroautophagie
related: autophagosome
related: xénophagie
related: endosome
related: lysosome secondaire
scope note: Cette publication annule et remplace celle du Journal officiel du 6 juillet 2008.

autophagie
type: ConceptConcept
type: Concept
creator: Commission d'enrichissement de la langue française, FranceTerme
date parution JO: 2019-09-12
equivalent EN: autophagy @en
equivalent EN: autophagy (en)
part of speech: nom féminin
definition: Digestion intracellulaire de divers composants cytoplasmiques par des lysosomes.
in scheme: Biologie
in scheme: concept-SD-biologie-biochimie-et-biologie-moleculaire
in scheme: concept-SD-biologie-biologie-cellulaire
in scheme: concepts
notation: COGB298
note: L’autophagie joue un rôle essentiel dans l’homéostasie cellulaire et dans l’immunité contre les pathogènes.
related: lysosome
related: macroautophagie
related: autophagosome
related: xénophagie

macroautophagie
type: ConceptConcept
type: Concept
creator: Commission d'enrichissement de la langue française, FranceTerme
date parution JO: 2019-09-12
equivalent EN: macroautophagy @en
equivalent EN: macroautophagy (en)
part of speech: nom féminin
definition: Autophagie dans laquelle un autophagosome séquestre des composants cytoplasmiques avant de fusionner avec le lysosome.
in scheme: Biologie
in scheme: concept-SD-biologie-biochimie-et-biologie-moleculaire
in scheme: concept-SD-biologie-biologie-cellulaire
in scheme: concepts
notation: COGB299
note: 1. La macroautophagie permet le renouvellement des constituants cellulaires, les composants cytoplasmiques détruits étant des protéines anormales ou des organites vieillissants.
note: 2. La macroautophagie peut s’intensifier et conduire à la mort cellulaire.
related: lysosome
related: autophagie
related: autophagosome
related: xénophagie

attracteur
type: ConceptConcept
type: Concept
creator: Commission d'enrichissement de la langue française, FranceTerme
date parution JO: 2011-09-18
equivalent EN: attractor @en
equivalent EN: attractor (en)
part of speech: adjectif
definition: Se dit d'un état ou d'une séquence d'états auxquels un organisme vivant revient nécessairement, après une perturbation limitée.
in scheme: Biologie
in scheme: concept-SD-biologie-physiologie
in scheme: concepts
notation: COGB3

extrolite
type: ConceptConcept
type: Concept
creator: Commission d'enrichissement de la langue française, FranceTerme
date parution JO: 2011-09-18
equivalent EN: extrolite @en
equivalent EN: extrolite (en)
part of speech: nom masculin
definition: Métabolite secondaire, généralement excrété, impliqué dans les interactions entre l'organisme qui l'a produit et le milieu environnant.
in scheme: Biologie
in scheme: concept-SD-biologie-biochimie-et-biologie-moleculaire
in scheme: concepts
notation: COGB30
related: métabolite secondaire

autophagosome
type: ConceptConcept
type: Concept
creator: Commission d'enrichissement de la langue française, FranceTerme
date parution JO: 2019-09-12
equivalent EN: autophagosome @en
equivalent EN: autophagosome (en)
part of speech: nom masculin
definition: Organite présent dans la plupart des cellules eucaryotes, entouré d’une double membrane, qui intervient dans la macroautophagie.
in scheme: Biologie
in scheme: concept-SD-biologie-biochimie-et-biologie-moleculaire
in scheme: concept-SD-biologie-biologie-cellulaire
in scheme: concepts
notation: COGB300
note: Au cours de la macroautophagie, la membrane externe de l’autophagosome fusionne avec celle du lysosome et la membrane interne est digérée par les hydrolases lysosomales en même temps que le matériel séquestré.
related: lysosome
related: autophagie
related: macroautophagie
related: xénophagie

caryophérine
type: ConceptConcept
type: Concept
creator: Commission d'enrichissement de la langue française, FranceTerme
date parution JO: 2019-09-12
deconseille ou frequent: karyophérine
equivalent EN: karyopherin @en
equivalent EN: karyopherin (en)
part of speech: nom féminin
definition: Protéine qui assure le transport d’autres molécules biologiques entre le cytoplasme et le noyau d’une cellule.
in scheme: Biologie
in scheme: concept-SD-biologie-biochimie-et-biologie-moleculaire
in scheme: concept-SD-biologie-biologie-cellulaire
in scheme: concepts
notation: COGB301
note: 1. Les caryophérines sont, selon le sens du transport, des exportines ou des importines.
note: 2. Lorsque le transport est achevé, les caryophérines retournent à vide par les pores nucléaires dans le noyau ou le cytoplasme afin d’assurer un nouveau transport.
related: importine
related: exportine

importine
type: ConceptConcept
type: Concept
creator: Commission d'enrichissement de la langue française, FranceTerme
date parution JO: 2019-09-12
equivalent EN: importin @en
equivalent EN: importin (en)
part of speech: nom féminin
definition: Caryophérine du cytosol qui assure, au niveau d’un pore nucléaire, le transport vers l’intérieur du noyau de protéines pourvues d’une séquence d’importation nucléaire.
in scheme: Biologie
in scheme: concept-SD-biologie-biochimie-et-biologie-moleculaire
in scheme: concept-SD-biologie-biologie-cellulaire
in scheme: concepts
notation: COGB302
related: caryophérine
related: exportine
scope note: Cette publication annule et remplace celle du Journal officiel du 31 janvier 2016.

exportine
type: ConceptConcept
type: Concept
creator: Commission d'enrichissement de la langue française, FranceTerme
date parution JO: 2019-09-12
equivalent EN: exportin @en
equivalent EN: exportin (en)
part of speech: nom féminin
definition: Caryophérine du noyau cellulaire, qui assure, au niveau d’un pore nucléaire, le passage, dans le cytoplasme, d’ARN, notamment messager, et de protéines pourvues d’une séquence d’exportation nucléaire.
in scheme: Biologie
in scheme: concept-SD-biologie-biochimie-et-biologie-moleculaire
in scheme: concept-SD-biologie-biologie-cellulaire
in scheme: concepts
notation: COGB303
related: ARN messager
related: caryophérine
related: importine
scope note: Cette publication annule et remplace celle du Journal officiel du 31 janvier 2016.

filament intermédiaire
type: ConceptConcept
type: Concept
creator: Commission d'enrichissement de la langue française, FranceTerme
date parution JO: 2019-09-12
deconseille ou frequent: filaments intermédiaires
equivalent EN: intermediate filament @en
equivalent EN: intermediate filament (en)
definition: Fibre protéique du cytosquelette des cellules animales qui, en s’associant à d’autres fibres de même nature, forme un réseau contribuant notamment au soutien architectural et à la résistance mécanique des cellules, et dont la protéine constitutive peut varier selon le type cellulaire.
in scheme: Biologie
in scheme: concept-SD-biologie-biochimie-et-biologie-moleculaire
in scheme: concept-SD-biologie-biologie-cellulaire
in scheme: concepts
notation: COGB304
note: 1. Le diamètre des filaments intermédiaires de 8 à 12 nanomètres est compris entre celui des microfilaments d’actine et celui des microtubules.
note: 2. Le réseau ainsi formé se développe dans le cytoplasme, dans le nucléoplasme et à la surface nucléoplasmique de l’enveloppe nucléaire interne des cellules.
related: vimentine

vimentine
type: ConceptConcept
type: Concept
creator: Commission d'enrichissement de la langue française, FranceTerme
date parution JO: 2019-09-12
equivalent EN: vimentin @en
equivalent EN: vimentin (en)
part of speech: nom féminin
definition: Protéine constitutive des filaments intermédiaires, principalement présente dans des cellules peu différenciées, qui établit, grâce à une protéine de liaison, des interactions avec les microtubules.
in scheme: Biologie
in scheme: concept-SD-biologie-biochimie-et-biologie-moleculaire
in scheme: concept-SD-biologie-biologie-cellulaire
in scheme: concepts
notation: COGB305
related: filament intermédiaire

phagémide
type: ConceptConcept
type: Concept
creator: Commission d'enrichissement de la langue française, FranceTerme
date parution JO: 2019-09-12
equivalent EN: phagemid @en
equivalent EN: phagemid (en)
part of speech: nom masculin
definition: Vecteur de synthèse composé de séquences de phages, de séquences de plasmides et d’un gène marqueur, qui sert à cloner des fragments de gène.
in scheme: Biologie
in scheme: concept-SD-biologie-biochimie-et-biologie-moleculaire
in scheme: concept-SD-biologie-biologie-cellulaire
in scheme: concepts
notation: COGB306
related: plasmide
related: vecteur
related: bactériophage
scope note: Cette publication annule et remplace celle du Journal officiel du 18 septembre 2011.

régulation coordonnée
type: ConceptConcept
type: Concept
creator: Commission d'enrichissement de la langue française, FranceTerme
date parution JO: 2019-09-12
equivalent EN: coordinate regulation @en
equivalent EN: coordinate regulation (en)
definition: Régulation de l’expression des cistrons placés les uns à la suite des autres derrière un seul promoteur, qui sont transcrits en même temps sous la forme d’un ARNm polycistronique.
in scheme: Biologie
in scheme: concept-SD-biologie-biochimie-et-biologie-moleculaire
in scheme: concepts
notation: COGB307
related: ARNm polycistronique
related: opéron
related: promoteur
related: cistron

régulation négative de la transcription
type: ConceptConcept
type: Concept
creator: Commission d'enrichissement de la langue française, FranceTerme
date parution JO: 2019-09-12
deconseille ou frequent: régulation négative de l'expression des gènes
equivalent EN: negative regulation of transcription @en
equivalent EN: negative regulation of transcription (en)
definition: Régulation de l’expression des gènes dans laquelle un facteur répresseur se lie à l’ADN pour empêcher la transcription.
in scheme: Biologie
in scheme: concept-SD-biologie-biochimie-et-biologie-moleculaire
in scheme: concepts
notation: COGB308
related: gène de régulation
related: régulation positive de la transcription
related: régulation autogène

régulation positive de la transcription
type: ConceptConcept
type: Concept
creator: Commission d'enrichissement de la langue française, FranceTerme
date parution JO: 2019-09-12
deconseille ou frequent: régulation positive de l'expression des gènes
equivalent EN: positive regulation of transcription @en
equivalent EN: positive regulation of transcription (en)
definition: Régulation de l’expression des gènes dans laquelle un facteur activateur se lie à l’ADN pour assurer la transcription.
in scheme: Biologie
in scheme: concept-SD-biologie-biochimie-et-biologie-moleculaire
in scheme: concepts
notation: COGB309
related: gène de régulation
related: régulation négative de la transcription
related: régulation autogène

gène agouti
type: ConceptConcept
type: Concept
creator: Commission d'enrichissement de la langue française, FranceTerme
date parution JO: 2011-09-18
equivalent EN: agouti gene @en
equivalent EN: agouti gene (en)
definition: Gène qui détermine l'insertion de bandes claires dans la fourrure foncée d'un animal en dominant les gènes responsables de la couleur sombre.
in scheme: Biologie
in scheme: concept-SD-biologie-biochimie-et-biologie-moleculaire
in scheme: concepts
notation: COGB31
note: L'agouti est un petit rongeur d'Amérique du Sud dont le pelage comporte des bandes alternées claires et sombres.

synténie
type: ConceptConcept
type: Concept
creator: Commission d'enrichissement de la langue française, FranceTerme
date parution JO: 2019-09-12
equivalent EN: synteny @en
equivalent EN: synteny (en)
part of speech: nom féminin
definition: Ordonnancement identique des gènes sur des chromosomes de deux espèces différentes.
in scheme: Biologie
in scheme: concept-SD-biologie-biochimie-et-biologie-moleculaire
in scheme: concept-SD-biologie-biologie-cellulaire
in scheme: concepts
notation: COGB310
note: On parle, par exemple, de la synténie entre le chromosome 20 de l’homme et une partie du chromosome 2 de la souris.

gène LFC
type: ConceptConcept
type: Concept
creator: Commission d'enrichissement de la langue française, FranceTerme
date parution JO: 2019-09-12
deconseille ou frequent: FLC
deconseille ou frequent: gène FLC
equivalent EN: FLC gene @en
equivalent EN: FLC gene (en)
equivalent EN: flowering locus C gene @en
equivalent EN: flowering locus C gene (en)
definition: Gène spécifique des plantes ayant besoin de vernalisation, qui code une protéine bloquant, dès l’embryon et au cours du développement, la transcription des gènes nécessaires à leur floraison.
in scheme: Biologie
in scheme: concept-SD-biologie-biochimie-et-biologie-moleculaire
in scheme: concept-SD-biologie-biologie-vegetale
in scheme: concepts
notation: COGB311
note: 1. Le gène LFC est inhibé quand la plante est soumise à une période de froid, ce qui permet ainsi sa floraison.
note: 2. On trouve aussi, dans le langage professionnel, le terme « gène FLC ».
related: protéine de transition florale

protéine de stimulation florale
type: ConceptConcept
type: Concept
creator: Commission d'enrichissement de la langue française, FranceTerme
date parution JO: 2019-09-12
deconseille ou frequent: protéine CO
deconseille ou frequent: protéine CONSTANS
equivalent EN: CO protein @en
equivalent EN: CO protein (en)
equivalent EN: CONSTANS @en
equivalent EN: CONSTANS (en)
equivalent EN: CONSTANS protein @en
equivalent EN: CONSTANS protein (en)
definition: Protéine présente dans les feuilles, stable à la lumière et dégradée à l’obscurité par des protéases, qui stimule la transcription du gène de la protéine de transition florale.
in scheme: Biologie
in scheme: concept-SD-biologie-biochimie-et-biologie-moleculaire
in scheme: concept-SD-biologie-biologie-vegetale
in scheme: concepts
notation: COGB312
note: On trouve aussi, dans le langage professionnel, les termes « protéine CONSTANS » et « protéine CO ».
related: protéine de transition florale

protéine de transition florale
type: ConceptConcept
type: Concept
creator: Commission d'enrichissement de la langue française, FranceTerme
date parution JO: 2019-09-12
deconseille ou frequent: protéine FT
equivalent EN: FT protein @en
equivalent EN: FT protein (en)
forme abregee: protéine TF
definition: Protéine des plantes à fleurs, dont la synthèse est stimulée par la protéine de stimulation florale, et qui migre par les tubes criblés jusqu’au méristème apical, où son association avec un facteur de transcription déclenche l’état préfloral des plantes photopériodiques.
in scheme: Biologie
in scheme: concept-SD-biologie-biochimie-et-biologie-moleculaire
in scheme: concept-SD-biologie-biologie-vegetale
in scheme: concepts
notation: COGB313
note: On trouve aussi, dans le langage professionnel, le terme « protéine FT ».
related: gène LFC
related: protéine de stimulation florale

récalcitrance
type: ConceptConcept
type: Concept
creator: Commission d'enrichissement de la langue française, FranceTerme
date parution JO: 2019-09-12
deconseille ou frequent: récalcitrant
equivalent EN: recalcitrance @en
equivalent EN: recalcitrance (en)
part of speech: nom féminin
definition: Incapacité d’un explant végétal en culture in vitro à avoir une activité de croissance cellulaire, à développer de nouveaux organes ou à donner une plante entière.
in scheme: Biologie
in scheme: concept-SD-biologie-biologie-du-developpement
in scheme: concept-SD-biologie-biologie-vegetale
in scheme: concepts
notation: COGB314
note: La récalcitrance peut, dans certains cas, être levée en modifiant les conditions de culture.

systémine
type: ConceptConcept
type: Concept
creator: Commission d'enrichissement de la langue française, FranceTerme
date parution JO: 2019-09-12
equivalent EN: systemin @en
equivalent EN: systemin (en)
part of speech: nom féminin
definition: Polypeptide produit par les feuilles après une blessure et véhiculé par la sève, qui stimule la synthèse d’acide jasmonique et de protéines inhibitrices de protéases.
in scheme: Biologie
in scheme: concept-SD-biologie-biochimie-et-biologie-moleculaire
in scheme: concept-SD-biologie-biologie-vegetale
in scheme: concepts
notation: COGB315
note: Une fois stimulées par la systémine, les protéines inhibitrices de protéases empêchent l’assimilation des protéines végétales par les insectes phytophages.
related: acide jasmonique

exon
type: ConceptConcept
type: Concept
creator: Commission d'enrichissement de la langue française, FranceTerme
date parution JO: 2021-02-04
deconseille ou frequent: exon codant
deconseille ou frequent: exons codants
equivalent EN: exon @en
equivalent EN: exon (en)
part of speech: nom masculin
definition: Segment d’un transcrit primaire conservé après l’épissage de l’ARN ; par extension, partie de l’ADN correspondant à ce segment.
in scheme: Biologie
in scheme: concept-SD-biologie-genie-genetique
in scheme: concepts
notation: COGB316
note: On appelle « exon codant » un exon traduit en séquence protéique.
related: brassage d'exons
related: exome
related: épissage
related: intron

exome
type: ConceptConcept
type: Concept
creator: Commission d'enrichissement de la langue française, FranceTerme
date parution JO: 2021-02-04
equivalent EN: exome @en
equivalent EN: exome (en)
part of speech: nom masculin
definition: Partie du génome constituée par les exons codants.
in scheme: Biologie
in scheme: concept-SD-biologie-genie-genetique
in scheme: concepts
notation: COGB317
note: Chez l’homme, l’exome représente environ 1,5 % du génome.
related: exon

épissage
type: ConceptConcept
type: Concept
creator: Commission d'enrichissement de la langue française, FranceTerme
date parution JO: 2021-02-04
equivalent EN: splicing @en
equivalent EN: splicing (en)
part of speech: nom masculin
definition: Processus de maturation de l’ARN qui consiste en l’excision des introns et en la réunion des exons.
in scheme: Biologie
in scheme: concept-SD-biologie-genie-genetique
in scheme: concepts
notation: COGB318
related: lasso
related: maturation moléculaire
related: exon
related: intron
related: petit ARN nucléaire
related: épissage protéique post-traduction
related: extéine
related: intéine
related: site accepteur d'épissage
related: site donneur d'épissage
scope note: Cette publication annule et remplace celle du Journal officiel du 22 septembre 2000.

intron
type: ConceptConcept
type: Concept
creator: Commission d'enrichissement de la langue française, FranceTerme
date parution JO: 2021-02-04
equivalent EN: intervening DNA sequence @en
equivalent EN: intervening DNA sequence (en)
equivalent EN: intervening nucleotide sequence @en
equivalent EN: intervening nucleotide sequence (en)
equivalent EN: intervening sequence @en
equivalent EN: intervening sequence (en)
equivalent EN: intron @en
equivalent EN: intron (en)
part of speech: nom masculin
definition: Segment d’un transcrit primaire éliminé au cours de l’épissage de l’ARN ; par extension, partie de l’ADN correspondant à ce segment.
in scheme: Biologie
in scheme: concept-SD-biologie-genie-genetique
in scheme: concepts
notation: COGB319
related: gène continu
related: gène fragmenté
related: lasso
related: maturase
related: exon
related: épissage
related: site accepteur d'épissage
related: site de branchement
related: site donneur d'épissage
scope note: Cette publication annule et remplace celle du Journal officiel du 22 septembre 2000.

gène candidat
type: ConceptConcept
type: Concept
creator: Commission d'enrichissement de la langue française, FranceTerme
date parution JO: 2011-09-18
equivalent EN: candidate gene @en
equivalent EN: candidate gene (en)
definition: Gène qui, au vu de ses propriétés ou de son produit d'expression protéique, est supposé responsable d'un comportement physiologique particulier voire d'une maladie génétique.
in scheme: Biologie
in scheme: concept-SD-biologie-biochimie-et-biologie-moleculaire
in scheme: concepts
notation: COGB32

protéine adaptatrice
type: ConceptConcept
type: Concept
creator: Commission d'enrichissement de la langue française, FranceTerme
abbreviation: PA
date parution JO: 2021-02-04
equivalent EN: AP @en
equivalent EN: AP (en)
equivalent EN: adaptor protein @en
equivalent EN: adaptor protein (en)
definition: Protéine dont la fonction est de relier deux ou plusieurs protéines différentes dans un complexe moléculaire.
in scheme: Biologie
in scheme: concept-SD-biologie-biochimie-et-biologie-moleculaire
in scheme: concept-SD-biologie-biologie-cellulaire
in scheme: concepts
notation: COGB320
note: Les protéines adaptatrices interviennent en particulier dans la signalisation cellulaire et le transport vésiculaire.
related: adaptine

adaptine
type: ConceptConcept
type: Concept
creator: Commission d'enrichissement de la langue française, FranceTerme
date parution JO: 2021-02-04
equivalent EN: adaptin @en
equivalent EN: adaptin (en)
part of speech: nom féminin
definition: Protéine adaptatrice qui relie un récepteur transmembranaire à la clathrine, participant ainsi à la formation des vésicules recouvertes de clathrine.
in scheme: Biologie
in scheme: concept-SD-biologie-biochimie-et-biologie-moleculaire
in scheme: concept-SD-biologie-biologie-cellulaire
in scheme: concepts
notation: COGB321
note: 1. Les adaptines composent la couche interne du manteau des vésicules recouvertes de clathrine.
note: 2. Il existe plusieurs types d’adaptines, chacune étant spécifique d’un groupe différent de récepteurs présents sur les puits et les vésicules recouverts de clathrine.
related: protéine adaptatrice
related: clathrine
related: vésicule recouverte de clathrine
related: puits recouvert de clathrine
related: récepteur transmembranaire

clathrine
type: ConceptConcept
type: Concept
creator: Commission d'enrichissement de la langue française, FranceTerme
date parution JO: 2021-02-04
equivalent EN: clathrin @en
equivalent EN: clathrin (en)
part of speech: nom féminin
definition: Complexe protéique constitué de trois grandes et trois petites chaînes polypeptidiques qui s’associe à d’autres complexes de même nature pour former la couche externe du manteau recouvrant temporairement les vésicules de transport intracellulaire et les puits de la membrane plasmique.
in scheme: Biologie
in scheme: concept-SD-biologie-biologie-cellulaire
in scheme: concepts
notation: COGB322
note: La clathrine a une forme en étoile à trois branches et se polymérise spontanément pour former des structures polyédriques caractéristiques.
related: adaptine
related: vésicule recouverte de clathrine
related: puits recouvert de clathrine
related: acanthosome
related: dynamine
related: pinocytose
related: endocytose
related: endosome
scope note: Cette publication annule et remplace celle du Journal officiel du 6 juillet 2008.

vésicule recouverte de clathrine
type: ConceptConcept
type: Concept
creator: Commission d'enrichissement de la langue française, FranceTerme
date parution JO: 2021-02-04
deconseille ou frequent: vésicule épineuse
equivalent EN: CCV @en
equivalent EN: CCV (en)
equivalent EN: clathrin-coated vesicle @en
equivalent EN: clathrin-coated vesicle (en)
definition: Vésicule de transport intracellulaire dont la surface est temporairement tapissée de clathrine et qui provient d’un puits recouvert de clathrine.
in scheme: Biologie
in scheme: concept-SD-biologie-biochimie-et-biologie-moleculaire
in scheme: concept-SD-biologie-biologie-cellulaire
in scheme: concepts
notation: COGB323
note: 1. On distingue plusieurs types de vésicules recouvertes de clathrine, selon la nature des récepteurs et des adaptines de leur manteau.
note: 2. On trouve aussi le terme « vésicule épineuse », en raison de l’aspect que lui confère le manteau de clathrine.
related: adaptine
related: clathrine
related: puits recouvert de clathrine
related: acanthosome
related: dynamine

puits recouvert de clathrine
type: ConceptConcept
type: Concept
creator: Commission d'enrichissement de la langue française, FranceTerme
date parution JO: 2021-02-04
equivalent EN: CCP @en
equivalent EN: CCP (en)
equivalent EN: clathrin-coated pit @en
equivalent EN: clathrin-coated pit (en)
definition: Invagination de la membrane plasmique ou de l’appareil de Golgi, dont la surface cytosolique est tapissée de clathrine et qui est à l’origine d’une vésicule recouverte de clathrine par rétrécissement et rupture de son goulot.
in scheme: Biologie
in scheme: concept-SD-biologie-biochimie-et-biologie-moleculaire
in scheme: concept-SD-biologie-biologie-cellulaire
in scheme: concepts
notation: COGB324
related: adaptine
related: clathrine
related: vésicule recouverte de clathrine
related: dynamine
related: pinocytose

désaminase de l'adénosine
type: ConceptConcept
type: Concept
creator: Commission d'enrichissement de la langue française, FranceTerme
date parution JO: 2021-02-04
deconseille ou frequent: adénosine désaminase
deconseille ou frequent: désaminase d'adénosine
equivalent EN: ADA @en
equivalent EN: ADA (en)
equivalent EN: adenosine deaminase @en
equivalent EN: adenosine deaminase (en)
definition: Enzyme qui catalyse l’hydrolyse de l’adénosine ou de la désoxyadénosine, entraînant la formation d’inosine ou de désoxyinosine et d’ammoniac.
in scheme: Biologie
in scheme: Santé et médecine
in scheme: concept-SD-biologie-biochimie-et-biologie-moleculaire
in scheme: concept-SD-sante-et-medecine-biochimie-et-biologie-moleculaire
in scheme: concepts
notation: COGB326
note: Le déficit congénital en désaminase de l’adénosine, première immunodéficience génétique décrite, entraîne un syndrome d’immunodéficience sévère.

adressage des protéines
type: ConceptConcept
type: Concept
creator: Commission d'enrichissement de la langue française, FranceTerme
date parution JO: 2021-02-04
deconseille ou frequent: adressage de protéines
deconseille ou frequent: routage de protéines
equivalent EN: protein targeting @en
equivalent EN: protein targeting (en)
alternative label: routage des protéines
definition: Ensemble des mécanismes qui, dès la formation des protéines, assurent leur transport vers les compartiments cellulaires auxquels elles sont destinées.
in scheme: Biologie
in scheme: concept-SD-biologie-biochimie-et-biologie-moleculaire
in scheme: concept-SD-biologie-biologie-cellulaire
in scheme: concepts
notation: COGB327
note: L’adressage des protéines dépend de motifs peptidiques présents dans celles-ci et spécifiques de chacun des compartiments cellulaires.

ciseaux moléculaires
type: ConceptConcept
type: Concept
creator: Commission d'enrichissement de la langue française, FranceTerme
date parution JO: 2021-02-04
deconseille ou frequent: ciseau génétique
deconseille ou frequent: ciseau moléculaire
equivalent EN: molecular scissor @en
equivalent EN: molecular scissor (en)
alternative label: ciseaux génétiques
definition: Enzyme ou complexe enzymatique dont une partie reconnaît une séquence spécifique de l’ADN et l’autre réalise une coupure de cet ADN au niveau du site reconnu.
in scheme: Biologie
in scheme: concept-SD-biologie-biochimie-et-biologie-moleculaire
in scheme: concept-SD-biologie-biologie-cellulaire
in scheme: concepts
notation: COGB328
note: 1. Les enzymes de restriction et l’endodésoxyribonucléase 9 associée à un ARN guide de synthèse sont des exemples de ciseaux moléculaires.
note: 2. Les ciseaux moléculaires sont utilisés comme outil de réécriture génomique.
related: restriction
related: ARN guide
related: endodésoxyribonucléase 9
related: réécriture génomique

recombinaison homologue
type: ConceptConcept
type: Concept
creator: Commission d'enrichissement de la langue française, FranceTerme
date parution JO: 2021-02-04
equivalent EN: homologous recombination @en
equivalent EN: homologous recombination (en)
definition: Recombinaison qui s’effectue par échange de segments d’ADN entre deux séquences identiques ou proches.
in scheme: Biologie
in scheme: concept-SD-biologie-biochimie-et-biologie-moleculaire
in scheme: concept-SD-biologie-genetique
in scheme: concepts
notation: COGB329
note: La recombinaison homologue intervient notamment dans la recombinaison génétique au cours de la méiose.
related: recombinaison génétique
related: point chaud de recombinaison
related: recombinaison hétérologue

gène orthologue
type: ConceptConcept
type: Concept
creator: Commission d'enrichissement de la langue française, FranceTerme
date parution JO: 2011-09-18
equivalent EN: orthologous gene @en
equivalent EN: orthologous gene (en)
definition: Gène commun à différentes espèces, provenant d'un même gène ancestral et ayant conservé une structure et une fonction identiques au cours de l'évolution.
in scheme: Biologie
in scheme: concept-SD-biologie-biochimie-et-biologie-moleculaire
in scheme: concepts
notation: COGB33
related: gène paralogue

recombinaison hétérologue
type: ConceptConcept
type: Concept
creator: Commission d'enrichissement de la langue française, FranceTerme
date parution JO: 2021-02-04
deconseille ou frequent: recombinaison non homologue
equivalent EN: heterologous recombination @en
equivalent EN: heterologous recombination (en)
equivalent EN: non homologous recombination @en
equivalent EN: non homologous recombination (en)
alternative label: recombinaison illégitime
definition: Recombinaison qui s’effectue par échange de segments d’ADN entre deux séquences différentes.
in scheme: Biologie
in scheme: concept-SD-biologie-biochimie-et-biologie-moleculaire
in scheme: concept-SD-biologie-genetique
in scheme: concepts
notation: COGB330
note: 1. La recombinaison hétérologue intervient par exemple dans l’intégration de l’ADN de certains virus dans le génome de cellules.
note: 2. On trouve aussi le terme « recombinaison non homologue ».
related: point chaud de recombinaison
related: recombinaison homologue

suppresseur
type: ConceptConcept
type: Concept
creator: Commission d'enrichissement de la langue française, FranceTerme
date parution JO: 2021-02-04
equivalent EN: suppressor @en
equivalent EN: suppressor (en)
part of speech: nom masculin
definition: Gène dont au moins un des allèles est capable de supprimer l’effet de mutations d’autres gènes.
in scheme: Biologie
in scheme: concept-SD-biologie-genie-genetique
in scheme: concepts
notation: COGB331
scope note: Cette publication annule et remplace celle des termes « suppresseur » et « gène suppresseur » au Journal officiel du 22 septembre 2000.

xénophagie
type: ConceptConcept
type: Concept
creator: Commission d'enrichissement de la langue française, FranceTerme
date parution JO: 2021-02-04
equivalent EN: xenophagy @en
equivalent EN: xenophagy (en)
part of speech: nom féminin
definition: Macroautophagie sélective qui permet la destruction des pathogènes cytosoliques, tels des parasites, des bactéries ou des virus.
in scheme: Biologie
in scheme: concept-SD-biologie-biochimie-et-biologie-moleculaire
in scheme: concept-SD-biologie-biologie-cellulaire
in scheme: concepts
notation: COGB332
note: La sélectivité est assurée en particulier par des récepteurs de reconnaissance de motifs pathogéniques.
related: récepteur
related: lysosome
related: autophagie
related: macroautophagie
related: autophagosome

plasmide de résistance
type: ConceptConcept
type: Concept
creator: Commission d'enrichissement de la langue française, FranceTerme
date parution JO: 2021-02-04
equivalent EN: R factor @en
equivalent EN: R factor (en)
equivalent EN: R plasmid @en
equivalent EN: R plasmid (en)
equivalent EN: resistance plasmid @en
equivalent EN: resistance plasmid (en)
forme abregee: facteur R
forme abregee: plasmide R
alternative label: facteur de résistance
definition: Plasmide qui code une ou des enzymes inactivatrices d’un ou de plusieurs antibiotiques ou agents toxiques.
in scheme: Biologie
in scheme: concept-SD-biologie-bacteriologie
in scheme: concept-SD-biologie-genie-genetique
in scheme: concepts
notation: COGB333
scope note: Cette publication annule et remplace celle du Journal officiel du 22 septembre 2000.

transposon
type: ConceptConcept
type: Concept
creator: Commission d'enrichissement de la langue française, FranceTerme
date parution JO: 2021-02-04
equivalent EN: jumping gene @en
equivalent EN: jumping gene (en)
equivalent EN: mobile element @en
equivalent EN: mobile element (en)
equivalent EN: transposable element @en
equivalent EN: transposable element (en)
equivalent EN: transposon @en
equivalent EN: transposon (en)
part of speech: nom masculin
definition: Fragment d’ADN susceptible de se déplacer d’un endroit du génome à un autre.
in scheme: Biologie
in scheme: concept-SD-biologie-biochimie-et-biologie-moleculaire
in scheme: concepts
notation: COGB334
note: 1. Un transposon est généralement composé des gènes nécessaires à sa mobilité et de deux courtes séquences répétées inverses qui les encadrent.
note: 2. Les transposons bactériens portent souvent des gènes qui codent des protéines conférant une résistance à un agent toxique.
related: rétrotransposon
related: coïntégration
related: hélitron
related: transposon créateur de gènes
related: transposon mutateur
related: précurseur de petits ARN interférents
scope note: Cette publication annule et remplace celle du Journal officiel du 6 juillet 2008.

biomimétisme
type: ConceptConcept
type: Concept
creator: Commission d'enrichissement de la langue française, FranceTerme
date parution JO: 2021-02-04
deconseille ou frequent: biomimickry
deconseille ou frequent: bionique
equivalent EN: biomimicry @en
equivalent EN: biomimicry (en)
part of speech: nom masculin
definition: Développement de nouvelles applications fondées sur la biomimétique.
in scheme: Tous domaines
in scheme: concepts
notation: COGB335
note: 1. Le biomimétisme s’inspire des aspects moléculaires, structuraux ou fonctionnels des êtres vivants.
note: 2. Le biomimétisme concerne par exemple les domaines de l’architecture, de l’économie, de la mécanique, de la chimie et de la médecine.
related: chimie biomimétique
related: biomimétique

acanthosome
type: ConceptConcept
type: Concept
creator: Commission d'enrichissement de la langue française, FranceTerme
date parution JO: 2021-02-04
equivalent EN: coated vesicle @en
equivalent EN: coated vesicle (en)
part of speech: nom masculin
definition: Vésicule recouverte de clathrine active dans certains mécanismes de pinocytose.
in scheme: Biologie
in scheme: concept-SD-biologie-biologie-cellulaire
in scheme: concepts
notation: COGB336
note: Du grec akantha, « épine ».
related: clathrine
related: vésicule recouverte de clathrine
related: pinocytose
scope note: Cette publication annule et remplace celle du Journal officiel du 6 juillet 2008.

dynamine
type: ConceptConcept
type: Concept
creator: Commission d'enrichissement de la langue française, FranceTerme
date parution JO: 2021-02-04
equivalent EN: dynamin @en
equivalent EN: dynamin (en)
part of speech: nom féminin
definition: Protéine cellulaire qui, en s’enroulant en hélice autour des structures destinées à assurer l’endocytose, permet, par sa torsion, le détachement de ces structures de la membrane plasmique.
in scheme: Biologie
in scheme: concept-SD-biologie-biochimie-et-biologie-moleculaire
in scheme: concept-SD-biologie-biologie-cellulaire
in scheme: concepts
notation: COGB338
note: À maturité, les structures de la membrane plasmique forment des vésicules recouvertes de clathrine.
related: clathrine
related: vésicule recouverte de clathrine
related: puits recouvert de clathrine
related: endocytose
related: endosome
scope note: Cette publication annule et remplace celle du Journal officiel du 14 juin 2017.

endodésoxyribonucléase 9
type: ConceptConcept
type: Concept
creator: Commission d'enrichissement de la langue française, FranceTerme
date parution JO: 2021-02-04
equivalent EN: CRISPR-associated protein 9 @en
equivalent EN: CRISPR-associated protein 9 (en)
equivalent EN: CRISPR-associated sequence 9 @en
equivalent EN: CRISPR-associated sequence 9 (en)
equivalent EN: Cas9 @en
equivalent EN: Cas9 (en)
definition: Enzyme qui, positionnée grâce à son ARN guide, coupe les deux brins d’un ADN porteur d’un motif de reconnaissance du proto-espaceur dans la région où la séquence d’un brin de l’ADN est complémentaire de celle de l’ARN guide.
in scheme: Biologie
in scheme: concept-SD-biologie-biochimie-et-biologie-moleculaire
in scheme: concepts
notation: COGB339
note: 1. Chez les archées et les bactéries, l’endodésoxyribonucléase 9 est codée par un gène situé en amont du groupement d’éléments palindromiques et d’espaceurs. Elle joue un rôle défensif en coupant un ADN étranger dont la séquence a déjà été stockée dans un espaceur et a servi à fabriquer un ARN guide.
note: 2. L’endodésoxyribonucléase 9 associée à un ARN guide de synthèse est un exemple de ciseaux moléculaires utilisés en laboratoire.
note: 3. L’endodésoxyribonucléase 9 est l’une des nombreuses formes d’endodésoxyribonucléase, chacune étant désignée par un chiffre.
related: groupement d'éléments palindromiques et d'espaceurs
related: ARN guide
related: espaceur
related: motif de reconnaissance du proto-espaceur
related: ciseaux moléculaires
related: réécriture génomique
related: concept-SANT235
scope note: Cette publication annule et remplace celle du Journal officiel du 28 mars 2018.

gène paralogue
type: ConceptConcept
type: Concept
creator: Commission d'enrichissement de la langue française, FranceTerme
date parution JO: 2011-09-18
equivalent EN: paralogous gene @en
equivalent EN: paralogous gene (en)
definition: Gène dont la structure ou la fonction ont changé au cours de l'évolution par rapport au gène ancestral dont il provient, que ce soit au sein d'une même espèce ou dans des espèces différentes.
in scheme: Biologie
in scheme: concept-SD-biologie-biochimie-et-biologie-moleculaire
in scheme: concepts
notation: COGB34
related: gène orthologue

pinocytose
type: ConceptConcept
type: Concept
creator: Commission d'enrichissement de la langue française, FranceTerme
date parution JO: 2021-02-04
equivalent EN: pinocytosis @en
equivalent EN: pinocytosis (en)
part of speech: nom féminin
definition: Processus par lequel du liquide extracellulaire est incorporé dans des endosomes, au niveau des puits recouverts de clathrine.
in scheme: Biologie
in scheme: concept-SD-biologie-biologie-cellulaire
in scheme: concepts
notation: COGB340
related: cavéole
related: clathrine
related: puits recouvert de clathrine
related: acanthosome
related: endocytose
related: endosome
scope note: Cette publication annule et remplace celle du Journal officiel du 6 juillet 2008.

biomimétique
type: ConceptConcept
type: Concept
creator: Commission d'enrichissement de la langue française, FranceTerme
date parution JO: 2021-02-04
equivalent EN: biomimetics @en
equivalent EN: biomimetics (en)
part of speech: nom féminin
definition: Démarche scientifique qui consiste à étudier les mécanismes déterminant les propriétés des êtres vivants, en vue de s’en inspirer pour développer de nouvelles applications.
in scheme: Tous domaines
in scheme: concepts
notation: COGB341
related: chimie biomimétique
related: biomimétisme

autopoïèse
type: ConceptConcept
type: Concept
creator: Commission d'enrichissement de la langue française, FranceTerme
date parution JO: 2022-04-09
equivalent EN: autopoiesis @en
equivalent EN: autopoiesis (en)
part of speech: nom féminin
definition: Propriété qu’ont les organismes vivants de générer eux-mêmes leur organisation structurale et fonctionnelle, en interaction permanente avec leur environnement.
in scheme: Biologie
in scheme: concept-SD-biologie-biochimie-et-biologie-moleculaire
in scheme: concepts
notation: COGB342

régulation autogène
type: ConceptConcept
type: Concept
creator: Commission d'enrichissement de la langue française, FranceTerme
date parution JO: 2022-04-09
deconseille ou frequent: autorégulation
equivalent EN: autogenous regulation @en
equivalent EN: autogenous regulation (en)
alternative label: autorégulation génique
definition: Tout mécanisme par lequel le produit d’un gène contrôle l’expression de ce même gène.
in scheme: Biologie
in scheme: concept-SD-biologie-biochimie-et-biologie-moleculaire
in scheme: concepts
notation: COGB343
related: régulation négative de la transcription
related: régulation positive de la transcription
scope note: Cette publication annule et remplace celle du terme « autorégulation » au Journal officiel du 22 septembre 2000.

complexe majeur d'histocompatibilité
type: ConceptConcept
type: Concept
creator: Commission d'enrichissement de la langue française, FranceTerme
abbreviation: CMH
date parution JO: 2022-04-09
deconseille ou frequent: histocompatibilité CMH
equivalent EN: MHC @en
equivalent EN: MHC (en)
equivalent EN: major histocompatibility complex @en
equivalent EN: major histocompatibility complex (en)
definition: Région du génome des vertébrés regroupant l’information génétique qui code des protéines présentes sur la face externe de la membrane plasmique, responsables de la reconnaissance du soi et permettant la réponse immunitaire.
in scheme: Biologie
in scheme: concept-SD-biologie-genie-genetique
in scheme: concepts
notation: COGB344
note: 1. Les protéines codées par le complexe majeur d’histocompatibilité sont spécifiques de chaque individu.
note: 2. Le rejet d’une greffe de tissus ou d’organes est dû notamment à des différences trop importantes entre les complexes majeurs d’histocompatibilité de deux individus.
related: apprêtement de l'antigène
related: présentation de l'antigène
scope note: Cette publication annule et remplace celle du Journal officiel du 22 septembre 2000.

réécriture génomique
type: ConceptConcept
type: Concept
creator: Commission d'enrichissement de la langue française, FranceTerme
date parution JO: 2022-04-09
deconseille ou frequent: gene editing
deconseille ou frequent: modification du génome
deconseille ou frequent: modification génomique
deconseille ou frequent: édition du génome
deconseille ou frequent: édition génique
equivalent EN: genome editing @en
equivalent EN: genome editing (en)
alternative label: édition génomique
definition: Modification par ingénierie de la séquence d’un site déterminé d’un génome par addition, suppression ou substitution de nucléotides, qui est effectuée ou initiée par des complexes enzymatiques adressés à ce site.
in scheme: Biologie
in scheme: concept-SD-biologie-biochimie-et-biologie-moleculaire
in scheme: concept-SD-biologie-genetique
in scheme: concepts
notation: COGB345
note: 1. La réécriture génomique utilise souvent des ciseaux moléculaires et peut nécessiter la présence d’une matrice d’ADN ou d’ARN.
note: 2. La réécriture génomique permet de corriger une mutation délétère ou de conférer une propriété nouvelle à une cellule, voire, le cas échéant, à l’organisme qui en est issu.
related: motif de reconnaissance du proto-espaceur
related: nucléase-effecteur de type activateur de transcription
related: ciseaux moléculaires
related: endodésoxyribonucléase 9
related: réécriture de base
related: réécriture par matrice d'ARN
scope note: Cette publication annule et remplace celle du Journal officiel du 28 mars 2018.

réécriture de base
type: ConceptConcept
type: Concept
creator: Commission d'enrichissement de la langue française, FranceTerme
date parution JO: 2022-04-09
deconseille ou frequent: modification de base
equivalent EN: base editing @en
equivalent EN: base editing (en)
alternative label: édition de base
definition: Réécriture génomique qui consiste à modifier une seule paire de bases d’un site déterminé d’un génome.
in scheme: Biologie
in scheme: concept-SD-biologie-biochimie-et-biologie-moleculaire
in scheme: concept-SD-biologie-genetique
in scheme: concepts
notation: COGB346
related: réécriture génomique
related: paire de bases

réécriture par matrice d'ARN
type: ConceptConcept
type: Concept
creator: Commission d'enrichissement de la langue française, FranceTerme
date parution JO: 2022-04-09
deconseille ou frequent: édition premium
deconseille ou frequent: édition primaire
equivalent EN: prime editing @en
equivalent EN: prime editing (en)
definition: Réécriture génomique qui consiste à incorporer au génome une séquence d’ADN issue de la transcription inverse in situ d’une matrice d’ARN.
in scheme: Biologie
in scheme: concept-SD-biologie-biochimie-et-biologie-moleculaire
in scheme: concept-SD-biologie-genetique
in scheme: concepts
notation: COGB347
note: On trouve aussi le terme « édition primaire », qui est déconseillé.
related: matrice
related: réécriture génomique

oncoprotéine
type: ConceptConcept
type: Concept
creator: Commission d'enrichissement de la langue française, FranceTerme
date parution JO: 2022-04-09
equivalent EN: oncoprotein @en
equivalent EN: oncoprotein (en)
part of speech: nom féminin
alternative label: protéine oncogénique
definition: Protéine codée par un oncogène.
in scheme: Biologie
in scheme: concept-SD-biologie-biochimie-et-biologie-moleculaire
in scheme: concepts
notation: COGB348
related: oncogène

osmolyte
type: ConceptConcept
type: Concept
creator: Commission d'enrichissement de la langue française, FranceTerme
date parution JO: 2022-04-09
equivalent EN: osmolyte @en
equivalent EN: osmolyte (en)
part of speech: nom masculin
definition: Métabolite qui, en s’accumulant dans une cellule, élève la pression osmotique de celle-ci.
in scheme: Biologie
in scheme: concept-SD-biologie-biochimie-et-biologie-moleculaire
in scheme: concept-SD-biologie-biologie-vegetale
in scheme: concepts
notation: COGB349
note: 1. Les amines, les polyols et les sucres sont des exemples d’osmolytes.
note: 2. Lorsqu’ils sont présents en grande quantité dans les cellules d’une plante, les osmolytes permettent d’améliorer la tolérance de celle-ci au déficit hydrique et au froid.

gène redondant
type: ConceptConcept
type: Concept
creator: Commission d'enrichissement de la langue française, FranceTerme
date parution JO: 2011-09-18
equivalent EN: redundant gene @en
equivalent EN: redundant gene (en)
definition: Gène dont il existe un ou des équivalents dans le génome et qui, inactivé par mutation, est remplacé dans sa fonction par un ou plusieurs de ses équivalents.
in scheme: Biologie
in scheme: concept-SD-biologie-biochimie-et-biologie-moleculaire
in scheme: concepts
notation: COGB35
note: Les gènes redondants sont des facteurs importants de l'évolution biologique.

protéine de transport d'auxine
type: ConceptConcept
type: Concept
creator: Commission d'enrichissement de la langue française, FranceTerme
date parution JO: 2022-04-09
deconseille ou frequent: protéine PIN
equivalent EN: PIN protein @en
equivalent EN: PIN protein (en)
equivalent EN: PIN-FORMED protein @en
equivalent EN: PIN-FORMED protein (en)
definition: Protéine transmembranaire qui, chez les plantes terrestres, assure le flux d’auxine de cellule en cellule.
in scheme: Biologie
in scheme: concept-SD-biologie-biologie-vegetale
in scheme: concepts
notation: COGB350
note: 1. Les protéines de transport d’auxine permettent l’ajustement constant des concentrations locales d’auxine dont dépend le développement du végétal.
note: 2. La perte de fonction du gène codant cette protéine a pour conséquence l’absence de développement des organes de la plante, qui se réduit alors à une longue structure en aiguille.
note: 3. On trouve aussi, dans le langage professionnel, le terme « protéine PIN ».

toxine de Shiga
type: ConceptConcept
type: Concept
creator: Commission d'enrichissement de la langue française, FranceTerme
date parution JO: 2022-04-09
deconseille ou frequent: shigatoxine
equivalent EN: shiga-like toxin @en
equivalent EN: shiga-like toxin (en)
equivalent EN: shigatoxin @en
equivalent EN: shigatoxin (en)
definition: Protéine pathogène pour l’homme et pour certains animaux, produite par des entérobactéries du genre Shigella et par certaines souches d’Escherichia coli.
in scheme: Biologie
in scheme: concept-SD-biologie-biochimie-et-biologie-moleculaire
in scheme: concepts
notation: COGB351
note: 1. Les toxines de Shiga endommagent des cellules des endothéliums des vaisseaux, des reins et de la muqueuse intestinale, entraînant des dysenteries hémorragiques parfois mortelles.
note: 2. On trouve aussi, dans le langage professionnel, le terme « shigatoxine ».

cible thérapeutique
type: ConceptConcept
type: Concept
date parution JO: 2023-01-05
deconseille ou frequent: cible biologique
equivalent EN: biological target @en
equivalent EN: biological target (en)
equivalent EN: therapeutic target @en
equivalent EN: therapeutic target (en)
part of speech: locution nominale féminine
definition: Agent pathogène ou structure endogène qui, dans une situation pathologique, fait l’objet d’un traitement thérapeutique chez l’homme ou chez l’animal.
in scheme: Santé et médecine
in scheme: concept-SD-sante-et-medecine-pharmacologie
in scheme: concept-SD-sante-et-medecine-toxicologie
in scheme: concepts
notation: COGB352
note: 1. Un agent pathogène peut être, par exemple, un virus, une bactérie ou un parasite ; une structure endogène peut être, par exemple, une protéine, un acide nucléique, un organe ou un tissu tumoral.
note: 2. Selon la cible thérapeutique, le traitement peut consister soit à l’éliminer, soit à modifier son fonctionnement afin de limiter sa nocivité.
note: 3. On trouve aussi, dans le langage professionnel, le terme « cible biologique » utilisé dans ce sens.
related: pharmacorésistance
related: pharmacosensibilité
related: concept-SANT177
scope note: Cette publication annule et remplace celle du terme « cible biologique » au Journal officiel du 18 septembre 2011.

connexine
type: ConceptConcept
type: Concept
abbreviation: Cx
date parution JO: 2023-01-05
equivalent EN: Cx @en
equivalent EN: Cx (en)
equivalent EN: connexin @en
equivalent EN: connexin (en)
part of speech: nom féminin
definition: Protéine transmembranaire des vertébrés qui, associée à d’autres protéines de la même famille, forme des connexons.
in scheme: Biologie
in scheme: concept-SD-biologie-biochimie-et-biologie-moleculaire
in scheme: concept-SD-biologie-biologie-cellulaire
in scheme: concepts
notation: COGB353
note: La connexine fait partie d’une famille de protéines.
related: famille de protéines
related: connexon

connexon
type: ConceptConcept
type: Concept
date parution JO: 2023-01-05
equivalent EN: connexon @en
equivalent EN: connexon (en)
part of speech: nom masculin
definition: Structure biomoléculaire composée de six connexines, qui constitue un pore hydrophile dans la membrane des cellules de certains tissus des vertébrés.
in scheme: Biologie
in scheme: concept-SD-biologie-biochimie-et-biologie-moleculaire
in scheme: concept-SD-biologie-biologie-cellulaire
in scheme: concepts
notation: COGB354
note: Un connexon est toujours associé à un autre connexon de la cellule adjacente, les deux connexons formant ainsi une jonction communicante.
related: connexine
related: jonction communicante

stress oxydant
type: ConceptConcept
type: Concept
date parution JO: 2023-01-05
deconseille ou frequent: stress oxydatif
equivalent EN: oxidative stress @en
equivalent EN: oxidative stress (en)
part of speech: locution nominale masculine
definition: Perturbation déclenchée dans les cellules par un excès d’espèces réactives de l’oxygène, qui peut endommager les molécules organiques, induire des mutations à l’origine de cancers, et accélérer le vieillissement cellulaire.
in scheme: Biologie
in scheme: concept-SD-biologie-biochimie-et-biologie-moleculaire
in scheme: concept-SD-biologie-biologie-cellulaire
in scheme: concepts
notation: COGB355
note: On trouve aussi, dans le langage professionnel, le terme « stress oxydatif », qui n’est pas recommandé.
related: espèce réactive de l'oxygène

jonction communicante
type: ConceptConcept
type: Concept
creator: Commission d'enrichissement de la langue française, FranceTerme
date parution JO: 2023-01-05
equivalent EN: gap junction @en
equivalent EN: gap junction (en)
part of speech: locution nominale féminine
definition: Canal formé par deux connexons, qui met en relation les cytoplasmes de cellules voisines et permet des échanges de molécules en solution ou de signaux électriques.
in scheme: Biologie
in scheme: concept-SD-biologie-biochimie-et-biologie-moleculaire
in scheme: concept-SD-biologie-biologie-cellulaire
in scheme: concepts
notation: COGB356
note: Chez les végétaux, les plasmodesmes jouent un rôle similaire à celui de la jonction communicante.
related: plasmodesme
related: connexon
related: jonction étanche

jonction étanche
type: ConceptConcept
type: Concept
creator: Commission d'enrichissement de la langue française, FranceTerme
date parution JO: 2023-01-05
deconseille ou frequent: jonction serrée
equivalent EN: tight junction @en
equivalent EN: tight junction (en)
part of speech: locution nominale féminine
definition: Assemblage de petites protéines transmembranaires présentes chez certains animaux, qui forment une barrière imperméable entre les membranes plasmiques de deux cellules épithéliales adjacentes.
in scheme: Biologie
in scheme: concept-SD-biologie-biochimie-et-biologie-moleculaire
in scheme: concept-SD-biologie-biologie-cellulaire
in scheme: concepts
notation: COGB357
note: 1. La jonction étanche empêche le passage d’eau et de solutés entre les faces externes et internes de l’épithélium.
note: 2. On trouve aussi, dans le langage professionnel, le terme « jonction serrée ».
related: jonction communicante

microglie
type: ConceptConcept
type: Concept
creator: Commission d'enrichissement de la langue française, FranceTerme
date parution JO: 2023-01-05
deconseille ou frequent: cellules microgliales
deconseille ou frequent: microgliale
equivalent EN: microglia @en
equivalent EN: microglia (en)
part of speech: nom féminin
definition: Population de cellules du système immunitaire inné, spécifiques du système nerveux central, qui interviennent notamment dans l’élimination des déchets cellulaires par phagocytose et dans la maturation des réseaux neuronaux par trogocytose.
in scheme: Biologie
in scheme: concept-SD-biologie-biochimie-et-biologie-moleculaire
in scheme: concepts
notation: COGB358
note: 1. Les cellules de la microglie, appelées « cellules microgliales », jouent un rôle équivalent à celui des macrophages.
note: 2. Dans des conditions pathologiques, les cellules microgliales peuvent soit déclencher ou amplifier la réaction inflammatoire, soit favoriser la régénération cellulaire.
related: trogocytose

trogocytose
type: ConceptConcept
type: Concept
date parution JO: 2023-01-05
equivalent EN: trogocytosis @en
equivalent EN: trogocytosis (en)
part of speech: nom féminin
definition: Processus par lequel une cellule capture et incorpore une petite portion de membrane appartenant à une autre cellule.
in scheme: Biologie
in scheme: concept-SD-biologie-biochimie-et-biologie-moleculaire
in scheme: concept-SD-biologie-biologie-cellulaire
in scheme: concepts
notation: COGB359
note: 1. Pour les cellules immunitaires, la trogocytose implique un transfert de molécules et peut entraîner l’acquisition de nouvelles fonctions.
note: 2. Pour les cellules neuronales, la trogocytose permet d’éliminer les prolongements et les synapses non fonctionnels.
related: microglie

hétérodisomie
type: ConceptConcept
type: Concept
creator: Commission d'enrichissement de la langue française, FranceTerme
abbreviation: HPD @en
date parution JO: 2011-09-18
equivalent EN: HPD @en
equivalent EN: HPD (en)
equivalent EN: heterodisomy @en
equivalent EN: heterodisomy (en)
equivalent EN: heteroparental disomy @en
equivalent EN: heteroparental disomy (en)
part of speech: nom féminin
definition: Présence, dans une cellule diploïde, de deux chromosomes homologues, non identiques, hérités de l'un des deux parents seulement.
in scheme: Biologie
in scheme: concept-SD-biologie-genetique
in scheme: concepts
notation: COGB36
related: disomie uniparentale
related: isodisomie

espèce réactive de l'oxygène
type: ConceptConcept
type: Concept
abbreviation: ERO
date parution JO: 2023-01-05
equivalent EN: ROS @en
equivalent EN: ROS (en)
equivalent EN: reactive oxygen species @en
equivalent EN: reactive oxygen species (en)
part of speech: locution nominale féminine
definition: Chacun des produits de la réduction du dioxygène qui, dans certaines conditions, peuvent devenir toxiques pour la cellule et déclencher un stress oxydant.
in scheme: Biologie
in scheme: concept-SD-biologie-biochimie-et-biologie-moleculaire
in scheme: concept-SD-biologie-biologie-cellulaire
in scheme: concepts
notation: COGB360
note: 1. Les principales espèces réactives de l’oxygène sont l’ion superoxyde, le peroxyde d’hydrogène, le radical hydroxyle et l’oxygène singulet.
note: 2. Il existe une production physiologique d’espèces réactives de l’oxygène dans les mitochondries durant le processus respiratoire.
note: 3. Les espèces réactives de l’oxygène sont produites en grande quantité en contexte inflammatoire par les cellules immunitaires.
related: stress oxydant

isodisomie
type: ConceptConcept
type: Concept
creator: Commission d'enrichissement de la langue française, FranceTerme
abbreviation: UPD @en
date parution JO: 2011-09-18
equivalent EN: UPD @en
equivalent EN: UPD (en)
equivalent EN: isodisomy @en
equivalent EN: isodisomy (en)
equivalent EN: uniparental disomy @en
equivalent EN: uniparental disomy (en)
part of speech: nom féminin
definition: Présence, dans une cellule diploïde, de deux chromosomes homologues, identiques, hérités de l'un des deux parents seulement.
in scheme: Biologie
in scheme: concept-SD-biologie-genetique
in scheme: concepts
notation: COGB37
related: disomie uniparentale
related: hétérodisomie

inactivation génique par virus
type: ConceptConcept
type: Concept
creator: Commission d'enrichissement de la langue française, FranceTerme
abbreviation: VIGS @en
date parution JO: 2011-09-18
equivalent EN: VIGS @en
equivalent EN: VIGS (en)
equivalent EN: virus-induced gene silencing @en
equivalent EN: virus-induced gene silencing (en)
definition: Phénomène par lequel un gène, ou un transgène, est inactivé par un virus recombiné comportant une partie de sa séquence.
in scheme: Biologie
in scheme: concept-SD-biologie-biochimie-et-biologie-moleculaire
in scheme: concepts
notation: COGB38
note: L'inactivation génique par virus n'a été observée que dans le monde végétal.
related: recombiné

interactome
type: ConceptConcept
type: Concept
creator: Commission d'enrichissement de la langue française, FranceTerme
date parution JO: 2011-09-18
equivalent EN: interactome @en
equivalent EN: interactome (en)
part of speech: nom masculin
definition: Ensemble des interactions moléculaires qui se produisent au sein d'une cellule, d'un tissu ou d'un organisme, au cours des divers processus physiologiques.
in scheme: Biologie
in scheme: concept-SD-biologie-biochimie-et-biologie-moleculaire
in scheme: concepts
notation: COGB39

biomatériau
type: ConceptConcept
type: Concept
creator: Commission d'enrichissement de la langue française, FranceTerme
date parution JO: 2011-09-18
equivalent EN: biomaterial @en
equivalent EN: biomaterial (en)
part of speech: nom masculin
definition: Matériau, résorbable ou non, qui peut être implanté dans le corps humain pour remodeler, réparer, remplacer des fonctions ou des organes défectueux, ou même susciter leur autoréparation.
in scheme: Santé et médecine
in scheme: concept-SD-sante-et-medecine-chirurgie
in scheme: concepts
notation: COGB4
note: 1. Le collagène injecté est un exemple de biomatériau résorbable.
note: 2. Le polyéthylène utilisé pour les prothèses est un exemple de biomatériau non résorbable.
related: orthobiologie

interférence transcriptionnelle
type: ConceptConcept
type: Concept
creator: Commission d'enrichissement de la langue française, FranceTerme
date parution JO: 2011-09-18
equivalent EN: transcriptional interference @en
equivalent EN: transcriptional interference (en)
definition: Mécanisme de régulation par lequel la transcription d'une région du génome bloque celle d'une autre région, située sur le même chromosome.
in scheme: Biologie
in scheme: concept-SD-biologie-biochimie-et-biologie-moleculaire
in scheme: concepts
notation: COGB40

orthobiologie
type: ConceptConcept
type: Concept
creator: Commission d'enrichissement de la langue française, FranceTerme
date parution JO: 2011-09-18
equivalent EN: orthobiologics @en
equivalent EN: orthobiologics (en)
part of speech: nom féminin
definition: Partie de la science des biomatériaux concernant la réparation des tissus osseux et cartilagineux.
in scheme: Santé et médecine
in scheme: concept-SD-sante-et-medecine-orthopedie
in scheme: concepts
notation: COGB41
related: biomatériau

petit ARN nucléaire
type: ConceptConcept
type: Concept
creator: Commission d'enrichissement de la langue française, FranceTerme
abbreviation: snRNA @en
date parution JO: 2011-09-18
equivalent EN: small nuclear RNA @en
equivalent EN: small nuclear RNA (en)
equivalent EN: snRNA @en
equivalent EN: snRNA (en)
definition: ARN de 100 à 300 nucléotides, riche en résidus d'uracile et impliqué dans l'épissage de l'ARN.
in scheme: Biologie
in scheme: concept-SD-biologie-biochimie-et-biologie-moleculaire
in scheme: concepts
notation: COGB42
related: épissage

pharmacopotentialité
type: ConceptConcept
type: Concept
creator: Commission d'enrichissement de la langue française, FranceTerme
date parution JO: 2011-09-18
equivalent EN: drugability @en
equivalent EN: drugability (en)
equivalent EN: druggability @en
equivalent EN: druggability (en)
part of speech: nom féminin
definition: Capacité d'une molécule à être utilisée comme médicament ou à entrer dans la composition de celui-ci.
in scheme: Santé et médecine
in scheme: concept-SD-sante-et-medecine-pharmacologie
in scheme: concept-SD-sante-et-medecine-toxicologie
in scheme: concepts
notation: COGB44

pharmacorésistance
type: ConceptConcept
type: Concept
creator: Commission d'enrichissement de la langue française, FranceTerme
date parution JO: 2011-09-18
equivalent EN: pharmacoresistance @en
equivalent EN: pharmacoresistance (en)
part of speech: nom féminin
definition: Absence de réactivité d'une cible biologique à des substances à effets thérapeutiques.
in scheme: Santé et médecine
in scheme: concept-SD-sante-et-medecine-pharmacologie
in scheme: concept-SD-sante-et-medecine-toxicologie
in scheme: concepts
notation: COGB45
related: cible biologique
related: cible thérapeutique
related: pharmacosensibilité

pharmacosensibilité
type: ConceptConcept
type: Concept
creator: Commission d'enrichissement de la langue française, FranceTerme
date parution JO: 2011-09-18
equivalent EN: pharmacosensitivity @en
equivalent EN: pharmacosensitivity (en)
part of speech: nom féminin
definition: Réactivité d'une cible biologique à des substances à effets thérapeutiques.
in scheme: Santé et médecine
in scheme: concept-SD-sante-et-medecine-pharmacologie
in scheme: concept-SD-sante-et-medecine-toxicologie
in scheme: concepts
notation: COGB46
related: cible biologique
related: cible thérapeutique
related: pharmacorésistance

photophosphorylation
type: ConceptConcept
type: Concept
creator: Commission d'enrichissement de la langue française, FranceTerme
date parution JO: 2011-09-18
equivalent EN: photophosphorylation @en
equivalent EN: photophosphorylation (en)
part of speech: nom féminin
definition: Forme de phosphorylation consistant en la transformation, dans les cellules d'organismes phototrophes, de l'adénosine diphosphate (ADP) en adénosine triphosphate (ATP), sous l'action de la lumière.
in scheme: Biologie
in scheme: concept-SD-biologie-biochimie-et-biologie-moleculaire
in scheme: concepts
notation: COGB47

phytothermorégulation
type: ConceptConcept
type: Concept
creator: Commission d'enrichissement de la langue française, FranceTerme
date parution JO: 2011-09-18
equivalent EN: phytothermoregulation @en
equivalent EN: phytothermoregulation (en)
part of speech: nom féminin
definition: Phénomène physiologique qui assure le maintien de la température interne des plantes soumises à des températures extrêmes ou à une lumière intense.
in scheme: Biologie
in scheme: concept-SD-biologie-biologie-vegetale
in scheme: concepts
notation: COGB48

précurseur de micro-ARN
type: ConceptConcept
type: Concept
creator: Commission d'enrichissement de la langue française, FranceTerme
abbreviation: miRNA precursor @en
date parution JO: 2011-09-18
equivalent EN: miRNA precursor @en
equivalent EN: miRNA precursor (en)
equivalent EN: microRNA precursor @en
equivalent EN: microRNA precursor (en)
definition: ARN simple brin partiellement replié sous une forme double brin en épingle à cheveux et qui, découpé par l'enzyme éminceuse en un seul court duplex, donne naissance à un micro-ARN après l'élimination de l'un des brins.
in scheme: Biologie
in scheme: concept-SD-biologie-biochimie-et-biologie-moleculaire
in scheme: concepts
notation: COGB49
related: boucle en épingle à cheveux
related: enzyme éminceuse
related: micro-ARN

précurseur de petits ARN interférents
type: ConceptConcept
type: Concept
creator: Commission d'enrichissement de la langue française, FranceTerme
date parution JO: 2011-09-18
equivalent EN: siRNA precursor @en
equivalent EN: siRNA precursor (en)
alternative label: précurseur d'ARN interférents courts
definition: Long duplex d'ARN, issu d'ARN messagers, de transposons, de transgènes, de virus ou d'ADN de l'hétérochromatine qui, découpé par une enzyme éminceuse en plusieurs courts duplex, donne naissance à de petits ARN interférents très nombreux, tous différents, et s'accumulant à partir de chacun des deux brins.
in scheme: Biologie
in scheme: concept-SD-biologie-biochimie-et-biologie-moleculaire
in scheme: concepts
notation: COGB50
related: ARN messager
related: enzyme éminceuse
related: transposon
related: petit ARN interférent

produit d'amplification
type: ConceptConcept
type: Concept
creator: Commission d'enrichissement de la langue française, FranceTerme
date parution JO: 2011-09-18
equivalent EN: amplicon @en
equivalent EN: amplicon (en)
equivalent EN: amplification product @en
equivalent EN: amplification product (en)
definition: Séquence spécifique d'ADN double brin obtenue lors d'une réaction d'amplification en chaîne par polymérase.
in scheme: Biologie
in scheme: concept-SD-biologie-biochimie-et-biologie-moleculaire
in scheme: concepts
notation: COGB51
related: amplification en chaîne par polymérase

protéine domestique
type: ConceptConcept
type: Concept
creator: Commission d'enrichissement de la langue française, FranceTerme
date parution JO: 2011-09-18
deconseille ou frequent: protéine de ménage
equivalent EN: housekeeping protein @en
equivalent EN: housekeeping protein (en)
definition: Protéine qui participe aux processus métaboliques fondamentaux dans presque toutes les cellules d'un organisme multicellulaire.
in scheme: Biologie
in scheme: concept-SD-biologie-biochimie-et-biologie-moleculaire
in scheme: concepts
notation: COGB52
note: On trouve aussi, dans le langage professionnel, le terme « protéine de ménage ».

protéine isoforme
type: ConceptConcept
type: Concept
creator: Commission d'enrichissement de la langue française, FranceTerme
date parution JO: 2011-09-18
equivalent EN: isoform protein @en
equivalent EN: isoform protein (en)
definition: Protéine appartenant à une famille dont les représentants possèdent une structure très proche, due à une légère variation de la séquence de leurs acides aminés, et ont, de ce fait, des fonctions voisines.
in scheme: Biologie
in scheme: concept-SD-biologie-biochimie-et-biologie-moleculaire
in scheme: concepts
notation: COGB53
note: Les protéines isoformes, qui dérivent d'un même gène ancestral, sont codées par des gènes situés à des locus chromosomiques différents.

protéine liée à la pathogenèse
type: ConceptConcept
type: Concept
creator: Commission d'enrichissement de la langue française, FranceTerme
abbreviation: PR protein @en
date parution JO: 2011-09-18
deconseille ou frequent: protéine PR
equivalent EN: PR protein @en
equivalent EN: PR protein (en)
equivalent EN: pathogenesis-related protein @en
equivalent EN: pathogenesis-related protein (en)
definition: Protéine synthétisée par une plante après une attaque par un pathogène, et qui assure des réactions de défense.
in scheme: Biologie
in scheme: concept-SD-biologie-biologie-vegetale
in scheme: concepts
notation: COGB54
note: On trouve aussi, dans le langage professionnel, l'expression « protéine PR », qui n'est pas recommandée.

puce à sondes recouvrantes
type: ConceptConcept
type: Concept
creator: Commission d'enrichissement de la langue française, FranceTerme
date parution JO: 2011-09-18
equivalent EN: tiling array @en
equivalent EN: tiling array (en)
definition: Support miniaturisé de verre portant de courts oligonucléotides qui, en se recouvrant partiellement, forment une séquence représentant une région ou la totalité d'un génome et permettent d'identifier les régions transcrites.
in scheme: Biologie
in scheme: concept-SD-biologie-biochimie-et-biologie-moleculaire
in scheme: concepts
notation: COGB55

réaction d'hypersensibilité
type: ConceptConcept
type: Concept
creator: Commission d'enrichissement de la langue française, FranceTerme
abbreviation: HR @en
date parution JO: 2011-09-18
equivalent EN: HR @en
equivalent EN: HR (en)
equivalent EN: hypersensitive reaction @en
equivalent EN: hypersensitive reaction (en)
equivalent EN: hypersensitive response @en
equivalent EN: hypersensitive response (en)
definition: Mécanisme de défense d'une plante qui est activé en réponse à une attaque parasitaire, et se traduit par la mort programmée des premières cellules infectées, empêchant ainsi la propagation du parasite.
in scheme: Biologie
in scheme: concept-SD-biologie-biologie-vegetale
in scheme: concepts
notation: COGB56
related: résistance systémique acquise

récepteur transmembranaire
type: ConceptConcept
type: Concept
creator: Commission d'enrichissement de la langue française, FranceTerme
date parution JO: 2011-09-18
equivalent EN: transmembrane receptor @en
equivalent EN: transmembrane receptor (en)
definition: Récepteur traversant la membrane plasmique et comportant une partie extracellulaire et une partie intracellulaire.
in scheme: Biologie
in scheme: concept-SD-biologie-biochimie-et-biologie-moleculaire
in scheme: concept-SD-biologie-biologie-cellulaire
in scheme: concepts
notation: COGB57
note: La partie extracellulaire peut se lier à un ligand, ce qui provoque des modifications de la partie intracellulaire.
related: récepteur
related: ligand
related: récepteur transmembranaire de fusion sélective
related: adaptine

réparosome
type: ConceptConcept
type: Concept
creator: Commission d'enrichissement de la langue française, FranceTerme
date parution JO: 2011-09-18
equivalent EN: reparosome @en
equivalent EN: reparosome (en)
part of speech: nom masculin
definition: Ensemble des mécanismes qui assurent la maintenance du génome tout en générant, par mutation ou réarrangement génomique, une diversité génétique.
in scheme: Biologie
in scheme: concept-SD-biologie-biochimie-et-biologie-moleculaire
in scheme: concepts
notation: COGB58
note: Le réparosome ajoute à la réparation de l'ADN une possibilité de diversification génétique.
related: mutation
related: réparation de l'ADN

résistance
type: ConceptConcept
type: Concept
creator: Commission d'enrichissement de la langue française, FranceTerme
date parution JO: 2011-09-18
equivalent EN: resistance @en
equivalent EN: resistance (en)
part of speech: nom féminin
definition: Mécanisme de défense naturelle présent à l'état latent dans une plante, qui est activé après une attaque parasitaire.
in scheme: Biologie
in scheme: concept-SD-biologie-biologie-vegetale
in scheme: concepts
notation: COGB59
note: La résistance peut être déclenchée par des agents infectieux ou par des composés organiques.
related: résistance systémique acquise

typage de l'ADN
type: ConceptConcept
type: Concept
creator: Commission d'enrichissement de la langue française, FranceTerme
date parution JO: 2011-09-18
equivalent EN: DNA typing @en
equivalent EN: DNA typing (en)
definition: Identification d'individus différents, réalisée à partir de la distribution de fragments d'ADN correspondant à des régions polymorphes du génome, préalablement séparés par électrophérèse et révélés à l'aide de sondes nucléiques.
in scheme: Biologie
in scheme: concept-SD-biologie-biochimie-et-biologie-moleculaire
in scheme: concepts
notation: COGB6
related: sonde nucléique

site de polyclonage
type: ConceptConcept
type: Concept
creator: Commission d'enrichissement de la langue française, FranceTerme
date parution JO: 2011-09-18
equivalent EN: polylinker @en
equivalent EN: polylinker (en)
alternative label: site de clonage multiple
definition: Courte séquence d'ADN d'un vecteur, qui contient un ensemble de sites de restriction uniques pouvant être utilisés pour le clonage de divers ADN.
in scheme: Biologie
in scheme: concept-SD-biologie-biochimie-et-biologie-moleculaire
in scheme: concepts
notation: COGB60
related: site de restriction
related: vecteur

site de séquence ciblée
type: ConceptConcept
type: Concept
creator: Commission d'enrichissement de la langue française, FranceTerme
abbreviation: STS @en
date parution JO: 2011-09-18
equivalent EN: STS @en
equivalent EN: STS (en)
equivalent EN: sequence-tagged site @en
equivalent EN: sequence-tagged site (en)
forme abregee: séquence ciblée
definition: Courte séquence, présente de façon unique dans un génome, qui peut être facilement reproduite par amplification en chaîne par polymérase.
in scheme: Biologie
in scheme: concept-SD-biologie-biochimie-et-biologie-moleculaire
in scheme: concepts
notation: COGB61
related: amplification en chaîne par polymérase

ADN égoïste
type: ConceptConcept
type: Concept
creator: Commission d'enrichissement de la langue française, FranceTerme
date parution JO: 2012-06-10
deconseille ou frequent: ADN muet
deconseille ou frequent: ADN poubelle
equivalent EN: junk DNA @en
equivalent EN: junk DNA (en)
equivalent EN: selfish DNA @en
equivalent EN: selfish DNA (en)
definition: ADN qui se propage dans le génome en utilisant des protéines codées par les autres séquences géniques, sans avantage immédiatement visible pour l'organisme.
in scheme: Biologie
in scheme: concept-SD-biologie-biochimie-et-biologie-moleculaire
in scheme: concepts
notation: COGB62
note: 1. L'ADN égoïste a la capacité de se maintenir, de s'accumuler et de se transposer.
note: 2. On trouve encore parfois le terme « ADN muet ».
scope note: Cette publication annule et remplace celle du terme « ADN muet » au Journal officiel du 6 septembre 2008.

amplification rapide d'extrémités d'ADNc
type: ConceptConcept
type: Concept
creator: Commission d'enrichissement de la langue française, FranceTerme
abbreviation: RACE @en
date parution JO: 2012-06-10
equivalent EN: RACE @en
equivalent EN: RACE (en)
equivalent EN: rapid amplification of cDNA ends @en
equivalent EN: rapid amplification of cDNA ends (en)
definition: Technique d'amplification en chaîne par polymérase, utilisée pour identifier les extrémités d'une molécule d'ADN complémentaire.
in scheme: Biologie
in scheme: concept-SD-biologie-biochimie-et-biologie-moleculaire
in scheme: concepts
notation: COGB63
note: On trouve aussi, dans le langage professionnel, le terme RACE, qui n'est pas recommandé.
related: amplification en chaîne par polymérase
related: ADN complémentaire

analyse d'hétéroduplex
type: ConceptConcept
type: Concept
creator: Commission d'enrichissement de la langue française, FranceTerme
abbreviation: HA @en
date parution JO: 2012-06-10
equivalent EN: HA @en
equivalent EN: HA (en)
equivalent EN: heteroduplex analysis @en
equivalent EN: heteroduplex analysis (en)
equivalent EN: heteroduplex tracking @en
equivalent EN: heteroduplex tracking (en)
definition: Ensemble des méthodes de détection des mutations qui recourent au repérage d'appariements incorrects des paires de bases de l'ADN.
in scheme: Biologie
in scheme: concept-SD-biologie-biochimie-et-biologie-moleculaire
in scheme: concepts
notation: COGB64
related: hétéroduplex
related: mutation
related: paire de bases

aquaporine
type: ConceptConcept
type: Concept
creator: Commission d'enrichissement de la langue française, FranceTerme
abbreviation: AQP
date parution JO: 2012-06-10
equivalent EN: AQP @en
equivalent EN: AQP (en)
equivalent EN: aquaporin @en
equivalent EN: aquaporin (en)
part of speech: nom féminin
definition: Glycoprotéine transmembranaire qui facilite les mouvements de l'eau à l'intérieur des cellules et entre elles.
in scheme: Biologie
in scheme: concept-SD-biologie-biochimie-et-biologie-moleculaire
in scheme: concept-SD-biologie-biologie-cellulaire
in scheme: concepts
notation: COGB65
note: Du latin aqua, « eau », et du grec poros, « passage ».

banque d'ADN complémentaire
type: ConceptConcept
type: Concept
creator: Commission d'enrichissement de la langue française, FranceTerme
date parution JO: 2012-06-10
equivalent EN: cDNA library @en
equivalent EN: cDNA library (en)
equivalent EN: complementary DNA library @en
equivalent EN: complementary DNA library (en)
forme abregee: banque d'ADNc
definition: Collection de fragments d'ADN complémentaire ne comprenant que l'ADN codant, clonés dans des vecteurs tels que des phages ou des plasmides.
in scheme: Biologie
in scheme: concept-SD-biologie-biochimie-et-biologie-moleculaire
in scheme: concepts
notation: COGB66
related: plasmide
related: vecteur
related: ADN complémentaire
related: bactériophage
related: banque génomique
related: criblage d'ADN
scope note: Cette publication annule et remplace celle du terme « banque de gènes » au Journal officiel du 22 septembre 2000.

banque d'expression
type: ConceptConcept
type: Concept
creator: Commission d'enrichissement de la langue française, FranceTerme
date parution JO: 2012-06-10
equivalent EN: expression library @en
equivalent EN: expression library (en)
definition: Collection de gènes ou de fragments de gènes, clonés dans des vecteurs, qui portent des séquences de régulation permettant leur expression après introduction dans une cellule hôte.
in scheme: Biologie
in scheme: concept-SD-biologie-biochimie-et-biologie-moleculaire
in scheme: concepts
notation: COGB67
related: vecteur
related: cellule hôte

banque génomique
type: ConceptConcept
type: Concept
creator: Commission d'enrichissement de la langue française, FranceTerme
date parution JO: 2012-06-10
deconseille ou frequent: banque de gènes
equivalent EN: genomic library @en
equivalent EN: genomic library (en)
definition: Collection de fragments d'ADN codant et non codant issus du génome complet d'un organisme et clonés dans des vecteurs tels que des phages, des plasmides ou des chromosomes artificiels.
in scheme: Biologie
in scheme: concept-SD-biologie-biochimie-et-biologie-moleculaire
in scheme: concepts
notation: COGB68
related: plasmide
related: vecteur
related: bactériophage
related: banque d'ADN complémentaire
related: criblage d'ADN
scope note: Cette publication annule et remplace celle du terme « banque de gènes » au Journal officiel du 22 septembre 2000.

catastrophine
type: ConceptConcept
type: Concept
creator: Commission d'enrichissement de la langue française, FranceTerme
date parution JO: 2012-06-10
equivalent EN: catastrophin @en
equivalent EN: catastrophin (en)
part of speech: nom féminin
definition: Protéine qui déstabilise les microtubules en les dépolymérisant.
in scheme: Biologie
in scheme: concept-SD-biologie-biochimie-et-biologie-moleculaire
in scheme: concepts
notation: COGB69

allomone
type: ConceptConcept
type: Concept
creator: Commission d'enrichissement de la langue française, FranceTerme
date parution JO: 2011-09-18
equivalent EN: allomone @en
equivalent EN: allomone (en)
part of speech: nom féminin
definition: Substance produite par les individus d'une espèce, qui induit, chez ceux d'une autre espèce, une réaction favorable à l'espèce émettrice.
in scheme: Biologie
in scheme: concept-SD-biologie-biochimie-et-biologie-moleculaire
in scheme: concepts
notation: COGB7
note: Une allomone peut être, par exemple, une substance répulsive ou toxique pour les insectes phytophages, ou un parfum, émis par une fleur, attirant les insectes pollinisateurs.
related: composé sémiochimique
related: kairomone
related: synomone

protéine chaperon
type: ConceptConcept
type: Concept
creator: Commission d'enrichissement de la langue française, FranceTerme
date parution JO: 2012-06-10
equivalent EN: molecular chaperone @en
equivalent EN: molecular chaperone (en)
alternative label: chaperonne
definition: Protéine des eucaryotes et des bactéries qui assure le repliement correct des chaînes polypeptidiques naissantes qu'elle stabilise en empêchant des associations inappropriées entre des molécules, et favorise le transfert des protéines nouvellement synthétisées vers un compartiment cellulaire donné.
in scheme: Biologie
in scheme: concept-SD-biologie-biochimie-et-biologie-moleculaire
in scheme: concepts
notation: COGB70
related: protéine de coup de chaleur
related: protéine de stress
related: chaperonine

chromosome artificiel de bactérie
type: ConceptConcept
type: Concept
creator: Commission d'enrichissement de la langue française, FranceTerme
abbreviation: BAC @en
date parution JO: 2012-06-10
equivalent EN: BAC @en
equivalent EN: BAC (en)
equivalent EN: bacterial artificial chromosome @en
equivalent EN: bacterial artificial chromosome (en)
definition: Plasmide recombiné, inséré dans des bactéries, qui sert de vecteur de clonage de segments d'un ADN étranger de 100 à 500 kilobases.
in scheme: Biologie
in scheme: concept-SD-biologie-biochimie-et-biologie-moleculaire
in scheme: concept-SD-biologie-genie-genetique
in scheme: concepts
notation: COGB71
note: Le chromosome artificiel de bactérie est construit avec les éléments du plasmide F d'Escherichia coli.
related: kilobase
related: plasmide recombiné
related: vecteur

chromosome artificiel de levure
type: ConceptConcept
type: Concept
creator: Commission d'enrichissement de la langue française, FranceTerme
abbreviation: YAC @en
date parution JO: 2012-06-10
equivalent EN: YAC @en
equivalent EN: YAC (en)
equivalent EN: yeast artificial chromosome @en
equivalent EN: yeast artificial chromosome (en)
definition: Vecteur de clonage construit à partir de séquences d'ADN chromosomique de levure et pouvant intégrer des segments d'un ADN étranger de 150 à 1 000 kilobases.
in scheme: Biologie
in scheme: concept-SD-biologie-biochimie-et-biologie-moleculaire
in scheme: concept-SD-biologie-genie-genetique
in scheme: concepts
notation: COGB72
related: kilobase
related: vecteur
related: séquence cognate

complexe de reconnaissance de l'origine
type: ConceptConcept
type: Concept
creator: Commission d'enrichissement de la langue française, FranceTerme
abbreviation: ORC @en
date parution JO: 2012-06-10
equivalent EN: ORC @en
equivalent EN: ORC (en)
equivalent EN: origin recognition complex @en
equivalent EN: origin recognition complex (en)
definition: Complexe protéique lié à l'ADN, qui reconnaît le site où commence la réplication de l'ADN dans les chromosomes eucaryotes.
in scheme: Biologie
in scheme: concept-SD-biologie-biochimie-et-biologie-moleculaire
in scheme: concepts
notation: COGB73
related: origine de réplication

élément nucléaire dispersé court
type: ConceptConcept
type: Concept
creator: Commission d'enrichissement de la langue française, FranceTerme
abbreviation: SINE @en
date parution JO: 2012-06-10
equivalent EN: SINE @en
equivalent EN: SINE (en)
equivalent EN: short interspersed nuclear element @en
equivalent EN: short interspersed nuclear element (en)
equivalent EN: short interspersed repeat @en
equivalent EN: short interspersed repeat (en)
equivalent EN: short interspersed repeat element @en
equivalent EN: short interspersed repeat element (en)
definition: Rétrotransposon des eucaryotes formé d'une séquence de 100 à 500 paires de bases, répétée et disséminée dans le génome.
in scheme: Biologie
in scheme: concept-SD-biologie-biochimie-et-biologie-moleculaire
in scheme: concepts
notation: COGB74
related: rétrotransposon
related: élément nucléaire dispersé long
related: paire de bases

criblage d'ADN
type: ConceptConcept
type: Concept
creator: Commission d'enrichissement de la langue française, FranceTerme
date parution JO: 2012-06-10
equivalent EN: DNA screening @en
equivalent EN: DNA screening (en)
definition: Détection, dans une banque génomique ou une banque d'ADN complémentaire, d'une séquence d'ADN cible, en particulier à l'aide d'une sonde nucléique dont la séquence est complémentaire de celle de la cible.
in scheme: Biologie
in scheme: concept-SD-biologie-biochimie-et-biologie-moleculaire
in scheme: concepts
notation: COGB75
related: sonde nucléique
related: banque d'ADN complémentaire
related: banque génomique

cycline
type: ConceptConcept
type: Concept
creator: Commission d'enrichissement de la langue française, FranceTerme
date parution JO: 2012-06-10
equivalent EN: cyclin @en
equivalent EN: cyclin (en)
part of speech: nom féminin
definition: Protéine régulatrice des eucaryotes qui, en activant une kinase, permet le passage d'une phase du cycle cellulaire à la suivante.
in scheme: Biologie
in scheme: concept-SD-biologie-biochimie-et-biologie-moleculaire
in scheme: concepts
notation: COGB76
note: Quatre familles de cyclines, identifiées par les lettres A, B, D et E, sont actuellement connues.
related: facteur promoteur de la mitose
related: kinase dépendante des cyclines

détermination
type: ConceptConcept
type: Concept
creator: Commission d'enrichissement de la langue française, FranceTerme
date parution JO: 2012-06-10
equivalent EN: commitment @en
equivalent EN: commitment (en)
equivalent EN: determination @en
equivalent EN: determination (en)
part of speech: nom féminin
definition: Engagement d'une cellule ou d'un groupe de cellules dans un programme particulier de différenciation ou de développement.
in scheme: Biologie
in scheme: concept-SD-biologie-biochimie-et-biologie-moleculaire
in scheme: concept-SD-biologie-biologie-cellulaire
in scheme: concepts
notation: COGB77

doigt à zinc
type: ConceptConcept
type: Concept
creator: Commission d'enrichissement de la langue française, FranceTerme
date parution JO: 2012-06-10
deconseille ou frequent: doigt de gant
deconseille ou frequent: doigt de zinc
deconseille ou frequent: doigt en zinc
equivalent EN: zinc finger @en
equivalent EN: zinc finger (en)
definition: Motif formé d'une trentaine d'acides aminés de certaines protéines régulatrices, que stabilise un atome de zinc et qui confère à ces protéines la propriété d'interagir spécifiquement avec certaines régions des acides nucléiques.
in scheme: Biologie
in scheme: concept-SD-biologie-biochimie-et-biologie-moleculaire
in scheme: concepts
notation: COGB78
note: Le doigt à zinc est souvent présent dans les facteurs généraux de transcription.
related: facteur général de transcription

domaine protéique
type: ConceptConcept
type: Concept
creator: Commission d'enrichissement de la langue française, FranceTerme
date parution JO: 2012-06-10
equivalent EN: protein domain @en
equivalent EN: protein domain (en)
definition: Partie d'une protéine ayant une séquence, une structure et une fonction singulières.
in scheme: Biologie
in scheme: concept-SD-biologie-biochimie-et-biologie-moleculaire
in scheme: concept-SD-biologie-biologie-cellulaire
in scheme: concepts
notation: COGB79
related: sélectine

kairomone
type: ConceptConcept
type: Concept
creator: Commission d'enrichissement de la langue française, FranceTerme
date parution JO: 2011-09-18
equivalent EN: kairomone @en
equivalent EN: kairomone (en)
part of speech: nom féminin
definition: Substance, parfois odorante, produite par les individus d'une espèce, qui induit, chez ceux d'une autre espèce, un comportement défavorable à l'espèce émettrice, mais parfois bénéfique à l'espèce réceptrice.
in scheme: Biologie
in scheme: concept-SD-biologie-biochimie-et-biologie-moleculaire
in scheme: concepts
notation: COGB8
note: L'odeur émise par un insecte, qui permet à ses parasites de le localiser, est un exemple de kairomone.
related: composé sémiochimique
related: allomone
related: synomone

enregistrement patch-clamp
type: ConceptConcept
type: Concept
creator: Commission d'enrichissement de la langue française, FranceTerme
date parution JO: 2012-06-10
deconseille ou frequent: technique patch-clamp
equivalent EN: patch-clamp technique @en
equivalent EN: patch-clamp technique (en)
definition: Technique miniaturisée d'électrophysiologie qui permet d'enregistrer l'intensité des courants générés par le passage des ions au niveau d'un ou de plusieurs canaux ioniques d'un petit champ membranaire sur lequel on applique étroitement une électrode de verre.
in scheme: Biologie
in scheme: concept-SD-biologie-biologie-cellulaire
in scheme: concepts
notation: COGB80

épissage protéique post-traduction
type: ConceptConcept
type: Concept
creator: Commission d'enrichissement de la langue française, FranceTerme
date parution JO: 2012-06-10
deconseille ou frequent: épissage protéique post-traductionnel
equivalent EN: post-translational protein splicing @en
equivalent EN: post-translational protein splicing (en)
definition: Excision d'un polypeptide fonctionnel interne d'une protéine originelle et réunion des deux segments séparés par cette excision.
in scheme: Biologie
in scheme: concept-SD-biologie-biochimie-et-biologie-moleculaire
in scheme: concepts
notation: COGB81
note: 1. On trouve aussi, dans le langage professionnel, le terme « épissage protéique post-traductionnel ».
note: 2. Ce mécanisme, connu dans l'ensemble du monde vivant, survient spontanément dès que la protéine est synthétisée.
related: épissage
related: extéine
related: intéine

extéine
type: ConceptConcept
type: Concept
creator: Commission d'enrichissement de la langue française, FranceTerme
date parution JO: 2012-06-10
equivalent EN: extein @en
equivalent EN: extein (en)
part of speech: nom féminin
definition: Molécule formée des deux segments d'un polypeptide, ligaturés lors de l'épissage d'une protéine.
in scheme: Biologie
in scheme: concept-SD-biologie-biochimie-et-biologie-moleculaire
in scheme: concepts
notation: COGB83
related: épissage
related: épissage protéique post-traduction
related: intéine

facteur général de transcription
type: ConceptConcept
type: Concept
creator: Commission d'enrichissement de la langue française, FranceTerme
date parution JO: 2013-09-15
deconseille ou frequent: facteur trans
equivalent EN: general transcription factor @en
equivalent EN: general transcription factor (en)
definition: Protéine qui se lie aux promoteurs de nombreux gènes et qui est nécessaire à l'initiation de leur transcription.
in scheme: Biologie
in scheme: concept-SD-biologie-biochimie-et-biologie-moleculaire
in scheme: concepts
notation: COGB84
related: promoteur
related: reprogrammation
related: doigt à zinc
related: concept-SANT65

facteur promoteur de la mitose
type: ConceptConcept
type: Concept
creator: Commission d'enrichissement de la langue française, FranceTerme
abbreviation: MPF @en
date parution JO: 2012-06-10
equivalent EN: M-phase-promoting factor @en
equivalent EN: M-phase-promoting factor (en)
equivalent EN: MPF @en
equivalent EN: MPF (en)
alternative label: facteur promoteur de la phase M
definition: Complexe protéique comprenant une cycline et une protéine-kinase, qui déclenche la mitose ou phase M du cycle cellulaire.
in scheme: Biologie
in scheme: concept-SD-biologie-biochimie-et-biologie-moleculaire
in scheme: concepts
notation: COGB85
related: protéine-kinase
related: cycline

fonction d'édition
type: ConceptConcept
type: Concept
creator: Commission d'enrichissement de la langue française, FranceTerme
date parution JO: 2012-06-10
deconseille ou frequent: proof-reading function
equivalent EN: editing function @en
equivalent EN: editing function (en)
equivalent EN: proofreading function @en
equivalent EN: proofreading function (en)
definition: Mécanisme, catalysé par des polymérases, selon lequel des nucléotides incorrectement incorporés dans une séquence d'acide nucléique sont éliminés ou remplacés.
in scheme: Biologie
in scheme: concept-SD-biologie-biochimie-et-biologie-moleculaire
in scheme: concepts
notation: COGB86

histone-désacétylase
type: ConceptConcept
type: Concept
creator: Commission d'enrichissement de la langue française, FranceTerme
abbreviation: HDAC
date parution JO: 2012-06-10
equivalent EN: HDAC @en
equivalent EN: HDAC (en)
equivalent EN: histone deacetylase @en
equivalent EN: histone deacetylase (en)
part of speech: nom féminin
alternative label: désacétylase d'histone
definition: Enzyme qui catalyse l'élimination des groupes acétyle adjoints aux lysines des protéines histones et non histones, ce qui entraîne la répression de la transcription.
in scheme: Biologie
in scheme: concept-SD-biologie-biochimie-et-biologie-moleculaire
in scheme: concepts
notation: COGB87
related: désacétylation

hybridation fluorescente in situ
type: ConceptConcept
type: Concept
creator: Commission d'enrichissement de la langue française, FranceTerme
abbreviation: FISH @en
date parution JO: 2012-06-10
deconseille ou frequent: fluorescence in situ hybridisation
deconseille ou frequent: méthode Fish
equivalent EN: FISH @en
equivalent EN: FISH (en)
equivalent EN: fluorescence in situ hybridization @en
equivalent EN: fluorescence in situ hybridization (en)
definition: Hybridation in situ qui utilise une sonde nucléique d'ADN marquée par un fluorochrome pour visualiser, sous exposition aux rayons ultraviolets, la position d'un fragment d'ADN sur un chromosome.
in scheme: Biologie
in scheme: concept-SD-biologie-biochimie-et-biologie-moleculaire
in scheme: concepts
notation: COGB88
note: On trouve aussi, dans le langage professionnel, l'expression « méthode Fish », qui n'est pas recommandée.
related: hybridation in situ
related: sonde nucléique
related: fluorochrome

intégrine
type: ConceptConcept
type: Concept
creator: Commission d'enrichissement de la langue française, FranceTerme
date parution JO: 2012-06-10
equivalent EN: integrin @en
equivalent EN: integrin (en)
part of speech: nom féminin
definition: Protéine qui, enchâssée dans la membrane plasmique, établit des liens entre le cytosquelette d'actine et des molécules de la matrice extracellulaire.
in scheme: Biologie
in scheme: concept-SD-biologie-biochimie-et-biologie-moleculaire
in scheme: concepts
notation: COGB89
note: Les intégrines constituent une superfamille de protéines impliquées dans l'adhérence intercellulaire, l'organogenèse et la différenciation cellulaire.

synomone
type: ConceptConcept
type: Concept
creator: Commission d'enrichissement de la langue française, FranceTerme
date parution JO: 2011-09-18
equivalent EN: synomone @en
equivalent EN: synomone (en)
part of speech: nom féminin
definition: Substance produite par les individus d'une espèce pour leur propre bénéfice et pour celui des individus d'une espèce réceptrice.
in scheme: Biologie
in scheme: concept-SD-biologie-biochimie-et-biologie-moleculaire
in scheme: concepts
notation: COGB9
note: Le parfum dégagé par les inflorescences du Buddleia, appelé « arbre aux papillons », est un exemple de synomone : il attire certains papillons, qui trouvent dans son nectar une importante source d'énergie et assurent la pollinisation de la plante.
related: composé sémiochimique
related: allomone
related: kairomone

intéine
type: ConceptConcept
type: Concept
creator: Commission d'enrichissement de la langue française, FranceTerme
date parution JO: 2012-06-10
equivalent EN: intein @en
equivalent EN: intein (en)
part of speech: nom féminin
definition: Segment excisé lors de l'épissage post-traduction d'une protéine.
in scheme: Biologie
in scheme: concept-SD-biologie-biochimie-et-biologie-moleculaire
in scheme: concepts
notation: COGB90
related: épissage
related: épissage protéique post-traduction
related: extéine

kinase dépendante des cyclines
type: ConceptConcept
type: Concept
creator: Commission d'enrichissement de la langue française, FranceTerme
abbreviation: CDK @en
date parution JO: 2012-06-10
deconseille ou frequent: cyclin dependant kinase
equivalent EN: CDK @en
equivalent EN: CDK (en)
equivalent EN: cyclin-dependent kinase @en
equivalent EN: cyclin-dependent kinase (en)
definition: Protéine-kinase qui n'est active que lorsqu'elle est liée à une cycline particulière.
in scheme: Biologie
in scheme: concept-SD-biologie-biochimie-et-biologie-moleculaire
in scheme: concepts
notation: COGB91
note: La kinase dépendante des cyclines édifie des complexes avec des cyclines spécifiques pour phosphoryler des protéines régulatrices, à des étapes particulières du cycle cellulaire.
related: protéine-kinase
related: cycline

lectine
type: ConceptConcept
type: Concept
creator: Commission d'enrichissement de la langue française, FranceTerme
date parution JO: 2012-06-10
equivalent EN: lectin @en
equivalent EN: lectin (en)
part of speech: nom féminin
definition: Protéine sans pouvoir catalytique, capable de se lier spécifiquement à un monosaccharide de surface, à un oligosaccharide de surface ou encore à une glycoprotéine qui porte ces molécules.
in scheme: Biologie
in scheme: concept-SD-biologie-biochimie-et-biologie-moleculaire
in scheme: concept-SD-biologie-biologie-cellulaire
in scheme: concepts
notation: COGB92
note: Les lectines ont un rôle dans la reconnaissance et l'adhérence cellulaires, dans la protection contre les bactéries et les virus ainsi que dans l'approvisionnement en peptides du réticulum endoplasmique.
related: sélectine
related: molécule d'adhérence cellulaire

élément nucléaire dispersé long
type: ConceptConcept
type: Concept
creator: Commission d'enrichissement de la langue française, FranceTerme
abbreviation: LINE @en
date parution JO: 2012-06-10
equivalent EN: LINE @en
equivalent EN: LINE (en)
equivalent EN: long interspersed nuclear element @en
equivalent EN: long interspersed nuclear element (en)
equivalent EN: long interspersed repeat @en
equivalent EN: long interspersed repeat (en)
equivalent EN: long interspersed repeat element @en
equivalent EN: long interspersed repeat element (en)
definition: Rétrotransposon des eucaryotes formé d'une séquence de 6 000 à 7 000 paires de bases, répétée et disséminée dans le génome.
in scheme: Biologie
in scheme: concept-SD-biologie-biochimie-et-biologie-moleculaire
in scheme: concepts
notation: COGB93
related: rétrotransposon
related: élément nucléaire dispersé court
related: paire de bases

micro-ARN
type: ConceptConcept
type: Concept
creator: Commission d'enrichissement de la langue française, FranceTerme
abbreviation: miRNA @en
date parution JO: 2012-06-10
deconseille ou frequent: micro-RNA
equivalent EN: miRNA @en
equivalent EN: miRNA (en)
equivalent EN: microRNA @en
equivalent EN: microRNA (en)
part of speech: nom masculin
definition: ARN simple brin de 21 ou 22 nucléotides qui bloque des gènes différant de celui dont il est issu, en guidant le clivage des ARN messagers qui lui sont complémentaires, ou en bloquant directement leur traduction sans les cliver.
in scheme: Biologie
in scheme: concept-SD-biologie-biochimie-et-biologie-moleculaire
in scheme: concepts
notation: COGB94
related: riborégulateur
related: complexe de blocage de l'expression génique par des ARN
related: enzyme éminceuse
related: interférence par ARN
related: précurseur de micro-ARN

molécule d'adhérence cellulaire
type: ConceptConcept
type: Concept
creator: Commission d'enrichissement de la langue française, FranceTerme
abbreviation: CAM @en
date parution JO: 2012-06-10
equivalent EN: CAM @en
equivalent EN: CAM (en)
equivalent EN: cell adhesion molecule @en
equivalent EN: cell adhesion molecule (en)
definition: Protéine membranaire de surface impliquée dans les mécanismes d'adhérence entre les cellules d'un même tissu ou de tissus différents.
in scheme: Biologie
in scheme: concept-SD-biologie-biochimie-et-biologie-moleculaire
in scheme: concept-SD-biologie-biologie-cellulaire
in scheme: concepts
notation: COGB95
note: Les molécules d'adhérence cellulaire sont réparties en trois classes principales : les cadhérines, les sélectines et certaines immunoglobulines.
related: sélectine
related: lectine
related: cadhérine

paire de bases
type: ConceptConcept
type: Concept
creator: Commission d'enrichissement de la langue française, FranceTerme
abbreviation: pb
date parution JO: 2012-06-10
deconseille ou frequent: bp
deconseille ou frequent: bps
equivalent EN: base pair @en
equivalent EN: base pair (en)
definition: Unité de longueur des molécules d'ADN bicaténaire, qui correspond à l'ensemble de deux bases complémentaires de cet ADN et qui est égale à 0,34 nanomètre.
in scheme: Biologie
in scheme: concept-SD-biologie-biochimie-et-biologie-moleculaire
in scheme: concepts
notation: COGB96
related: décalage du cadre de lecture
related: kilobase
related: motif de reconnaissance du proto-espaceur
related: réécriture de base
related: analyse d'hétéroduplex
related: élément nucléaire dispersé court
related: élément nucléaire dispersé long

paradoxe de la valeur C
type: ConceptConcept
type: Concept
creator: Commission d'enrichissement de la langue française, FranceTerme
date parution JO: 2012-06-10
equivalent EN: C-value paradox @en
equivalent EN: C-value paradox (en)
definition: Absence de corrélation entre le degré de complexité des organismes d'une part, la taille de leur génome et le nombre de leurs gènes d'autre part.
in scheme: Biologie
in scheme: concept-SD-biologie-biochimie-et-biologie-moleculaire
in scheme: concepts
notation: COGB97
related: valeur C

petit ARN interférent
type: ConceptConcept
type: Concept
creator: Commission d'enrichissement de la langue française, FranceTerme
abbreviation: siRNA @en
date parution JO: 2012-06-10
equivalent EN: short interfering RNA @en
equivalent EN: short interfering RNA (en)
equivalent EN: siRNA @en
equivalent EN: siRNA (en)
equivalent EN: small interfering RNA @en
equivalent EN: small interfering RNA (en)
alternative label: ARN interférent court
definition: ARN simple brin de 21 à 25 nucléotides qui empêche soit la traduction du gène dont il est issu ou d'un gène apparenté en guidant le clivage des ARN messagers qui lui sont complémentaires, soit la transcription de ces gènes en modifiant la conformation de la chromatine au niveau des ADN qui lui sont complémentaires.
in scheme: Biologie
in scheme: concept-SD-biologie-biochimie-et-biologie-moleculaire
in scheme: concepts
notation: COGB98
related: ARN messager
related: riborégulateur
related: complexe de blocage transcriptionnel par des ARN
related: complexe de blocage de l'expression génique par des ARN
related: enzyme éminceuse
related: interférence par ARN
related: précurseur de petits ARN interférents

point chaud de mutation
type: ConceptConcept
type: Concept
creator: Commission d'enrichissement de la langue française, FranceTerme
date parution JO: 2012-06-10
deconseille ou frequent: mutation hot spot
equivalent EN: mutation hot spot @en
equivalent EN: mutation hot spot (en)
equivalent EN: mutation hotspot @en
equivalent EN: mutation hotspot (en)
definition: Site d'une molécule d'ADN où la fréquence de mutation est beaucoup plus élevée que celle des autres sites.
in scheme: Biologie
in scheme: concept-SD-biologie-biochimie-et-biologie-moleculaire
in scheme: concept-SD-biologie-genetique
in scheme: concepts
notation: COGB99
related: mutation

affichage des prix
type: ConceptConcept
type: Concept
creator: Commission d'enrichissement de la langue française, FranceTerme
source: révision de l'arrêté du 12 janvier 1973
date parution JO: 2000-09-22
equivalent EN: posting @en
equivalent EN: posting (en)
in scheme: Économie et gestion d'entreprise
in scheme: concepts
notation: COGE160
related: prix affiché

bande magnétique
type: ConceptConcept
type: Concept
creator: Commission d'enrichissement de la langue française, FranceTerme
source: révision de l'arrêté du 27 août 1992
date parution JO: 2000-09-22
equivalent EN: magnetic tape @en
equivalent EN: magnetic tape (en)
in scheme: Tous domaines
in scheme: concepts
notation: COGE162

calendrier
type: ConceptConcept
type: Concept
creator: Commission d'enrichissement de la langue française, FranceTerme
source: révision de l'arrêté du 12 août 1976
date parution JO: 2000-09-22
equivalent EN: timing @en
equivalent EN: timing (en)
part of speech: nom masculin
in scheme: Tous domaines
in scheme: concepts
notation: COGE163
related: planification

compatibilité
type: ConceptConcept
type: Concept
creator: Commission d'enrichissement de la langue française, FranceTerme
source: révision de l'arrêté du 22 décembre 1981
date parution JO: 2000-09-22
equivalent EN: compatibility @en
equivalent EN: compatibility (en)
part of speech: nom féminin
in scheme: Tous domaines
in scheme: concepts
notation: COGE164

contrôle
type: ConceptConcept
type: Concept
creator: Commission d'enrichissement de la langue française, FranceTerme
source: révision de l'arrêté du 12 janvier 1973
date parution JO: 2000-09-22
equivalent EN: check-out @en
equivalent EN: check-out (en)
equivalent EN: control @en
equivalent EN: control (en)
equivalent EN: inspection @en
equivalent EN: inspection (en)
part of speech: nom masculin
in scheme: Tous domaines
in scheme: concepts
notation: COGE166
preferred label: control @en

contrôleur, -euse
type: ConceptConcept
type: Concept
creator: Commission d'enrichissement de la langue française, FranceTerme
source: révision de l'arrêté du 12 août 1976
date parution JO: 2000-09-22
equivalent EN: tester @en
equivalent EN: tester (en)
part of speech: nom
in scheme: Tous domaines
in scheme: concepts
notation: COGE167

essayeur
type: ConceptConcept
type: Concept
creator: Commission d'enrichissement de la langue française, FranceTerme
source: révision de l'arrêté du 12 août 1976
date parution JO: 2000-09-22
equivalent EN: tester @en
equivalent EN: tester (en)
part of speech: nom masculin
in scheme: Tous domaines
in scheme: concepts
notation: COGE168

imperméabilisation
type: ConceptConcept
type: Concept
creator: Commission d'enrichissement de la langue française, FranceTerme
source: révision de l'arrêté du 12 août 1976
date parution JO: 2000-09-22
equivalent EN: waterproofing @en
equivalent EN: waterproofing (en)
part of speech: nom féminin
in scheme: Tous domaines
in scheme: concepts
notation: COGE170

ingénierie
type: ConceptConcept
type: Concept
creator: Commission d'enrichissement de la langue française, FranceTerme
source: révision de l'arrêté du 12 janvier 1973
date parution JO: 2000-09-22
equivalent EN: engineering @en
equivalent EN: engineering (en)
part of speech: nom féminin
in scheme: Tous domaines
in scheme: concepts
notation: COGE171
related: concept-petrole-et-gaz

minutage
type: ConceptConcept
type: Concept
creator: Commission d'enrichissement de la langue française, FranceTerme
source: révision de l'arrêté du 12 août 1976
date parution JO: 2000-09-22
equivalent EN: timing @en
equivalent EN: timing (en)
part of speech: nom masculin
in scheme: Tous domaines
in scheme: concepts
notation: COGE172

non conforme aux normes
type: ConceptConcept
type: Concept
creator: Commission d'enrichissement de la langue française, FranceTerme
source: révision de l'arrêté du 23 septembre 1987
abbreviation: NC
date parution JO: 2000-09-22
equivalent EN: substandard @en
equivalent EN: substandard (en)
forme abregee: non conforme
in scheme: Tous domaines
in scheme: concepts
notation: COGE173

prix affiché
type: ConceptConcept
type: Concept
creator: Commission d'enrichissement de la langue française, FranceTerme
source: révision de l'arrêté du 12 janvier 1973
date parution JO: 2000-09-22
equivalent EN: posted price @en
equivalent EN: posted price (en)
in scheme: Économie et gestion d'entreprise
in scheme: concepts
notation: COGE174
related: affichage des prix

résumé
type: ConceptConcept
type: Concept
creator: Commission d'enrichissement de la langue française, FranceTerme
source: révision de l'arrêté du 30 décembre 1983
date parution JO: 2000-09-22
equivalent EN: abstract @en
equivalent EN: abstract (en)
part of speech: nom masculin
in scheme: Tous domaines
in scheme: concepts
notation: COGE175

réunion
type: ConceptConcept
type: Concept
creator: Commission d'enrichissement de la langue française, FranceTerme
source: révision de l'arrêté du 18 février 1988
date parution JO: 2000-09-22
equivalent EN: meeting @en
equivalent EN: meeting (en)
part of speech: nom féminin
in scheme: Tous domaines
in scheme: concepts
notation: COGE176

savoir-faire
type: ConceptConcept
type: Concept
creator: Commission d'enrichissement de la langue française, FranceTerme
source: révision de l'arrêté du 12 janvier 1973
date parution JO: 2000-09-22
equivalent EN: know-how @en
equivalent EN: know-how (en)
part of speech: nom masculin
alternative label: compétence
alternative label: expérience
in scheme: Tous domaines
in scheme: concepts
notation: COGE177

télécommande
type: ConceptConcept
type: Concept
creator: Commission d'enrichissement de la langue française, FranceTerme
source: révision de l'arrêté du 12 janvier 1973
date parution JO: 2000-09-22
equivalent EN: remote control @en
equivalent EN: remote control (en)
part of speech: nom féminin
in scheme: Tous domaines
in scheme: concepts
notation: COGE178

testeur
type: ConceptConcept
type: Concept
creator: Commission d'enrichissement de la langue française, FranceTerme
source: révision de l'arrêté du 29 avril 1992
date parution JO: 2000-09-22
equivalent EN: tester @en
equivalent EN: tester (en)
part of speech: nom masculin
in scheme: Tous domaines
in scheme: concepts
notation: COGE179
related: traducteur de test

traitement
type: ConceptConcept
type: Concept
creator: Commission d'enrichissement de la langue française, FranceTerme
source: révision de l'arrêté du 12 janvier 1973
date parution JO: 2000-09-22
equivalent EN: processing @en
equivalent EN: processing (en)
part of speech: nom masculin
in scheme: Tous domaines
in scheme: concepts
notation: COGE180

traiteur
type: ConceptConcept
type: Concept
creator: Commission d'enrichissement de la langue française, FranceTerme
source: révision de l'arrêté du 30 juin 1992
date parution JO: 2000-09-22
equivalent EN: caterer @en
equivalent EN: caterer (en)
part of speech: nom masculin
broader: concept-restauration
in scheme: Restauration
in scheme: concepts
notation: COGE181

ventilateur
type: ConceptConcept
type: Concept
creator: Commission d'enrichissement de la langue française, FranceTerme
source: révision de l'arrêté du 12 août 1976
date parution JO: 2000-09-22
equivalent EN: fan @en
equivalent EN: fan (en)
part of speech: nom masculin
in scheme: Tous domaines
in scheme: concepts
notation: COGE182

vibreur sonore
type: ConceptConcept
type: Concept
creator: Commission d'enrichissement de la langue française, FranceTerme
source: révision de l'arrêté du 12 août 1976
date parution JO: 2000-09-22
equivalent EN: buzzer @en
equivalent EN: buzzer (en)
in scheme: Tous domaines
in scheme: concepts
notation: COGE183

haut niveau
type: ConceptConcept
type: Concept
creator: Commission d'enrichissement de la langue française, FranceTerme
source: révision de l'arrêté du 18 février 1988
date parution JO: 2000-09-22
equivalent EN: high level @en
equivalent EN: high level (en)
in scheme: Tous domaines
in scheme: concepts
notation: COGE185

arme de défense à balles souples
type: ConceptConcept
type: Concept
creator: Commission d'enrichissement de la langue française, FranceTerme
abbreviation: DBS
date parution JO: 2003-01-30
deconseille ou frequent: Flash-ball
deconseille ou frequent: défense à balles souples
deconseille ou frequent: flashball
forme abregee: défense à balles souples (de)
definition: Arme de défense projetant des balles en caoutchouc non perforantes.
in scheme: Armement
in scheme: concept-SD-armement-securite
in scheme: concepts
notation: COGE220
note: 1. Le terme « arme » peut être remplacé par tout autre terme approprié, tel « pistolet » ou « fusil ».
note: 2. « Flash-ball », marque déposée française, ou « flashball », ne doivent pas être employés.
related: concept-armement

autonomisation
type: ConceptConcept
type: Concept
creator: Commission d'enrichissement de la langue française, FranceTerme
date parution JO: 2005-12-18
equivalent EN: empowerment @en
equivalent EN: empowerment (en)
part of speech: nom féminin
definition: Processus par lequel une personne ou une collectivité se libère d'un état de sujétion, acquiert la capacité d'user de la plénitude de ses droits, s'affranchit d'une dépendance d'ordre social, moral ou intellectuel.
in scheme: Sciences humaines
in scheme: concepts
notation: COGE294

généralisation
type: ConceptConcept
type: Concept
creator: Commission d'enrichissement de la langue française, FranceTerme
date parution JO: 2005-12-18
deconseille ou frequent: main streaming
deconseille ou frequent: main-streaming
equivalent EN: mainstreaming @en
equivalent EN: mainstreaming (en)
part of speech: nom féminin
definition: Action visant à susciter l'adhésion la plus large possible à des principes, des règles, des valeurs dominantes.
in scheme: Politique
in scheme: concept-SD-politique-politique-internationale
in scheme: concepts
notation: COGE295

intégration
type: ConceptConcept
type: Concept
creator: Commission d'enrichissement de la langue française, FranceTerme
date parution JO: 2005-12-18
deconseille ou frequent: main streaming
deconseille ou frequent: main-streaming
equivalent EN: mainstreaming @en
equivalent EN: mainstreaming (en)
part of speech: nom féminin
definition: Processus par lequel une personne ou un groupe s'insère dans le milieu, la société où il vit.
in scheme: Sciences humaines
in scheme: concepts
notation: COGE296

fenêtre intruse
type: ConceptConcept
type: Concept
creator: Commission d'enrichissement de la langue française, FranceTerme
abbreviation: pop-up @en
date parution JO: 2005-12-18
deconseille ou frequent: popup window
equivalent EN: pop-up @en
equivalent EN: pop-up (en)
equivalent EN: pop-up window @en
equivalent EN: pop-up window (en)
forme abregee: intruse, n.f.
definition: Fenêtre qui s'affiche soudainement à l'écran sans que l'utilisateur en ait fait la demande.
in scheme: Informatique
in scheme: concept-SD-informatique-internet
in scheme: concepts
notation: COGE298

complexe touristique
type: ConceptConcept
type: Concept
creator: Commission d'enrichissement de la langue française, FranceTerme
date parution JO: 2006-02-12
equivalent EN: resort @en
equivalent EN: resort (en)
forme abregee: complexe, n.m.
definition: Ensemble d'installations hôtelières et d'équipements de loisirs aménagés en un lieu par un même promoteur.
in scheme: Économie et gestion d'entreprise
in scheme: Tourisme
in scheme: concepts
notation: COGE380
note: On évitera de confondre « complexe » et « station », qui désigne un lieu de villégiature, bien que ces deux termes aient le même équivalent en anglais.
related: station

station
type: ConceptConcept
type: Concept
creator: Commission d'enrichissement de la langue française, FranceTerme
date parution JO: 2006-02-12
equivalent EN: resort @en
equivalent EN: resort (en)
part of speech: nom féminin
in scheme: Économie et gestion d'entreprise
in scheme: Tourisme
in scheme: concepts
notation: COGE381
related: complexe touristique

pôle
type: ConceptConcept
type: Concept
creator: Commission d'enrichissement de la langue française, FranceTerme
date parution JO: 2006-02-12
deconseille ou frequent: pivot
deconseille ou frequent: plaque tournante
deconseille ou frequent: plateforme
deconseille ou frequent: plateforme de correspondance
deconseille ou frequent: point nodal
deconseille ou frequent: pôle d'échanges
equivalent EN: hub @en
equivalent EN: hub (en)
part of speech: nom masculin
definition: Point d'embarquement ou de débarquement de voyageurs ou de marchandises assurant de multiples correspondances entre diverses compagnies de transport d'un même réseau ou l'interconnexion entre différents réseaux ou modes de transport.
in scheme: Transports et mobilité
in scheme: concepts
notation: COGE382
note: Les termes « pivot », « plateforme », « plaque tournante » et « pôle d'échanges » sont également utilisés dans ce sens. Dans le domaine ferroviaire, on trouve aussi « point nodal ». Dans le domaine aérien, on utilise aussi « plateforme de correspondance ».
related: port d'éclatement
scope note: Cette publication annule et remplace celle du terme « pivot » au Journal officiel du 22 septembre 2000.

information-divertissement
type: ConceptConcept
type: Concept
creator: Commission d'enrichissement de la langue française, FranceTerme
date parution JO: 2006-03-03
equivalent EN: infotainment @en
equivalent EN: infotainment (en)
forme abregee: infodivertissement, n.m.
part of speech: nom féminin
definition: Traitement distrayant de l'information par les médias.
in scheme: Audiovisuel
in scheme: concepts
notation: COGE384
related: information-divertissement

défilé
type: ConceptConcept
type: Concept
creator: Commission d'enrichissement de la langue française, FranceTerme
date parution JO: 2006-03-03
equivalent EN: fashion show @en
equivalent EN: fashion show (en)
equivalent EN: showcase @en
equivalent EN: showcase (en)
part of speech: nom masculin
in scheme: Habillement et mode
in scheme: concepts
notation: COGE386
related: concept-mode

présentation promotionnelle
type: ConceptConcept
type: Concept
creator: Commission d'enrichissement de la langue française, FranceTerme
date parution JO: 2006-03-03
equivalent EN: showcase @en
equivalent EN: showcase (en)
forme abregee: présentation, n.f.
in scheme: Arts
in scheme: Audiovisuel
in scheme: concept-SD-arts-arts-de-la-scene
in scheme: concept-SD-audiovisuel-arts-de-la-scene
in scheme: concepts
notation: COGE387

paritarisme
type: ConceptConcept
type: Concept
creator: Commission d'enrichissement de la langue française, FranceTerme
date parution JO: 2006-03-04
deconseille ou frequent: gender main streaming
deconseille ou frequent: gender main-streaming
equivalent EN: gender mainstreaming @en
equivalent EN: gender mainstreaming (en)
part of speech: nom masculin
definition: Action en faveur de l'égalité entre les femmes et les hommes.
in scheme: Sciences humaines
in scheme: concept-SD-sciences-humaines-sciences-sociales
in scheme: concepts
notation: COGE389

ondelette
type: ConceptConcept
type: Concept
creator: Commission d'enrichissement de la langue française, FranceTerme
date parution JO: 2006-03-09
equivalent EN: wavelet @en
equivalent EN: wavelet (en)
part of speech: nom féminin
definition: Petite onde localisée.
in scheme: Mathématiques
in scheme: Physique
in scheme: concepts
notation: COGE390
note: Une ondelette est une oscillation de moyenne nulle, caractérisée par son instant d'émission et sa durée. On peut établir une analogie, dans le domaine musical, entre une ondelette et une note dont l'instant d'émission, la durée, le contenu et la fréquence sont déterminés.

transformée en ondelettes
type: ConceptConcept
type: Concept
creator: Commission d'enrichissement de la langue française, FranceTerme
date parution JO: 2006-03-09
equivalent EN: wavelet transform @en
equivalent EN: wavelet transform (en)
definition: Décomposition d'une fonction quelconque en une superposition d'oscillations élémentaires de moyenne nulle, dont la durée est limitée et l'instant d'émission déterminé.
in scheme: Mathématiques
in scheme: Physique
in scheme: concepts
notation: COGE391

externalisation
type: ConceptConcept
type: Concept
creator: Commission d'enrichissement de la langue française, FranceTerme
date parution JO: 2006-03-09
deconseille ou frequent: externaliser
deconseille ou frequent: sous-traitance
equivalent EN: business process outsourcing @en
equivalent EN: business process outsourcing (en)
equivalent EN: outsourcing @en
equivalent EN: outsourcing (en)
part of speech: nom féminin
definition: Recours à un partenaire extérieur pour exercer une activité qu'une entreprise ou une organisation décide de ne plus assurer elle-même.
in scheme: Économie et gestion d'entreprise
in scheme: Finance
in scheme: concepts
notation: COGE392
note: Pour l'externalisation de l'exécution de tout ou partie d'un contrat, on emploie le terme « sous-traitance ».
related: internalisation

testage
type: ConceptConcept
type: Concept
creator: Commission d'enrichissement de la langue française, FranceTerme
date parution JO: 2006-03-25
equivalent EN: testing @en
equivalent EN: testing (en)
part of speech: nom masculin
definition: Le fait de pratiquer un contrôle, une vérification, une évaluation, un test.
in scheme: Tous domaines
in scheme: concepts
notation: COGE393

test de discrimination
type: ConceptConcept
type: Concept
creator: Commission d'enrichissement de la langue française, FranceTerme
date parution JO: 2006-03-25
deconseille ou frequent: testing
forme abregee: test, n.m.
definition: Opération qui vise à déceler des comportements discriminatoires en effectuant successivement des démarches analogues au nom de personnes différentes par l'origine ou l'apparence.
in scheme: Emploi et travail
in scheme: Social
in scheme: concepts
notation: COGE394
note: L'emploi du mot testing, emprunté à l'anglais, est à proscrire.

personnalisation
type: ConceptConcept
type: Concept
creator: Commission d'enrichissement de la langue française, FranceTerme
date parution JO: 2006-04-05
deconseille ou frequent: custom
deconseille ou frequent: customisation
equivalent EN: customization @en
equivalent EN: customization (en)
equivalent EN: tuning @en
equivalent EN: tuning (en)
part of speech: nom féminin
definition: Modification apportée, notamment au moyen d'accessoires, à l'aspect, à l'aménagement ou au moteur d'un véhicule de série, de façon à le rendre plus conforme aux goûts de son propriétaire.
in scheme: Automobile
in scheme: concepts
notation: COGE398
note: L'emploi du terme anglais custom, pour désigner le véhicule lui-même, est à proscrire.

cliquer-parler
type: ConceptConcept
type: Concept
creator: Commission d'enrichissement de la langue française, FranceTerme
date parution JO: 2006-04-05
deconseille ou frequent: click & talk
equivalent EN: Web call back @en
equivalent EN: Web call back (en)
equivalent EN: Web call through @en
equivalent EN: Web call through (en)
equivalent EN: click and talk @en
equivalent EN: click and talk (en)
equivalent EN: click to call @en
equivalent EN: click to call (en)
part of speech: nom masculin
definition: Service permettant à un internaute d'établir une liaison vocale avec un opérateur et de dialoguer avec lui pendant qu'il visite un site.
in scheme: Informatique
in scheme: Télécommunications
in scheme: concept-SD-informatique-internet
in scheme: concept-SD-telecommunications-internet
in scheme: concepts
notation: COGE400
note: L'internaute clique sur un bouton d'appel et peut être mis immédiatement en relation avec un opérateur (en anglais : Web call through), ou être rappelé au numéro de téléphone qu'il a indiqué (en anglais : Web call back).

dialogue en ligne
type: ConceptConcept
type: Concept
creator: Commission d'enrichissement de la langue française, FranceTerme
date parution JO: 2006-04-05
deconseille ou frequent: tchat
equivalent EN: chat @en
equivalent EN: chat (en)
forme abregee: dialogue, n.m.
definition: Conversation entre plusieurs personnes connectées en même temps à un réseau, qui échangent des messages s'affichant en temps réel sur leur écran.
in scheme: Informatique
in scheme: Télécommunications
in scheme: concept-SD-informatique-internet
in scheme: concept-SD-telecommunications-internet
in scheme: concepts
notation: COGE401
scope note: Cette publication annule et remplace celle du terme « causette » au Journal officiel du 16 mars 1999.

passe-livres
type: ConceptConcept
type: Concept
creator: Commission d'enrichissement de la langue française, FranceTerme
date parution JO: 2006-04-05
deconseille ou frequent: book crossing
deconseille ou frequent: passa-libro
equivalent EN: bookcrossing @en
equivalent EN: bookcrossing (en)
part of speech: nom masculin
definition: Pratique consistant à déposer un livre dans un lieu public afin que d'autres personnes puissent le découvrir et le faire circuler à leur tour.
in scheme: Culture
in scheme: Édition et livre
in scheme: concepts
notation: COGE404

salle d'exposition
type: ConceptConcept
type: Concept
creator: Commission d'enrichissement de la langue française, FranceTerme
date parution JO: 2006-04-05
deconseille ou frequent: show room
equivalent EN: showroom @en
equivalent EN: showroom (en)
in scheme: Économie et gestion d'entreprise
in scheme: concepts
notation: COGE405

action de groupe
type: ConceptConcept
type: Concept
creator: Commission d'enrichissement de la langue française, FranceTerme
date parution JO: 2006-05-13
equivalent EN: class action @en
equivalent EN: class action (en)
definition: Voie ouverte dans certains pays par la procédure civile, permettant à un ou plusieurs requérants d'exercer une action en justice pour le compte d'une catégorie de personnes sans en avoir nécessairement reçu le mandat au préalable.
in scheme: Droit
in scheme: concepts
notation: COGE408

décalage
type: ConceptConcept
type: Concept
creator: Commission d'enrichissement de la langue française, FranceTerme
date parution JO: 2006-09-09
equivalent EN: time shift @en
equivalent EN: time shift (en)
equivalent EN: time shifting @en
equivalent EN: time shifting (en)
part of speech: nom masculin
definition: Fonction permettant à l'auditeur ou au téléspectateur de suspendre la réception d'un programme tout en l'enregistrant pour en reprendre ultérieurement le cours à son point d'interruption.
in scheme: Audiovisuel
in scheme: concept-SD-audiovisuel-radio
in scheme: concept-SD-audiovisuel-television
in scheme: concepts
notation: COGE414

incursion
type: ConceptConcept
type: Concept
creator: Commission d'enrichissement de la langue française, FranceTerme
date parution JO: 2006-09-09
equivalent EN: cross-over @en
equivalent EN: cross-over (en)
equivalent EN: crossover @en
equivalent EN: crossover (en)
part of speech: nom féminin
definition: Pratique consistant, pour un artiste, à passer d'un genre ou d'un style de musique à un autre.
in scheme: Arts
in scheme: concept-SD-arts-musique
in scheme: concepts
notation: COGE415

incursion
type: ConceptConcept
type: Concept
creator: Commission d'enrichissement de la langue française, FranceTerme
date parution JO: 2006-09-09
equivalent EN: cross-over @en
equivalent EN: cross-over (en)
equivalent EN: crossover @en
equivalent EN: crossover (en)
part of speech: nom féminin
definition: Apparition d'un personnage dans une série télévisée ou une bande dessinée différente de celle à laquelle il appartient.
in scheme: Audiovisuel
in scheme: Édition et livre
in scheme: concept-SD-audiovisuel-television
in scheme: concept-SD-edition-et-livre-television
in scheme: concepts
notation: COGE416

gestion des droits numériques
type: ConceptConcept
type: Concept
creator: Commission d'enrichissement de la langue française, FranceTerme
abbreviation: DRM @en
abbreviation: GDN
date parution JO: 2006-10-26
equivalent EN: DRM @en
equivalent EN: DRM (en)
equivalent EN: digital rights management @en
equivalent EN: digital rights management (en)
definition: Mise en œuvre des différents procédés destinés à protéger les droits afférents à la diffusion de contenus sur supports numériques.
in scheme: Audiovisuel
in scheme: Communication
in scheme: concepts
notation: COGE422
related: gestion des actifs numériques

durabilité
type: ConceptConcept
type: Concept
creator: Commission d'enrichissement de la langue française, FranceTerme
date parution JO: 2006-12-27
equivalent EN: sustainability @en
equivalent EN: sustainability (en)
part of speech: nom féminin
alternative label: caractère durable
definition: Caractéristique d'une politique qui peut être durablement menée ou d'une évolution susceptible de se poursuivre sans compromettre l'avenir.
in scheme: Tous domaines
in scheme: concepts
notation: COGE437

instructions
type: ConceptConcept
type: Concept
creator: Commission d'enrichissement de la langue française, FranceTerme
date parution JO: 2006-12-27
equivalent EN: brief @en
equivalent EN: brief (en)
part of speech: nom féminin pluriel
alternative label: consignes
definition: Informations ou directives présentées aux différents acteurs d'une opération avant le début de celle-ci.
in scheme: Tous domaines
in scheme: concepts
notation: COGE438
note: Le terme « brief » est employé dans le vocabulaire militaire.

instruire
type: ConceptConcept
type: Concept
creator: Commission d'enrichissement de la langue française, FranceTerme
date parution JO: 2006-12-27
deconseille ou frequent: briefer
deconseille ou frequent: donner des consignes
deconseille ou frequent: donner des instructions
deconseille ou frequent: mettre au courant
deconseille ou frequent: to brief
equivalent EN: brief @en
equivalent EN: brief (en)
part of speech: verbe transitif
definition: Présenter aux acteurs concernés des informations ou des directives relatives à une opération avant le début de celle-ci.
in scheme: Tous domaines
in scheme: concepts
notation: COGE439
note: Selon le contexte, il est possible de recourir également à des expressions telles que « donner des consignes », « donner des instructions », « mettre au courant ».

point de presse
type: ConceptConcept
type: Concept
creator: Commission d'enrichissement de la langue française, FranceTerme
date parution JO: 2006-12-27
deconseille ou frequent: point presse
equivalent EN: press briefing @en
equivalent EN: press briefing (en)
definition: Séance d'information destinée aux journalistes pour faire le point sur un sujet ou une situation.
in scheme: Communication
in scheme: concepts
notation: COGE440

réunion-bilan
type: ConceptConcept
type: Concept
creator: Commission d'enrichissement de la langue française, FranceTerme
date parution JO: 2006-12-27
equivalent EN: debriefing @en
equivalent EN: debriefing (en)
part of speech: nom féminin
definition: Réunion destinée à rendre compte d'une opération pour faire le point sur sa réalisation et ses résultats, et éventuellement décider de la suite à donner.
in scheme: Tous domaines
in scheme: concepts
notation: COGE441
note: Le terme « debriefing » est employé dans le vocabulaire militaire.
related: réunion préparatoire

réunion préparatoire
type: ConceptConcept
type: Concept
creator: Commission d'enrichissement de la langue française, FranceTerme
date parution JO: 2006-12-27
equivalent EN: briefing @en
equivalent EN: briefing (en)
definition: Présentation aux acteurs concernés des informations ou des directives relatives à une opération avant le début de celle-ci.
in scheme: Tous domaines
in scheme: concepts
notation: COGE442
note: Le terme « briefing » est employé dans le vocabulaire militaire.
related: réunion-bilan

pavé tactile
type: ConceptConcept
type: Concept
creator: Commission d'enrichissement de la langue française, FranceTerme
date parution JO: 2007-01-03
deconseille ou frequent: touchpad
deconseille ou frequent: trackpad
equivalent EN: touch pad @en
equivalent EN: touch pad (en)
equivalent EN: track pad @en
equivalent EN: track pad (en)
definition: Dispositif de pointage et de navigation, qui comporte une surface plane sur laquelle on déplace le doigt.
in scheme: Informatique
in scheme: concepts
notation: COGE444

maison mobile
type: ConceptConcept
type: Concept
creator: Commission d'enrichissement de la langue française, FranceTerme
date parution JO: 2007-01-03
deconseille ou frequent: mobil-home
deconseille ou frequent: mobile-home
deconseille ou frequent: mobilehome
equivalent EN: mobile home @en
equivalent EN: mobile home (en)
definition: Construction préfabriquée transportable qui peut servir d'habitation.
in scheme: Aménagement et urbanisme
in scheme: Habitat et construction
in scheme: concepts
notation: COGE445

salle d'époque
type: ConceptConcept
type: Concept
creator: Commission d'enrichissement de la langue française, FranceTerme
date parution JO: 2007-02-16
equivalent EN: period room @en
equivalent EN: period room (en)
definition: Espace réunissant un ensemble d'éléments destinés à reconstituer un décor typique d'un moment dans l'histoire du goût.
in scheme: Culture
in scheme: concept-SD-culture-musees
in scheme: concepts
notation: COGE449

époque (d')
type: ConceptConcept
type: Concept
creator: Commission d'enrichissement de la langue française, FranceTerme
date parution JO: 2007-06-07
deconseille ou frequent: d'époque
equivalent EN: vintage @en
equivalent EN: vintage (en)
part of speech: nom ou adjectif
definition: Se dit d'un objet, autrefois en usage, qui revient au goût du jour.
in scheme: Culture
in scheme: Économie et gestion d'entreprise
in scheme: concepts
notation: COGE451

rétro
type: ConceptConcept
type: Concept
creator: Commission d'enrichissement de la langue française, FranceTerme
date parution JO: 2007-06-07
deconseille ou frequent: à l'ancienne
equivalent EN: vintage @en
equivalent EN: vintage (en)
part of speech: adjectif invariable
definition: Se dit d'un objet qui imite un style passé ou une mode révolue.
in scheme: Culture
in scheme: Économie et gestion d'entreprise
in scheme: concepts
notation: COGE452
note: On dit aussi « à l'ancienne ».

tirage d'époque
type: ConceptConcept
type: Concept
creator: Commission d'enrichissement de la langue française, FranceTerme
abbreviation: vintage @en
date parution JO: 2007-06-07
equivalent EN: vintage @en
equivalent EN: vintage (en)
equivalent EN: vintage print @en
equivalent EN: vintage print (en)
definition: Photographie dont le tirage est contemporain de la prise de vue.
in scheme: Arts
in scheme: concept-SD-arts-photographie
in scheme: concepts
notation: COGE453

journaliste embarqué
type: ConceptConcept
type: Concept
creator: Commission d'enrichissement de la langue française, FranceTerme
date parution JO: 2007-05-02
equivalent EN: embedded journalist @en
equivalent EN: embedded journalist (en)
equivalent EN: embedded reporter @en
equivalent EN: embedded reporter (en)
definition: Journaliste intégré, sur la base d'un accord contractuel, à une unité combattante en opération.
in scheme: Communication
in scheme: Défense
in scheme: concept-SD-communication-operations
in scheme: concept-SD-defense-operations
in scheme: concepts
notation: COGE454

compagnie à bas prix
type: ConceptConcept
type: Concept
creator: Commission d'enrichissement de la langue française, FranceTerme
date parution JO: 2007-06-07
deconseille ou frequent: compagnie à bas coûts
deconseille ou frequent: low cost
equivalent EN: low cost airline @en
equivalent EN: low cost airline (en)
equivalent EN: low cost company @en
equivalent EN: low cost company (en)
equivalent EN: low fare airline @en
equivalent EN: low fare airline (en)
definition: Compagnie aérienne dont l'offre commerciale repose principalement sur les tarifs les plus bas possible, obtenus en réduisant les coûts d'exploitation, notamment ceux qui sont liés aux conditions d'utilisation des appareils et aux services proposés aux passagers.
in scheme: Tourisme
in scheme: Transports et mobilité
in scheme: concept-SD-tourisme-transport-aerien
in scheme: concept-SD-transports-et-mobilite-transport-aerien
in scheme: concepts
notation: COGE460
note: On trouve aussi le terme « compagnie à bas coûts ».
related: coûts réduits (à)
related: Recommandation sur les équivalents français à donner à l'expression low cost

boîtier multiservice
type: ConceptConcept
type: Concept
creator: Commission d'enrichissement de la langue française, FranceTerme
date parution JO: 2007-06-16
deconseille ou frequent: box
forme abregee: boîtier, n.m.
definition: Appareil permettant d'accéder, à partir de terminaux, à plusieurs services de communication, tels que l'internet, la téléphonie et la télévision, à travers un même réseau.
in scheme: Informatique
in scheme: Télécommunications
in scheme: concept-SD-informatique-internet
in scheme: concept-SD-telecommunications-internet
in scheme: concepts
notation: COGE472
note: 1. Le boîtier peut intégrer d'autres fonctions telles que le décodage de télévision et une mémoire de grande capacité.
note: 2. L'emploi du mot anglais box, qui entre dans la composition de noms de marque de boîtiers multiservices, est à proscrire.
related: quadruple service
related: triple service
related: concept-TELE356
related: concept-TELE372

quadruple service
type: ConceptConcept
type: Concept
creator: Commission d'enrichissement de la langue française, FranceTerme
date parution JO: 2007-06-16
equivalent EN: quadruple play @en
equivalent EN: quadruple play (en)
definition: Service combinant l'accès à l'internet, à la téléphonie fixe et mobile et à la télévision par l'intermédiaire d'un boîtier multiservice.
in scheme: Informatique
in scheme: Télécommunications
in scheme: concept-SD-informatique-internet
in scheme: concept-SD-telecommunications-internet
in scheme: concepts
notation: COGE473
related: boîtier multiservice

triple service
type: ConceptConcept
type: Concept
creator: Commission d'enrichissement de la langue française, FranceTerme
date parution JO: 2007-06-16
equivalent EN: triple play @en
equivalent EN: triple play (en)
definition: Service combinant l'accès à l'internet, à la téléphonie fixe et à la télévision par l'intermédiaire d'un boîtier multiservice.
in scheme: Informatique
in scheme: Télécommunications
in scheme: concept-SD-informatique-internet
in scheme: concept-SD-telecommunications-internet
in scheme: concepts
notation: COGE474
related: boîtier multiservice
related: concept-TELE450

investisseur providentiel
type: ConceptConcept
type: Concept
creator: Commission d'enrichissement de la langue française, FranceTerme
date parution JO: 2007-09-07
equivalent EN: business angel @en
equivalent EN: business angel (en)
definition: Investisseur privé qui apporte capital et savoir-faire à de jeunes entreprises innovantes sans rechercher de rendement immédiat, dans une perspective de succès à terme.
in scheme: Économie et gestion d'entreprise
in scheme: concepts
notation: COGE482
note: On peut dire aussi « bon génie ».
related: aide financière au démarrage
related: fonds d'amorçage

survaleur
type: ConceptConcept
type: Concept
creator: Commission d'enrichissement de la langue française, FranceTerme
date parution JO: 2007-09-07
deconseille ou frequent: écart d'acquisition positif
equivalent EN: goodwill @en
equivalent EN: goodwill (en)
part of speech: nom féminin
definition: Différence positive entre la valeur d'une entreprise sur le marché et la valeur comptable de son actif net, telle qu'elle ressort de son bilan au moment d'une acquisition ou d'une fusion.
in scheme: Économie générale
in scheme: Finance
in scheme: concept-SD-economie-generale-comptabilite
in scheme: concept-SD-finance-comptabilite
in scheme: concepts
notation: COGE483
note: 1. La notion de « survaleur » est utilisée notamment dans le cadre d'une offre publique d'achat (OPA), d'une offre publique d'échange (OPE) ou d'une fusion.
note: 2. La survaleur est une partie de l'actif incorporel.
note: 3. On rencontre aussi le terme « écart d'acquisition positif ».
related: actif incorporel
related: fonds commercial
scope note: Cette publication annule et remplace celle du Journal officiel du 22 septembre 2000.

alerte professionnelle
type: ConceptConcept
type: Concept
creator: Commission d'enrichissement de la langue française, FranceTerme
date parution JO: 2007-09-07
deconseille ou frequent: whistleblower
equivalent EN: whistleblowing @en
equivalent EN: whistleblowing (en)
alternative label: dénonciation
definition: Disclosure by a company's employee or by any person in relation therewith of irregularities that they have been aware of, and that jeopardize their own interests, the company's or third parties'. @en
definition: Révélation par le salarié d'une entreprise ou par toute personne en relation avec celle-ci d'irrégularités dont ils ont eu connaissance, et qui portent atteinte à leurs intérêts propres, à ceux de l'entreprise ou à ceux de tiers.
in scheme: Droit
in scheme: Économie et gestion d'entreprise
in scheme: concepts
notation: COGE484

œuvre en usage partagé
type: ConceptConcept
type: Concept
creator: Commission d'enrichissement de la langue française, FranceTerme
date parution JO: 2007-09-22
deconseille ou frequent: Creative Commons
equivalent EN: œuvre en partage
alternative label: œuvre en partage
definition: Œuvre que son auteur destine à l'usage commun et dont il abandonne ou concède à titre gratuit tout ou partie des droits d'utilisation, selon certaines conditions.
in scheme: Droit
in scheme: concept-SD-droit-propriete-intellectuelle
in scheme: concepts
notation: COGE485
note: 1. Une œuvre en usage partagé peut faire l'objet d'un contrat qui précise la nature et l'étendue des exploitations consenties (simple usage, possibilité de modification ou de transformation).
note: 2. L'emploi de l'expression « Creative Commons », dénomination sociale en anglais d'une organisation qui propose ce type de contrat, est déconseillé.

cybersquat
type: ConceptConcept
type: Concept
creator: Commission d'enrichissement de la langue française, FranceTerme
date parution JO: 2008-04-17
deconseille ou frequent: typosquat
deconseille ou frequent: typosquatting
equivalent EN: cybersquatting @en
equivalent EN: cybersquatting (en)
part of speech: nom masculin
definition: Pratique consistant à accaparer, en le déposant, un nom de domaine reprenant ou évoquant une marque, un nom commercial, un patronyme ou toute autre dénomination, afin de tirer un profit matériel ou moral de sa notoriété présente ou à venir.
in scheme: Droit
in scheme: Informatique
in scheme: concept-SD-droit-internet
in scheme: concept-SD-informatique-internet
in scheme: concepts
notation: COGE516
note: Le « cybersquat » consiste par exemple à déposer des noms en très grand nombre dans l'espoir de revendre certains d'entre eux, ou des variantes orthographiques d'une même dénomination : on parlera dans ce cas de « typosquat » (en anglais : typosquatting).
related: cybersquatteur, -euse

cybersquatteur, -euse
type: ConceptConcept
type: Concept
creator: Commission d'enrichissement de la langue française, FranceTerme
date parution JO: 2008-04-17
deconseille ou frequent: typosquatter
deconseille ou frequent: typosquatteur
equivalent EN: cybersquatter @en
equivalent EN: cybersquatter (en)
part of speech: nom
in scheme: Droit
in scheme: Informatique
in scheme: concept-SD-droit-internet
in scheme: concept-SD-informatique-internet
in scheme: concepts
notation: COGE517
related: cybersquat

biosphérisation
type: ConceptConcept
type: Concept
creator: Commission d'enrichissement de la langue française, FranceTerme
date parution JO: 2008-04-17
equivalent EN: terraforming @en
equivalent EN: terraforming (en)
part of speech: nom féminin
definition: Transformation de tout ou partie d'une planète, consistant à créer des conditions de vie semblables à celles de la biosphère terrestre en vue de reconstituer un environnement où l'être humain puisse habiter durablement.
in scheme: Spatiologie
in scheme: concept-SD-spatiologie-planetologie
in scheme: concepts
notation: COGE518
scope note: Cette publication annule et remplace celle du terme « écogenèse » au Journal officiel du 22 septembre 2000.

activateur
type: ConceptConcept
type: Concept
creator: Commission d'enrichissement de la langue française, FranceTerme
abbreviation: activator @en
date parution JO: 2008-07-06
equivalent EN: activator @en
equivalent EN: activator (en)
equivalent EN: activator protein @en
equivalent EN: activator protein (en)
part of speech: nom masculin
definition: Protéine codée par un gène régulateur, qui se fixe sur un site d'initiation de la transcription d'un autre gène et stimule cette transcription.
in scheme: Biologie
in scheme: concept-SD-biologie-biochimie-et-biologie-moleculaire
in scheme: concepts
notation: COGE523
related: site d'initiation de la transcription

agoniste
type: ConceptConcept
type: Concept
creator: Commission d'enrichissement de la langue française, FranceTerme
date parution JO: 2008-07-06
equivalent EN: agonist @en
equivalent EN: agonist (en)
part of speech: nom masculin
definition: Molécule qui se lie de façon réversible à un récepteur spécifique de cellules-cibles et qui déclenche chez celles-ci les mêmes effets que le ligand naturel.
in scheme: Biologie
in scheme: concept-SD-biologie-biochimie-et-biologie-moleculaire
in scheme: concepts
notation: COGE524
note: Le terme « agoniste » est également utilisé comme adjectif.
related: antagoniste

antagoniste
type: ConceptConcept
type: Concept
creator: Commission d'enrichissement de la langue française, FranceTerme
date parution JO: 2008-07-06
equivalent EN: antagonist @en
equivalent EN: antagonist (en)
part of speech: nom masculin
definition: Molécule qui se lie de façon irréversible à un récepteur spécifique de cellules-cibles, à la place du ligand naturel ou de l'agoniste, ce qui supprime tout effet physiologique de ces cellules.
in scheme: Biologie
in scheme: concept-SD-biologie-biochimie-et-biologie-moleculaire
in scheme: concepts
notation: COGE525
note: Le terme « antagoniste » est également utilisé comme adjectif.
related: anti-hormone
related: agoniste

apomorphe
type: ConceptConcept
type: Concept
creator: Commission d'enrichissement de la langue française, FranceTerme
date parution JO: 2008-07-06
equivalent EN: apomorphic @en
equivalent EN: apomorphic (en)
part of speech: adjectif
definition: Se dit d'un caractère résultant de l'évolution d'un caractère ancestral au sein d'un même groupe taxinomique.
in scheme: Biologie
in scheme: concept-SD-biologie-genetique
in scheme: concepts
notation: COGE526
related: plésiomorphe
related: synapomorphe

balistique biologique
type: ConceptConcept
type: Concept
creator: Commission d'enrichissement de la langue française, FranceTerme
date parution JO: 2008-07-06
deconseille ou frequent: biolistique
equivalent EN: biolistic transformation @en
equivalent EN: biolistic transformation (en)
equivalent EN: biolistics @en
equivalent EN: biolistics (en)
equivalent EN: biological ballistic @en
equivalent EN: biological ballistic (en)
definition: Méthode de transformation génétique consistant à bombarder des cellules avec des microbilles métalliques enrobées d'ADN, à l'aide d'un canon à particules.
in scheme: Biologie
in scheme: concept-SD-biologie-biochimie-et-biologie-moleculaire
in scheme: concepts
notation: COGE527
note: On trouve aussi, dans le langage professionnel, le terme « biolistique ».

bioréhabilitation
type: ConceptConcept
type: Concept
creator: Commission d'enrichissement de la langue française, FranceTerme
date parution JO: 2008-07-06
equivalent EN: bioremediation @en
equivalent EN: bioremediation (en)
part of speech: nom féminin
alternative label: dépollution biologique
definition: Dépollution du sol ou de l'eau d'un site au moyen de microorganismes décomposeurs, d'algues ou de certaines plantes capables de concentrer des éléments nocifs issus d'activités humaines.
in scheme: Environnement
in scheme: concepts
notation: COGE528
related: phytoréhabilitation

cadhérine
type: ConceptConcept
type: Concept
creator: Commission d'enrichissement de la langue française, FranceTerme
date parution JO: 2008-07-06
equivalent EN: cadherin @en
equivalent EN: cadherin (en)
part of speech: nom féminin
definition: Glycoprotéine transmembranaire dont le fonctionnement est dépendant du calcium, et qui est impliquée dans les mécanismes d'adhérence entre cellules.
in scheme: Biologie
in scheme: concept-SD-biologie-biologie-cellulaire
in scheme: concepts
notation: COGE529
note: Les cadhérines des divers tissus constituent une famille. Elles interviennent dans la signalisation, la prolifération et la différenciation cellulaires, ainsi que dans le maintien des tissus.
related: molécule d'adhérence cellulaire
related: caténine

caténine
type: ConceptConcept
type: Concept
creator: Commission d'enrichissement de la langue française, FranceTerme
date parution JO: 2008-07-06
equivalent EN: catenin @en
equivalent EN: catenin (en)
part of speech: nom féminin
definition: Protéine cellulaire servant de lien entre certaines protéines transmembranaires et les protéines du cytosquelette.
in scheme: Biologie
in scheme: concept-SD-biologie-biochimie-et-biologie-moleculaire
in scheme: concepts
notation: COGE530
related: cadhérine

construction génique
type: ConceptConcept
type: Concept
creator: Commission d'enrichissement de la langue française, FranceTerme
date parution JO: 2008-07-06
equivalent EN: genetic construct @en
equivalent EN: genetic construct (en)
definition: Molécule d'ADN élaborée par recombinaison in vitro en vue de son transfert et de son expression dans une cellule ou dans un organisme.
in scheme: Biologie
in scheme: concept-SD-biologie-biochimie-et-biologie-moleculaire
in scheme: concepts
notation: COGE532

effecteur allostérique
type: ConceptConcept
type: Concept
creator: Commission d'enrichissement de la langue française, FranceTerme
date parution JO: 2008-07-06
equivalent EN: allosteric effector @en
equivalent EN: allosteric effector (en)
definition: Molécule capable de se fixer sur le site de régulation d'une enzyme allostérique et qui, en provoquant une modification réversible de la configuration de celle-ci, entraîne son inhibition ou son activation.
in scheme: Biologie
in scheme: concept-SD-biologie-biochimie-et-biologie-moleculaire
in scheme: concepts
notation: COGE533

endocytose
type: ConceptConcept
type: Concept
creator: Commission d'enrichissement de la langue française, FranceTerme
date parution JO: 2008-07-06
equivalent EN: endocytosis @en
equivalent EN: endocytosis (en)
part of speech: nom féminin
definition: Pénétration dans une cellule de matériel extracellulaire, par invagination de la membrane plasmique suivie de la formation de vésicules s'isolant dans le cytoplasme.
in scheme: Biologie
in scheme: concept-SD-biologie-biologie-cellulaire
in scheme: concepts
notation: COGE534
related: clathrine
related: dynamine
related: pinocytose
related: endosome
related: exocytose

endosome
type: ConceptConcept
type: Concept
creator: Commission d'enrichissement de la langue française, FranceTerme
date parution JO: 2008-07-06
equivalent EN: endosome @en
equivalent EN: endosome (en)
part of speech: nom masculin
alternative label: vésicule d'endocytose
alternative label: vésicule endosomale
definition: Vésicule formée par invagination de la membrane plasmique, qui transfère aux lysosomes le matériel nouvellement ingéré.
in scheme: Biologie
in scheme: concept-SD-biologie-biologie-cellulaire
in scheme: concepts
notation: COGE535
related: lysosome
related: clathrine
related: dynamine
related: pinocytose
related: endocytose
related: lysosome secondaire

ethnobotanique
type: ConceptConcept
type: Concept
creator: Commission d'enrichissement de la langue française, FranceTerme
date parution JO: 2008-07-06
equivalent EN: ethnobotany @en
equivalent EN: ethnobotany (en)
part of speech: nom féminin
definition: Étude des relations entre les populations humaines et le monde végétal.
in scheme: Sciences de la nature
in scheme: Sciences humaines
in scheme: concepts
notation: COGE536

exocytose
type: ConceptConcept
type: Concept
creator: Commission d'enrichissement de la langue française, FranceTerme
date parution JO: 2008-07-06
equivalent EN: exocytosis @en
equivalent EN: exocytosis (en)
part of speech: nom féminin
definition: Expulsion hors d'une cellule du contenu de vésicules intracellulaires, par fusion de la membrane vésiculaire avec la membrane plasmique.
in scheme: Biologie
in scheme: concept-SD-biologie-biologie-cellulaire
in scheme: concepts
notation: COGE537
related: endocytose

homéoboîte
type: ConceptConcept
type: Concept
creator: Commission d'enrichissement de la langue française, FranceTerme
date parution JO: 2008-07-06
equivalent EN: homeobox @en
equivalent EN: homeobox (en)
part of speech: nom féminin
alternative label: séquence homéotique
definition: Séquence de 180 nucléotides de la région codante d'un homéogène.
in scheme: Biologie
in scheme: concept-SD-biologie-biochimie-et-biologie-moleculaire
in scheme: concepts
notation: COGE538
note: Une homéoboîte contribue à la régulation du lignage cellulaire et du développement.
related: homéodomaine
related: homéogène
related: homéoprotéine
scope note: Cette publication annule et remplace celle du terme « séquence homéotique » au Journal officiel du 22 septembre 2000.

homéodomaine
type: ConceptConcept
type: Concept
creator: Commission d'enrichissement de la langue française, FranceTerme
date parution JO: 2008-07-06
equivalent EN: homeodomain @en
equivalent EN: homeodomain (en)
part of speech: nom masculin
alternative label: domaine homéotique
definition: Séquence de 60 acides aminés d'une homéoprotéine, qui reconnaît une région régulatrice de gènes sur laquelle elle se fixe.
in scheme: Biologie
in scheme: concept-SD-biologie-biochimie-et-biologie-moleculaire
in scheme: concepts
notation: COGE539
related: homéoboîte
related: homéoprotéine

homéogène
type: ConceptConcept
type: Concept
creator: Commission d'enrichissement de la langue française, FranceTerme
date parution JO: 2008-07-06
equivalent EN: homeotic gene @en
equivalent EN: homeotic gene (en)
part of speech: nom masculin
alternative label: gène homéotique
definition: Gène dont une mutation interrompt, altère ou réoriente le développement normal d'un organe et conduit à son remplacement par un autre.
in scheme: Biologie
in scheme: concept-SD-biologie-biochimie-et-biologie-moleculaire
in scheme: concept-SD-biologie-genetique
in scheme: concepts
notation: COGE540
related: homéose
related: homéoboîte
related: homéoprotéine

homéoprotéine
type: ConceptConcept
type: Concept
creator: Commission d'enrichissement de la langue française, FranceTerme
date parution JO: 2008-07-06
equivalent EN: homeoprotein @en
equivalent EN: homeoprotein (en)
part of speech: nom féminin
alternative label: protéine homéotique
definition: Protéine codée par un homéogène comportant un homéodomaine.
in scheme: Biologie
in scheme: concept-SD-biologie-biochimie-et-biologie-moleculaire
in scheme: concepts
notation: COGE541
related: homéoboîte
related: homéodomaine
related: homéogène

liaison génétique
type: ConceptConcept
type: Concept
creator: Commission d'enrichissement de la langue française, FranceTerme
date parution JO: 2008-07-06
equivalent EN: genetic linkage @en
equivalent EN: genetic linkage (en)
definition: Association de gènes situés sur un même chromosome, qui est généralement transmise en bloc à la descendance.
in scheme: Biologie
in scheme: concept-SD-biologie-genetique
in scheme: concepts
notation: COGE542

lysosome secondaire
type: ConceptConcept
type: Concept
creator: Commission d'enrichissement de la langue française, FranceTerme
date parution JO: 2008-07-06
equivalent EN: secondary lysosome @en
equivalent EN: secondary lysosome (en)
definition: Organite qui résulte de la fusion d'un lysosome avec un endosome.
in scheme: Biologie
in scheme: concept-SD-biologie-biologie-cellulaire
in scheme: concepts
notation: COGE544
related: lysosome
related: endosome

pharmacophore
type: ConceptConcept
type: Concept
creator: Commission d'enrichissement de la langue française, FranceTerme
date parution JO: 2008-07-06
equivalent EN: pharmacophore @en
equivalent EN: pharmacophore (en)
part of speech: nom masculin
definition: Molécule ou région d'une molécule dont l'activité biologique possède un effet thérapeutique.
in scheme: Santé et médecine
in scheme: concept-SD-sante-et-medecine-pharmacologie
in scheme: concept-SD-sante-et-medecine-toxicologie
in scheme: concepts
notation: COGE545
note: Le terme « pharmacophore » est également utilisé comme adjectif.

phénogénétique
type: ConceptConcept
type: Concept
creator: Commission d'enrichissement de la langue française, FranceTerme
date parution JO: 2008-07-06
equivalent EN: phenogenetics @en
equivalent EN: phenogenetics (en)
part of speech: nom féminin
definition: Étude des influences qu'exerce le milieu sur les caractères propres à un être vivant.
in scheme: Biologie
in scheme: concept-SD-biologie-genetique
in scheme: concepts
notation: COGE546

plésiomorphe
type: ConceptConcept
type: Concept
creator: Commission d'enrichissement de la langue française, FranceTerme
date parution JO: 2008-07-06
equivalent EN: plesiomorphic @en
equivalent EN: plesiomorphic (en)
part of speech: adjectif
definition: Se dit d'un caractère ancestral commun à divers groupes taxinomiques.
in scheme: Biologie
in scheme: concept-SD-biologie-genetique
in scheme: concepts
notation: COGE548
related: apomorphe
related: synapomorphe

polycistronique
type: ConceptConcept
type: Concept
creator: Commission d'enrichissement de la langue française, FranceTerme
date parution JO: 2008-07-06
equivalent EN: polycistronic @en
equivalent EN: polycistronic (en)
part of speech: adjectif
definition: Se dit, chez les procaryotes, d'un ARN messager résultant de la transcription de plusieurs gènes contigus.
in scheme: Biologie
in scheme: concept-SD-biologie-biochimie-et-biologie-moleculaire
in scheme: concepts
notation: COGE549
related: ARN messager
related: monocistronique
related: opéron

ribozyme
type: ConceptConcept
type: Concept
creator: Commission d'enrichissement de la langue française, FranceTerme
date parution JO: 2008-07-06
equivalent EN: ribozyme @en
equivalent EN: ribozyme (en)
part of speech: nom masculin
definition: Petit ARN à propriété enzymatique, de type nucléase, transférase ou polymérase, capable de catalyser une ou plusieurs réactions biochimiques.
in scheme: Biologie
in scheme: concept-SD-biologie-biochimie-et-biologie-moleculaire
in scheme: concepts
notation: COGE550
related: désoxyribozyme

site accepteur d'épissage
type: ConceptConcept
type: Concept
creator: Commission d'enrichissement de la langue française, FranceTerme
abbreviation: splice acceptor @en
date parution JO: 2008-07-06
equivalent EN: splice acceptor @en
equivalent EN: splice acceptor (en)
equivalent EN: splice acceptor site @en
equivalent EN: splice acceptor site (en)
forme abregee: accepteur d'épissage
definition: Extrémité d'un exon, notée 5', où s'achève l'excision d'un intron, avant l'épissage.
in scheme: Biologie
in scheme: concept-SD-biologie-biochimie-et-biologie-moleculaire
in scheme: concepts
notation: COGE551
related: épissage
related: intron
related: site donneur d'épissage

site de branchement
type: ConceptConcept
type: Concept
creator: Commission d'enrichissement de la langue française, FranceTerme
date parution JO: 2008-07-06
equivalent EN: branch site @en
equivalent EN: branch site (en)
definition: Séquence de l'ARN prémessager qui signale la présence d'un intron.
in scheme: Biologie
in scheme: concept-SD-biologie-biochimie-et-biologie-moleculaire
in scheme: concepts
notation: COGE552
related: ARN prémessager
related: intron

site donneur d'épissage
type: ConceptConcept
type: Concept
creator: Commission d'enrichissement de la langue française, FranceTerme
abbreviation: splice donor @en
date parution JO: 2008-07-06
equivalent EN: splice donor @en
equivalent EN: splice donor (en)
equivalent EN: splice donor site @en
equivalent EN: splice donor site (en)
forme abregee: donneur d'épissage
definition: Extrémité d'un exon, notée 3', où commence l'excision d'un intron, avant l'épissage.
in scheme: Biologie
in scheme: concept-SD-biologie-biochimie-et-biologie-moleculaire
in scheme: concepts
notation: COGE553
related: épissage
related: intron
related: site accepteur d'épissage

synapomorphe
type: ConceptConcept
type: Concept
creator: Commission d'enrichissement de la langue française, FranceTerme
date parution JO: 2008-07-06
equivalent EN: synapomorphic @en
equivalent EN: synapomorphic (en)
part of speech: adjectif
definition: Se dit d'un caractère apomorphe partagé par différents taxons.
in scheme: Biologie
in scheme: concept-SD-biologie-genetique
in scheme: concepts
notation: COGE554
related: apomorphe
related: plésiomorphe
related: taxon

film biographique
type: ConceptConcept
type: Concept
creator: Commission d'enrichissement de la langue française, FranceTerme
abbreviation: biopic @en
date parution JO: 2008-11-27
equivalent EN: biographical picture @en
equivalent EN: biographical picture (en)
equivalent EN: biopic @en
equivalent EN: biopic (en)
alternative label: biofilm
definition: Film illustrant la vie et l'œuvre d'un personnage célèbre.
in scheme: Audiovisuel
in scheme: concept-SD-audiovisuel-cinema
in scheme: concept-SD-audiovisuel-television
in scheme: concepts
notation: COGE560

éditeur exécutif
type: ConceptConcept
type: Concept
creator: Commission d'enrichissement de la langue française, FranceTerme
date parution JO: 2008-11-27
equivalent EN: packager @en
equivalent EN: packager (en)
definition: Personne chargée, en sous-traitance, de tout ou partie des étapes de la publication d'un ouvrage.
in scheme: Édition et livre
in scheme: concepts
notation: COGE561

gestion de l'archivage
type: ConceptConcept
type: Concept
creator: Commission d'enrichissement de la langue française, FranceTerme
date parution JO: 2009-04-22
deconseille ou frequent: record management
equivalent EN: records management @en
equivalent EN: records management (en)
definition: Organisation et contrôle de la constitution, de la sélection, de la conservation et de la destination finale des documents d'une administration, d'une entreprise ou d'un organisme.
in scheme: Tous domaines
in scheme: concepts
notation: COGE562

mise en récit
type: ConceptConcept
type: Concept
creator: Commission d'enrichissement de la langue française, FranceTerme
abbreviation: storytelling @en
date parution JO: 2008-11-27
equivalent EN: story-telling @en
equivalent EN: story-telling (en)
equivalent EN: storytelling @en
equivalent EN: storytelling (en)
definition: Méthode de communication qui consiste à substituer à la simple présentation d'informations ou à des analyses d'idées des récits à caractère exemplaire.
in scheme: Communication
in scheme: concepts
notation: COGE563

anaérocombustion
type: ConceptConcept
type: Concept
creator: Commission d'enrichissement de la langue française, FranceTerme
abbreviation: CLC @en
date parution JO: 2008-09-06
deconseille ou frequent: charbon propre
equivalent EN: CLC @en
equivalent EN: CLC (en)
equivalent EN: chemical looping combustion @en
equivalent EN: chemical looping combustion (en)
part of speech: nom féminin
definition: Procédé de combustion pour la production d'énergie, dans lequel on utilise comme comburant, à la place de l'air, un oxyde métallique régénéré périodiquement.
in scheme: Énergie
in scheme: Environnement
in scheme: concepts
notation: COGE564
note: L'anaérocombustion permet d'obtenir un flux de dioxyde de carbone (CO2) exempt d'azote, plus facile à récupérer et à conditionner pour le transport et le stockage. Elle fait partie des procédés dits du « charbon propre ».
related: oxycombustion
related: technologie du charbon propre

cadrage
type: ConceptConcept
type: Concept
creator: Commission d'enrichissement de la langue française, FranceTerme
date parution JO: 2008-09-06
equivalent EN: scoping @en
equivalent EN: scoping (en)
part of speech: nom masculin
definition: Étape initiale d'une évaluation environnementale, qui détermine les facteurs à analyser et le type d'informations à recueillir pour mener celle-ci à bien.
in scheme: Environnement
in scheme: concepts
notation: COGE565
related: filtrage

captage et stockage du CO
type: ConceptConcept
type: Concept
creator: Commission d'enrichissement de la langue française, FranceTerme
abbreviation: CCS @en
abbreviation: CSC
date parution JO: 2008-09-06
equivalent EN: CCS @en
equivalent EN: CCS (en)
equivalent EN: CO2 capture and sequestration @en
equivalent EN: CO2 capture and sequestration (en)
equivalent EN: CO2 capture and storage @en
equivalent EN: CO2 capture and storage (en)
definition: Processus consistant à recueillir le dioxyde de carbone (CO2) produit dans des usines ou des centrales électriques et à le transporter dans un lieu de stockage afin d'en empêcher la diffusion dans l'atmosphère.
in scheme: Énergie
in scheme: Environnement
in scheme: concepts
notation: COGE566
related: absorption anthropique de carbone
related: puits de carbone
related: technologie du charbon propre
related: hydrogène à faible empreinte carbone

filtrage
type: ConceptConcept
type: Concept
creator: Commission d'enrichissement de la langue française, FranceTerme
date parution JO: 2008-09-06
equivalent EN: screening @en
equivalent EN: screening (en)
part of speech: nom masculin
definition: Opération permettant de déterminer s'il y a lieu d'effectuer une évaluation environnementale.
in scheme: Environnement
in scheme: concepts
notation: COGE567
related: cadrage

oxycombustion
type: ConceptConcept
type: Concept
creator: Commission d'enrichissement de la langue française, FranceTerme
date parution JO: 2008-09-06
deconseille ou frequent: charbon propre
equivalent EN: oxycombustion @en
equivalent EN: oxycombustion (en)
part of speech: nom féminin
definition: Procédé de combustion pour la production d'énergie, dans lequel on utilise comme comburant, à la place de l'air, de l'oxygène pur.
in scheme: Énergie
in scheme: Environnement
in scheme: concepts
notation: COGE568
note: L'oxycombustion permet d'obtenir un flux de dioxyde de carbone (CO2) exempt d'azote, plus facile à récupérer et à conditionner pour le transport et le stockage. Elle fait partie des procédés dits du « charbon propre ».
related: anaérocombustion
related: technologie du charbon propre

aire de restauration
type: ConceptConcept
type: Concept
creator: Commission d'enrichissement de la langue française, FranceTerme
date parution JO: 2008-08-27
equivalent EN: food court @en
equivalent EN: food court (en)
definition: Partie d'un lieu public tel qu'une gare, un aéroport ou un centre commercial, où sont regroupés des restaurants et des commerces d'alimentation, généralement en libre-service.
in scheme: Restauration
in scheme: Tourisme
in scheme: concepts
notation: COGE569
note: Le regroupement permet aux restaurateurs de mettre en commun un certain nombre de ressources et de services.
related: cafétéria

animaloïde
type: ConceptConcept
type: Concept
creator: Commission d'enrichissement de la langue française, FranceTerme
date parution JO: 2008-12-07
equivalent EN: animal-like @en
equivalent EN: animal-like (en)
equivalent EN: animal-like robot @en
equivalent EN: animal-like robot (en)
part of speech: nom masculin ou adjectif
definition: Robot ou automate ayant l'aspect ou le comportement d'un animal ; se dit d'un tel robot ou automate.
in scheme: Automatique
in scheme: Robotique
in scheme: concepts
notation: COGE572

ascendant, -e
type: ConceptConcept
type: Concept
creator: Commission d'enrichissement de la langue française, FranceTerme
antonym: descendant, -e
date parution JO: 2008-12-07
deconseille ou frequent: de bas en haut
equivalent EN: bottom-up @en
equivalent EN: bottom-up (en)
part of speech: adjectif
alternative label: bas en haut (de)
alternative label: inductif, -ive
definition: Se dit d'une démarche qui se fonde sur des données, des observations ou des résultats concrets pour aboutir à une explication ou à une modélisation conceptuelle.
in scheme: Sciences
in scheme: concepts
notation: COGE573

boîte noire
type: ConceptConcept
type: Concept
creator: Commission d'enrichissement de la langue française, FranceTerme
date parution JO: 2008-12-07
equivalent EN: black box @en
equivalent EN: black box (en)
definition: Dispositif réel ou théorique dont on ignore ou veut ignorer la structure et le fonctionnement pour ne s'intéresser qu'aux fonctions qu'il remplit.
in scheme: Automatique
in scheme: Sciences
in scheme: concepts
notation: COGE574

boucle fermée
type: ConceptConcept
type: Concept
creator: Commission d'enrichissement de la langue française, FranceTerme
date parution JO: 2008-12-07
equivalent EN: closed loop @en
equivalent EN: closed loop (en)
equivalent EN: feedback loop @en
equivalent EN: feedback loop (en)
alternative label: boucle de réaction
definition: Mode de fonctionnement d'un système naturel ou artificiel caractérisé par une réaction de son entrée ou de son fonctionnement aux valeurs du signal de sortie.
in scheme: Automatique
in scheme: concepts
notation: COGE575
note: Une boucle fermée peut avoir un effet régulateur et permettre, par exemple, de maintenir, en dépit de perturbations, une sortie ayant les valeurs souhaitées. Elle peut au contraire être une source d'instabilité, comme lors de l'effet Larsen, sifflement intempestif provoqué par une trop grande proximité entre le microphone (l'entrée) et le haut-parleur (la sortie) d'un dispositif de sonorisation.
related: boucle ouverte

boucle ouverte
type: ConceptConcept
type: Concept
creator: Commission d'enrichissement de la langue française, FranceTerme
date parution JO: 2008-12-07
equivalent EN: open loop @en
equivalent EN: open loop (en)
definition: Mode de fonctionnement d'un système naturel ou artificiel dont le comportement est indépendant des valeurs de la grandeur de sortie.
in scheme: Automatique
in scheme: concepts
notation: COGE576
related: boucle fermée

bras esclave
type: ConceptConcept
type: Concept
creator: Commission d'enrichissement de la langue française, FranceTerme
date parution JO: 2008-12-07
deconseille ou frequent: système de téléopération
deconseille ou frequent: téléopérateur
equivalent EN: slave arm @en
equivalent EN: slave arm (en)
definition: Dispositif électromécanique qui exécute diverses tâches de manipulation d'objets ou de produits, dangereux ou inaccessibles, en reproduisant, grâce à une liaison électronique, les manœuvres effectuées à distance par un opérateur humain actionnant un dispositif similaire.
in scheme: Automatique
in scheme: Robotique
in scheme: concepts
notation: COGE577
note: L'ensemble constitué par un « bras maître » et un « bras esclave » est un « téléopérateur » (ou système de téléopération).
related: bras maître

bras maître
type: ConceptConcept
type: Concept
creator: Commission d'enrichissement de la langue française, FranceTerme
date parution JO: 2008-12-07
deconseille ou frequent: système de téléopération
deconseille ou frequent: téléopérateur
equivalent EN: master arm @en
equivalent EN: master arm (en)
definition: Dispositif électromécanique servant à manœuvrer à distance un dispositif similaire qui exécute diverses tâches de manipulation d'objets ou de produits, dangereux ou inaccessibles.
in scheme: Automatique
in scheme: Robotique
in scheme: concepts
notation: COGE578
note: 1. L'ensemble constitué par un « bras maître » et un « bras esclave » est un « téléopérateur » (ou système de téléopération).
note: 2. Par extension, on emploie aussi le terme « bras maître » lorsque le système commandé n'est pas un « bras esclave » mais, par exemple, un véhicule ou un objet de synthèse réalisé par ordinateur.
related: bras esclave

descendant, -e
type: ConceptConcept
type: Concept
creator: Commission d'enrichissement de la langue française, FranceTerme
antonym: ascendant, -e
date parution JO: 2008-12-07
deconseille ou frequent: de haut en bas
equivalent EN: top-down @en
equivalent EN: top-down (en)
part of speech: adjectif
alternative label: déductif, -ive
alternative label: haut en bas (de)
definition: Se dit d'une démarche qui se fonde sur une explication ou une modélisation conceptuelle pour aboutir à des données, des observations ou des résultats concrets.
in scheme: Sciences
in scheme: concepts
notation: COGE579

couverture de défaillance
type: ConceptConcept
type: Concept
creator: Commission d'enrichissement de la langue française, FranceTerme
abbreviation: CDS @en
abbreviation: default swap @en
date parution JO: 2009-05-19
deconseille ou frequent: acheteur de protection
deconseille ou frequent: vendeur de protection
equivalent EN: CDS @en
equivalent EN: CDS (en)
equivalent EN: credit default swap @en
equivalent EN: credit default swap (en)
equivalent EN: default swap @en
equivalent EN: default swap (en)
definition: Contrat par lequel un établissement qui a consenti un crédit s'assure, auprès d'un tiers et moyennant le paiement d'une prime généralement annuelle, contre le défaut de remboursement de ce crédit.
in scheme: Finance
in scheme: concepts
notation: COGE583
note: Les deux parties sont appelées réciproquement « acheteur de protection » et « vendeur de protection ».
related: dérivé de crédit

économie caritative
type: ConceptConcept
type: Concept
creator: Commission d'enrichissement de la langue française, FranceTerme
date parution JO: 2009-05-19
equivalent EN: charity business @en
equivalent EN: charity business (en)
definition: Ensemble d'activités économiques ayant pour fin ou pour moyen l'action humanitaire ou charitable.
in scheme: Économie et gestion d'entreprise
in scheme: concepts
notation: COGE585

pôle de compétitivité
type: ConceptConcept
type: Concept
creator: Commission d'enrichissement de la langue française, FranceTerme
date parution JO: 2009-05-19
equivalent EN: competitiveness cluster @en
equivalent EN: competitiveness cluster (en)
definition: Regroupement, sur un territoire donné, d'entreprises, de centres de recherche et d'établissements de formation, qui travaillent ensemble pour favoriser l'émergence de produits, procédés ou services novateurs.
in scheme: Économie et gestion d'entreprise
in scheme: concepts
notation: COGE586
related: grappe d'entreprises

prêt hypothécaire à haut risque
type: ConceptConcept
type: Concept
creator: Commission d'enrichissement de la langue française, FranceTerme
deconseille ou frequent: PRIO29
equivalent EN: subprime mortage loan @en
equivalent EN: subprime mortage loan (en)
equivalent EN: subprime mortgage @en
equivalent EN: subprime mortgage (en)
alternative label: prêt hypothécaire toxique
definition: Prêt hypothécaire consenti à un taux d'intérêt variable ou progressif à une clientèle dont la solvabilité est fragile
in scheme: Finance
in scheme: concepts
notation: COGE587

gouvernance
type: ConceptConcept
type: Concept
creator: Commission d'enrichissement de la langue française, FranceTerme
date parution JO: 2009-04-22
equivalent EN: governance @en
equivalent EN: governance (en)
part of speech: nom féminin
definition: Manière de concevoir et d'exercer l'autorité à la tête d'une entreprise, d'une organisation, d'un État.
definition: The way of thinking about and exercising authority at the head of a company, an organisation, a State. @en
in scheme: Tous domaines
in scheme: concepts
notation: COGE588
note: Governance is measured not only by taking into account the level of organisation and efficiency, but also and especially according to criteria such as transparency, participation, and shared responsibilities. @en
note: La gouvernance s'apprécie non seulement en tenant compte du degré d'organisation et d'efficience, mais aussi et surtout d'après des critères tels que la transparence, la participation, et le partage des responsabilités.
preferred label: governance @en
related: État fragile
related: État défaillant
related: gouvernement de l'entreprise

navette de relève
type: ConceptConcept
type: Concept
creator: Commission d'enrichissement de la langue française, FranceTerme
date parution JO: 2009-04-22
equivalent EN: crew-boat @en
equivalent EN: crew-boat (en)
equivalent EN: crewboat @en
equivalent EN: crewboat (en)
equivalent EN: surfer @en
equivalent EN: surfer (en)
forme abregee: navette, n.f.
alternative label: navette d'équipage
definition: Navire qui sert principalement au transport rapide de personnel vers les plateformes pétrolières ou vers d'autres installations au large.
in scheme: Pétrole et gaz
in scheme: Transports et mobilité
in scheme: concept-SD-petrole-et-gaz-transport-maritime
in scheme: concept-SD-transports-et-mobilite-transport-maritime
in scheme: concepts
notation: COGE589

télépéage ouvert
type: ConceptConcept
type: Concept
creator: Commission d'enrichissement de la langue française, FranceTerme
abbreviation: TPO
date parution JO: 2009-04-22
deconseille ou frequent: flux libre
deconseille ou frequent: télépéage à flux libre
equivalent EN: free flow @en
equivalent EN: free flow (en)
equivalent EN: free flow toll @en
equivalent EN: free flow toll (en)
definition: Péage à distance, sans barrière et équipé d'un système électromagnétique, grâce auquel les véhicules peuvent passer sans ralentir.
in scheme: Transports et mobilité
in scheme: concepts
notation: COGE590
note: Le télépéage ouvert, qui n'oblige pas à marquer l'arrêt, constitue un progrès par rapport au télépéage traditionnel, qui, même s'il n'exige aucune action du conducteur, nécessite l'ouverture d'une barrière.

gyropode
type: ConceptConcept
type: Concept
creator: Commission d'enrichissement de la langue française, FranceTerme
date parution JO: 2009-05-26
deconseille ou frequent: segway
part of speech: nom masculin
broader: concept-motocycle-et-cycle
definition: Véhicule électrique monoplace, constitué d'une plateforme munie de deux roues sur laquelle l'utilisateur se tient debout, d'un système de stabilisation gyroscopique et d'un manche de maintien et de conduite.
in scheme: Cycle
in scheme: Transports et mobilité
in scheme: concepts
notation: COGE592
note: « Segway », qui est un nom de marque, ne doit pas être employé.
related: gyroplanche
related: gyroroue
related: concept-SPOR426

écotechniques de l'information et de la communication
type: ConceptConcept
type: Concept
creator: Commission d'enrichissement de la langue française, FranceTerme
abbreviation: green IT @en
abbreviation: éco-TIC
date parution JO: 2009-07-12
deconseille ou frequent: green TIC
deconseille ou frequent: green computing
equivalent EN: green IT @en
equivalent EN: green IT (en)
equivalent EN: green information technology @en
equivalent EN: green information technology (en)
definition: Techniques de l'information et de la communication dont la conception ou l'emploi permettent de réduire les effets négatifs des activités humaines sur l'environnement.
in scheme: Informatique
in scheme: Télécommunications
in scheme: concepts
notation: COGE593
note: La réduction des effets négatifs des activités humaines sur l'environnement tient à la diminution de la consommation d'énergie et des émissions de gaz à effet de serre qui résulte du recours aux écotechniques, ou à la conception même de ces techniques, qui s'attache à diminuer les agressions qu'elles pourraient faire subir à l'environnement au cours de leur cycle de vie.
related: écotechnologie

Recommandation sur les équivalents français du mot gender
type: ConceptConcept
type: Concept
creator: Commission d'enrichissement de la langue française, FranceTerme
date parution JO: 2005-07-22
deconseille ou frequent: gender awareness
deconseille ou frequent: gender bias
deconseille ou frequent: gender disparities
deconseille ou frequent: gender equality
deconseille ou frequent: gender studies
in scheme: Tous domaines
in scheme: concepts
notation: COGE737
scope note: Lire la recommandation "http://www.culture.fr/Ressources/FranceTerme/Recommandations-d-usage/GENDER" ; toutes les recommandations d'usage publiées par la Commission générale de terminologie et de néologie au Journal officiel à l'adresse suivante : http://www.culture.fr/Ressources/FranceTerme/Recommandations-d-usage

Recommandation sur les équivalents français à donner au mot live
type: ConceptConcept
type: Concept
creator: Commission d'enrichissement de la langue française, FranceTerme
date parution JO: 2009-03-05
deconseille ou frequent: direct live
deconseille ou frequent: en direct
deconseille ou frequent: en direct live
in scheme: Tous domaines
in scheme: concepts
notation: COGE738
scope note: Lire la recommandation "http://www.culture.fr/Ressources/FranceTerme/Recommandations-d-usage/LIVE" ; toutes les recommandations d'usage publiées par la Commission générale de terminologie et de néologie au Journal officiel à l'adresse suivante : http://www.culture.fr/Ressources/FranceTerme/Recommandations-d-usage

Recommandation sur l'équivalent français à donner à l'expression beach [sport]
type: ConceptConcept
type: Concept
creator: Commission d'enrichissement de la langue française, FranceTerme
date parution JO: 2008-03-22
deconseille ou frequent: beach handball
deconseille ou frequent: beach hockey
deconseille ou frequent: beach rugby
deconseille ou frequent: beach soccer
deconseille ou frequent: beach tennis
deconseille ou frequent: beach volley-ball
in scheme: Sports
in scheme: concepts
notation: COGE739
scope note: Lire la recommandation "http://www.culture.fr/Ressources/FranceTerme/Recommandations-d-usage/BEACH" ; toutes les recommandations d'usage publiées par la Commission générale de terminologie et de néologie au Journal officiel à l'adresse suivante : http://www.culture.fr/Ressources/FranceTerme/Recommandations-d-usage

Recommandation sur les équivalents français du mot coach
type: ConceptConcept
type: Concept
creator: Commission d'enrichissement de la langue française, FranceTerme
date parution JO: 2005-07-22
deconseille ou frequent: coacher
deconseille ou frequent: coaching
deconseille ou frequent: life coaching
in scheme: Tous domaines
in scheme: concepts
notation: COGE740
scope note: Lire la recommandation "http://www.culture.fr/Ressources/FranceTerme/Recommandations-d-usage/COACH" ; toutes les recommandations d'usage publiées par la Commission générale de terminologie et de néologie au Journal officiel à l'adresse suivante : http://www.culture.fr/Ressources/FranceTerme/Recommandations-d-usage

Recommandation sur l'équivalent français du mot s'miles
type: ConceptConcept
type: Concept
creator: Commission d'enrichissement de la langue française, FranceTerme
date parution JO: 2005-12-18
in scheme: Économie et gestion d'entreprise
in scheme: concepts
notation: COGE742
scope note: Lire la recommandation "http://www.culture.fr/Ressources/FranceTerme/Recommandations-d-usage/S-MILES" ; toutes les recommandations d'usage publiées par la Commission générale de terminologie et de néologie au Journal officiel à l'adresse suivante : http://www.culture.fr/Ressources/FranceTerme/Recommandations-d-usage

Recommandation sur les équivalents français à donner au terme travel retail
type: ConceptConcept
type: Concept
creator: Commission d'enrichissement de la langue française, FranceTerme
date parution JO: 2007-06-07
in scheme: Économie et gestion d'entreprise
in scheme: concepts
notation: COGE743
scope note: Lire la recommandation "http://www.culture.fr/Ressources/FranceTerme/Recommandations-d-usage/TRAVEL-RETAIL" ; toutes les recommandations d'usage publiées par la Commission générale de terminologie et de néologie au Journal officiel à l'adresse suivante : http://www.culture.fr/Ressources/FranceTerme/Recommandations-d-usage

information de dernière minute
type: ConceptConcept
type: Concept
creator: Commission d'enrichissement de la langue française, FranceTerme
date parution JO: 2010-04-24
equivalent EN: breaking news @en
equivalent EN: breaking news (en)
forme abregee: dernière minute
definition: Information dont l'importance justifie la diffusion ou la publication en urgence.
in scheme: Audiovisuel
in scheme: Communication
in scheme: concepts
notation: COGE744

informatique en nuage
type: ConceptConcept
type: Concept
creator: Commission d'enrichissement de la langue française, FranceTerme
date parution JO: 2010-06-06
equivalent EN: cloud computing @en
equivalent EN: cloud computing (en)
definition: Method of a client data processing, whose operation can be done via the internet, under the form of services provided by a provider. @en
definition: Mode de traitement des données d'un client, dont l'exploitation s'effectue par l'internet, sous la forme de services fournis par un prestataire.
in scheme: Informatique
in scheme: concept-SD-informatique-internet
in scheme: concepts
notation: COGE746
note: Cloud computing is a particular form of computer stewardship, where the location and functioning of the cloud are not made known to the clients. @en
note: L'informatique en nuage est une forme particulière de gérance de l'informatique, dans laquelle l'emplacement et le fonctionnement du nuage ne sont pas portés à la connaissance des clients.
related: nuage
related: jeu vidéo en nuage
related: gérance de l'informatique
related: infrastructure à la demande
related: matériel à la demande
related: logiciel à la demande
related: provisionnement
related: concept-INFO952
related: concept-TELE556
scope note: La présente publication annule et remplace celle effectuée au Journal officiel du 24 avril 2010

nuage
type: ConceptConcept
type: Concept
creator: Commission d'enrichissement de la langue française, FranceTerme
date parution JO: 2010-04-24
equivalent EN: cloud @en
equivalent EN: cloud (en)
part of speech: nom masculin
definition: Ensemble des matériels et des logiciels accessibles par l'internet, qu'un prestataire met à la disposition de ses clients sous la forme de services en ligne.
in scheme: Informatique
in scheme: concept-SD-informatique-internet
in scheme: concepts
notation: COGE747
note: L'emplacement des matériels et des logiciels ainsi que leur mode de fonctionnement ne sont pas portés à la connaissance des clients.
related: informatique en nuage

barre d'actualités
type: ConceptConcept
type: Concept
creator: Commission d'enrichissement de la langue française, FranceTerme
date parution JO: 2010-08-15
deconseille ou frequent: news bar
equivalent EN: newsbar @en
equivalent EN: newsbar (en)
forme abregee: barre, n.f.
definition: Bandeau réservé sur un écran à la diffusion en continu d'informations.
in scheme: Audiovisuel
in scheme: Informatique
in scheme: concept-SD-audiovisuel-internet
in scheme: concept-SD-informatique-internet
in scheme: concepts
notation: COGE748

mobilisation éclair
type: ConceptConcept
type: Concept
creator: Commission d'enrichissement de la langue française, FranceTerme
date parution JO: 2010-08-15
deconseille ou frequent: flashmob
equivalent EN: flash mob @en
equivalent EN: flash mob (en)
definition: Rassemblement impromptu de personnes averties par minimessage ou par l'internet.
in scheme: Tous domaines
in scheme: concepts
notation: COGE749

flexisécurité
type: ConceptConcept
type: Concept
creator: Commission d'enrichissement de la langue française, FranceTerme
date parution JO: 2010-07-27
deconseille ou frequent: flexcurité
deconseille ou frequent: flexsécurité
equivalent EN: flexicurity @en
equivalent EN: flexicurity (en)
equivalent EN: flexsecurity @en
equivalent EN: flexsecurity (en)
part of speech: nom féminin
definition: Politique économique et sociale visant à conjuguer la flexibilité de l'emploi et un niveau élevé de protection des salariés.
in scheme: Emploi et travail
in scheme: Social
in scheme: concepts
notation: COGE751

débrider
type: ConceptConcept
type: Concept
creator: Commission d'enrichissement de la langue française, FranceTerme
date parution JO: 2010-11-21
deconseille ou frequent: débridage
deconseille ou frequent: jailbreaking
deconseille ou frequent: to jailbreak
equivalent EN: jailbreak @en
equivalent EN: jailbreak (en)
part of speech: verbe
definition: Contourner les protections d'un système pour supprimer les restrictions d'utilisation mises en place par le constructeur.
in scheme: Informatique
in scheme: concepts
notation: COGE758
related: concept-TELE511
related: concept-TELE523

tablette
type: ConceptConcept
type: Concept
creator: Commission d'enrichissement de la langue française, FranceTerme
date parution JO: 2011-02-20
deconseille ou frequent: iPad
deconseille ou frequent: iSlate
equivalent EN: pad @en
equivalent EN: pad (en)
equivalent EN: tablet @en
equivalent EN: tablet (en)
equivalent EN: touch screen tablet @en
equivalent EN: touch screen tablet (en)
part of speech: nom féminin
alternative label: ardoise
definition: Ordinateur portable et ultraplat, qui se présente comme un écran tactile et qui permet notamment d'accéder à des contenus multimédias.
in scheme: Audiovisuel
in scheme: Informatique
in scheme: concept-SD-audiovisuel-internet
in scheme: concept-SD-informatique-internet
in scheme: concepts
notation: COGE761
note: Les noms de marque tels que « iPad » ou « iSlate » ne doivent pas être utilisés pour désigner de façon générale ces ordinateurs.
related: écran tactile
related: ordinateur
related: concept-TELE535

hivernisation
type: ConceptConcept
type: Concept
creator: Commission d'enrichissement de la langue française, FranceTerme
date parution JO: 2011-02-20
equivalent EN: winterisation (GB) @en
equivalent EN: winterisation (en-GB)
equivalent EN: winterization (US) @en
equivalent EN: winterization (en-US)
part of speech: nom féminin
definition: Ensemble des dispositions de construction et d'entretien propres à rendre un matériel résistant aux conditions hivernales.
in scheme: Transports et mobilité
in scheme: concept-SD-transports-et-mobilite-transport-ferroviaire
in scheme: concepts
notation: COGE762

vignette active
type: ConceptConcept
type: Concept
creator: Commission d'enrichissement de la langue française, FranceTerme
date parution JO: 2011-03-13
equivalent EN: web widget @en
equivalent EN: web widget (en)
equivalent EN: widget @en
equivalent EN: widget (en)
definition: Outil logiciel interactif associé à un élément graphique, qui permet d'afficher, sous une forme condensée, certaines informations pouvant renvoyer à des données plus détaillées contenues dans l'ordinateur ou fournies par un site de l'internet.
in scheme: Informatique
in scheme: concept-SD-informatique-internet
in scheme: concepts
notation: COGE763
note: L'élément graphique peut être une horloge, un bulletin météo, un album de photos, un graphique boursier.

écoconformité
type: ConceptConcept
type: Concept
creator: Commission d'enrichissement de la langue française, FranceTerme
date parution JO: 2011-03-27
equivalent EN: cross compliance @en
equivalent EN: cross compliance (en)
part of speech: nom féminin
definition: Adéquation d'un projet, d'une activité ou de leurs conséquences au respect d'une écocondition ou d'une règlementation environnementale.
in scheme: Environnement
in scheme: concepts
notation: COGE765
note: La vérification de l'écoconformité peut faire l'objet d'une écocertification.
related: écocondition
related: écocertification

Recommandation sur les équivalents français à donner au mot flyer
type: ConceptConcept
type: Concept
creator: Commission d'enrichissement de la langue française, FranceTerme
date parution JO: 2011-02-03
deconseille ou frequent: brochure
deconseille ou frequent: coupon
deconseille ou frequent: dépliant
deconseille ou frequent: feuille
deconseille ou frequent: feuillet
deconseille ou frequent: imprimé
deconseille ou frequent: invitation
deconseille ou frequent: papillon
deconseille ou frequent: prospectus
deconseille ou frequent: tract
in scheme: Communication
in scheme: concepts
notation: COGE766
scope note: Lire la recommandation "http://www.culture.fr/Ressources/FranceTerme/Recommandations-d-usage/FLYER" ; toutes les recommandations d'usage publiées par la Commission générale de terminologie et de néologie au Journal officiel à l'adresse suivante : http://www.culture.fr/Ressources/FranceTerme/Recommandations-d-usage

écocondition
type: ConceptConcept
type: Concept
creator: Commission d'enrichissement de la langue française, FranceTerme
date parution JO: 2011-03-27
equivalent EN: cross compliance requirement @en
equivalent EN: cross compliance requirement (en)
part of speech: nom féminin
definition: Clause subordonnant au respect d'un ou de plusieurs critères environnementaux l'octroi d'une autorisation ou d'une aide financière à une entreprise ou à un organisme.
in scheme: Environnement
in scheme: concepts
notation: COGE769
related: écoconformité

copiage de carte
type: ConceptConcept
type: Concept
creator: Commission d'enrichissement de la langue française, FranceTerme
date parution JO: 2011-03-27
equivalent EN: card skimming @en
equivalent EN: card skimming (en)
equivalent EN: credit card skimming @en
equivalent EN: credit card skimming (en)
equivalent EN: skimming @en
equivalent EN: skimming (en)
definition: Technique de fraude visant à obtenir les données confidentielles d'une carte de paiement en copiant sa piste magnétique et éventuellement en captant son code secret au moyen d'un copieur de carte installé sur des terminaux de paiement ou de retrait.
in scheme: Finance
in scheme: concepts
notation: COGE770
related: copieur de carte

copieur de carte
type: ConceptConcept
type: Concept
creator: Commission d'enrichissement de la langue française, FranceTerme
date parution JO: 2011-03-27
equivalent EN: credit card skimmer @en
equivalent EN: credit card skimmer (en)
equivalent EN: credit card skimming device @en
equivalent EN: credit card skimming device (en)
equivalent EN: skimmer @en
equivalent EN: skimmer (en)
equivalent EN: skimming device @en
equivalent EN: skimming device (en)
definition: Dispositif technique permettant de lire et de capter frauduleusement les données confidentielles d'une carte de paiement.
in scheme: Électronique
in scheme: Finance
in scheme: concepts
notation: COGE771
note: Le copieur de carte peut associer un lecteur de carte à un faux clavier ou à une caméra.
related: copiage de carte

écoquartier
type: ConceptConcept
type: Concept
creator: Commission d'enrichissement de la langue française, FranceTerme
date parution JO: 2012-02-19
deconseille ou frequent: eco-district
deconseille ou frequent: éco-quartier
equivalent EN: ecodistrict @en
equivalent EN: ecodistrict (en)
part of speech: nom masculin
definition: Zone urbaine aménagée et gérée selon des objectifs et des pratiques de développement durable qui appellent l'engagement de l'ensemble de ses habitants.
in scheme: Aménagement et urbanisme
in scheme: Environnement
in scheme: concepts
notation: COGE780
related: écocité
related: développement durable

écocité
type: ConceptConcept
type: Concept
creator: Commission d'enrichissement de la langue française, FranceTerme
date parution JO: 2012-02-19
deconseille ou frequent: eco-city
deconseille ou frequent: ville durable
deconseille ou frequent: éco-cité
deconseille ou frequent: éco-ville
deconseille ou frequent: écoville
equivalent EN: ecocity @en
equivalent EN: ecocity (en)
equivalent EN: sustainable city @en
equivalent EN: sustainable city (en)
part of speech: nom féminin
definition: Ville aménagée et gérée selon des objectifs et des pratiques de développement durable qui appellent l'engagement de l'ensemble de ses habitants.
in scheme: Aménagement et urbanisme
in scheme: Environnement
in scheme: concepts
notation: COGE781
note: On trouve aussi, dans le langage professionnel, le terme « ville durable ».
related: écoquartier
related: développement durable
related: ville intelligente

hydrolienne
type: ConceptConcept
type: Concept
creator: Commission d'enrichissement de la langue française, FranceTerme
date parution JO: 2012-02-19
equivalent EN: marine turbine @en
equivalent EN: marine turbine (en)
equivalent EN: underwater turbine @en
equivalent EN: underwater turbine (en)
equivalent EN: water current turbine @en
equivalent EN: water current turbine (en)
part of speech: nom féminin
definition: Turbine immergée qui utilise l'énergie des courants marins, et parfois fluviaux, pour produire de l'électricité.
in scheme: Énergie
in scheme: Environnement
in scheme: concepts
notation: COGE782

liseuse
type: ConceptConcept
type: Concept
creator: Commission d'enrichissement de la langue française, FranceTerme
abbreviation: e-reader @en
abbreviation: reader @en
date parution JO: 2012-04-04
deconseille ou frequent: ebook
deconseille ou frequent: livre électronique
equivalent EN: e-book reader @en
equivalent EN: e-book reader (en)
equivalent EN: e-reader @en
equivalent EN: e-reader (en)
equivalent EN: electronic book reader @en
equivalent EN: electronic book reader (en)
equivalent EN: electronic reader @en
equivalent EN: electronic reader (en)
equivalent EN: reader @en
equivalent EN: reader (en)
part of speech: nom féminin
definition: Appareil portable doté d'un écran et destiné au stockage et à la lecture des livres numériques ou des périodiques.
in scheme: Édition et livre
in scheme: Informatique
in scheme: concepts
notation: COGE783
note: On trouve aussi le terme « livre électronique ».
related: livre numérique
related: mise en page fixe
related: mise en page adaptative
related: encre électronique
scope note: Cette publication annule et remplace celle du terme « livre électronique » au Journal officiel du 18 janvier 2005.

livre numérique
type: ConceptConcept
type: Concept
creator: Commission d'enrichissement de la langue française, FranceTerme
abbreviation: electronic book @en
date parution JO: 2012-04-04
deconseille ou frequent: ebook
deconseille ou frequent: livre électronique
equivalent EN: e-book @en
equivalent EN: e-book (en)
equivalent EN: electronic book @en
equivalent EN: electronic book (en)
definition: Ouvrage édité et diffusé sous forme numérique, destiné à être lu sur un écran.
in scheme: Édition et livre
in scheme: concepts
notation: COGE784
note: 1. Le livre numérique peut être un ouvrage composé directement sous forme numérique ou numérisé à partir d'imprimés ou de manuscrits.
note: 2. Le livre numérique peut être lu à l'aide de supports électroniques très divers.
note: 3. On trouve aussi le terme « livre électronique », qui n'est pas recommandé en ce sens.
related: liseuse
related: mise en page fixe
related: mise en page adaptative
related: concept-edition-et-livre

euro-obligation
type: ConceptConcept
type: Concept
creator: Commission d'enrichissement de la langue française, FranceTerme
date parution JO: 2012-05-13
deconseille ou frequent: euro-bond
deconseille ou frequent: euroobligation
deconseille ou frequent: european bond
equivalent EN: eurobond @en
equivalent EN: eurobond (en)
part of speech: nom féminin
alternative label: obligation européenne
definition: Obligation publique émise dans la zone euro et garantie par l'ensemble des États membres de cette zone ou par certains d'entre eux.
in scheme: Finance
in scheme: concepts
notation: COGE786
note: L'émission commune d'euro-obligations, si elle était décidée, serait un moyen de mutualiser les dettes souveraines d'États membres de la zone euro.

test de résistance
type: ConceptConcept
type: Concept
creator: Commission d'enrichissement de la langue française, FranceTerme
date parution JO: 2012-05-31
equivalent EN: stress test @en
equivalent EN: stress test (en)
definition: Évaluation de la capacité de résistance d'une installation à des agressions externes plus importantes que celles qui ont été prises en compte dans l'analyse de sûreté.
in scheme: Nucléaire
in scheme: concepts
notation: COGE787
related: concept-NUCL4
related: concept-NUCL681
related: concept-NUCL720

effet falaise
type: ConceptConcept
type: Concept
creator: Commission d'enrichissement de la langue française, FranceTerme
date parution JO: 2012-05-31
equivalent EN: cliff edge effect @en
equivalent EN: cliff edge effect (en)
definition: Altération brutale du comportement d'une installation, que suffit à provoquer une légère modification du scénario envisagé pour un accident dont les conséquences sont alors fortement aggravées.
in scheme: Nucléaire
in scheme: concepts
notation: COGE788
related: concept-NUCL720

réseau électrique intelligent
type: ConceptConcept
type: Concept
creator: Commission d'enrichissement de la langue française, FranceTerme
date parution JO: 2012-09-12
deconseille ou frequent: smart grids
equivalent EN: smart grid @en
equivalent EN: smart grid (en)
equivalent EN: smart power grid @en
equivalent EN: smart power grid (en)
definition: Réseau de transport et de distribution de l'énergie électrique doté des outils techniques et informatiques qui permettent d'en optimiser la gestion en tenant compte du comportement des usagers et de l'offre des producteurs.
in scheme: Électricité
in scheme: Énergie
in scheme: concepts
notation: COGE789
note: Les réseaux électriques intelligents sont destinés à faciliter l'utilisation de sources d'énergie intermittentes ou diversement réparties sur le territoire, ainsi que la gestion par les usagers de leur consommation.
related: compteur électrique connecté
related: concept-TELE558
related: concept-electricite

taxe d'expatriation
type: ConceptConcept
type: Concept
creator: Commission d'enrichissement de la langue française, FranceTerme
date parution JO: 2012-09-08
equivalent EN: exit tax @en
equivalent EN: exit tax (en)
definition: Impôt compensatoire auquel peuvent être soumises les plus-values latentes constatées sur le patrimoine mobilier d'un contribuable qui transfère son domicile fiscal d'un État à un autre.
in scheme: Économie générale
in scheme: concept-SD-economie-generale-fiscalite
in scheme: concepts
notation: COGE791

mot-dièse
type: ConceptConcept
type: Concept
creator: Commission d'enrichissement de la langue française, FranceTerme
date parution JO: 2013-01-23
deconseille ou frequent: hash tag
deconseille ou frequent: mot-clic
deconseille ou frequent: mots-dièse
equivalent EN: hashtag @en
equivalent EN: hashtag (en)
part of speech: nom masculin
definition: Suite signifiante de caractères sans espace commençant par le signe # (dièse), qui signale un sujet d'intérêt et est insérée dans un message par son rédacteur afin d'en faciliter le repérage.
in scheme: Informatique
in scheme: Télécommunications
in scheme: concept-SD-informatique-internet
in scheme: concept-SD-telecommunications-internet
in scheme: concepts
notation: COGE792
note: 1. En cliquant sur un mot-dièse, le lecteur a accès à l'ensemble des messages qui le contiennent.
note: 2. L'usage du mot-dièse est particulièrement répandu dans les réseaux sociaux fonctionnant par minimessages.
note: 3. Pluriel : mots-dièse.
related: microblogue

bâtiment bioclimatique
type: ConceptConcept
type: Concept
creator: Commission d'enrichissement de la langue française, FranceTerme
date parution JO: 2013-02-01
equivalent EN: bioclimatic building @en
equivalent EN: bioclimatic building (en)
equivalent EN: environmental building @en
equivalent EN: environmental building (en)
broader: concept-batiment
definition: Bâtiment dont l'implantation et la conception prennent en compte le climat et l'environnement immédiat, afin de réduire les besoins en énergie pour le chauffage, le refroidissement et l'éclairage.
in scheme: Énergie
in scheme: Habitat et construction
in scheme: concepts
notation: COGE798
note: La conception d'un bâtiment bioclimatique repose notamment sur le choix de matériaux appropriés, le recours à des techniques de circulation d'air, l'utilisation du rayonnement solaire ou de la géothermie, et la récupération des eaux de pluie.
related: bâtiment à énergie positive
related: bâtiment passif
related: maison bioclimatique
related: bâtiment autonome

maison passive
type: ConceptConcept
type: Concept
creator: Commission d'enrichissement de la langue française, FranceTerme
date parution JO: 2013-02-01
equivalent EN: Passivhaus @de
equivalent EN: Passivhaus (de)
equivalent EN: passive house @en
equivalent EN: passive house (en)
in scheme: Énergie
in scheme: Habitat et construction
in scheme: concepts
notation: COGE799
related: bâtiment passif

bâtiment à énergie positive
type: ConceptConcept
type: Concept
creator: Commission d'enrichissement de la langue française, FranceTerme
abbreviation: BEPOS
date parution JO: 2013-02-01
equivalent EN: energy plus building @en
equivalent EN: energy plus building (en)
equivalent EN: positive-energy building @en
equivalent EN: positive-energy building (en)
alternative label: bâtiment à bilan énergétique positif
broader: concept-batiment
definition: Bâtiment bioclimatique conçu pour produire en moyenne plus d'énergie qu'il n'en consomme.
in scheme: Énergie
in scheme: Habitat et construction
in scheme: concepts
notation: COGE800
note: 1. Le surplus d'énergie, rendu possible par l'isolation thermique poussée du bâtiment, l'orientation de ses ouvertures et l'économie des usages, est dû à des équipements n'utilisant que les énergies renouvelables, comme le photovoltaïque.
note: 2. Le surplus d'énergie électrique peut être renvoyé au réseau électrique public.
related: bâtiment bioclimatique
related: bâtiment passif
related: maison à énergie positive

électrosynthèse microbienne
type: ConceptConcept
type: Concept
creator: Commission d'enrichissement de la langue française, FranceTerme
abbreviation: MES @en
date parution JO: 2013-03-24
equivalent EN: MES @en
equivalent EN: MES (en)
equivalent EN: microbial electrosynthesis @en
equivalent EN: microbial electrosynthesis (en)
definition: Production de composés organiques par la réduction du dioxyde de carbone, elle-même réalisée grâce à l'action de microorganismes fixés sur la cathode d'une cellule électrochimique.
in scheme: Chimie
in scheme: Environnement
in scheme: concepts
notation: COGE801
note: L'électrosynthèse microbienne est un moyen de stocker, sous forme de composés organiques stables, l'énergie produite de façon intermittente par des sources d'énergie renouvelables, telles que le soleil ou le vent.
related: cellule électrochimique
related: biotransformation
related: pile à combustible microbienne

pile à combustible microbienne
type: ConceptConcept
type: Concept
creator: Commission d'enrichissement de la langue française, FranceTerme
abbreviation: MFC @en
abbreviation: PCM
date parution JO: 2013-03-24
equivalent EN: MFC @en
equivalent EN: MFC (en)
equivalent EN: microbial fuel cell @en
equivalent EN: microbial fuel cell (en)
definition: Dispositif de production d'électricité par l'oxydation de composés organiques, elle-même réalisée grâce à l'action de microorganismes fixés sur l'anode d'une cellule électrochimique.
in scheme: Chimie
in scheme: Environnement
in scheme: concepts
notation: COGE802
note: Une pile à combustible microbienne permet, tout en produisant de l'électricité, d'assurer l'épuration biologique de composés organiques contenus dans les eaux usées.
related: cellule électrochimique
related: biotransformation
related: électrosynthèse microbienne

acide peptidonucléique
type: ConceptConcept
type: Concept
creator: Commission d'enrichissement de la langue française, FranceTerme
abbreviation: APN
abbreviation: PNA @en
date parution JO: 2013-05-05
deconseille ou frequent: peptid nucleic acid
equivalent EN: PNA @en
equivalent EN: PNA (en)
equivalent EN: peptide nucleic acid @en
equivalent EN: peptide nucleic acid (en)
alternative label: acide peptidique nucléique
definition: Molécule synthétique, hybride de protéine et d'ADN, qui peut, en se liant à une molécule d'ADN, inhiber ou activer la réplication, la transcription ou la réparation de gènes spécifiques, ou encore bloquer la traduction de l'ARN messager en l'inactivant.
in scheme: Biologie
in scheme: concept-SD-biologie-biochimie-et-biologie-moleculaire
in scheme: concepts
notation: COGE804
related: ARN messager
related: aptamère

acide xénonucléique
type: ConceptConcept
type: Concept
creator: Commission d'enrichissement de la langue française, FranceTerme
abbreviation: AXN
abbreviation: XNA @en
date parution JO: 2013-05-05
deconseille ou frequent: xenonucleic acid
deconseille ou frequent: xéno-ADN
deconseille ou frequent: xénoADN
equivalent EN: XNA @en
equivalent EN: XNA (en)
equivalent EN: xeno-nucleic acid @en
equivalent EN: xeno-nucleic acid (en)
definition: Acide nucléique artificiel synthétisé à partir d'une molécule d'ADN, dans lequel le désoxyribose est remplacé par une autre structure cyclique, mais qui conserve les caractéristiques structurelles et fonctionnelles de la molécule d'origine.
in scheme: Biologie
in scheme: concept-SD-biologie-biochimie-et-biologie-moleculaire
in scheme: concepts
notation: COGE805
note: 1. Un acide xénonucléique ne peut être obtenu qu'au moyen d'une polymérase de synthèse particulière.
note: 2. L'emploi de l'expression « xéno-ADN » est déconseillé.

biologie de synthèse
type: ConceptConcept
type: Concept
creator: Commission d'enrichissement de la langue française, FranceTerme
date parution JO: 2013-05-05
equivalent EN: synthetic biology @en
equivalent EN: synthetic biology (en)
alternative label: biologie synthétique
definition: Branche interdisciplinaire de la biologie moléculaire qui recourt à la physique, à l'informatique et à la chimie pour inventer des génomes, obtenir des réactions enzymatiques nouvelles, et créer des cellules capables d'activités métaboliques et fonctionnelles inédites.
in scheme: Biologie
in scheme: concept-SD-biologie-biochimie-et-biologie-moleculaire
in scheme: concepts
notation: COGE806

achat à effet de levier
type: ConceptConcept
type: Concept
creator: Commission d'enrichissement de la langue française, FranceTerme
abbreviation: AEL
abbreviation: LBO @en
date parution JO: 2013-01-23
deconseille ou frequent: leveraged buyout
equivalent EN: LBO @en
equivalent EN: LBO (en)
equivalent EN: leveraged buy-out @en
equivalent EN: leveraged buy-out (en)
definition: Acquisition d'une entreprise au moyen d'un faible apport de capitaux propres et d'un recours important à l'emprunt.
in scheme: Finance
in scheme: concepts
notation: COGE807
related: établissement à fort effet de levier

établissement à fort effet de levier
type: ConceptConcept
type: Concept
creator: Commission d'enrichissement de la langue française, FranceTerme
abbreviation: EFEL
abbreviation: HLI @en
date parution JO: 2013-01-23
equivalent EN: HLI @en
equivalent EN: HLI (en)
equivalent EN: highly leveraged institution @en
equivalent EN: highly leveraged institution (en)
definition: Établissement spécialisé dans l'achat et la vente d'actifs, dont le financement repose sur une proportion importante d'endettement par rapport aux fonds propres engagés.
in scheme: Finance
in scheme: concepts
notation: COGE808
related: achat à effet de levier
related: fonds spéculatif

bâtiment passif
type: ConceptConcept
type: Concept
creator: Commission d'enrichissement de la langue française, FranceTerme
date parution JO: 2013-02-01
equivalent EN: Passivhaus @de
equivalent EN: Passivhaus (de)
equivalent EN: passive building @en
equivalent EN: passive building (en)
definition: Bâtiment bioclimatique conçu pour que son bilan énergétique tende vers l'équilibre.
in scheme: Énergie
in scheme: Habitat et construction
in scheme: concepts
notation: COGE809
note: La consommation d'énergie destinée au chauffage d'un bâtiment passif ne doit pas excéder un plafond déterminé, quelle que soit l'origine de cette énergie.
related: bâtiment bioclimatique
related: maison passive
related: bâtiment à énergie positive

maison bioclimatique
type: ConceptConcept
type: Concept
creator: Commission d'enrichissement de la langue française, FranceTerme
date parution JO: 2013-02-01
equivalent EN: bioclimatic house @en
equivalent EN: bioclimatic house (en)
in scheme: Énergie
in scheme: Habitat et construction
in scheme: concepts
notation: COGE810
related: bâtiment bioclimatique

maison à énergie positive
type: ConceptConcept
type: Concept
creator: Commission d'enrichissement de la langue française, FranceTerme
date parution JO: 2013-02-01
equivalent EN: energy plus house @en
equivalent EN: energy plus house (en)
equivalent EN: positive-energy house @en
equivalent EN: positive-energy house (en)
alternative label: maison à bilan énergétique positif
in scheme: Énergie
in scheme: Habitat et construction
in scheme: concepts
notation: COGE811
related: bâtiment à énergie positive

apportez votre équipement personnel de communication
type: ConceptConcept
type: Concept
creator: Commission d'enrichissement de la langue française, FranceTerme
abbreviation: AVEC
abbreviation: BYOD @en
date parution JO: 2013-03-24
equivalent EN: BYOD @en
equivalent EN: BYOD (en)
equivalent EN: bring your own device @en
equivalent EN: bring your own device (en)
definition: Se dit de l'utilisation, dans un cadre professionnel, d'un matériel personnel tel qu'un téléphone multifonction ou un ordinateur.
in scheme: Informatique
in scheme: Télécommunications
in scheme: concepts
notation: COGE812

beuverie express
type: ConceptConcept
type: Concept
creator: Commission d'enrichissement de la langue française, FranceTerme
date parution JO: 2013-07-28
deconseille ou frequent: alcoolisation express
deconseille ou frequent: biture express
deconseille ou frequent: hyper alcoolisation
equivalent EN: binge drinking @en
equivalent EN: binge drinking (en)
definition: Absorption massive d'alcool, généralement en groupe, visant à provoquer l'ivresse en un minimum de temps.
in scheme: Santé et médecine
in scheme: Social
in scheme: concepts
notation: COGE845
related: concept-SANT184

Recommandation sur l'équivalent français à donner à l'expression street [sport]
type: ConceptConcept
type: Concept
creator: Commission d'enrichissement de la langue française, FranceTerme
date parution JO: 2013-04-07
deconseille ou frequent: street basketball
deconseille ou frequent: street football
deconseille ou frequent: street golf
deconseille ou frequent: street hockey
deconseille ou frequent: street sport
in scheme: Sports
in scheme: concepts
notation: COGE846
scope note: Lire la recommandation "http://www.culture.fr/Ressources/FranceTerme/Recommandations-d-usage/STREET" ; toutes les recommandations d'usage publiées par la Commission générale de terminologie et de néologie au Journal officiel à l'adresse suivante : http://www.culture.fr/Ressources/FranceTerme/Recommandations-d-usage

financement participatif
type: ConceptConcept
type: Concept
creator: Commission d'enrichissement de la langue française, FranceTerme
date parution JO: 2013-05-18
deconseille ou frequent: crowd funding
equivalent EN: crowdfunding @en
equivalent EN: crowdfunding (en)
definition: Financement faisant appel à un grand nombre de personnes, généralement des internautes, pour qu'elles investissent les fonds nécessaires à l'aboutissement d'un projet.
definition: Funding requiring a significant number of people, usually web users, to invest the necessary funds for a project to be successful. @en
in scheme: Finance
in scheme: concepts
notation: COGE847
note: 1. Crowdfunding flourished with the developement of the internet. Contributions are sought for various types of projects (works, products, services, cultural or commercial events). 2. Online collection of the contributions may be either performed by the project proponents themselves or use specialised platforms. @en
note: 1. Le financement participatif a pris son essor avec le développement de l'internet. Les contributions sont sollicitées pour des projets de diverse nature (œuvres, produits, services, évènements, culturels ou commerciaux).
note: 3. La collecte en ligne des contributions peut être assurée par les promoteurs des projets eux-mêmes ou s'appuyer sur des plateformes spécialisées.
preferred label: crowdfunding @en
related: prêt entre pairs
related: finance parallèle
related: financement participatif par prêt
related: mécénat participatif
related: financement participatif par titres

animateur, -trice de communauté
type: ConceptConcept
type: Concept
creator: Commission d'enrichissement de la langue française, FranceTerme
date parution JO: 2013-09-08
deconseille ou frequent: animateur de communautés
deconseille ou frequent: community management
deconseille ou frequent: gestionnaire de communautés
equivalent EN: community manager @en
equivalent EN: community manager (en)
alternative label: gestionnaire de communauté
definition: Personne chargée de développer la présence sur la toile d'une organisation publique ou privée en fidélisant un groupe d'internautes et en animant ses échanges dans des réseaux sociaux, des médias en ligne ou des forums.
in scheme: Communication
in scheme: Économie et gestion d'entreprise
in scheme: concepts
notation: COGE848
related: responsable de la promotion en ligne
related: responsable des réseaux sociaux
related: mercatique par réseaux sociaux
related: référencement par les réseaux sociaux
related: référencement non payant

vote des rémunérations
type: ConceptConcept
type: Concept
creator: Commission d'enrichissement de la langue française, FranceTerme
deconseille ou frequent: PRIO59
equivalent EN: say on pay @en
equivalent EN: say on pay (en)
definition: Vote de la rémunération des dirigeants d'une société par l'assemblée des actionnaires.
in scheme: Finance
in scheme: concepts
notation: COGE851

retrait automobile
type: ConceptConcept
type: Concept
creator: Commission d'enrichissement de la langue française, FranceTerme
abbreviation: click and collect @en
abbreviation: drive-thru @en
date parution JO: 2013-12-20
deconseille ou frequent: drive fermier
deconseille ou frequent: drive picking
deconseille ou frequent: retrait au volant
deconseille ou frequent: retrait à la ferme
equivalent EN: click & collect @en
equivalent EN: click & collect (en)
equivalent EN: click and collect @en
equivalent EN: click and collect (en)
equivalent EN: drive-through @en
equivalent EN: drive-through (en)
equivalent EN: drive-thru @en
equivalent EN: drive-thru (en)
forme abregee: retrait auto
alternative label: retrait express
definition: Service permettant à un client de venir avec un véhicule retirer rapidement des achats effectués en ligne.
in scheme: Économie et gestion d'entreprise
in scheme: concepts
notation: COGE854
note: 1. L'emploi du mot drive, emprunté de l’anglais, est à proscrire.
note: 2. Dans le cas de produits retirés dans une ferme ou à un point de vente agricole collectif, on parlera de « retrait à la ferme » et non de « drive fermier », emprunté de l'anglais.
related: point de retrait automobile
related: retrait en magasin
related: commerce en ligne
related: service au volant

point de retrait automobile
type: ConceptConcept
type: Concept
creator: Commission d'enrichissement de la langue française, FranceTerme
abbreviation: drive-through supermarket @en
abbreviation: drive-thru supermarket @en
date parution JO: 2013-12-20
deconseille ou frequent: zone de retrait automobile
equivalent EN: collection point @en
equivalent EN: collection point (en)
equivalent EN: drive-through @en
equivalent EN: drive-through (en)
equivalent EN: drive-through supermarket @en
equivalent EN: drive-through supermarket (en)
equivalent EN: drive-thru @en
equivalent EN: drive-thru (en)
equivalent EN: drive-thru supermarket @en
equivalent EN: drive-thru supermarket (en)
forme abregee: point de retrait auto
alternative label: point de retrait express
definition: Lieu spécialement aménagé pour permettre à un client de venir avec un véhicule retirer rapidement des achats effectués en ligne.
in scheme: Aménagement et urbanisme
in scheme: Économie et gestion d'entreprise
in scheme: concepts
notation: COGE855
note: 1. On peut dire aussi « zone de retrait automobile ».
note: 2. L'emploi du mot drive, emprunté de l’anglais, est à proscrire.
related: retrait automobile
related: service au volant

réalité scénarisée
type: ConceptConcept
type: Concept
creator: Commission d'enrichissement de la langue française, FranceTerme
date parution JO: 2014-02-11
deconseille ou frequent: reality drama
deconseille ou frequent: réalité scriptée
equivalent EN: scripted reality @en
equivalent EN: scripted reality (en)
equivalent EN: structured reality @en
equivalent EN: structured reality (en)
definition: Genre de programme télévisuel tiré de faits divers ou de situations de la vie courante, empruntant aux procédés du reportage et recourant à des scènes reconstituées afin de produire un effet d'authenticité.
in scheme: Audiovisuel
in scheme: concept-SD-audiovisuel-television
in scheme: concepts
notation: COGE862

production participative
type: ConceptConcept
type: Concept
creator: Commission d'enrichissement de la langue française, FranceTerme
date parution JO: 2014-08-05
deconseille ou frequent: PRIO65
deconseille ou frequent: crowd sourcing
deconseille ou frequent: production collaborative
deconseille ou frequent: travail collaboratif
equivalent EN: crowdsourcing @en
equivalent EN: crowdsourcing (en)
definition: Mode de réalisation d’un projet ou d’un produit faisant appel aux contributions d’un grand nombre de personnes, généralement des internautes.
in scheme: Tous domaines
in scheme: concepts
notation: COGE863
note: 1. On peut, par exemple, recourir à la production participative pour concevoir un logiciel ou pour élaborer une encyclopédie.
note: 2. On trouve aussi l’expression « production collaborative ».

tout en ligne
type: ConceptConcept
type: Concept
creator: Commission d'enrichissement de la langue française, FranceTerme
date parution JO: 2014-03-23
deconseille ou frequent: journal tout en ligne
deconseille ou frequent: pure player
deconseille ou frequent: édition tout en ligne
part of speech: locution adjectivale invariable
definition: Se dit d'un éditeur, en particulier un éditeur de presse, qui exerce son activité exclusivement dans l'internet, ou de cette activité elle-même.
in scheme: Communication
in scheme: Édition et livre
in scheme: concept-SD-communication-presse
in scheme: concept-SD-edition-et-livre-presse
in scheme: concepts
notation: COGE864
note: 1. On parle par exemple d'un « journal tout en ligne » ou encore de l'« édition tout en ligne ».
note: 2. Le terme pure player, emprunté de l’anglais, est à proscrire.
related: distributeur en ligne

ouverture des données
type: ConceptConcept
type: Concept
creator: Commission d'enrichissement de la langue française, FranceTerme
date parution JO: 2014-05-03
equivalent EN: open data @en
equivalent EN: open data (en)
equivalent EN: open data policy @en
equivalent EN: open data policy (en)
definition: Politique par laquelle un organisme met à la disposition de tous des données numériques, dans un objectif de transparence ou afin de permettre leur réutilisation, notamment à des fins économiques.
in scheme: Droit
in scheme: concepts
notation: COGE865
related: données ouvertes
related: innovation ouverte

données ouvertes
type: ConceptConcept
type: Concept
creator: Commission d'enrichissement de la langue française, FranceTerme
date parution JO: 2014-05-03
equivalent EN: open data @en
equivalent EN: open data (en)
definition: Data made available by an organism to everyone in the form of digital files in order to enable them to be re-used. @en
definition: Données qu'un organisme met à la disposition de tous sous forme de fichiers numériques afin de permettre leur réutilisation.
in scheme: Droit
in scheme: Informatique
in scheme: concepts
notation: COGE866
note: 1. Open data is not generally personal. 2. It is accessible in a format promoting its re-use. 3. The re-use of open data may be subject to conditions. @en
note: 1. Les données ouvertes n'ont généralement pas de caractère personnel.
note: 2. Elles sont accessibles dans un format favorisant leur réutilisation.
note: 3. La réutilisation des données ouvertes peut être soumise à conditions.
preferred label: open data @en
related: ouverture des données
related: concept-INFO961
related: concept-INFO962

télévision participative
type: ConceptConcept
type: Concept
creator: Commission d'enrichissement de la langue française, FranceTerme
abbreviation: social TV @en
date parution JO: 2014-05-16
deconseille ou frequent: tv sociale
deconseille ou frequent: télévision sociale
equivalent EN: social TV @en
equivalent EN: social TV (en)
equivalent EN: social television @en
equivalent EN: social television (en)
definition: Télévision proposant au public d'échanger, principalement via les réseaux sociaux, des appréciations et des commentaires sur un programme, avant, pendant ou après sa diffusion, voire d'interagir avec ce programme.
in scheme: Audiovisuel
in scheme: concept-SD-audiovisuel-television
in scheme: concepts
notation: COGE867
note: On trouve aussi l’expression « télévision sociale ».
related: transmédia

transmédia
type: ConceptConcept
type: Concept
creator: Commission d'enrichissement de la langue française, FranceTerme
date parution JO: 2014-05-16
equivalent EN: crossmedia @en
equivalent EN: crossmedia (en)
equivalent EN: transmedia storytelling @en
equivalent EN: transmedia storytelling (en)
definition: Se dit d’un mode de création ou de production utilisant de façon combinée et complémentaire différents médias pour développer une même œuvre ou un même sujet ; par extension, ce mode de création ou de production.
in scheme: Audiovisuel
in scheme: concepts
notation: COGE868
related: télévision participative
related: multisupport
related: jeu vidéo à réalité intégrée

flux (en)
type: ConceptConcept
type: Concept
creator: Commission d'enrichissement de la langue française, FranceTerme
date parution JO: 2015-01-21
deconseille ou frequent: en continu
deconseille ou frequent: en flux
deconseille ou frequent: en streaming
equivalent EN: streaming @en
equivalent EN: streaming (en)
part of speech: locution adjectivale
definition: Se dit de la diffusion ou de la réception par l'internet de contenus audio et vidéo, selon un mode de transmission permettant une lecture en continu sans téléchargement.
in scheme: Audiovisuel
in scheme: Télécommunications
in scheme: concept-SD-audiovisuel-internet
in scheme: concept-SD-telecommunications-internet
in scheme: concepts
notation: COGE872
note: On trouve aussi l’expression « en continu ».
related: téléchargement
scope note: Cette publication annule et remplace celle du terme « diffusion en flux » au Journal officiel du 18 janvier 2005.

hors offre du fournisseur d'accès à l'internet
type: ConceptConcept
type: Concept
creator: Commission d'enrichissement de la langue française, FranceTerme
abbreviation: OTT @en
date parution JO: 2015-07-12
deconseille ou frequent: service OTT
equivalent EN: OTT @en
equivalent EN: OTT (en)
equivalent EN: over the top @en
equivalent EN: over the top (en)
forme abregee: hors offre FAI, loc.adj.
part of speech: locution adjectivale
definition: Se dit d'un service proposé en dehors des offres commerciales du fournisseur d’accès à l'internet choisi par l’internaute, qui peut concurrencer celles-ci et est généralement très consommateur de bande passante.
in scheme: Audiovisuel
in scheme: Télécommunications
in scheme: concept-SD-audiovisuel-internet
in scheme: concept-SD-telecommunications-internet
in scheme: concepts
notation: COGE873
related: concept-TELE365
related: concept-TELE366

mégadonnées
type: ConceptConcept
type: Concept
creator: Commission d'enrichissement de la langue française, FranceTerme
date parution JO: 2014-08-22
deconseille ou frequent: données de masse
deconseille ou frequent: données en masse
deconseille ou frequent: données massives
deconseille ou frequent: données volumineuses
deconseille ou frequent: masse de données
equivalent EN: big data @en
equivalent EN: big data (en)
part of speech: nom féminin pluriel
broader: donnée
definition: Données structurées ou non dont le très grand volume requiert des outils d'analyse adaptés.
in scheme: Informatique
in scheme: concepts
notation: COGE874
note: On trouve aussi l'expression « données massives ».
related: traitement automatique de données
related: expert, -e en mégadonnées
related: concept-INFO965
related: concept-INFO979
related: concept-INFO985

féminicide
type: ConceptConcept
type: Concept
creator: Commission d'enrichissement de la langue française, FranceTerme
date parution JO: 2014-09-16
deconseille ou frequent: fémicide
deconseille ou frequent: gynocide
deconseille ou frequent: gynécide
equivalent EN: femicide @en
equivalent EN: femicide (en)
equivalent EN: femicidio @es
equivalent EN: femicidio (es)
equivalent EN: feminicide @en
equivalent EN: feminicide (en)
equivalent EN: feminicidio @es
equivalent EN: feminicidio (es)
equivalent EN: femminicidio @it
equivalent EN: femminicidio (it)
part of speech: nom masculin
definition: Homicide d'une femme, d’une jeune fille ou d'une enfant en raison de son sexe.
in scheme: Droit
in scheme: Sciences humaines
in scheme: concepts
notation: COGE875
note: Le féminicide peut désigner un meurtre à caractère individuel ou systématique.
related: homicide sexiste
related: concept-SANT248

homicide sexiste
type: ConceptConcept
type: Concept
creator: Commission d'enrichissement de la langue française, FranceTerme
date parution JO: 2014-09-16
deconseille ou frequent: crime de genre
deconseille ou frequent: genricide
deconseille ou frequent: généricide
deconseille ou frequent: violence de genre
equivalent EN: crimen de género @es
equivalent EN: crimen de género (es)
equivalent EN: gendercide @en
equivalent EN: gendercide (en)
definition: Homicide d'une personne en raison de son sexe ou de son orientation sexuelle.
in scheme: Droit
in scheme: Sciences humaines
in scheme: concepts
notation: COGE876
related: féminicide

intercepteur d'IMSI
type: ConceptConcept
type: Concept
creator: Commission d'enrichissement de la langue française, FranceTerme
date parution JO: 2016-01-31
equivalent EN: IMSI catcher @en
equivalent EN: IMSI catcher (en)
definition: Appareil ou dispositif technique qui, simulant le fonctionnement d’une station de base de téléphonie mobile, capte et enregistre les identités internationales d’abonnement mobile des terminaux se trouvant à proximité avant de les transmettre à la station de base du réseau.
in scheme: Télécommunications
in scheme: concept-SD-telecommunications-radiocommunications
in scheme: concepts
notation: COGE892
note: L'intercepteur d'IMSI peut être complété par un dispositif d'enregistrement des données échangées entre les terminaux.
related: identité internationale d'abonnement mobile
related: concept-TELE85

identité internationale d'abonnement mobile
type: ConceptConcept
type: Concept
creator: Commission d'enrichissement de la langue française, FranceTerme
date parution JO: 2016-01-31
equivalent EN: IMSI @en
equivalent EN: IMSI (en)
equivalent EN: international mobile subscriber identity @en
equivalent EN: international mobile subscriber identity (en)
equivalent EN: international mobile subscription identity @en
equivalent EN: international mobile subscription identity (en)
alternative label: IMSI
definition: Chaîne de chiffres identifiant une carte SIM par l'indicatif de pays du mobile, le code de réseau du mobile et le numéro d'identification d'abonnement mobile.
in scheme: Télécommunications
in scheme: concept-SD-telecommunications-radiocommunications
in scheme: concepts
notation: COGE893
note: Le terme « identité internationale d'abonnement mobile » a été normalisé par l'Union internationale des télécommunications dans la recommandation UIT-T E.212.
related: intercepteur d'IMSI
related: concept-TELE509

test JA DDF
type: ConceptConcept
type: Concept
creator: Commission d'enrichissement de la langue française, FranceTerme
definition: TEst en indice
in scheme: Culture
in scheme: concepts
notation: COGE905
note: test ablisage italique

information-divertissement
type: ConceptConcept
type: Concept
creator: Commission d'enrichissement de la langue française, FranceTerme
date parution JO: 2006-03-03
equivalent EN: infotainment @en
equivalent EN: infotainment (en)
forme abregee: infodivertissement, n.m.
part of speech: nom féminin
definition: Alternance, dans une même émission, d'informations et de divertissements.
in scheme: Audiovisuel
in scheme: concepts
notation: COGE908
related: information-divertissement

test nl
type: ConceptConcept
type: Concept
creator: Commission d'enrichissement de la langue française, FranceTerme
in scheme: Communication
in scheme: concepts
notation: COGE909

accord
type: ConceptConcept
type: Concept
creator: Commission d'enrichissement de la langue française, FranceTerme
source: révision de l'arrêté du 10 octobre 1985
date parution JO: 2000-09-22
equivalent EN: tuning @en
equivalent EN: tuning (en)
part of speech: nom masculin
definition: Réglage destiné à produire ou à capter des signaux électriques ou acoustiques de fréquences déterminées.
in scheme: Acoustique
in scheme: Audiovisuel
in scheme: concepts
notation: CULT1
note: On parle par exemple de l'accord d'un récepteur, d'un filtre, d'un instrument de musique ou d'une antenne sur une fréquence spécifiée.
preferred label: tuning @en

animateur, -trice
type: ConceptConcept
type: Concept
creator: Commission d'enrichissement de la langue française, FranceTerme
source: révision de l'arrêté du 10 octobre 1985
date parution JO: 2000-09-22
part of speech: nom
definition: Personne chargée de préparer, de présenter, d'expliquer et de coordonner les divers éléments constitutifs d'une émission.
in scheme: Audiovisuel
in scheme: concept-SD-audiovisuel-radio
in scheme: concept-SD-audiovisuel-television
in scheme: concepts
notation: CULT10
note: On parle d'animateur à propos des émissions de programmes, et de présentateur lorsqu'il s'agit d'informations.

retour rapide
type: ConceptConcept
type: Concept
creator: Commission d'enrichissement de la langue française, FranceTerme
source: révision de l'arrêté du 10 octobre 1985
date parution JO: 2000-09-22
equivalent EN: fast rewind @en
equivalent EN: fast rewind (en)
definition: Défilement rapide d'un support d'enregistrement dans le sens inverse de la lecture.
in scheme: Audiovisuel
in scheme: concepts
notation: CULT102
related: avance rapide

rotophaseur
type: ConceptConcept
type: Concept
creator: Commission d'enrichissement de la langue française, FranceTerme
source: révision de l'arrêté du 24 janvier 1983
date parution JO: 2000-09-22
equivalent EN: phasing @en
equivalent EN: phasing (en)
part of speech: nom masculin
definition: Dispositif électronique simulant l'effet d'un haut-parleur tournant.
in scheme: Acoustique
in scheme: Audiovisuel
in scheme: concepts
notation: CULT103

scintillement
type: ConceptConcept
type: Concept
creator: Commission d'enrichissement de la langue française, FranceTerme
source: révision de l'arrêté du 10 octobre 1985
date parution JO: 2000-09-22
equivalent EN: flutter @en
equivalent EN: flutter (en)
part of speech: nom masculin
definition: Fluctuation de la vitesse relative entre un support d'enregistrement et la tête d'enregistrement ou de lecture, dont la fréquence est supérieure à 10 hertz.
in scheme: Acoustique
in scheme: Audiovisuel
in scheme: concepts
notation: CULT104
related: fluctuations de vitesse
related: pleurage

scripte
type: ConceptConcept
type: Concept
creator: Commission d'enrichissement de la langue française, FranceTerme
source: révision de l'arrêté du 24 janvier 1983
date parution JO: 2000-09-22
equivalent EN: script @en
equivalent EN: script (en)
part of speech: nom
definition: Responsable de la continuité de la réalisation et de la tenue des documents auprès du réalisateur d'un film ou d'une émission.
in scheme: Audiovisuel
in scheme: Communication
in scheme: concepts
notation: CULT105

sélectionné
type: ConceptConcept
type: Concept
creator: Commission d'enrichissement de la langue française, FranceTerme
source: révision de l'arrêté du 24 janvier 1983
date parution JO: 2000-09-22
deconseille ou frequent: nominé
deconseille ou frequent: nommé
equivalent EN: nominated @en
equivalent EN: nominated (en)
part of speech: adjectif
definition: Retenu comme candidat pour un prix ou une distinction.
in scheme: Audiovisuel
in scheme: concepts
notation: CULT106
note: 1. On dit aussi « nommé ».
note: 2. Le terme « nominé » est à proscrire.

silencieux
type: ConceptConcept
type: Concept
creator: Commission d'enrichissement de la langue française, FranceTerme
source: révision de l'arrêté du 24 janvier 1983
date parution JO: 2000-09-22
equivalent EN: muting @en
equivalent EN: muting (en)
equivalent EN: squelch @en
equivalent EN: squelch (en)
part of speech: nom masculin
definition: Dispositif électronique qui réduit ou supprime automatiquement le signal de sortie d'un récepteur de radiodiffusion sonore ou d'un syntoniseur, en particulier pendant les réglages d'accord.
in scheme: Acoustique
in scheme: Audiovisuel
in scheme: concepts
notation: CULT107
related: sourdine
related: syntoniseur
related: concept-TELE311

sonorisation
type: ConceptConcept
type: Concept
creator: Commission d'enrichissement de la langue française, FranceTerme
source: révision de l'arrêté du 24 janvier 1983
date parution JO: 2000-09-22
equivalent EN: PA @en
equivalent EN: PA (en)
equivalent EN: public address @en
equivalent EN: public address (en)
part of speech: nom féminin
definition: Ensemble des moyens permettant d'assurer la diffusion de la parole et de la musique dans un espace important.
in scheme: Acoustique
in scheme: Audiovisuel
in scheme: concepts
notation: CULT108
related: amplificateur de sonorisation

sourdine
type: ConceptConcept
type: Concept
creator: Commission d'enrichissement de la langue française, FranceTerme
source: révision de l'arrêté du 24 janvier 1983
date parution JO: 2000-09-22
equivalent EN: muting @en
equivalent EN: muting (en)
part of speech: nom féminin
definition: Commande d'un appareil audiovisuel qui permet de réduire ou supprimer le signal sonore, puis de le rétablir.
in scheme: Acoustique
in scheme: Audiovisuel
in scheme: concepts
notation: CULT109
related: silencieux

antiripage
type: ConceptConcept
type: Concept
creator: Commission d'enrichissement de la langue française, FranceTerme
source: révision de l'arrêté du 10 octobre 1985
date parution JO: 2000-09-22
equivalent EN: antiskating @en
equivalent EN: antiskating (en)
part of speech: nom masculin
alternative label: compensation de force centripète
definition: Procédé destiné à compenser la tendance d'un bras de lecture à se rapprocher du centre du disque.
in scheme: Acoustique
in scheme: Audiovisuel
in scheme: concepts
notation: CULT11
note: Ce procédé n'est nécessaire que pour les bras de lecture phonographique non tangentiels.

spectacle solo
type: ConceptConcept
type: Concept
creator: Commission d'enrichissement de la langue française, FranceTerme
source: révision de l'arrêté du 10 octobre 1985
date parution JO: 2000-09-22
deconseille ou frequent: standup
deconseille ou frequent: standup comedy
equivalent EN: one-man show @en
equivalent EN: one-man show (en)
equivalent EN: stand-up @en
equivalent EN: stand-up (en)
equivalent EN: stand-up comedy @en
equivalent EN: stand-up comedy (en)
forme abregee: solo, n.m.
alternative label: seul en scène
definition: Spectacle de variétés assuré par un artiste seul en scène.
in scheme: Arts
in scheme: concept-SD-arts-arts-de-la-scene
in scheme: concepts
notation: CULT110

stylisme
type: ConceptConcept
type: Concept
creator: Commission d'enrichissement de la langue française, FranceTerme
source: révision de l'arrêté du 24 janvier 1983
date parution JO: 2000-09-22
deconseille ou frequent: conception
equivalent EN: design @en
equivalent EN: design (en)
part of speech: nom masculin
definition: Travail sur l'aspect extérieur d'un produit industriel en vue d'un résultat esthétique s'accordant à des impératifs fonctionnels et commerciaux.
in scheme: Tous domaines
in scheme: concepts
notation: CULT111
note: On trouve aussi « conception ».

styliste
type: ConceptConcept
type: Concept
creator: Commission d'enrichissement de la langue française, FranceTerme
source: révision de l'arrêté du 24 janvier 1983
date parution JO: 2000-09-22
equivalent EN: designer @en
equivalent EN: designer (en)
part of speech: nom
definition: Professionnel chargé du stylisme.
in scheme: Tous domaines
in scheme: concepts
notation: CULT112

suramplificateur
type: ConceptConcept
type: Concept
creator: Commission d'enrichissement de la langue française, FranceTerme
source: révision de l'arrêté du 24 janvier 1983
date parution JO: 2000-09-22
equivalent EN: booster @en
equivalent EN: booster (en)
part of speech: nom masculin
definition: Amplificateur de puissance supplémentaire, notamment pour un véhicule automobile.
in scheme: Acoustique
in scheme: Audiovisuel
in scheme: concepts
notation: CULT113
related: amplificateur de sonorisation

syntoniseur
type: ConceptConcept
type: Concept
creator: Commission d'enrichissement de la langue française, FranceTerme
source: révision de l'arrêté du 24 janvier 1983
date parution JO: 2000-09-22
deconseille ou frequent: syntonisateur
equivalent EN: tuner @en
equivalent EN: tuner (en)
part of speech: nom masculin
definition: Appareil électronique capable de convertir un signal radiofréquence reçu par une antenne en un signal audiofréquence de faible puissance.
in scheme: Acoustique
in scheme: Audiovisuel
in scheme: concepts
notation: CULT114
note: Le terme « syntonisateur » est employé au Canada.
related: silencieux
related: ampli-syntoniseur

téléprompteur
type: ConceptConcept
type: Concept
creator: Commission d'enrichissement de la langue française, FranceTerme
source: révision de l'arrêté du 24 janvier 1983
date parution JO: 2000-09-22
equivalent EN: teleprompter @en
equivalent EN: teleprompter (en)
part of speech: nom masculin
definition: Appareil permettant de lire un texte face à la caméra.
in scheme: Audiovisuel
in scheme: concept-SD-audiovisuel-television
in scheme: concepts
notation: CULT115

témoignage publicitaire
type: ConceptConcept
type: Concept
creator: Commission d'enrichissement de la langue française, FranceTerme
source: révision de l'arrêté du 10 octobre 1985
date parution JO: 2000-09-22
equivalent EN: testimonial @en
equivalent EN: testimonial (en)
definition: Technique publicitaire utilisant le témoignage.
in scheme: Communication
in scheme: concept-SD-communication-publicite
in scheme: concepts
notation: CULT116

test en aveugle
type: ConceptConcept
type: Concept
creator: Commission d'enrichissement de la langue française, FranceTerme
source: révision de l'arrêté du 24 janvier 1983
date parution JO: 2000-09-22
deconseille ou frequent: test aveugle
equivalent EN: blind test @en
equivalent EN: blind test (en)
definition: Test de comparaison entre deux ou plusieurs produits anonymement présentés.
in scheme: Communication
in scheme: concept-SD-communication-publicite
in scheme: concepts
notation: CULT117
note: On trouve aussi « test aveugle ».

test de mémorisation assistée
type: ConceptConcept
type: Concept
creator: Commission d'enrichissement de la langue française, FranceTerme
source: révision de l'arrêté du 10 octobre 1985
abbreviation: TMA
date parution JO: 2000-09-22
equivalent EN: aided recall test @en
equivalent EN: aided recall test (en)
definition: Mesure de l'impact d'un message publicitaire à l'aide d'éléments de rappel.
in scheme: Communication
in scheme: concept-SD-communication-publicite
in scheme: concepts
notation: CULT118

test du lendemain
type: ConceptConcept
type: Concept
creator: Commission d'enrichissement de la langue française, FranceTerme
source: révision de l'arrêté du 24 janvier 1983
abbreviation: DAR @en
abbreviation: TDL
date parution JO: 2000-09-22
equivalent EN: DAR @en
equivalent EN: DAR (en)
equivalent EN: day after recall @en
equivalent EN: day after recall (en)
definition: Mesure de l'impact d'un message publicitaire vingt-quatre heures après sa diffusion.
in scheme: Communication
in scheme: concept-SD-communication-publicite
in scheme: concepts
notation: CULT119

avance rapide
type: ConceptConcept
type: Concept
creator: Commission d'enrichissement de la langue française, FranceTerme
source: révision de l'arrêté du 10 octobre 1985
date parution JO: 2000-09-22
equivalent EN: fast forward @en
equivalent EN: fast forward (en)
definition: Défilement rapide d'un support d'enregistrement dans le sens de la lecture.
in scheme: Audiovisuel
in scheme: concepts
notation: CULT12
related: retour rapide

tirage équifractionné
type: ConceptConcept
type: Concept
creator: Commission d'enrichissement de la langue française, FranceTerme
source: révision de l'arrêté du 24 janvier 1983
date parution JO: 2000-09-22
equivalent EN: split run @en
equivalent EN: split run (en)
definition: Tirage d'une revue ou d'un journal en deux fractions égales, chacune contenant une annonce différente pour un même produit, de façon à en comparer l'efficacité.
in scheme: Communication
in scheme: concept-SD-communication-publicite
in scheme: concepts
notation: CULT120

très gros plan
type: ConceptConcept
type: Concept
creator: Commission d'enrichissement de la langue française, FranceTerme
source: révision de l'arrêté du 24 janvier 1983
abbreviation: TGP
date parution JO: 2000-09-22
equivalent EN: big close-up @en
equivalent EN: big close-up (en)
equivalent EN: extreme close-up @en
equivalent EN: extreme close-up (en)
definition: Cadrage d'un détail du visage ; par extension, désigne toute prise de vue très rapprochée d'un objet.
in scheme: Audiovisuel
in scheme: concept-SD-audiovisuel-cinema
in scheme: concept-SD-audiovisuel-television
in scheme: concepts
notation: CULT121
related: gros plan
related: plan rapproché

valeur efficace
type: ConceptConcept
type: Concept
creator: Commission d'enrichissement de la langue française, FranceTerme
source: révision de l'arrêté du 10 octobre 1985
abbreviation: RMS value @en
date parution JO: 2000-09-22
equivalent EN: RMS value @en
equivalent EN: RMS value (en)
equivalent EN: root-mean-square value @en
equivalent EN: root-mean-square value (en)
definition: Valeur d'une grandeur constante produisant les mêmes effets énergétiques qu'une grandeur variable de même nature.
in scheme: Tous domaines
in scheme: concepts
notation: CULT122
note: La valeur efficace de t1 à t2 d'une fonction y du temps est la racine carrée de la moyenne de t1 à t2 de la fonction y2, carré de la fonction y.

verrouilleur de synchronisation
type: ConceptConcept
type: Concept
creator: Commission d'enrichissement de la langue française, FranceTerme
source: révision de l'arrêté du 24 janvier 1983
date parution JO: 2000-09-22
equivalent EN: gen-lock @en
equivalent EN: gen-lock (en)
forme abregee: verrouilleur, n.m.
definition: Dispositif permettant d'asservir le générateur de synchronisation sur un signal extérieur.
in scheme: Audiovisuel
in scheme: concept-SD-audiovisuel-video
in scheme: concepts
notation: CULT123

voix dans le champ
type: ConceptConcept
type: Concept
creator: Commission d'enrichissement de la langue française, FranceTerme
source: révision de l'arrêté du 24 janvier 1983
date parution JO: 2000-09-22
deconseille ou frequent: voix in
equivalent EN: voice-in @en
equivalent EN: voice-in (en)
definition: Voix d'une personne présente à l'écran.
in scheme: Audiovisuel
in scheme: concept-SD-audiovisuel-cinema
in scheme: concept-SD-audiovisuel-television
in scheme: concepts
notation: CULT124
note: L'expression « voix in » ne doit pas être employée.

voix hors champ
type: ConceptConcept
type: Concept
creator: Commission d'enrichissement de la langue française, FranceTerme
source: révision de l'arrêté du 10 octobre 1985
date parution JO: 2000-09-22
deconseille ou frequent: voix off
equivalent EN: voice-off @en
equivalent EN: voice-off (en)
equivalent EN: voice-over @en
equivalent EN: voice-over (en)
definition: Voix d'une personne absente à l'écran.
in scheme: Audiovisuel
in scheme: concept-SD-audiovisuel-cinema
in scheme: concept-SD-audiovisuel-television
in scheme: concepts
notation: CULT125
note: L'expression « voix off » ne doit pas être employée.

baladeur
type: ConceptConcept
type: Concept
creator: Commission d'enrichissement de la langue française, FranceTerme
source: révision de l'arrêté du 24 janvier 1983
date parution JO: 2000-09-22
equivalent EN: walkman @en
equivalent EN: walkman (en)
part of speech: nom masculin
definition: Appareil portatif de reproduction sonore et éventuellement d'enregistrement, muni d'un casque à écouteurs, que l'on peut utiliser en se déplaçant.
in scheme: Audiovisuel
in scheme: concepts
notation: CULT13
note: Le terme « Walkman », qui est un nom de marque déposée, ne doit pas être utilisé.

baladeur radio
type: ConceptConcept
type: Concept
creator: Commission d'enrichissement de la langue française, FranceTerme
source: révision de l'arrêté du 24 janvier 1983
date parution JO: 2000-09-22
definition: Récepteur radio portatif muni d'un casque à écouteurs, que l'on peut utiliser en se déplaçant.
in scheme: Audiovisuel
in scheme: concepts
notation: CULT14

balance
type: ConceptConcept
type: Concept
creator: Commission d'enrichissement de la langue française, FranceTerme
source: révision de l'arrêté du 10 octobre 1985
date parution JO: 2000-09-22
equivalent EN: balance @en
equivalent EN: balance (en)
part of speech: nom féminin
definition: Dispositif permettant d'ajuster les niveaux acoustiques de sortie des deux voies d'un ensemble stéréophonique.
in scheme: Acoustique
in scheme: Audiovisuel
in scheme: concepts
notation: CULT15
related: équilibreur avant-arrière

bande mère
type: ConceptConcept
type: Concept
creator: Commission d'enrichissement de la langue française, FranceTerme
source: révision de l'arrêté du 24 janvier 1983
date parution JO: 2000-09-22
equivalent EN: master @en
equivalent EN: master (en)
definition: Bande originale de montage.
in scheme: Audiovisuel
in scheme: concept-SD-audiovisuel-video
in scheme: concepts
notation: CULT16
related: matriçage
related: matricer

bande vidéo
type: ConceptConcept
type: Concept
creator: Commission d'enrichissement de la langue française, FranceTerme
source: révision de l'arrêté du 24 janvier 1983
date parution JO: 2000-09-22
equivalent EN: video tape @en
equivalent EN: video tape (en)
definition: Bande magnétique servant à l'enregistrement des images et du son.
in scheme: Audiovisuel
in scheme: concept-SD-audiovisuel-television
in scheme: concept-SD-audiovisuel-video
in scheme: concepts
notation: CULT17

base de campagne
type: ConceptConcept
type: Concept
creator: Commission d'enrichissement de la langue française, FranceTerme
source: révision de l'arrêté du 24 janvier 1983
date parution JO: 2000-09-22
equivalent EN: copy platform @en
equivalent EN: copy platform (en)
definition: Ensemble de réflexions qui permet de passer à la réalisation d'une campagne publicitaire.
in scheme: Communication
in scheme: concept-SD-communication-publicite
in scheme: concepts
notation: CULT18

bénéfice publicitaire
type: ConceptConcept
type: Concept
creator: Commission d'enrichissement de la langue française, FranceTerme
source: révision de l'arrêté du 10 octobre 1985
date parution JO: 2000-09-22
equivalent EN: brand benefit acceptance @en
equivalent EN: brand benefit acceptance (en)
definition: Contribution évaluable de la publicité à l'amélioration de l'image de marque d'une société ou d'un produit.
in scheme: Communication
in scheme: concept-SD-communication-publicite
in scheme: concepts
notation: CULT19

accroc
type: ConceptConcept
type: Concept
creator: Commission d'enrichissement de la langue française, FranceTerme
source: révision de l'arrêté du 10 octobre 1985
date parution JO: 2000-09-22
equivalent EN: scratch @en
equivalent EN: scratch (en)
part of speech: nom masculin
definition: Détérioration localisée d'un support d'enregistrement qui se traduit par une perte de l'information ou l'apparition d'un signal parasite.
in scheme: Audiovisuel
in scheme: concepts
notation: CULT2
note: Selon la nature du défaut, on utilise divers termes imagés comme « clic », « crac », « tache », « éclair », « crachement » ou « cerne ».

bras tangentiel
type: ConceptConcept
type: Concept
creator: Commission d'enrichissement de la langue française, FranceTerme
source: révision de l'arrêté du 10 octobre 1985
date parution JO: 2000-09-22
equivalent EN: tangential arm @en
equivalent EN: tangential arm (en)
definition: Bras de lecture d'un tourne-disque qui se déplace sans pivotement, de façon à maintenir le plan symétrique du lecteur tangent à l'axe du sillon.
in scheme: Audiovisuel
in scheme: concepts
notation: CULT20
related: erreur de piste

bureau
type: ConceptConcept
type: Concept
creator: Commission d'enrichissement de la langue française, FranceTerme
source: révision de l'arrêté du 10 octobre 1985
date parution JO: 2000-09-22
equivalent EN: desk @en
equivalent EN: desk (en)
part of speech: nom masculin
definition: Délégation décentralisée d'une agence de presse, d'un journal ou d'un organisme de radiodiffusion ou de télévision.
in scheme: Audiovisuel
in scheme: Communication
in scheme: concepts
notation: CULT21

bureau des dépêches
type: ConceptConcept
type: Concept
creator: Commission d'enrichissement de la langue française, FranceTerme
source: révision de l'arrêté du 10 octobre 1985
date parution JO: 2000-09-22
equivalent EN: desk @en
equivalent EN: desk (en)
alternative label: salle des dépêches
definition: Salle des téléscripteurs, du classement des dépêches et parfois de la documentation.
in scheme: Audiovisuel
in scheme: Communication
in scheme: concepts
notation: CULT22
related: salle de rédaction

câbliste
type: ConceptConcept
type: Concept
creator: Commission d'enrichissement de la langue française, FranceTerme
source: révision de l'arrêté du 24 janvier 1983
date parution JO: 2000-09-22
equivalent EN: cableperson @en
equivalent EN: cableperson (en)
part of speech: nom
definition: Personne chargée de manipuler les câbles d'une caméra lors de ses déplacements dans une prise de vues.
in scheme: Audiovisuel
in scheme: concept-SD-audiovisuel-cinema
in scheme: concept-SD-audiovisuel-television
in scheme: concepts
notation: CULT23

cadreur, -euse
type: ConceptConcept
type: Concept
creator: Commission d'enrichissement de la langue française, FranceTerme
source: révision de l'arrêté du 24 janvier 1983
date parution JO: 2000-09-22
equivalent EN: camera operator @en
equivalent EN: camera operator (en)
equivalent EN: camera person @en
equivalent EN: camera person (en)
part of speech: nom
alternative label: opérateur, -trice de prises de vues
definition: Responsable de la caméra et du cadrage des images, sous l'autorité du directeur de la photographie.
in scheme: Audiovisuel
in scheme: concept-SD-audiovisuel-cinema
in scheme: concepts
notation: CULT24

caméscope
type: ConceptConcept
type: Concept
creator: Commission d'enrichissement de la langue française, FranceTerme
source: révision de l'arrêté du 10 octobre 1985
date parution JO: 2000-09-22
deconseille ou frequent: Betacam
deconseille ou frequent: Camscope
equivalent EN: camcorder @en
equivalent EN: camcorder (en)
equivalent EN: camrecorder @en
equivalent EN: camrecorder (en)
part of speech: nom masculin
definition: Appareil portatif qui intègre dans le même boîtier une caméra électronique et un magnétoscope.
in scheme: Audiovisuel
in scheme: concepts
notation: CULT25
note: Les termes Camscope et Betacam, qui sont des noms de marques déposées, ne doivent pas être employés.

carton publicitaire
type: ConceptConcept
type: Concept
creator: Commission d'enrichissement de la langue française, FranceTerme
source: révision de l'arrêté du 24 janvier 1983
date parution JO: 2000-09-22
equivalent EN: display @en
equivalent EN: display (en)
forme abregee: carton, n.m.
definition: Matériel publicitaire destiné à la vitrine ou à l'étalage.
in scheme: Communication
in scheme: concept-SD-communication-publicite
in scheme: concepts
notation: CULT26

ciné-parc
type: ConceptConcept
type: Concept
creator: Commission d'enrichissement de la langue française, FranceTerme
source: révision de l'arrêté du 24 janvier 1983
date parution JO: 2000-09-22
equivalent EN: drive-in cinema @en
equivalent EN: drive-in cinema (en)
part of speech: nom masculin
definition: Cinéma de plein air où le spectateur assiste à la projection assis dans sa voiture.
in scheme: Audiovisuel
in scheme: concepts
notation: CULT27

code temporel
type: ConceptConcept
type: Concept
creator: Commission d'enrichissement de la langue française, FranceTerme
source: révision de l'arrêté du 24 janvier 1983
date parution JO: 2000-09-22
deconseille ou frequent: timecode
equivalent EN: time code @en
equivalent EN: time code (en)
definition: Code électronique permettant de fournir ou d'obtenir des indications de temps sur une bande vidéo.
in scheme: Audiovisuel
in scheme: concept-SD-audiovisuel-television
in scheme: concept-SD-audiovisuel-video
in scheme: concepts
notation: CULT28

conditionnement
type: ConceptConcept
type: Concept
creator: Commission d'enrichissement de la langue française, FranceTerme
source: révision de l'arrêté du 10 octobre 1985
date parution JO: 2000-09-22
equivalent EN: package @en
equivalent EN: package (en)
part of speech: nom masculin
definition: Action de conditionner.
in scheme: Économie et gestion d'entreprise
in scheme: concepts
notation: CULT29

accroche
type: ConceptConcept
type: Concept
creator: Commission d'enrichissement de la langue française, FranceTerme
source: révision de l'arrêté du 24 janvier 1983
date parution JO: 2000-09-22
equivalent EN: catching @en
equivalent EN: catching (en)
equivalent EN: catchline @en
equivalent EN: catchline (en)
part of speech: nom féminin
definition: Partie d'une annonce publicitaire, généralement le titre, attirant l'attention.
in scheme: Communication
in scheme: concept-SD-communication-publicite
in scheme: concepts
notation: CULT3
related: corps d'annonce
related: signature

conducteur
type: ConceptConcept
type: Concept
creator: Commission d'enrichissement de la langue française, FranceTerme
source: révision de l'arrêté du 24 janvier 1983
date parution JO: 2000-09-22
equivalent EN: cue sheet @en
equivalent EN: cue sheet (en)
part of speech: nom masculin
definition: Liste écrite ou informatisée donnant l'ordre chronologique des séquences d'un programme audiovisuel.
in scheme: Audiovisuel
in scheme: concept-SD-audiovisuel-television
in scheme: concept-SD-audiovisuel-video
in scheme: concepts
notation: CULT30

copie d'antenne
type: ConceptConcept
type: Concept
creator: Commission d'enrichissement de la langue française, FranceTerme
source: révision de l'arrêté du 24 janvier 1983
date parution JO: 2000-09-22
equivalent EN: air print @en
equivalent EN: air print (en)
equivalent EN: release print @en
equivalent EN: release print (en)
alternative label: copie pour antenne
definition: Copie d'un enregistrement sur film ou sur bande magnétique, spécifiquement destinée à la diffusion par un émetteur de radiodiffusion sonore ou de télévision.
in scheme: Audiovisuel
in scheme: concept-SD-audiovisuel-television
in scheme: concept-SD-audiovisuel-video
in scheme: concepts
notation: CULT31

copie de diffusion
type: ConceptConcept
type: Concept
creator: Commission d'enrichissement de la langue française, FranceTerme
source: révision de l'arrêté du 24 janvier 1983
date parution JO: 2000-09-22
definition: Copie d'un enregistrement sur film ou sur bande magnétique, spécifiquement destinée à la diffusion quel qu'en soit le moyen.
in scheme: Audiovisuel
in scheme: concepts
notation: CULT32

couper sec
type: ConceptConcept
type: Concept
creator: Commission d'enrichissement de la langue française, FranceTerme
source: révision de l'arrêté du 24 janvier 1983
date parution JO: 2000-09-22
deconseille ou frequent: to cut
equivalent EN: cut @en
equivalent EN: cut (en)
definition: Faire une coupure brusque et nette du plan sonore ou visuel.
in scheme: Audiovisuel
in scheme: concept-SD-audiovisuel-cinema
in scheme: concept-SD-audiovisuel-television
in scheme: concepts
notation: CULT33

couponnage
type: ConceptConcept
type: Concept
creator: Commission d'enrichissement de la langue française, FranceTerme
source: révision de l'arrêté du 10 octobre 1985
date parution JO: 2000-09-22
equivalent EN: couponing @en
equivalent EN: couponing (en)
part of speech: nom masculin
definition: Opération qui consiste à promouvoir un produit ou un service à l'aide d'un coupon-réponse.
in scheme: Communication
in scheme: concept-SD-communication-publicite
in scheme: concepts
notation: CULT34

débordement
type: ConceptConcept
type: Concept
creator: Commission d'enrichissement de la langue française, FranceTerme
source: révision de l'arrêté du 24 janvier 1983
date parution JO: 2000-09-22
equivalent EN: overlap @en
equivalent EN: overlap (en)
part of speech: nom masculin
definition: Partie de la diffusion publicitaire dont la zone de couverture déborde du territoire prévu par le plan de campagne.
in scheme: Communication
in scheme: concept-SD-communication-publicite
in scheme: concepts
notation: CULT35

décodeur
type: ConceptConcept
type: Concept
creator: Commission d'enrichissement de la langue française, FranceTerme
source: révision de l'arrêté du 10 octobre 1985
date parution JO: 2000-09-22
equivalent EN: decoder @en
equivalent EN: decoder (en)
part of speech: nom masculin
definition: Dispositif destiné à extraire et à reconstituer un ou plusieurs signaux utiles à partir d'un signal codé.
in scheme: Audiovisuel
in scheme: concepts
notation: CULT36
related: concept-TELE356

décodeur stéréophonique
type: ConceptConcept
type: Concept
creator: Commission d'enrichissement de la langue française, FranceTerme
source: révision de l'arrêté du 10 octobre 1985
date parution JO: 2000-09-22
equivalent EN: stereophonic decoder @en
equivalent EN: stereophonic decoder (en)
definition: Circuit permettant de séparer les signaux des voies gauche et droite, transmis sous forme d'une émission stéréophonique.
in scheme: Acoustique
in scheme: Audiovisuel
in scheme: concepts
notation: CULT37

architecture paysagère
type: ConceptConcept
type: Concept
creator: Commission d'enrichissement de la langue française, FranceTerme
date parution JO: 1998-12-16
equivalent EN: landscape architecture @en
equivalent EN: landscape architecture (en)
definition: Composition ordonnée d'espaces extérieurs, le plus souvent à dominante végétale.
in scheme: Aménagement et urbanisme
in scheme: Arts
in scheme: concept-SD-amenagement-et-urbanisme-art-des-jardins
in scheme: concept-SD-arts-art-des-jardins
in scheme: concepts
notation: CULT376

dalle
type: ConceptConcept
type: Concept
creator: Commission d'enrichissement de la langue française, FranceTerme
date parution JO: 1998-12-16
equivalent EN: suspended slab @en
equivalent EN: suspended slab (en)
part of speech: nom féminin
definition: Sol artificiel surélevé permettant des circulations séparées sur plusieurs niveaux.
in scheme: Aménagement et urbanisme
in scheme: concepts
notation: CULT377

épannelage
type: ConceptConcept
type: Concept
creator: Commission d'enrichissement de la langue française, FranceTerme
date parution JO: 1998-12-16
part of speech: nom masculin
definition: Forme simplifiée des masses bâties constitutives d'un tissu urbain.
in scheme: Aménagement et urbanisme
in scheme: concepts
notation: CULT378

friche industrielle
type: ConceptConcept
type: Concept
creator: Commission d'enrichissement de la langue française, FranceTerme
date parution JO: 1998-12-16
deconseille ou frequent: brownfield
equivalent EN: derelict land @en
equivalent EN: derelict land (en)
equivalent EN: vacant industrial land @en
equivalent EN: vacant industrial land (en)
definition: Terrain sur lequel subsistent des installations industrielles à l'abandon.
in scheme: Aménagement et urbanisme
in scheme: concepts
notation: CULT379
related: friche urbaine
related: zone de friche

désynchronisation ponctuelle
type: ConceptConcept
type: Concept
creator: Commission d'enrichissement de la langue française, FranceTerme
source: révision de l'arrêté du 24 janvier 1983
date parution JO: 2000-09-22
equivalent EN: audio-video split @en
equivalent EN: audio-video split (en)
definition: Décalage du son par rapport à l'image en un point de montage.
in scheme: Audiovisuel
in scheme: concept-SD-audiovisuel-video
in scheme: concepts
notation: CULT38

aigu
type: ConceptConcept
type: Concept
creator: Commission d'enrichissement de la langue française, FranceTerme
source: révision de l'arrêté du 10 octobre 1985
date parution JO: 2000-09-22
equivalent EN: treble @en
equivalent EN: treble (en)
part of speech: nom masculin ou adjectif
in scheme: Acoustique
in scheme: Audiovisuel
in scheme: concepts
notation: CULT384
related: grave

faire le point
type: ConceptConcept
type: Concept
creator: Commission d'enrichissement de la langue française, FranceTerme
source: révision de l'arrêté du 10 octobre 1985
date parution JO: 2000-09-22
deconseille ou frequent: to round-up
equivalent EN: round-up @en
equivalent EN: round-up (en)
in scheme: Audiovisuel
in scheme: concept-SD-audiovisuel-radio
in scheme: concept-SD-audiovisuel-television
in scheme: concepts
notation: CULT389

grave
type: ConceptConcept
type: Concept
creator: Commission d'enrichissement de la langue française, FranceTerme
source: révision de l'arrêté du 10 octobre 1985
date parution JO: 2000-09-22
equivalent EN: bass @en
equivalent EN: bass (en)
part of speech: nom masculin ou adjectif
in scheme: Acoustique
in scheme: Audiovisuel
in scheme: concepts
notation: CULT391
related: aigu

interlude
type: ConceptConcept
type: Concept
creator: Commission d'enrichissement de la langue française, FranceTerme
source: révision de l'arrêté du 10 octobre 1985
date parution JO: 2000-09-22
equivalent EN: fill-in @en
equivalent EN: fill-in (en)
part of speech: nom masculin
in scheme: Audiovisuel
in scheme: concept-SD-audiovisuel-radio
in scheme: concept-SD-audiovisuel-television
in scheme: concepts
notation: CULT392

multimédia
type: ConceptConcept
type: Concept
creator: Commission d'enrichissement de la langue française, FranceTerme
source: révision de l'arrêté du 24 janvier 1983
date parution JO: 2000-09-22
equivalent EN: multimedia @en
equivalent EN: multimedia (en)
part of speech: adjectif
in scheme: Audiovisuel
in scheme: Télécommunications
in scheme: concepts
notation: CULT393
note: Pluriel : multimédias.
related: média

palmarès
type: ConceptConcept
type: Concept
creator: Commission d'enrichissement de la langue française, FranceTerme
source: révision de l'arrêté du 10 octobre 1985
date parution JO: 2000-09-22
equivalent EN: hit parade @en
equivalent EN: hit parade (en)
part of speech: nom masculin
in scheme: Audiovisuel
in scheme: concepts
notation: CULT395

radiocassette
type: ConceptConcept
type: Concept
creator: Commission d'enrichissement de la langue française, FranceTerme
source: révision de l'arrêté du 24 janvier 1983
date parution JO: 2000-09-22
equivalent EN: radiorecorder @en
equivalent EN: radiorecorder (en)
part of speech: nom féminin
in scheme: Audiovisuel
in scheme: Télécommunications
in scheme: concepts
notation: CULT396

réglage de vitesse
type: ConceptConcept
type: Concept
creator: Commission d'enrichissement de la langue française, FranceTerme
source: révision de l'arrêté du 10 octobre 1985
date parution JO: 2000-09-22
equivalent EN: pitch control @en
equivalent EN: pitch control (en)
in scheme: Audiovisuel
in scheme: concepts
notation: CULT397

salle de rédaction
type: ConceptConcept
type: Concept
creator: Commission d'enrichissement de la langue française, FranceTerme
source: révision de l'arrêté du 10 octobre 1985
date parution JO: 2000-09-22
equivalent EN: desk @en
equivalent EN: desk (en)
in scheme: Audiovisuel
in scheme: Communication
in scheme: concepts
notation: CULT398
related: bureau des dépêches

achat groupé
type: ConceptConcept
type: Concept
creator: Commission d'enrichissement de la langue française, FranceTerme
source: révision de l'arrêté du 24 janvier 1983
date parution JO: 2000-09-22
equivalent EN: package @en
equivalent EN: package (en)
definition: Achat d'un ensemble de programmes à un même vendeur.
in scheme: Audiovisuel
in scheme: concepts
notation: CULT4

document
type: ConceptConcept
type: Concept
creator: Commission d'enrichissement de la langue française, FranceTerme
source: révision de l'arrêté du 24 janvier 1983
date parution JO: 2000-09-22
equivalent EN: artwork @en
equivalent EN: artwork (en)
part of speech: nom masculin
definition: Réalisation définitive avant reproduction.
in scheme: Communication
in scheme: concept-SD-communication-publicite
in scheme: concepts
notation: CULT40

transcrire
type: ConceptConcept
type: Concept
creator: Commission d'enrichissement de la langue française, FranceTerme
source: révision de l'arrêté du 24 janvier 1983
date parution JO: 2000-09-22
deconseille ou frequent: to transcribe
equivalent EN: transcribe @en
equivalent EN: transcribe (en)
part of speech: verbe
in scheme: Audiovisuel
in scheme: concept-SD-audiovisuel-cinema
in scheme: concept-SD-audiovisuel-television
in scheme: concepts
notation: CULT402

présentoir
type: ConceptConcept
type: Concept
creator: Commission d'enrichissement de la langue française, FranceTerme
source: révision de l'arrêté du 24 janvier 1983
date parution JO: 2000-09-22
equivalent EN: merchandiser @en
equivalent EN: merchandiser (en)
part of speech: nom masculin
in scheme: Communication
in scheme: concept-SD-communication-publicite
in scheme: concepts
notation: CULT404

test d'évaluation
type: ConceptConcept
type: Concept
creator: Commission d'enrichissement de la langue française, FranceTerme
source: révision de l'arrêté du 24 janvier 1983
date parution JO: 2000-09-22
equivalent EN: copy testing @en
equivalent EN: copy testing (en)
in scheme: Communication
in scheme: concepts
notation: CULT405

journal interne d'entreprise
type: ConceptConcept
type: Concept
creator: Commission d'enrichissement de la langue française, FranceTerme
source: révision de l'arrêté du 10 octobre 1985
date parution JO: 2000-09-22
equivalent EN: house organ @en
equivalent EN: house organ (en)
in scheme: Communication
in scheme: concepts
notation: CULT406

publicitaire
type: ConceptConcept
type: Concept
creator: Commission d'enrichissement de la langue française, FranceTerme
source: révision de l'arrêté du 24 janvier 1983
date parution JO: 2000-09-22
equivalent EN: advertising man @en
equivalent EN: advertising man (en)
part of speech: nom ou adjectif
in scheme: Communication
in scheme: concept-SD-communication-publicite
in scheme: concepts
notation: CULT407

droit d'antenne
type: ConceptConcept
type: Concept
creator: Commission d'enrichissement de la langue française, FranceTerme
source: révision de l'arrêté du 10 octobre 1985
date parution JO: 2000-09-22
equivalent EN: broadcasting right @en
equivalent EN: broadcasting right (en)
alternative label: droit de diffusion
definition: Droit protégeant la transmission d'une émission.
in scheme: Audiovisuel
in scheme: concept-SD-audiovisuel-radio
in scheme: concept-SD-audiovisuel-television
in scheme: concepts
notation: CULT41

friche urbaine
type: ConceptConcept
type: Concept
creator: Commission d'enrichissement de la langue française, FranceTerme
date parution JO: 1998-12-16
equivalent EN: waste land @en
equivalent EN: waste land (en)
definition: Terrain laissé à l'abandon, ou utilisé à titre transitoire, en milieu urbain, dans l'attente d'une nouvelle occupation.
in scheme: Aménagement et urbanisme
in scheme: concepts
notation: CULT415
related: friche industrielle
related: zone de friche

marina
type: ConceptConcept
type: Concept
creator: Commission d'enrichissement de la langue française, FranceTerme
date parution JO: 1998-12-16
equivalent EN: marina @en
equivalent EN: marina (en)
part of speech: nom féminin
definition: Ensemble résidentiel construit en bord de mer, intégrant le plus souvent un port de plaisance aménagé.
in scheme: Aménagement et urbanisme
in scheme: Tourisme
in scheme: concepts
notation: CULT418

mégapole
type: ConceptConcept
type: Concept
creator: Commission d'enrichissement de la langue française, FranceTerme
date parution JO: 1998-12-16
deconseille ou frequent: conurbation
deconseille ou frequent: mégalopole
equivalent EN: megalopolis @en
equivalent EN: megalopolis (en)
part of speech: nom féminin
definition: Très grande agglomération, comportant plusieurs millions d'habitants.
in scheme: Aménagement et urbanisme
in scheme: concepts
notation: CULT419
note: 1. La réunion de plusieurs villes est généralement appelée « conurbation ».
note: 2. On dit aussi « mégalopole ».

duplex
type: ConceptConcept
type: Concept
creator: Commission d'enrichissement de la langue française, FranceTerme
source: révision de l'arrêté du 10 octobre 1985
date parution JO: 2000-09-22
equivalent EN: duplex @en
equivalent EN: duplex (en)
equivalent EN: two-way @en
equivalent EN: two-way (en)
part of speech: nom masculin
definition: Liaison ou transmission qui fonctionne entre deux points.
in scheme: Audiovisuel
in scheme: concepts
notation: CULT42

mobilier urbain
type: ConceptConcept
type: Concept
creator: Commission d'enrichissement de la langue française, FranceTerme
date parution JO: 1998-12-16
equivalent EN: street furniture @en
equivalent EN: street furniture (en)
definition: Ensemble des équipements de l'espace public liés à la circulation, à l'éclairage, à la propreté, au confort, à la publicité, etc.
in scheme: Aménagement et urbanisme
in scheme: concepts
notation: CULT422

correction physiologique
type: ConceptConcept
type: Concept
creator: Commission d'enrichissement de la langue française, FranceTerme
source: révision de l'arrêté du 5 octobre 1984
date parution JO: 2000-09-22
deconseille ou frequent: contour
equivalent EN: loudness @en
equivalent EN: loudness (en)
definition: Sur un amplificateur de haute fidélité, dispositif permettant de relever le niveau sonore d'une bande de fréquences, des graves aux aiguës.
in scheme: Acoustique
in scheme: Audiovisuel
in scheme: concepts
notation: CULT423
note: 1. La correction physiologique se fonde sur un spectre préétabli adapté à la physiologie de l'oreille humaine.
note: 2. Le synonyme « contour » est aujourd'hui désuet.

duplex (en mode)
type: ConceptConcept
type: Concept
creator: Commission d'enrichissement de la langue française, FranceTerme
source: révision de l'arrêté du 10 octobre 1985
date parution JO: 2000-09-22
deconseille ou frequent: duplex
deconseille ou frequent: en duplex
deconseille ou frequent: en mode duplex
equivalent EN: link-up @en
equivalent EN: link-up (en)
forme abregee: duplex (en)
part of speech: locution
definition: Se dit d'une liaison ou d'une transmission qui fonctionne entre deux points.
in scheme: Audiovisuel
in scheme: concepts
notation: CULT43
note: Exemples : une communication en mode duplex ; une communication en duplex.

audition
type: ConceptConcept
type: Concept
creator: Commission d'enrichissement de la langue française, FranceTerme
date parution JO: 2005-01-18
equivalent EN: casting @en
equivalent EN: casting (en)
part of speech: nom féminin
definition: Mode de sélection des artistes susceptibles de tenir les rôles d'un film, d'une pièce de théâtre ou d'un programme.
in scheme: Arts
in scheme: Audiovisuel
in scheme: concept-SD-arts-arts-de-la-scene
in scheme: concept-SD-audiovisuel-arts-de-la-scene
in scheme: concepts
notation: CULT430
related: distribution
related: régisseur de distribution
scope note: Cette publication annule et remplace celle du terme « distribution » au Journal officiel du 22 septembre 2000.

avant-première
type: ConceptConcept
type: Concept
creator: Commission d'enrichissement de la langue française, FranceTerme
date parution JO: 2005-01-18
equivalent EN: preview @en
equivalent EN: preview (en)
part of speech: nom féminin
definition: Projection d'un film devant un public restreint, destinée à recueillir les impressions des spectateurs avant la sortie en salle.
in scheme: Audiovisuel
in scheme: concept-SD-audiovisuel-cinema
in scheme: concepts
notation: CULT432
related: projection corporative

avant-soirée
type: ConceptConcept
type: Concept
creator: Commission d'enrichissement de la langue française, FranceTerme
date parution JO: 2005-01-18
deconseille ou frequent: access primetime
equivalent EN: access prime time @en
equivalent EN: access prime time (en)
part of speech: nom féminin
definition: Tranche horaire qui précède les heures de grande écoute.
in scheme: Audiovisuel
in scheme: concept-SD-audiovisuel-television
in scheme: concepts
notation: CULT433
related: heure de grande écoute
related: créneau de jour

avatar
type: ConceptConcept
type: Concept
creator: Commission d'enrichissement de la langue française, FranceTerme
date parution JO: 2005-01-18
equivalent EN: avatar @en
equivalent EN: avatar (en)
part of speech: nom masculin
definition: Personnage ou objet de synthèse évoluant dans un décor réel.
in scheme: Audiovisuel
in scheme: concept-SD-audiovisuel-infographie
in scheme: concepts
notation: CULT434
related: capture de mouvement
related: capture de jeu

comédie de situation
type: ConceptConcept
type: Concept
creator: Commission d'enrichissement de la langue française, FranceTerme
abbreviation: sitcom @en
date parution JO: 2005-01-18
deconseille ou frequent: sitcom
equivalent EN: sitcom @en
equivalent EN: sitcom (en)
equivalent EN: situation comedy @en
equivalent EN: situation comedy (en)
definition: Comédie de mœurs en plusieurs épisodes autonomes et comportant des personnages récurrents.
in scheme: Audiovisuel
in scheme: concept-SD-audiovisuel-television
in scheme: concepts
notation: CULT435

corps d'annonce
type: ConceptConcept
type: Concept
creator: Commission d'enrichissement de la langue française, FranceTerme
date parution JO: 2005-01-18
equivalent EN: body copy @en
equivalent EN: body copy (en)
definition: Texte constituant la partie informative d'un message publicitaire imprimé.
in scheme: Communication
in scheme: concept-SD-communication-publicite
in scheme: concepts
notation: CULT436
related: accroche
related: signature

débat-spectacle
type: ConceptConcept
type: Concept
creator: Commission d'enrichissement de la langue française, FranceTerme
date parution JO: 2005-01-18
equivalent EN: talk-show @en
equivalent EN: talk-show (en)
part of speech: nom masculin
definition: Émission de divertissement consistant en une discussion sur des sujets de société entre un animateur et ses invités.
in scheme: Audiovisuel
in scheme: concept-SD-audiovisuel-television
in scheme: concepts
notation: CULT437
related: émission-débat

diffusion multisupport
type: ConceptConcept
type: Concept
creator: Commission d'enrichissement de la langue française, FranceTerme
abbreviation: simulcast @en
date parution JO: 2005-01-18
equivalent EN: simulcast @en
equivalent EN: simulcast (en)
equivalent EN: simultaneous broadcasting @en
equivalent EN: simultaneous broadcasting (en)
definition: Émission simultanée d'un même programme sur des supports de diffusion différents.
in scheme: Audiovisuel
in scheme: concept-SD-audiovisuel-radio
in scheme: concept-SD-audiovisuel-television
in scheme: concepts
notation: CULT439

écran acoustique
type: ConceptConcept
type: Concept
creator: Commission d'enrichissement de la langue française, FranceTerme
source: révision de l'arrêté du 10 octobre 1985
date parution JO: 2000-09-22
equivalent EN: baffle @en
equivalent EN: baffle (en)
definition: Surface destinée à limiter la propagation d'une onde acoustique.
in scheme: Acoustique
in scheme: Audiovisuel
in scheme: concepts
notation: CULT44
related: enceinte acoustique
related: concept-acoustique

distribution
type: ConceptConcept
type: Concept
creator: Commission d'enrichissement de la langue française, FranceTerme
date parution JO: 2005-01-18
equivalent EN: cast @en
equivalent EN: cast (en)
part of speech: nom féminin
definition: Ensemble des artistes choisis pour tenir les rôles d'un film, d'une pièce de théâtre ou d'un programme.
in scheme: Arts
in scheme: Audiovisuel
in scheme: concept-SD-arts-arts-de-la-scene
in scheme: concept-SD-audiovisuel-arts-de-la-scene
in scheme: concepts
notation: CULT440
related: audition
related: régisseur de distribution
scope note: Cette publication annule et remplace celle du Journal officiel du 22 septembre 2000.

émission-débat
type: ConceptConcept
type: Concept
creator: Commission d'enrichissement de la langue française, FranceTerme
date parution JO: 2005-01-18
equivalent EN: talk-show @en
equivalent EN: talk-show (en)
part of speech: nom féminin
definition: Émission consistant en une discussion sur des sujets de société entre un animateur et ses invités.
in scheme: Audiovisuel
in scheme: concept-SD-audiovisuel-radio
in scheme: concept-SD-audiovisuel-television
in scheme: concepts
notation: CULT441
related: débat-spectacle

esquisseur, -euse
type: ConceptConcept
type: Concept
creator: Commission d'enrichissement de la langue française, FranceTerme
date parution JO: 2005-01-18
equivalent EN: roughman @en
equivalent EN: roughman (en)
part of speech: nom
definition: Dessinateur chargé de réaliser des esquisses à la demande.
in scheme: Communication
in scheme: concept-SD-communication-publicite
in scheme: concepts
notation: CULT442
related: esquisse

heure de grande écoute
type: ConceptConcept
type: Concept
creator: Commission d'enrichissement de la langue française, FranceTerme
date parution JO: 2005-01-18
deconseille ou frequent: heures de grande écoute
deconseille ou frequent: primetime
equivalent EN: prime time @en
equivalent EN: prime time (en)
definition: Tranche horaire où l'audience est la plus forte.
in scheme: Audiovisuel
in scheme: concept-SD-audiovisuel-television
in scheme: concepts
notation: CULT443
related: avant-soirée
related: créneau de jour

hors média
type: ConceptConcept
type: Concept
creator: Commission d'enrichissement de la langue française, FranceTerme
date parution JO: 2005-01-18
equivalent EN: below the line @en
equivalent EN: below the line (en)
part of speech: locution adjectivale
definition: Se dit de la partie d'un budget de production consacrée aux actions annexes à la réalisation artistique d'une œuvre.
in scheme: Audiovisuel
in scheme: concept-SD-audiovisuel-cinema
in scheme: concepts
notation: CULT444
note: Ce terme est parfois employé comme substantif : hors-média.

hors média
type: ConceptConcept
type: Concept
creator: Commission d'enrichissement de la langue française, FranceTerme
date parution JO: 2005-01-18
equivalent EN: below the line @en
equivalent EN: below the line (en)
part of speech: locution adjectivale
definition: Se dit d'une opération de communication qui ne fait pas appel aux principaux supports d'information.
in scheme: Communication
in scheme: concepts
notation: CULT445
note: Ce terme est parfois employé comme substantif : hors-média.

indicatif
type: ConceptConcept
type: Concept
creator: Commission d'enrichissement de la langue française, FranceTerme
date parution JO: 2005-01-18
deconseille ou frequent: jingle
equivalent EN: signature tune @en
equivalent EN: signature tune (en)
part of speech: nom masculin
definition: Courte séquence sonore qui permet l'identification d'une émission régulière.
in scheme: Audiovisuel
in scheme: concepts
notation: CULT446
note: Le terme jingle ne doit pas être employé.
related: concept-TELE357
scope note: Cette publication annule et remplace celle du Journal officiel du 22 septembre 2000.

lettre d'information
type: ConceptConcept
type: Concept
creator: Commission d'enrichissement de la langue française, FranceTerme
date parution JO: 2005-01-18
deconseille ou frequent: info-lettre
deconseille ou frequent: infolettre
equivalent EN: newsletter @en
equivalent EN: newsletter (en)
definition: Périodique d'information destiné à un public déterminé.
in scheme: Communication
in scheme: concepts
notation: CULT447
related: concept-communication

marbre
type: ConceptConcept
type: Concept
creator: Commission d'enrichissement de la langue française, FranceTerme
date parution JO: 2005-01-18
part of speech: nom masculin
definition: Support enregistré d'une émission prête à être diffusée.
in scheme: Audiovisuel
in scheme: concept-SD-audiovisuel-radio
in scheme: concept-SD-audiovisuel-television
in scheme: concepts
notation: CULT449

effaceur total
type: ConceptConcept
type: Concept
creator: Commission d'enrichissement de la langue française, FranceTerme
source: révision de l'arrêté du 10 octobre 1985
date parution JO: 2000-09-22
equivalent EN: bulk eraser @en
equivalent EN: bulk eraser (en)
definition: Dispositif destiné à effacer le contenu d'une bande magnétique sans procéder à son déroulement.
in scheme: Audiovisuel
in scheme: concepts
notation: CULT45

matriçage
type: ConceptConcept
type: Concept
creator: Commission d'enrichissement de la langue française, FranceTerme
date parution JO: 2005-01-18
deconseille ou frequent: PAD
deconseille ou frequent: prêt à diffuser
deconseille ou frequent: prête à diffuser
equivalent EN: mastering @en
equivalent EN: mastering (en)
part of speech: nom masculin
definition: Réunion, sur une seule bande mère, du montage de l'image et du son à la fin de la production d'un film ou d'une vidéo.
in scheme: Audiovisuel
in scheme: concept-SD-audiovisuel-video
in scheme: concepts
notation: CULT450
note: Peut aussi s'appliquer à la confection, à partir de la bande mère, d'une bande destinée à la diffusion télévisuelle dite « PAD (prêt à diffuser) ».
related: bande mère

matricer
type: ConceptConcept
type: Concept
creator: Commission d'enrichissement de la langue française, FranceTerme
date parution JO: 2005-01-18
deconseille ou frequent: mastériser
deconseille ou frequent: to make a master
equivalent EN: make a master @en
equivalent EN: make a master (en)
part of speech: verbe
definition: Réunir sur une seule bande mère le montage de l'image et du son à la fin de la production d'un film ou d'une vidéo.
in scheme: Audiovisuel
in scheme: concept-SD-audiovisuel-video
in scheme: concepts
notation: CULT451
note: Le terme « mastériser », utilisé dans le langage professionnel, est déconseillé.
related: bande mère
related: rematricer

multiplexe
type: ConceptConcept
type: Concept
creator: Commission d'enrichissement de la langue française, FranceTerme
date parution JO: 2005-01-18
equivalent EN: multiplex @en
equivalent EN: multiplex (en)
part of speech: nom masculin
definition: Ensemble de salles de projection cinématographique et d'espaces commerciaux établis sous un même toit et exploités sous une même enseigne.
in scheme: Audiovisuel
in scheme: concept-SD-audiovisuel-cinema
in scheme: concepts
notation: CULT452
note: Ne pas confondre avec « multiplex », dans le domaine des télécommunications.

obligation de diffusion
type: ConceptConcept
type: Concept
creator: Commission d'enrichissement de la langue française, FranceTerme
date parution JO: 2005-01-18
equivalent EN: must carry @en
equivalent EN: must carry (en)
definition: Obligation contractuelle incombant à un opérateur de réseau de communications électroniques de diffuser un programme particulier.
in scheme: Audiovisuel
in scheme: Télécommunications
in scheme: concepts
notation: CULT453

paiement à la séance
type: ConceptConcept
type: Concept
creator: Commission d'enrichissement de la langue française, FranceTerme
abbreviation: PPV @en
date parution JO: 2005-01-18
equivalent EN: PPV @en
equivalent EN: PPV (en)
equivalent EN: pay-per-view @en
equivalent EN: pay-per-view (en)
definition: Option qui permet à l'abonné de réseaux câblés ou de bouquets satellitaires de choisir contre paiement certaines émissions.
in scheme: Audiovisuel
in scheme: Télécommunications
in scheme: concept-SD-audiovisuel-internet
in scheme: concept-SD-telecommunications-internet
in scheme: concepts
notation: CULT454
related: concept-TELE104

papillon
type: ConceptConcept
type: Concept
creator: Commission d'enrichissement de la langue française, FranceTerme
date parution JO: 2005-01-18
deconseille ou frequent: Post-it
equivalent EN: post-it note @en
equivalent EN: post-it note (en)
equivalent EN: stick note @en
equivalent EN: stick note (en)
part of speech: nom masculin
definition: Petit papier détachable à bande semi-adhésive.
in scheme: Tous domaines
in scheme: concepts
notation: CULT456
note: « Post-it », qui est un nom de marque, ne doit pas être employé.

égaliseur
type: ConceptConcept
type: Concept
creator: Commission d'enrichissement de la langue française, FranceTerme
source: révision de l'arrêté du 24 janvier 1983
date parution JO: 2000-09-22
equivalent EN: equalizer @en
equivalent EN: equalizer (en)
part of speech: nom masculin
definition: Ensemble électronique possédant un grand nombre de réglages de tonalité permettant de modeler, au gré de l'utilisateur, la courbe de réponse d'un amplificateur.
in scheme: Acoustique
in scheme: Audiovisuel
in scheme: concepts
notation: CULT46

pause
type: ConceptConcept
type: Concept
creator: Commission d'enrichissement de la langue française, FranceTerme
date parution JO: 2005-01-18
equivalent EN: pause @en
equivalent EN: pause (en)
part of speech: nom féminin
definition: Fonction permettant d'interrompre le visionnage d'un programme de télévision diffusé en continu et de le reprendre ultérieurement au point d'interruption en différé.
in scheme: Audiovisuel
in scheme: concept-SD-audiovisuel-television
in scheme: concepts
notation: CULT461
note: Ce même mot désigne une fonction propre à un magnétoscope.

portfolio
type: ConceptConcept
type: Concept
creator: Commission d'enrichissement de la langue française, FranceTerme
date parution JO: 2005-01-18
deconseille ou frequent: book
equivalent EN: portfolio @en
equivalent EN: portfolio (en)
part of speech: nom masculin
definition: Dossier, en partie photographique ou illustré, constitué par un professionnel des arts ou de la mode en vue de présenter ses travaux ou de promouvoir ses activités.
in scheme: Communication
in scheme: concepts
notation: CULT462
note: Il est déconseillé d'employer le terme book.

présonorisation
type: ConceptConcept
type: Concept
creator: Commission d'enrichissement de la langue française, FranceTerme
date parution JO: 2005-01-18
deconseille ou frequent: play-back
deconseille ou frequent: sur-jeu
equivalent EN: playback @en
equivalent EN: playback (en)
forme abregee: présono, n.f.
alternative label: préenregistrement
definition: Technique cinématographique ou de télévision qui consiste à enregistrer le son avant l'image afin que le ou les interprètes puissent mimer les gestes et les attitudes exigés par la bande sonore.
in scheme: Audiovisuel
in scheme: concept-SD-audiovisuel-cinema
in scheme: concept-SD-audiovisuel-television
in scheme: concepts
notation: CULT463
note: Le néologisme « sur-jeu » n'est pas utilisé.

projection corporative
type: ConceptConcept
type: Concept
creator: Commission d'enrichissement de la langue française, FranceTerme
date parution JO: 2005-01-18
equivalent EN: preview @en
equivalent EN: preview (en)
definition: Projection privée d'un film destinée aux professionnels de la production, de la distribution et de la presse spécialisée avant la première diffusion.
in scheme: Audiovisuel
in scheme: concept-SD-audiovisuel-cinema
in scheme: concepts
notation: CULT464
related: avant-première

rematricer
type: ConceptConcept
type: Concept
creator: Commission d'enrichissement de la langue française, FranceTerme
date parution JO: 2005-01-18
deconseille ou frequent: to remaster
equivalent EN: remaster @en
equivalent EN: remaster (en)
part of speech: verbe
definition: Matricer à nouveau.
in scheme: Audiovisuel
in scheme: concept-SD-audiovisuel-video
in scheme: concepts
notation: CULT465
related: matricer

retour en arrière
type: ConceptConcept
type: Concept
creator: Commission d'enrichissement de la langue française, FranceTerme
date parution JO: 2005-01-18
deconseille ou frequent: flash back
equivalent EN: flashback @en
equivalent EN: flashback (en)
definition: Rupture de la continuité chronologique d'une action par l'évocation d'une période antérieure.
in scheme: Audiovisuel
in scheme: concept-SD-audiovisuel-cinema
in scheme: concept-SD-audiovisuel-television
in scheme: concepts
notation: CULT466
scope note: Cette publication annule et remplace celle du Journal officiel du 22 septembre 2000.

signature
type: ConceptConcept
type: Concept
creator: Commission d'enrichissement de la langue française, FranceTerme
date parution JO: 2005-01-18
equivalent EN: baseline @en
equivalent EN: baseline (en)
part of speech: nom féminin
definition: Slogan publicitaire accolé au nom d'une marque et la caractérisant.
in scheme: Communication
in scheme: concept-SD-communication-publicite
in scheme: concepts
notation: CULT467
related: accroche
related: corps d'annonce
scope note: Cette publication annule et remplace celle du Journal officiel du 22 septembre 2000.

simple
type: ConceptConcept
type: Concept
creator: Commission d'enrichissement de la langue française, FranceTerme
date parution JO: 2005-01-18
equivalent EN: single @en
equivalent EN: single (en)
part of speech: nom masculin
alternative label: format court
definition: Disque de variétés comportant, pour un disque vinyle, un seul morceau par face ou, pour un disque compact, moins de quatre morceaux.
in scheme: Audiovisuel
in scheme: concept-SD-audiovisuel-edition-musicale
in scheme: concepts
notation: CULT468
related: minialbum

télévision en ligne
type: ConceptConcept
type: Concept
creator: Commission d'enrichissement de la langue française, FranceTerme
abbreviation: web TV @en
date parution JO: 2005-01-18
deconseille ou frequent: TV internet
deconseille ou frequent: internet TV
deconseille ou frequent: net TV
deconseille ou frequent: web television
equivalent EN: web TV @en
equivalent EN: web TV (en)
equivalent EN: webtelevision @en
equivalent EN: webtelevision (en)
broader: concept-technologies-de-l'information-et-de-la-communication
definition: Diffusion de programmes audiovisuels par l'internet.
in scheme: Audiovisuel
in scheme: concept-SD-audiovisuel-television
in scheme: concepts
notation: CULT469

embargo
type: ConceptConcept
type: Concept
creator: Commission d'enrichissement de la langue française, FranceTerme
source: révision de l'arrêté du 10 octobre 1985
date parution JO: 2000-09-22
equivalent EN: embargo @en
equivalent EN: embargo (en)
equivalent EN: release @en
equivalent EN: release (en)
part of speech: nom masculin
definition: Le fait d'imposer un délai avant de diffuser une information ou un programme.
in scheme: Audiovisuel
in scheme: concepts
notation: CULT47

tube
type: ConceptConcept
type: Concept
creator: Commission d'enrichissement de la langue française, FranceTerme
date parution JO: 2005-01-18
equivalent EN: hit @en
equivalent EN: hit (en)
part of speech: nom masculin
definition: Œuvre remportant un succès commercial momentané.
in scheme: Audiovisuel
in scheme: concept-SD-audiovisuel-edition-musicale
in scheme: concepts
notation: CULT470

version dérivée
type: ConceptConcept
type: Concept
creator: Commission d'enrichissement de la langue française, FranceTerme
date parution JO: 2005-01-18
deconseille ou frequent: spinoff
deconseille ou frequent: version dérivée
equivalent EN: spin-off @en
equivalent EN: spin-off (en)
definition: Adaptation à la télévision d'un film à succès.
in scheme: Audiovisuel
in scheme: concept-SD-audiovisuel-television
in scheme: concepts
notation: CULT471
note: On parle également de « version dérivée » à propos d'une série télévisée.

mannequin vedette
type: ConceptConcept
type: Concept
creator: Commission d'enrichissement de la langue française, FranceTerme
date parution JO: 2005-01-18
equivalent EN: super model @en
equivalent EN: super model (en)
equivalent EN: top model @en
equivalent EN: top model (en)
in scheme: Habillement et mode
in scheme: concepts
notation: CULT472
related: concept-mode

esquisse
type: ConceptConcept
type: Concept
creator: Commission d'enrichissement de la langue française, FranceTerme
date parution JO: 2005-01-18
equivalent EN: rough @en
equivalent EN: rough (en)
part of speech: nom féminin
alternative label: crayonné
in scheme: Communication
in scheme: concept-SD-communication-publicite
in scheme: concepts
notation: CULT473
related: esquisseur, -euse

animatique
type: ConceptConcept
type: Concept
creator: Commission d'enrichissement de la langue française, FranceTerme
date parution JO: 2005-01-18
equivalent EN: animatics @en
equivalent EN: animatics (en)
part of speech: nom féminin
definition: Application à l'animation des techniques électroniques et informatiques ; par extension, animation par ordinateur présentant l'ébauche d'une future réalisation.
in scheme: Communication
in scheme: concept-SD-communication-infographie
in scheme: concepts
notation: CULT474

animateur, -trice
type: ConceptConcept
type: Concept
creator: Commission d'enrichissement de la langue française, FranceTerme
source: révision de l'arrêté du 10 octobre 1985
abbreviation: DJ @en
date parution JO: 2000-09-22
deconseille ou frequent: discjockey
equivalent EN: DJ @en
equivalent EN: DJ (en)
equivalent EN: disc jockey @en
equivalent EN: disc jockey (en)
part of speech: nom
definition: Personne qui passe de la musique, notamment de variétés, dans une réunion publique ou privée.
in scheme: Arts
in scheme: concept-SD-arts-musique
in scheme: concepts
notation: CULT476

média
type: ConceptConcept
type: Concept
creator: Commission d'enrichissement de la langue française, FranceTerme
source: révision de l'arrêté du 24 janvier 1983
date parution JO: 2000-09-22
equivalent EN: mass media @en
equivalent EN: mass media (en)
equivalent EN: media @en
equivalent EN: media (en)
part of speech: nom masculin
in scheme: Communication
in scheme: concepts
notation: CULT477
note: Pluriel : médias.
related: multimédia

cinéma à domicile
type: ConceptConcept
type: Concept
creator: Commission d'enrichissement de la langue française, FranceTerme
abbreviation: home cinema @en
abbreviation: home theater @en
abbreviation: home theatre @en
date parution JO: 2006-09-15
deconseille ou frequent: home theater
deconseille ou frequent: home theater system
deconseille ou frequent: home theatre
deconseille ou frequent: home theatre system
equivalent EN: home cinema @en
equivalent EN: home cinema (en)
equivalent EN: home cinema system @en
equivalent EN: home cinema system (en)
equivalent EN: home theater (US) @en
equivalent EN: home theater (en-US)
equivalent EN: home theater system (US) @en
equivalent EN: home theater system (en-US)
equivalent EN: home theatre (GB) @en
equivalent EN: home theatre (en-GB)
equivalent EN: home theatre system (GB) @en
equivalent EN: home theatre system (en-GB)
forme abregee: cinédom, n.m.
definition: Ensemble des équipements nécessaires à la projection à domicile d'œuvres cinématographiques ou de programmes de télévision dans des conditions proches de celles d'une salle de cinéma ; ce mode de projection.
in scheme: Audiovisuel
in scheme: concepts
notation: CULT479

émission à bande latérale unique
type: ConceptConcept
type: Concept
creator: Commission d'enrichissement de la langue française, FranceTerme
source: révision de l'arrêté du 10 octobre 1985
abbreviation: SSB transmission @en
date parution JO: 2000-09-22
equivalent EN: SSB transmission @en
equivalent EN: SSB transmission (en)
equivalent EN: single-sideband transmission @en
equivalent EN: single-sideband transmission (en)
forme abregee: émission BLU
definition: Production d'une onde électromagnétique modulée en amplitude dans laquelle on ne conserve qu'une seule bande latérale, en vue de réduire la largeur de bande occupée.
in scheme: Audiovisuel
in scheme: concepts
notation: CULT48
related: récepteur à bande latérale unique

coffret long format
type: ConceptConcept
type: Concept
creator: Commission d'enrichissement de la langue française, FranceTerme
date parution JO: 2006-09-15
equivalent EN: long box @en
equivalent EN: long box (en)
forme abregee: format long
forme abregee: long format
definition: Boîtier allongé renfermant un ou plusieurs disques compacts et des documents se rapportant à l'œuvre ou à l'auteur.
in scheme: Audiovisuel
in scheme: concept-SD-audiovisuel-edition-musicale
in scheme: concepts
notation: CULT480

composition d'images
type: ConceptConcept
type: Concept
creator: Commission d'enrichissement de la langue française, FranceTerme
date parution JO: 2006-09-15
equivalent EN: compositing @en
equivalent EN: compositing (en)
forme abregee: composition, n.f.
definition: Action d'assembler différents éléments visuels en vue de constituer une image unique.
in scheme: Audiovisuel
in scheme: concept-SD-audiovisuel-cinema
in scheme: concepts
notation: CULT481

coparrainage
type: ConceptConcept
type: Concept
creator: Commission d'enrichissement de la langue française, FranceTerme
date parution JO: 2006-09-15
equivalent EN: co-branding @en
equivalent EN: co-branding (en)
part of speech: nom masculin
definition: Mode de financement d'activités culturelles faisant appel à plusieurs marques partenaires.
in scheme: Culture
in scheme: concepts
notation: CULT483

cybercaméra
type: ConceptConcept
type: Concept
creator: Commission d'enrichissement de la langue française, FranceTerme
abbreviation: webcam @en
date parution JO: 2006-09-15
deconseille ou frequent: web cam
equivalent EN: webcam @en
equivalent EN: webcam (en)
equivalent EN: webcamera @en
equivalent EN: webcamera (en)
part of speech: nom féminin
definition: Caméra numérique, reliée à un ordinateur, qui permet de filmer et de diffuser en temps réel des vidéogrammes sur un réseau, en particulier l'internet.
in scheme: Audiovisuel
in scheme: Informatique
in scheme: concepts
notation: CULT484

grosse machine
type: ConceptConcept
type: Concept
creator: Commission d'enrichissement de la langue française, FranceTerme
date parution JO: 2006-09-15
deconseille ou frequent: block buster
equivalent EN: blockbuster @en
equivalent EN: blockbuster (en)
definition: Production à gros budget, dont l'ambition semble surtout commerciale.
in scheme: Audiovisuel
in scheme: concepts
notation: CULT485

imagisme
type: ConceptConcept
type: Concept
creator: Commission d'enrichissement de la langue française, FranceTerme
abbreviation: VJing @en
abbreviation: veejaying @en
date parution JO: 2006-09-15
deconseille ou frequent: vijaying
equivalent EN: VJing @en
equivalent EN: VJing (en)
equivalent EN: veejaying @en
equivalent EN: veejaying (en)
equivalent EN: video jockeying @en
equivalent EN: video jockeying (en)
part of speech: nom masculin
definition: Art de combiner des éléments visuels provenant de différentes sources, en particulier d'œuvres cinématographiques et de vidéogrammes, en vue de produire une création originale.
in scheme: Audiovisuel
in scheme: concepts
notation: CULT486
related: imagiste

imagiste
type: ConceptConcept
type: Concept
creator: Commission d'enrichissement de la langue française, FranceTerme
abbreviation: VJ @en
date parution JO: 2006-09-15
deconseille ou frequent: videojockey
deconseille ou frequent: vijay
equivalent EN: VJ @en
equivalent EN: VJ (en)
equivalent EN: veejay @en
equivalent EN: veejay (en)
equivalent EN: video jockey @en
equivalent EN: video jockey (en)
part of speech: nom
definition: Personne qui combine des éléments visuels provenant de différentes sources, en particulier d'œuvres cinématographiques et de vidéogrammes, en vue de produire une création originale.
in scheme: Audiovisuel
in scheme: concepts
notation: CULT487
related: imagisme

maquette
type: ConceptConcept
type: Concept
creator: Commission d'enrichissement de la langue française, FranceTerme
date parution JO: 2006-09-15
equivalent EN: lay-out @en
equivalent EN: lay-out (en)
part of speech: nom féminin
definition: Projet présentant l'agencement des images qui permettront de réaliser une scène d'animation.
in scheme: Communication
in scheme: concept-SD-communication-infographie
in scheme: concepts
notation: CULT489
related: maquette

enceinte acoustique
type: ConceptConcept
type: Concept
creator: Commission d'enrichissement de la langue française, FranceTerme
source: révision de l'arrêté du 10 octobre 1985
date parution JO: 2000-09-22
deconseille ou frequent: baffle
equivalent EN: speaker system @en
equivalent EN: speaker system (en)
forme abregee: enceinte, n.f.
definition: Coffret qui renferme un ou plusieurs haut-parleurs montés sur un écran acoustique.
in scheme: Acoustique
in scheme: Audiovisuel
in scheme: concepts
notation: CULT49
note: Le terme baffle ne doit pas être employé en français.
related: écran acoustique
related: concept-acoustique

peintre de caches
type: ConceptConcept
type: Concept
creator: Commission d'enrichissement de la langue française, FranceTerme
abbreviation: matt painter @en
date parution JO: 2006-09-15
equivalent EN: matt painter @en
equivalent EN: matt painter (en)
equivalent EN: matte painter @en
equivalent EN: matte painter (en)
definition: Artiste qui produit ou retouche manuellement ou à l'aide d'une palette graphique des décors pour les intégrer à des sources visuelles originales.
in scheme: Audiovisuel
in scheme: concept-SD-audiovisuel-cinema
in scheme: concepts
notation: CULT491
note: Une palette graphique est un système de création d'images utilisant l'écran d'une station de travail ou d'un microordinateur.

scénarimage
type: ConceptConcept
type: Concept
creator: Commission d'enrichissement de la langue française, FranceTerme
date parution JO: 2006-09-15
deconseille ou frequent: storyboard
equivalent EN: story-board @en
equivalent EN: story-board (en)
part of speech: nom masculin
alternative label: scénario en images
definition: Recueil de croquis correspondant au découpage du scénario d'un film, et présentant le contenu et le cadrage des différents plans de chacune des séquences.
in scheme: Audiovisuel
in scheme: concept-SD-audiovisuel-cinema
in scheme: concept-SD-audiovisuel-television
in scheme: concepts
notation: CULT492
related: scénarimagiste

scénarimagiste
type: ConceptConcept
type: Concept
creator: Commission d'enrichissement de la langue française, FranceTerme
date parution JO: 2006-09-15
deconseille ou frequent: storyboarder
equivalent EN: story-boarder @en
equivalent EN: story-boarder (en)
part of speech: nom
alternative label: scénariste en images
definition: Dessinateur chargé d'illustrer chaque plan du découpage d'un scénario.
in scheme: Audiovisuel
in scheme: concept-SD-audiovisuel-cinema
in scheme: concept-SD-audiovisuel-television
in scheme: concepts
notation: CULT493
related: scénarimage

sujet court
type: ConceptConcept
type: Concept
creator: Commission d'enrichissement de la langue française, FranceTerme
date parution JO: 2006-09-15
deconseille ou frequent: pastille
equivalent EN: featurette @en
equivalent EN: featurette (en)
definition: Reportage de courte durée destiné à assurer la promotion d'une œuvre enregistrée sur un support audiovisuel.
in scheme: Audiovisuel
in scheme: concepts
notation: CULT494
note: On rencontre aussi le terme « pastille ».

technoloisir
type: ConceptConcept
type: Concept
creator: Commission d'enrichissement de la langue française, FranceTerme
date parution JO: 2006-09-15
equivalent EN: home entertainment @en
equivalent EN: home entertainment (en)
part of speech: nom masculin
definition: Ensemble des activités de loisir que peuvent pratiquer les particuliers à leur domicile, grâce aux applications techniques de l'électronique.
in scheme: Audiovisuel
in scheme: concepts
notation: CULT495

télé-tirelire
type: ConceptConcept
type: Concept
creator: Commission d'enrichissement de la langue française, FranceTerme
abbreviation: call TV @en
date parution JO: 2006-09-15
equivalent EN: call TV @en
equivalent EN: call TV (en)
equivalent EN: call television @en
equivalent EN: call television (en)
part of speech: nom féminin
definition: Mode de financement de chaînes ou d'émissions de télévision par le recours aux appels téléphoniques des spectateurs ; l'ensemble de ces chaînes ou de ces programmes.
in scheme: Audiovisuel
in scheme: concept-SD-audiovisuel-television
in scheme: concepts
notation: CULT496

version d'auteur
type: ConceptConcept
type: Concept
creator: Commission d'enrichissement de la langue française, FranceTerme
date parution JO: 2006-09-15
deconseille ou frequent: réalisateur
equivalent EN: director's cut @en
equivalent EN: director's cut (en)
definition: Version d'une œuvre cinématographique dont le montage est assuré sous la responsabilité du réalisateur, et qui diffère parfois de la version exploitée dans les circuits commerciaux.
in scheme: Audiovisuel
in scheme: concept-SD-audiovisuel-cinema
in scheme: concepts
notation: CULT497

atelier
type: ConceptConcept
type: Concept
creator: Commission d'enrichissement de la langue française, FranceTerme
date parution JO: 2006-09-16
equivalent EN: workshop @en
equivalent EN: workshop (en)
part of speech: nom masculin
definition: Groupe de personnes réunies pour une période déterminée afin de mener une réflexion sur un sujet donné ou réaliser un projet commun.
in scheme: Tous domaines
in scheme: concepts
notation: CULT498
related: séance en ateliers
related: concept-INFO957

cintrier, -ière
type: ConceptConcept
type: Concept
creator: Commission d'enrichissement de la langue française, FranceTerme
date parution JO: 2006-09-16
equivalent EN: rigger @en
equivalent EN: rigger (en)
part of speech: nom
definition: Technicien qui assure les accrochages et le levage de charges au-dessus des plateaux.
in scheme: Arts
in scheme: concept-SD-arts-arts-de-la-scene
in scheme: concepts
notation: CULT499

adaptateur, -trice-rédacteur, -trice publicitaire
type: ConceptConcept
type: Concept
creator: Commission d'enrichissement de la langue française, FranceTerme
source: révision de l'arrêté du 10 octobre 1985
abbreviation: adapter @en
abbreviation: adaptor @en
date parution JO: 2000-09-22
deconseille ou frequent: adaptateur publicitaire
deconseille ou frequent: adaptateur-rédacteur publicitaire
deconseille ou frequent: adaptatrice publicitaire
deconseille ou frequent: adaptatrice-rédactrice publicitaire
equivalent EN: adapter @en
equivalent EN: adapter (en)
equivalent EN: adaptor @en
equivalent EN: adaptor (en)
equivalent EN: copy adapter @en
equivalent EN: copy adapter (en)
equivalent EN: copy adaptor @en
equivalent EN: copy adaptor (en)
definition: Concepteur ou rédacteur chargé d'adapter les messages publicitaires originaux à des environnements culturels, linguistiques et sociaux différents.
in scheme: Communication
in scheme: concept-SD-communication-publicite
in scheme: concepts
notation: CULT5

enregistrement fractionné
type: ConceptConcept
type: Concept
creator: Commission d'enrichissement de la langue française, FranceTerme
source: révision de l'arrêté du 10 octobre 1985
date parution JO: 2000-09-22
equivalent EN: multiplay @en
equivalent EN: multiplay (en)
definition: Procédé de prise de son dans lequel les différentes parties de l'enregistrement sont effectuées séparément sur des pistes distinctes.
in scheme: Audiovisuel
in scheme: concepts
notation: CULT50

commissaire
type: ConceptConcept
type: Concept
creator: Commission d'enrichissement de la langue française, FranceTerme
date parution JO: 2006-09-16
equivalent EN: curator @en
equivalent EN: curator (en)
part of speech: nom
definition: Personne responsable de la conception, de l'organisation et du déroulement d'une exposition, d'une manifestation scientifique ou culturelle.
in scheme: Culture
in scheme: concepts
notation: CULT501

dents-de-scie
type: ConceptConcept
type: Concept
creator: Commission d'enrichissement de la langue française, FranceTerme
date parution JO: 2006-09-16
deconseille ou frequent: toiture à redans
deconseille ou frequent: toiture à sheds
equivalent EN: sawtooth roof @en
equivalent EN: sawtooth roof (en) [toiture]
equivalent EN: shed @en
equivalent EN: shed (en)
part of speech: nom masculin
definition: Toiture à redents couvrant certains bâtiments à éclairage zénithal et destinés initialement à un usage industriel ; par extension, ce bâtiment lui-même.
in scheme: Habitat et construction
in scheme: concepts
notation: CULT502
scope note: Cette publication annule et remplace celle du terme « toiture à redans » au Journal officiel du 22 septembre 2000.

entrée de ville
type: ConceptConcept
type: Concept
creator: Commission d'enrichissement de la langue française, FranceTerme
date parution JO: 2006-09-16
equivalent EN: strip @en
equivalent EN: strip (en)
definition: Zone industrielle et commerciale qui se développe le long des principales voies d'accès d'une agglomération.
in scheme: Aménagement et urbanisme
in scheme: concepts
notation: CULT503

espace expérimental
type: ConceptConcept
type: Concept
creator: Commission d'enrichissement de la langue française, FranceTerme
date parution JO: 2006-09-16
equivalent EN: project room @en
equivalent EN: project room (en)
definition: Lieu d'exposition consacré à la présentation d'œuvres explorant les voies nouvelles de la création.
in scheme: Arts
in scheme: concepts
notation: CULT504

étalement urbain
type: ConceptConcept
type: Concept
creator: Commission d'enrichissement de la langue française, FranceTerme
abbreviation: sprawl @en
date parution JO: 2006-09-16
equivalent EN: sprawl @en
equivalent EN: sprawl (en)
equivalent EN: urban sprawl @en
equivalent EN: urban sprawl (en)
definition: Extension non maîtrisée de zones construites à la périphérie d'un espace urbain.
in scheme: Aménagement et urbanisme
in scheme: concepts
notation: CULT505
related: mitage
related: artificialisation des sols
related: périurbanisation
related: rurbanisation
related: densification parcellaire

mentor
type: ConceptConcept
type: Concept
creator: Commission d'enrichissement de la langue française, FranceTerme
date parution JO: 2006-09-16
equivalent EN: coach @en
equivalent EN: coach (en)
part of speech: nom
definition: Personne chargée de conseiller sur le plan artistique et commercial un artiste ou un groupe pour lui permettre d'atteindre une plus grande notoriété.
in scheme: Arts
in scheme: concept-SD-arts-arts-de-la-scene
in scheme: concepts
notation: CULT507
note: Le terme « mentor » est également utilisé en économie, dans le domaine de la gestion d'entreprise.
related: répétiteur, -trice

œuvre en devenir
type: ConceptConcept
type: Concept
creator: Commission d'enrichissement de la langue française, FranceTerme
date parution JO: 2006-09-16
deconseille ou frequent: oeuvre en devenir
equivalent EN: work in progress @en
equivalent EN: work in progress (en)
definition: Production artistique dont le public peut suivre l'évolution aux différentes étapes de sa création.
in scheme: Arts
in scheme: concepts
notation: CULT508

plateau
type: ConceptConcept
type: Concept
creator: Commission d'enrichissement de la langue française, FranceTerme
date parution JO: 2006-09-16
deconseille ou frequent: fluides en attente
deconseille ou frequent: loft
deconseille ou frequent: open plan office
deconseille ou frequent: open space office
equivalent EN: open space @en
equivalent EN: open space (en)
part of speech: nom masculin
definition: Vaste local pourvu d'équipements de base et libre d'aménagements.
in scheme: Habitat et construction
in scheme: concepts
notation: CULT509
note: 1. L'usage de loft en ce sens est impropre.
note: 2. Dans le langage professionnel, on parle de « fluides en attente » pour désigner les équipements de base.

épreuve
type: ConceptConcept
type: Concept
creator: Commission d'enrichissement de la langue française, FranceTerme
source: révision de l'arrêté du 10 octobre 1985
date parution JO: 2000-09-22
deconseille ou frequent: rushes
equivalent EN: rush @en
equivalent EN: rush (en)
part of speech: nom féminin
definition: Film brut après développement et avant montage.
in scheme: Audiovisuel
in scheme: concept-SD-audiovisuel-cinema
in scheme: concept-SD-audiovisuel-television
in scheme: concepts
notation: CULT51

pseudopole
type: ConceptConcept
type: Concept
creator: Commission d'enrichissement de la langue française, FranceTerme
date parution JO: 2006-09-16
equivalent EN: edge city @en
equivalent EN: edge city (en)
part of speech: nom féminin
definition: Zone urbaine sans conception d'ensemble, située aux abords d'une agglomération, destinée aux activités industrielles, commerciales ou de loisirs.
in scheme: Aménagement et urbanisme
in scheme: concepts
notation: CULT510

répétiteur, -trice
type: ConceptConcept
type: Concept
creator: Commission d'enrichissement de la langue française, FranceTerme
date parution JO: 2006-09-16
equivalent EN: coach @en
equivalent EN: coach (en)
part of speech: nom
definition: Personne chargée d'aider un artiste ou un groupe, par divers exercices ou lors des répétitions, à se préparer à tenir un rôle ou à un concert.
in scheme: Arts
in scheme: Audiovisuel
in scheme: concept-SD-arts-arts-de-la-scene
in scheme: concept-SD-audiovisuel-arts-de-la-scene
in scheme: concepts
notation: CULT511
related: mentor

silhouette
type: ConceptConcept
type: Concept
creator: Commission d'enrichissement de la langue française, FranceTerme
date parution JO: 2006-09-16
equivalent EN: skyline @en
equivalent EN: skyline (en)
part of speech: nom féminin
definition: Profil caractéristique d'une ville ou d'un paysage, tel qu'il se découpe sur le ciel.
in scheme: Aménagement et urbanisme
in scheme: Environnement
in scheme: concepts
notation: CULT512

succession
type: ConceptConcept
type: Concept
creator: Commission d'enrichissement de la langue française, FranceTerme
date parution JO: 2006-09-16
deconseille ou frequent: estate
equivalent EN: estate of @en
equivalent EN: estate of (en)
part of speech: nom féminin
definition: Mention apposée sur une œuvre pour indiquer qu'elle provient d'un legs, d'une donation ou d'une dation.
in scheme: Arts
in scheme: Culture
in scheme: concept-SD-arts-musees
in scheme: concept-SD-culture-musees
in scheme: concepts
notation: CULT513

avec l'aimable autorisation de
type: ConceptConcept
type: Concept
creator: Commission d'enrichissement de la langue française, FranceTerme
date parution JO: 2006-09-16
deconseille ou frequent: courtesy
deconseille ou frequent: courtesy of
equivalent EN: by courtesy of @en
equivalent EN: by courtesy of (en)
forme abregee: avec l'autorisation de
in scheme: Arts
in scheme: Culture
in scheme: concepts
notation: CULT514

coupe
type: ConceptConcept
type: Concept
creator: Commission d'enrichissement de la langue française, FranceTerme
date parution JO: 1998-12-16
equivalent EN: section @en
equivalent EN: section (en)
part of speech: nom féminin
in scheme: Habitat et construction
in scheme: concept-SD-habitat-et-construction-architecture
in scheme: concepts
notation: CULT515

tissu urbain
type: ConceptConcept
type: Concept
creator: Commission d'enrichissement de la langue française, FranceTerme
date parution JO: 1998-12-16
equivalent EN: urban fabric @en
equivalent EN: urban fabric (en)
in scheme: Aménagement et urbanisme
in scheme: concepts
notation: CULT516

trame verte
type: ConceptConcept
type: Concept
creator: Commission d'enrichissement de la langue française, FranceTerme
date parution JO: 1998-12-16
equivalent EN: green open system @en
equivalent EN: green open system (en)
in scheme: Aménagement et urbanisme
in scheme: Environnement
in scheme: concepts
notation: CULT517

accroche
type: ConceptConcept
type: Concept
creator: Commission d'enrichissement de la langue française, FranceTerme
date parution JO: 2007-12-23
equivalent EN: teaser @en
equivalent EN: teaser (en)
part of speech: nom féminin
definition: Séquence ou montage destinés à attirer ou à retenir l'attention du spectateur ou de l'auditeur.
in scheme: Audiovisuel
in scheme: concepts
notation: CULT518

couplage
type: ConceptConcept
type: Concept
creator: Commission d'enrichissement de la langue française, FranceTerme
date parution JO: 2010-07-22
equivalent EN: cross-boarding @en
equivalent EN: cross-boarding (en)
part of speech: nom masculin
definition: Méthode de production consistant à rationaliser le tournage d'épisodes différents d'une série en regroupant les séquences faisant appel aux mêmes acteurs et à des éléments récurrents tels que les décors et les moyens techniques.
in scheme: Audiovisuel
in scheme: concept-SD-audiovisuel-television
in scheme: concepts
notation: CULT519

équilibreur avant-arrière
type: ConceptConcept
type: Concept
creator: Commission d'enrichissement de la langue française, FranceTerme
source: révision de l'arrêté du 24 janvier 1983
date parution JO: 2000-09-22
deconseille ou frequent: balance
equivalent EN: fader @en
equivalent EN: fader (en)
forme abregee: équilibreur, n.m.
definition: Dans un système de reproduction sonore, par exemple un autoradio, dispositif de réglage permettant de doser le niveau acoustique entre les haut-parleurs avant et arrière.
in scheme: Acoustique
in scheme: Audiovisuel
in scheme: concepts
notation: CULT52
note: Un équilibreur (en anglais : balance) est aussi utilisé en stéréophonie.
related: balance

créneau de jour
type: ConceptConcept
type: Concept
creator: Commission d'enrichissement de la langue française, FranceTerme
date parution JO: 2007-12-23
deconseille ou frequent: day time
equivalent EN: daytime @en
equivalent EN: daytime (en)
definition: Tranche horaire de diffusion située pendant la journée, et correspondant le plus souvent à une période de faible écoute.
in scheme: Audiovisuel
in scheme: concepts
notation: CULT520
related: avant-soirée
related: heure de grande écoute

disque vidéo à durée déterminée
type: ConceptConcept
type: Concept
creator: Commission d'enrichissement de la langue française, FranceTerme
abbreviation: DVDD
date parution JO: 2007-12-23
equivalent EN: disposable DVD @en
equivalent EN: disposable DVD (en)
equivalent EN: self-destructing DVD @en
equivalent EN: self-destructing DVD (en)
definition: Disque numérique polyvalent, conçu pour devenir illisible au terme d'une courte utilisation.
in scheme: Audiovisuel
in scheme: concepts
notation: CULT521
note: La graphie « DVD-D », qui est celle d'un nom de marque, ne doit pas être employée.
related: disque numérique polyvalent

façonneur, -euse d'image
type: ConceptConcept
type: Concept
creator: Commission d'enrichissement de la langue française, FranceTerme
date parution JO: 2007-12-23
equivalent EN: spin doctor @en
equivalent EN: spin doctor (en)
definition: Spécialiste en communication, chargé de présenter une personnalité et ses décisions sous un jour favorable.
in scheme: Communication
in scheme: concepts
notation: CULT522

film piraté
type: ConceptConcept
type: Concept
creator: Commission d'enrichissement de la langue française, FranceTerme
date parution JO: 2007-12-23
deconseille ou frequent: screener
deconseille ou frequent: version pirate
equivalent EN: movie bootleg @en
equivalent EN: movie bootleg (en)
definition: Version d'une œuvre cinématographique captée de façon clandestine lors de sa projection en salle.
in scheme: Audiovisuel
in scheme: concept-SD-audiovisuel-cinema
in scheme: concepts
notation: CULT523
note: 1. L'emploi du mot screener, emprunté de l'anglais, est à proscrire.
note: 2. On distingue le « film piraté » de la « version pirate », désignant toute copie non autorisée.
related: piratage en salle

fond de catalogue
type: ConceptConcept
type: Concept
creator: Commission d'enrichissement de la langue française, FranceTerme
date parution JO: 2007-12-23
equivalent EN: back catalog (US) @en
equivalent EN: back catalog (en-US)
equivalent EN: back catalogue (GB) @en
equivalent EN: back catalogue (en-GB)
definition: Ensemble des œuvres d'un artiste ou d'un groupe, à l'exclusion des productions les plus récentes.
in scheme: Audiovisuel
in scheme: concept-SD-audiovisuel-edition-musicale
in scheme: concepts
notation: CULT524

gyrocaméra
type: ConceptConcept
type: Concept
creator: Commission d'enrichissement de la langue française, FranceTerme
date parution JO: 2007-12-23
deconseille ou frequent: Wescam
equivalent EN: gyro-stabilized camera @en
equivalent EN: gyro-stabilized camera (en)
part of speech: nom féminin
definition: Caméra aéroportée, stabilisée par un gyroscope.
in scheme: Audiovisuel
in scheme: concepts
notation: CULT525
note: « Wescam », qui est un nom de marque, ne doit pas être employé.

montage sauvage
type: ConceptConcept
type: Concept
creator: Commission d'enrichissement de la langue française, FranceTerme
date parution JO: 2007-12-23
equivalent EN: fan edit @en
equivalent EN: fan edit (en)
definition: Version d'une œuvre audiovisuelle ou musicale tronquée ou modifiée par des admirateurs, à l'insu de ses auteurs.
in scheme: Audiovisuel
in scheme: concepts
notation: CULT526
related: sous-titrage sauvage

passage éclair
type: ConceptConcept
type: Concept
creator: Commission d'enrichissement de la langue française, FranceTerme
date parution JO: 2007-12-23
equivalent EN: cameo appearance @en
equivalent EN: cameo appearance (en)
definition: Brève apparition d'une célébrité dans un film ou une émission de télévision.
in scheme: Audiovisuel
in scheme: concepts
notation: CULT527
related: vedette éclair

pilote
type: ConceptConcept
type: Concept
creator: Commission d'enrichissement de la langue française, FranceTerme
date parution JO: 2007-12-23
deconseille ou frequent: fixeur
deconseille ou frequent: fixeuse
equivalent EN: fixer @en
equivalent EN: fixer (en)
part of speech: nom
definition: Personne engagée pour guider un journaliste ou un homme d'affaires et pour favoriser ses contacts dans un milieu qui lui est inconnu, voire hostile.
in scheme: Communication
in scheme: concepts
notation: CULT528

piratage en salle
type: ConceptConcept
type: Concept
creator: Commission d'enrichissement de la langue française, FranceTerme
abbreviation: theater piracy @en
date parution JO: 2007-12-23
deconseille ou frequent: screening
equivalent EN: movie theater piracy @en
equivalent EN: movie theater piracy (en)
equivalent EN: theater piracy @en
equivalent EN: theater piracy (en)
definition: Captation clandestine d'une œuvre cinématographique lors de sa projection en public.
in scheme: Audiovisuel
in scheme: concept-SD-audiovisuel-cinema
in scheme: concepts
notation: CULT529
note: L'emploi du mot screening, emprunté de l'anglais, est à proscrire.
related: film piraté

erreur de piste
type: ConceptConcept
type: Concept
creator: Commission d'enrichissement de la langue française, FranceTerme
source: révision de l'arrêté du 10 octobre 1985
date parution JO: 2000-09-22
equivalent EN: track error @en
equivalent EN: track error (en)
equivalent EN: tracking error @en
equivalent EN: tracking error (en)
definition: Écart angulaire entre le plan de symétrie d'un lecteur de disque et l'axe du sillon.
in scheme: Audiovisuel
in scheme: concepts
notation: CULT53
note: Pour ne pas subir de distorsions, il convient de supprimer l'erreur de piste d'un bras tangentiel ou de la réduire par un bras pivotant convenablement allongé et un phonolecteur correctement orienté.
related: bras tangentiel

scénariste-conseil
type: ConceptConcept
type: Concept
creator: Commission d'enrichissement de la langue française, FranceTerme
date parution JO: 2007-12-23
deconseille ou frequent: plombier
equivalent EN: script doctor @en
equivalent EN: script doctor (en)
part of speech: nom
definition: Expert en dramaturgie engagé par la production d'un film pour en améliorer le scénario.
in scheme: Audiovisuel
in scheme: concepts
notation: CULT531
note: On trouve aussi, dans le langage professionnel, le terme « plombier ».

sélection
type: ConceptConcept
type: Concept
creator: Commission d'enrichissement de la langue française, FranceTerme
date parution JO: 2007-12-23
deconseille ou frequent: affiche
deconseille ou frequent: play list
equivalent EN: playlist @en
equivalent EN: playlist (en)
part of speech: nom féminin
definition: Choix d'œuvres musicales mises en valeur dans une programmation sur une période donnée.
in scheme: Audiovisuel
in scheme: concepts
notation: CULT532
note: On rencontre aussi le terme « affiche ».

stabilisateur
type: ConceptConcept
type: Concept
creator: Commission d'enrichissement de la langue française, FranceTerme
date parution JO: 2007-12-23
deconseille ou frequent: Steadicam
equivalent EN: steady cam @en
equivalent EN: steady cam (en)
part of speech: nom masculin
definition: Harnais doté d'un équipement servant à stabiliser la caméra.
in scheme: Audiovisuel
in scheme: concepts
notation: CULT533
note: « Steadicam », qui est un nom de marque, ne doit pas être employé.

vedette éclair
type: ConceptConcept
type: Concept
creator: Commission d'enrichissement de la langue française, FranceTerme
date parution JO: 2007-12-23
equivalent EN: cameo star @en
equivalent EN: cameo star (en)
definition: Célébrité faisant une brève apparition dans un film ou une émission de télévision.
in scheme: Audiovisuel
in scheme: concepts
notation: CULT534
related: passage éclair

vedette invitée
type: ConceptConcept
type: Concept
creator: Commission d'enrichissement de la langue française, FranceTerme
date parution JO: 2007-12-23
equivalent EN: guest star @en
equivalent EN: guest star (en)
alternative label: star invitée
definition: Artiste célèbre qui tient un rôle secondaire dans une œuvre audiovisuelle ou un spectacle.
in scheme: Arts
in scheme: Audiovisuel
in scheme: concept-SD-arts-arts-de-la-scene
in scheme: concept-SD-audiovisuel-arts-de-la-scene
in scheme: concepts
notation: CULT535

campaniste
type: ConceptConcept
type: Concept
creator: Commission d'enrichissement de la langue française, FranceTerme
date parution JO: 2007-12-23
part of speech: nom
definition: Spécialiste de la conception, de l'installation, du fonctionnement, du mouvement d'horlogerie et de l'entretien des cloches.
in scheme: Arts
in scheme: concept-SD-arts-musique
in scheme: concepts
notation: CULT536

fantasie
type: ConceptConcept
type: Concept
creator: Commission d'enrichissement de la langue française, FranceTerme
date parution JO: 2007-12-23
equivalent EN: fantasy @en
equivalent EN: fantasy (en)
part of speech: nom féminin
broader: concept-litterature
definition: Genre situé à la croisée du merveilleux et du fantastique, qui prend ses sources dans l'histoire, les mythes, les contes et la science-fiction.
in scheme: Audiovisuel
in scheme: Littérature
in scheme: concepts
notation: CULT537
note: La fantasie est un genre d'origine anglo-saxonne.

fête techno
type: ConceptConcept
type: Concept
creator: Commission d'enrichissement de la langue française, FranceTerme
date parution JO: 2007-12-23
equivalent EN: free party @en
equivalent EN: free party (en)
equivalent EN: rave party @en
equivalent EN: rave party (en)
definition: Vaste rassemblement, parfois clandestin, qui réunit des amateurs de musique électronique fortement rythmée, en plein air ou dans des locaux désaffectés.
in scheme: Arts
in scheme: concept-SD-arts-musique
in scheme: concepts
notation: CULT538
related: concept-musique

programmiste
type: ConceptConcept
type: Concept
creator: Commission d'enrichissement de la langue française, FranceTerme
date parution JO: 2007-12-23
part of speech: nom
definition: Personne chargée par le maître d'ouvrage de prendre en compte dans un programme l'ensemble des besoins et des contraintes liés à la réalisation d'un projet d'aménagement d'espace scénographique, architectural ou urbain.
in scheme: Aménagement et urbanisme
in scheme: concepts
notation: CULT539

exclusivité
type: ConceptConcept
type: Concept
creator: Commission d'enrichissement de la langue française, FranceTerme
source: révision de l'arrêté du 10 octobre 1985
date parution JO: 2000-09-22
equivalent EN: scoop @en
equivalent EN: scoop (en)
part of speech: nom féminin
definition: Information importante ou à sensation donnée en exclusivité.
in scheme: Audiovisuel
in scheme: Communication
in scheme: concepts
notation: CULT54

récriveur, -euse
type: ConceptConcept
type: Concept
creator: Commission d'enrichissement de la langue française, FranceTerme
date parution JO: 2007-12-23
deconseille ou frequent: réécriveur
equivalent EN: rewriter @en
equivalent EN: rewriter (en)
part of speech: nom
definition: Personne chargée de reprendre un texte pour le rendre plus conforme à sa destination.
in scheme: Audiovisuel
in scheme: Édition et livre
in scheme: concepts
notation: CULT540

stockage en libre-service
type: ConceptConcept
type: Concept
creator: Commission d'enrichissement de la langue française, FranceTerme
date parution JO: 2007-12-23
equivalent EN: self-storage @en
equivalent EN: self-storage (en)
definition: Service de garde-meubles offrant aux clients qui y recourent un accès direct aux espaces d'entreposage.
in scheme: Aménagement et urbanisme
in scheme: Habitat et construction
in scheme: concepts
notation: CULT541

sous-titrage sauvage
type: ConceptConcept
type: Concept
creator: Commission d'enrichissement de la langue française, FranceTerme
date parution JO: 2010-07-22
deconseille ou frequent: fan sub
equivalent EN: fansubbing @en
equivalent EN: fansubbing (en)
definition: Établissement d'une version sous-titrée d'un film ou d'une série, réalisée sans autorisation par des amateurs, en marge des circuits commerciaux.
in scheme: Audiovisuel
in scheme: concepts
notation: CULT543
related: montage sauvage

collage
type: ConceptConcept
type: Concept
creator: Commission d'enrichissement de la langue française, FranceTerme
date parution JO: 2010-07-22
equivalent EN: bootleg @en
equivalent EN: bootleg (en) [collage musical]
equivalent EN: mash-up @en
equivalent EN: mash-up (en)
equivalent EN: mashup @en
equivalent EN: mashup (en)
part of speech: nom masculin
definition: Assemblage, au moyen d'outils numériques, d'éléments visuels ou sonores provenant de différentes sources.
in scheme: Audiovisuel
in scheme: Informatique
in scheme: concepts
notation: CULT544

présuite
type: ConceptConcept
type: Concept
creator: Commission d'enrichissement de la langue française, FranceTerme
date parution JO: 2010-07-22
equivalent EN: prequel @en
equivalent EN: prequel (en)
part of speech: nom féminin
definition: Production qui exploite le succès d'une œuvre par l'invention d'un épisode antérieur dans la chronologie de l'histoire.
in scheme: Audiovisuel
in scheme: Littérature
in scheme: concepts
notation: CULT545
related: relance

gamme de couleurs
type: ConceptConcept
type: Concept
creator: Commission d'enrichissement de la langue française, FranceTerme
abbreviation: gamut @en
date parution JO: 2010-07-22
deconseille ou frequent: colour gamut
equivalent EN: color gamut @en
equivalent EN: color gamut (en)
equivalent EN: gamut @en
equivalent EN: gamut (en)
definition: Ensemble des nuances de couleurs disponible sur un équipement audiovisuel ou informatique.
in scheme: Audiovisuel
in scheme: Informatique
in scheme: concepts
notation: CULT546

tirage couleur
type: ConceptConcept
type: Concept
creator: Commission d'enrichissement de la langue française, FranceTerme
abbreviation: c-print @en
date parution JO: 2010-07-22
deconseille ou frequent: colour print
equivalent EN: c-print @en
equivalent EN: c-print (en)
equivalent EN: color print @en
equivalent EN: color print (en)
in scheme: Arts
in scheme: Édition et livre
in scheme: concept-SD-arts-photographie
in scheme: concept-SD-edition-et-livre-photographie
in scheme: concepts
notation: CULT547

séance en ateliers
type: ConceptConcept
type: Concept
creator: Commission d'enrichissement de la langue française, FranceTerme
date parution JO: 2010-07-22
deconseille ou frequent: break out session
deconseille ou frequent: breakout session
equivalent EN: break-out session @en
equivalent EN: break-out session (en)
forme abregee: ateliers, n.m.pl.
definition: Session de travail en sous-groupes, lors d'un colloque ou d'un congrès.
in scheme: Tous domaines
in scheme: concepts
notation: CULT548
related: atelier

patrimoine culturel immatériel
type: ConceptConcept
type: Concept
creator: Commission d'enrichissement de la langue française, FranceTerme
date parution JO: 2010-07-22
equivalent EN: intangible cultural heritage @en
equivalent EN: intangible cultural heritage (en)
definition: Ensemble des connaissances, des représentations, des savoir-faire, des expressions et des pratiques culturelles propres à un groupe humain et susceptibles d'être transmis.
in scheme: Culture
in scheme: concepts
notation: CULT549

fluctuations de vitesse
type: ConceptConcept
type: Concept
creator: Commission d'enrichissement de la langue française, FranceTerme
source: révision de l'arrêté du 10 octobre 1985
date parution JO: 2000-09-22
equivalent EN: wow and flutter @en
equivalent EN: wow and flutter (en)
definition: Variations de la vitesse relative entre un support d'enregistrement et la tête d'enregistrement ou de lecture, se traduisant par une modulation de fréquence parasite du signal enregistré.
in scheme: Acoustique
in scheme: Audiovisuel
in scheme: concepts
notation: CULT55
related: scintillement
related: pleurage

pièce à tout faire
type: ConceptConcept
type: Concept
creator: Commission d'enrichissement de la langue française, FranceTerme
date parution JO: 2011-10-16
equivalent EN: hobby room @en
equivalent EN: hobby room (en)
alternative label: pièce multiusage
definition: Pièce non habitable, vendue ou louée comme espace aménageable pour de multiples usages.
in scheme: Habitat et construction
in scheme: concepts
notation: CULT550

télé-poubelle
type: ConceptConcept
type: Concept
creator: Commission d'enrichissement de la langue française, FranceTerme
abbreviation: trash TV @en
date parution JO: 2010-07-22
equivalent EN: trash TV @en
equivalent EN: trash TV (en)
equivalent EN: trash television @en
equivalent EN: trash television (en)
part of speech: nom féminin
definition: Programme télévisé vulgaire, racoleur et dégradant.
in scheme: Audiovisuel
in scheme: concept-SD-audiovisuel-television
in scheme: concepts
notation: CULT551

bonus
type: ConceptConcept
type: Concept
creator: Commission d'enrichissement de la langue française, FranceTerme
abbreviation: bonus @en
date parution JO: 2010-07-22
equivalent EN: bonus @en
equivalent EN: bonus (en)
equivalent EN: bonus track @en
equivalent EN: bonus track (en)
part of speech: nom masculin
definition: Ensemble de documents annexes qui complètent l'édition vidéographique d'un film.
in scheme: Audiovisuel
in scheme: concept-SD-audiovisuel-cinema
in scheme: concept-SD-audiovisuel-television
in scheme: concepts
notation: CULT552

multisupport
type: ConceptConcept
type: Concept
creator: Commission d'enrichissement de la langue française, FranceTerme
date parution JO: 2010-07-22
equivalent EN: cross-media @en
equivalent EN: cross-media (en)
equivalent EN: crossmedia @en
equivalent EN: crossmedia (en)
part of speech: adjectif
definition: Se dit d'une campagne publicitaire recourant à différents supports de diffusion intervenant de façon coordonnée.
in scheme: Communication
in scheme: concept-SD-communication-publicite
in scheme: concepts
notation: CULT554
related: transmédia

dossier de presse
type: ConceptConcept
type: Concept
creator: Commission d'enrichissement de la langue française, FranceTerme
date parution JO: 2010-07-22
equivalent EN: press kit @en
equivalent EN: press kit (en)
in scheme: Communication
in scheme: concepts
notation: CULT556

écran fragmenté
type: ConceptConcept
type: Concept
creator: Commission d'enrichissement de la langue française, FranceTerme
date parution JO: 2010-07-22
deconseille ou frequent: écran splitté
deconseille ou frequent: écran splité
equivalent EN: split screen @en
equivalent EN: split screen (en)
definition: Procédé qui consiste à juxtaposer à l'écran plusieurs scènes d'une même œuvre correspondant à des actions parallèles ou simultanées ; par extension, la juxtaposition de ces scènes à l'écran.
in scheme: Audiovisuel
in scheme: concepts
notation: CULT557

jupe
type: ConceptConcept
type: Concept
creator: Commission d'enrichissement de la langue française, FranceTerme
date parution JO: 2010-07-22
equivalent EN: liner @en
equivalent EN: liner (en)
part of speech: nom féminin
definition: Revêtement appliqué sur les parois d'une fosse ou installé sur une armature, de manière à former un bassin étanche.
in scheme: Habitat et construction
in scheme: concepts
notation: CULT558

collage
type: ConceptConcept
type: Concept
creator: Commission d'enrichissement de la langue française, FranceTerme
date parution JO: 2010-07-22
equivalent EN: cut-up @en
equivalent EN: cut-up (en)
part of speech: nom masculin
definition: Composition faite d'éléments hétérogènes, qui constitue une œuvre originale.
in scheme: Arts
in scheme: concepts
notation: CULT559
related: collagiste

fondu
type: ConceptConcept
type: Concept
creator: Commission d'enrichissement de la langue française, FranceTerme
source: révision de l'arrêté du 24 janvier 1983
date parution JO: 2000-09-22
equivalent EN: shunt @en
equivalent EN: shunt (en)
part of speech: nom masculin
definition: Abaissement volontaire et progressif du niveau du signal son jusqu'à l'annulation.
in scheme: Audiovisuel
in scheme: concepts
notation: CULT56

désinscription
type: ConceptConcept
type: Concept
creator: Commission d'enrichissement de la langue française, FranceTerme
date parution JO: 2010-07-22
part of speech: nom féminin
definition: Radiation d'un objet, d'un immeuble ou d'un site figurant jusque-là dans une liste ou dans un inventaire, qui marque la déchéance d'un droit ou d'une protection.
in scheme: Culture
in scheme: concepts
notation: CULT562

bande-annonce
type: ConceptConcept
type: Concept
creator: Commission d'enrichissement de la langue française, FranceTerme
date parution JO: 2010-07-22
equivalent EN: trailer @en
equivalent EN: trailer (en)
part of speech: nom féminin
in scheme: Audiovisuel
in scheme: concept-SD-audiovisuel-cinema
in scheme: concept-SD-audiovisuel-television
in scheme: concepts
notation: CULT566
related: bande-annonce de livre

écumeur
type: ConceptConcept
type: Concept
creator: Commission d'enrichissement de la langue française, FranceTerme
date parution JO: 2010-07-22
equivalent EN: skimmer @en
equivalent EN: skimmer (en)
part of speech: nom masculin
definition: Système de récupération de déchets solides ou liquides à la surface de l'eau d'une piscine ou d'un bassin d'agrément.
in scheme: Habitat et construction
in scheme: concepts
notation: CULT567

longue traîne
type: ConceptConcept
type: Concept
creator: Commission d'enrichissement de la langue française, FranceTerme
date parution JO: 2010-07-22
equivalent EN: long tail @en
equivalent EN: long tail (en)
definition: Modèle économique dans lequel la vente, même en faible quantité, de produits culturels ou d'œuvres destinés à un public réduit ou dispersé devient rentable à long terme grâce au commerce en ligne.
in scheme: Audiovisuel
in scheme: Édition et livre
in scheme: concepts
notation: CULT568

fondu
type: ConceptConcept
type: Concept
creator: Commission d'enrichissement de la langue française, FranceTerme
source: révision de l'arrêté du 24 janvier 1983
date parution JO: 2000-09-22
equivalent EN: fade @en
equivalent EN: fade (en)
part of speech: nom masculin
definition: Apparition ou disparition progressive de l'image obtenue par une variation de l'exposition.
in scheme: Audiovisuel
in scheme: concept-SD-audiovisuel-cinema
in scheme: concept-SD-audiovisuel-television
in scheme: concepts
notation: CULT57

télévision de rattrapage
type: ConceptConcept
type: Concept
creator: Commission d'enrichissement de la langue française, FranceTerme
abbreviation: catch-up TV @en
date parution JO: 2010-07-22
deconseille ou frequent: replay television
deconseille ou frequent: replay tv
deconseille ou frequent: tv replay
equivalent EN: catch-up TV @en
equivalent EN: catch-up TV (en)
equivalent EN: catch-up television @en
equivalent EN: catch-up television (en)
definition: Service à la demande qui permet de voir ou de revoir un programme télévisé après sa première diffusion.
in scheme: Audiovisuel
in scheme: concept-SD-audiovisuel-television
in scheme: concepts
notation: CULT570
note: La télévision de rattrapage peut être gratuite ou payante, limitée ou non dans le temps, disponible immédiatement ou seulement après un certain délai par rapport à la diffusion initiale.
related: audio

mise en scène d'intérieur
type: ConceptConcept
type: Concept
creator: Commission d'enrichissement de la langue française, FranceTerme
date parution JO: 2010-07-22
equivalent EN: home staging @en
equivalent EN: home staging (en)
definition: Action consistant à rendre attrayant l'aménagement intérieur d'un bien immobilier en vue d'en favoriser la vente.
in scheme: Économie et gestion d'entreprise
in scheme: Habitat et construction
in scheme: concepts
notation: CULT572

vol à la rançon
type: ConceptConcept
type: Concept
creator: Commission d'enrichissement de la langue française, FranceTerme
date parution JO: 2010-07-22
equivalent EN: artnapping @en
equivalent EN: artnapping (en)
definition: Vol d'une œuvre d'art ou d'un objet précieux dont la restitution est conditionnée par le versement d'une rançon.
in scheme: Arts
in scheme: Culture
in scheme: concept-SD-arts-musees
in scheme: concept-SD-culture-musees
in scheme: concepts
notation: CULT573

performeur, -euse
type: ConceptConcept
type: Concept
creator: Commission d'enrichissement de la langue française, FranceTerme
date parution JO: 2010-07-22
equivalent EN: performer @en
equivalent EN: performer (en)
part of speech: nom
definition: Personne qui exécute une performance artistique.
in scheme: Arts
in scheme: concepts
notation: CULT574
related: performance

jouabilité
type: ConceptConcept
type: Concept
creator: Commission d'enrichissement de la langue française, FranceTerme
date parution JO: 2010-07-22
equivalent EN: gameplay @en
equivalent EN: gameplay (en)
part of speech: nom féminin
definition: Ensemble des possibilités d'action offertes au joueur par un jeu vidéo ; par extension, qualité du jeu appréciée au regard de ces possibilités.
in scheme: Audiovisuel
in scheme: concept-SD-audiovisuel-jeu-video
in scheme: concepts
notation: CULT576

fondu enchaîné
type: ConceptConcept
type: Concept
creator: Commission d'enrichissement de la langue française, FranceTerme
source: révision de l'arrêté du 24 janvier 1983
date parution JO: 2000-09-22
equivalent EN: cross fading @en
equivalent EN: cross fading (en)
definition: Combinaison simultanée d'un fondu et d'une ouverture en fondu.
in scheme: Audiovisuel
in scheme: concept-SD-audiovisuel-cinema
in scheme: concept-SD-audiovisuel-television
in scheme: concepts
notation: CULT58

fondu fermé
type: ConceptConcept
type: Concept
creator: Commission d'enrichissement de la langue française, FranceTerme
source: révision de l'arrêté du 24 janvier 1983
date parution JO: 2000-09-22
equivalent EN: dissolve @en
equivalent EN: dissolve (en)
alternative label: fermeture en fondu
alternative label: fondu au noir
definition: Disparition progressive de l'image qui s'évanouit dans le noir complet.
in scheme: Audiovisuel
in scheme: concept-SD-audiovisuel-cinema
in scheme: concept-SD-audiovisuel-television
in scheme: concepts
notation: CULT59

platinisme
type: ConceptConcept
type: Concept
creator: Commission d'enrichissement de la langue française, FranceTerme
abbreviation: DJing @en
date parution JO: 2011-10-16
deconseille ou frequent: turntablism
equivalent EN: DJing @en
equivalent EN: DJing (en)
equivalent EN: deejaying @en
equivalent EN: deejaying (en)
equivalent EN: disc jockeying @en
equivalent EN: disc jockeying (en)
part of speech: nom masculin
definition: Art de combiner différentes sources sonores, particulièrement des disques en vinyle ou compacts, en vue de produire une création originale.
in scheme: Arts
in scheme: concept-SD-arts-musique
in scheme: concepts
notation: CULT595
related: platiniste

platiniste
type: ConceptConcept
type: Concept
creator: Commission d'enrichissement de la langue française, FranceTerme
abbreviation: DJ @en
date parution JO: 2011-10-16
deconseille ou frequent: discjockey
equivalent EN: DJ @en
equivalent EN: DJ (en)
equivalent EN: deejay @en
equivalent EN: deejay (en)
equivalent EN: disc jockey @en
equivalent EN: disc jockey (en)
part of speech: nom
definition: Artiste qui combine différentes sources sonores, particulièrement des disques en vinyle ou compacts, en vue de produire une création originale.
in scheme: Arts
in scheme: concept-SD-arts-musique
in scheme: concepts
notation: CULT596
note: Le terme « platiniste » est également utilisé comme adjectif.
related: platinisme

aguichage
type: ConceptConcept
type: Concept
creator: Commission d'enrichissement de la langue française, FranceTerme
source: révision de l'arrêté du 24 janvier 1983
date parution JO: 2000-09-22
equivalent EN: teasing @en
equivalent EN: teasing (en)
part of speech: nom masculin
definition: Procédé publicitaire qui utilise l'aguiche.
in scheme: Communication
in scheme: concept-SD-communication-publicite
in scheme: concepts
notation: CULT6

fondu ouvert
type: ConceptConcept
type: Concept
creator: Commission d'enrichissement de la langue française, FranceTerme
source: révision de l'arrêté du 24 janvier 1983
date parution JO: 2000-09-22
equivalent EN: fade in @en
equivalent EN: fade in (en)
alternative label: ouverture en fondu
definition: Apparition progressive de l'image qui semble émerger du noir complet.
in scheme: Audiovisuel
in scheme: concept-SD-audiovisuel-cinema
in scheme: concept-SD-audiovisuel-television
in scheme: concepts
notation: CULT60

livre-éclair
type: ConceptConcept
type: Concept
creator: Commission d'enrichissement de la langue française, FranceTerme
date parution JO: 2011-10-16
equivalent EN: quick book @en
equivalent EN: quick book (en)
part of speech: nom masculin
definition: Ouvrage lié à un sujet d'actualité, qui est écrit et publié dans de très courts délais.
in scheme: Édition et livre
in scheme: concepts
notation: CULT605

capture de mouvement
type: ConceptConcept
type: Concept
creator: Commission d'enrichissement de la langue française, FranceTerme
date parution JO: 2011-10-16
equivalent EN: mocap @en
equivalent EN: mocap (en)
equivalent EN: motion capture @en
equivalent EN: motion capture (en)
definition: Technique d'enregistrement numérique des mouvements d'un être vivant permettant de les utiliser dans des images de synthèse.
in scheme: Audiovisuel
in scheme: concepts
notation: CULT606
related: avatar
related: capture de jeu
related: suivi des mains

capture de jeu
type: ConceptConcept
type: Concept
creator: Commission d'enrichissement de la langue française, FranceTerme
date parution JO: 2011-10-16
equivalent EN: performance capture @en
equivalent EN: performance capture (en)
definition: Technique d'enregistrement numérique du jeu et des expressions d'un acteur permettant de les utiliser dans des images de synthèse.
in scheme: Audiovisuel
in scheme: concepts
notation: CULT607
related: avatar
related: capture de mouvement

concepteur, -trice de lumière
type: ConceptConcept
type: Concept
creator: Commission d'enrichissement de la langue française, FranceTerme
date parution JO: 2011-10-16
deconseille ou frequent: concepteur lumière
equivalent EN: light designer @en
equivalent EN: light designer (en)
equivalent EN: lighting designer @en
equivalent EN: lighting designer (en)
definition: Personne qui conçoit l'éclairage d'un spectacle ou la mise en valeur par des effets de lumière d'un site, d'un monument ou d'un évènement.
in scheme: Arts
in scheme: concepts
notation: CULT608
note: On trouve aussi, dans le langage professionnel, le terme « concepteur lumière ».

concepteur, -trice de son
type: ConceptConcept
type: Concept
creator: Commission d'enrichissement de la langue française, FranceTerme
date parution JO: 2011-10-16
deconseille ou frequent: concepteur son
equivalent EN: sound designer @en
equivalent EN: sound designer (en)
definition: Personne qui conçoit les effets sonores d'un spectacle ou le paysage sonore d'un site, d'un monument ou d'un évènement.
in scheme: Arts
in scheme: concepts
notation: CULT609
note: On trouve aussi, dans le langage professionnel, le terme « concepteur son ».
related: paysage sonore

force centripète
type: ConceptConcept
type: Concept
creator: Commission d'enrichissement de la langue française, FranceTerme
source: révision de l'arrêté du 10 octobre 1985
date parution JO: 2000-09-22
equivalent EN: drag @en
equivalent EN: drag (en)
equivalent EN: side thrust @en
equivalent EN: side thrust (en)
equivalent EN: stylus drag @en
equivalent EN: stylus drag (en)
definition: Couple de rappel du bras vers le centre du disque, consécutif à la correction de l'erreur de piste d'un bras pivotant.
in scheme: Audiovisuel
in scheme: concepts
notation: CULT61

paysage sonore
type: ConceptConcept
type: Concept
creator: Commission d'enrichissement de la langue française, FranceTerme
date parution JO: 2011-10-16
equivalent EN: soundscape @en
equivalent EN: soundscape (en)
definition: Composition sonore conçue pour un espace déterminé.
in scheme: Arts
in scheme: concept-SD-arts-musique
in scheme: concepts
notation: CULT610
related: concepteur, -trice de son

concepteur, -trice de jeu
type: ConceptConcept
type: Concept
creator: Commission d'enrichissement de la langue française, FranceTerme
date parution JO: 2011-10-16
equivalent EN: game designer @en
equivalent EN: game designer (en)
definition: Personne qui conçoit un jeu vidéo et en dirige la réalisation.
in scheme: Audiovisuel
in scheme: concept-SD-audiovisuel-jeu-video
in scheme: concepts
notation: CULT612
related: concepteur, -trice de niveaux de jeu

concepteur, -trice de niveaux de jeu
type: ConceptConcept
type: Concept
creator: Commission d'enrichissement de la langue française, FranceTerme
date parution JO: 2017-04-08
deconseille ou frequent: concepteur de niveau de jeu
deconseille ou frequent: conceptrice de niveau de jeu
equivalent EN: game level designer @en
equivalent EN: game level designer (en)
equivalent EN: level designer @en
equivalent EN: level designer (en)
definition: Personne chargée en tout ou partie de la conception des niveaux d'un jeu vidéo.
in scheme: Audiovisuel
in scheme: concept-SD-audiovisuel-jeu-video
in scheme: concepts
notation: CULT613
related: concepteur, -trice de jeu
related: niveau de jeu

hyperjoueur, -euse
type: ConceptConcept
type: Concept
creator: Commission d'enrichissement de la langue française, FranceTerme
date parution JO: 2017-04-08
deconseille ou frequent: joueur accro
deconseille ou frequent: joueur hardcore
equivalent EN: hardcore gamer @en
equivalent EN: hardcore gamer (en)
part of speech: nom
definition: Joueur passionné de jeu vidéo, qui en a une pratique très fréquente et une grande maîtrise.
in scheme: Audiovisuel
in scheme: concept-SD-audiovisuel-jeu-video
in scheme: concepts
notation: CULT614
related: joueur, -euse professionnel, -elle
related: pratique intensive

modulateur de durée
type: ConceptConcept
type: Concept
creator: Commission d'enrichissement de la langue française, FranceTerme
date parution JO: 2011-10-16
equivalent EN: time stretcher @en
equivalent EN: time stretcher (en)
definition: Dispositif électronique permettant d'allonger ou de raccourcir la durée d'une séquence sonore sans changer nécessairement la hauteur des sons.
in scheme: Arts
in scheme: concept-SD-arts-musique
in scheme: concepts
notation: CULT615
related: concept-musique

modulateur de hauteur
type: ConceptConcept
type: Concept
creator: Commission d'enrichissement de la langue française, FranceTerme
date parution JO: 2011-10-16
equivalent EN: pitch bend @en
equivalent EN: pitch bend (en)
equivalent EN: pitch bender @en
equivalent EN: pitch bender (en)
definition: Dispositif électronique permettant de modifier de façon continue la hauteur d'un son.
in scheme: Arts
in scheme: concept-SD-arts-musique
in scheme: concepts
notation: CULT616

transpositeur
type: ConceptConcept
type: Concept
creator: Commission d'enrichissement de la langue française, FranceTerme
date parution JO: 2011-10-16
equivalent EN: pitch shift @en
equivalent EN: pitch shift (en)
equivalent EN: pitch shifter @en
equivalent EN: pitch shifter (en)
part of speech: nom masculin
definition: Dispositif électronique permettant de modifier la tonalité d'un morceau de musique.
in scheme: Arts
in scheme: concept-SD-arts-musique
in scheme: concepts
notation: CULT617

suspens
type: ConceptConcept
type: Concept
creator: Commission d'enrichissement de la langue française, FranceTerme
date parution JO: 2011-10-16
equivalent EN: cliffhanger @en
equivalent EN: cliffhanger (en)
part of speech: nom masculin
broader: concept-litterature
definition: Effet dramatique visant à tenir le lecteur ou le spectateur en haleine, notamment à la fin d'un chapitre, d'un épisode ou d'une séquence.
in scheme: Audiovisuel
in scheme: Littérature
in scheme: concepts
notation: CULT618

performance
type: ConceptConcept
type: Concept
creator: Commission d'enrichissement de la langue française, FranceTerme
date parution JO: 2010-07-22
equivalent EN: performance @en
equivalent EN: performance (en)
part of speech: nom féminin
definition: Évènement artistique qui recourt à différents modes d'expression dont l'exécution constitue l'œuvre elle-même.
in scheme: Arts
in scheme: concepts
notation: CULT619
related: performeur, -euse
related: concept-arts

gravure directe sur métal
type: ConceptConcept
type: Concept
creator: Commission d'enrichissement de la langue française, FranceTerme
source: révision de l'arrêté du 10 octobre 1985
abbreviation: DMM @en
abbreviation: GDM
date parution JO: 2000-09-22
equivalent EN: DMM @en
equivalent EN: DMM (en)
equivalent EN: direct metal mastering @en
equivalent EN: direct metal mastering (en)
definition: Procédé de gravure analogique directe sur support métallique.
in scheme: Audiovisuel
in scheme: concepts
notation: CULT62
note: Le terme anglais est une marque déposée.

capteur
type: ConceptConcept
type: Concept
creator: Commission d'enrichissement de la langue française, FranceTerme
date parution JO: 2011-10-16
equivalent EN: trigger @en
equivalent EN: trigger (en)
part of speech: nom masculin
definition: Accessoire électronique fixé sur un instrument de percussion, qui permet de convertir le son produit par cet instrument en le numérisant, et ainsi de le transformer ou de l'enrichir selon un programme prédéterminé.
in scheme: Arts
in scheme: concept-SD-arts-musique
in scheme: concepts
notation: CULT620

contrat d'endossement
type: ConceptConcept
type: Concept
creator: Commission d'enrichissement de la langue française, FranceTerme
date parution JO: 2011-10-16
equivalent EN: endorsement agreement @en
equivalent EN: endorsement agreement (en)
definition: Contrat par lequel une personnalité médiatique, notamment un artiste ou un sportif, s'engage à assurer la promotion d'une marque à titre exclusif.
in scheme: Communication
in scheme: concept-SD-communication-publicite
in scheme: concepts
notation: CULT621

désinfestation
type: ConceptConcept
type: Concept
creator: Commission d'enrichissement de la langue française, FranceTerme
date parution JO: 2011-10-16
equivalent EN: disinfestation @en
equivalent EN: disinfestation (en)
part of speech: nom féminin
definition: Élimination des rongeurs ou des arthropodes nuisibles.
in scheme: Tous domaines
in scheme: concepts
notation: CULT625

rousseurs
type: ConceptConcept
type: Concept
creator: Commission d'enrichissement de la langue française, FranceTerme
date parution JO: 2011-10-16
equivalent EN: foxing @en
equivalent EN: foxing (en)
part of speech: nom féminin pluriel
definition: Taches brun orangé altérant certains supports, tels que le papier, le carton ou le cuir.
in scheme: Arts
in scheme: Culture
in scheme: concept-SD-arts-patrimoine
in scheme: concept-SD-culture-patrimoine
in scheme: concepts
notation: CULT626
note: Les rousseurs sont dues à la présence, dans les supports, de particules métalliques oxydées ou de microorganismes.

directement en vidéo
type: ConceptConcept
type: Concept
creator: Commission d'enrichissement de la langue française, FranceTerme
abbreviation: DEV
abbreviation: DTV @en
date parution JO: 2011-10-16
equivalent EN: DTV @en
equivalent EN: DTV (en)
equivalent EN: direct-to-video @en
equivalent EN: direct-to-video (en)
part of speech: locution adjectivale
definition: Se dit de la sortie en vidéo d'un film sans exploitation préalable en salle.
in scheme: Audiovisuel
in scheme: concept-SD-audiovisuel-video
in scheme: concepts
notation: CULT627

gros plan
type: ConceptConcept
type: Concept
creator: Commission d'enrichissement de la langue française, FranceTerme
source: révision de l'arrêté du 24 janvier 1983
date parution JO: 2000-09-22
equivalent EN: close-up @en
equivalent EN: close-up (en)
definition: Plan isolant un détail du corps ; par extension, toute prise de vue rapprochée d'un objet.
in scheme: Audiovisuel
in scheme: concept-SD-audiovisuel-cinema
in scheme: concept-SD-audiovisuel-television
in scheme: concepts
notation: CULT63
note: 1. Lorsque le plan cadre une partie du visage (œil, bouche), on parle de très gros plan.
note: 2. Lorsque le gros plan cadre un détail d'objet, on parle d'un plan de détail.
related: très gros plan
related: plan rapproché

repéreur, -euse
type: ConceptConcept
type: Concept
creator: Commission d'enrichissement de la langue française, FranceTerme
date parution JO: 2011-10-16
equivalent EN: location scout @en
equivalent EN: location scout (en)
part of speech: nom
definition: Personne chargée de trouver des lieux pour le tournage d'un film.
in scheme: Audiovisuel
in scheme: concept-SD-audiovisuel-cinema
in scheme: concept-SD-audiovisuel-television
in scheme: concepts
notation: CULT631

rétropublication
type: ConceptConcept
type: Concept
creator: Commission d'enrichissement de la langue française, FranceTerme
date parution JO: 2011-10-16
equivalent EN: reverse publishing @en
equivalent EN: reverse publishing (en)
part of speech: nom féminin
definition: Édition sur papier d'un contenu originellement diffusé sur un support numérique.
in scheme: Communication
in scheme: Édition et livre
in scheme: concepts
notation: CULT632

ripeur, -euse
type: ConceptConcept
type: Concept
creator: Commission d'enrichissement de la langue française, FranceTerme
date parution JO: 2011-10-16
equivalent EN: ripper @en
equivalent EN: ripper (en)
part of speech: nom
definition: Technicien chargé du déménagement et de la manutention du mobilier nécessaire à une production théâtrale ou audiovisuelle.
in scheme: Arts
in scheme: Audiovisuel
in scheme: concept-SD-arts-arts-de-la-scene
in scheme: concept-SD-audiovisuel-arts-de-la-scene
in scheme: concepts
notation: CULT633

scène cinématique
type: ConceptConcept
type: Concept
creator: Commission d'enrichissement de la langue française, FranceTerme
date parution JO: 2011-10-16
equivalent EN: cut scene @en
equivalent EN: cut scene (en)
forme abregee: cinématique, n.f.
definition: Scène animée durant laquelle un joueur ne peut intervenir, et qui sert d'introduction ou de conclusion à un jeu vidéo, ou encore de transition entre les étapes interactives de ce jeu.
in scheme: Audiovisuel
in scheme: concept-SD-audiovisuel-jeu-video
in scheme: concepts
notation: CULT634

sortie simultanée
type: ConceptConcept
type: Concept
creator: Commission d'enrichissement de la langue française, FranceTerme
date parution JO: 2011-10-16
deconseille ou frequent: day-and-date
equivalent EN: day-and-date release @en
equivalent EN: day-and-date release (en)
definition: Première diffusion d'un film assurée par divers modes d'exploitation à une même date.
in scheme: Audiovisuel
in scheme: concept-SD-audiovisuel-cinema
in scheme: concepts
notation: CULT635

fréquence d'images
type: ConceptConcept
type: Concept
creator: Commission d'enrichissement de la langue française, FranceTerme
date parution JO: 2011-10-16
equivalent EN: frame rate @en
equivalent EN: frame rate (en)
definition: Cadence à laquelle des images sont successivement captées, transmises ou affichées sur un écran.
in scheme: Audiovisuel
in scheme: concept-SD-audiovisuel-jeu-video
in scheme: concepts
notation: CULT637

tournerie
type: ConceptConcept
type: Concept
creator: Commission d'enrichissement de la langue française, FranceTerme
date parution JO: 2011-10-16
equivalent EN: turn around @en
equivalent EN: turn around (en)
part of speech: nom féminin
definition: Séquence mélodique, harmonique ou rythmique, se répétant en boucle dans une œuvre musicale.
in scheme: Arts
in scheme: concept-SD-arts-musique
in scheme: concepts
notation: CULT639

groupiste
type: ConceptConcept
type: Concept
creator: Commission d'enrichissement de la langue française, FranceTerme
source: révision de l'arrêté du 24 janvier 1983
date parution JO: 2000-09-22
deconseille ou frequent: groupman
equivalent EN: generating set operator @en
equivalent EN: generating set operator (en)
equivalent EN: power generator electrician @en
equivalent EN: power generator electrician (en)
part of speech: nom
definition: Personne responsable du fonctionnement d'un groupe électrogène.
in scheme: Audiovisuel
in scheme: concept-SD-audiovisuel-cinema
in scheme: concept-SD-audiovisuel-television
in scheme: concepts
notation: CULT64
note: Le terme « groupman » ne doit pas être employé.

vidéolivre
type: ConceptConcept
type: Concept
creator: Commission d'enrichissement de la langue française, FranceTerme
abbreviation: vook @en
date parution JO: 2011-10-16
equivalent EN: video book @en
equivalent EN: video book (en)
equivalent EN: vook @en
equivalent EN: vook (en)
part of speech: nom masculin
definition: Ouvrage composé de textes, de sons et d'images animées, diffusé sur un support numérique.
in scheme: Édition et livre
in scheme: concepts
notation: CULT640

costumade
type: ConceptConcept
type: Concept
creator: Commission d'enrichissement de la langue française, FranceTerme
date parution JO: 2011-10-16
equivalent EN: cosplay @en
equivalent EN: cosplay (en)
part of speech: nom féminin
definition: Rassemblement costumé d'amateurs ayant endossé l'apparence de leurs personnages favoris, empruntés à la bande dessinée, au manga, au cinéma et aux jeux vidéo.
in scheme: Culture
in scheme: Loisirs
in scheme: concepts
notation: CULT641

station mobile de transmission par satellite
type: ConceptConcept
type: Concept
creator: Commission d'enrichissement de la langue française, FranceTerme
abbreviation: DSNG @en
abbreviation: SMTS
date parution JO: 2011-10-16
equivalent EN: DSNG @en
equivalent EN: DSNG (en)
equivalent EN: digital satellite news gathering @en
equivalent EN: digital satellite news gathering (en)
definition: Véhicule équipé d'un système de réception et de transmission d'un signal numérique par satellite.
in scheme: Audiovisuel
in scheme: Télécommunications
in scheme: concepts
notation: CULT642

mimoclip
type: ConceptConcept
type: Concept
creator: Commission d'enrichissement de la langue française, FranceTerme
date parution JO: 2011-10-16
equivalent EN: lip dub @en
equivalent EN: lip dub (en)
equivalent EN: lipdub @en
equivalent EN: lipdub (en)
part of speech: nom masculin
definition: Interprétation mimée, sur un vidéogramme, d'une bande-son préexistante ; par extension, ce vidéogramme lui-même.
in scheme: Audiovisuel
in scheme: concept-SD-audiovisuel-video
in scheme: concepts
notation: CULT643

document de position
type: ConceptConcept
type: Concept
creator: Commission d'enrichissement de la langue française, FranceTerme
date parution JO: 2011-10-16
equivalent EN: position paper @en
equivalent EN: position paper (en)
definition: Document par lequel une organisation expose de façon officielle ses vues sur un sujet, dans un contexte donné.
in scheme: Communication
in scheme: concepts
notation: CULT645

clair (en)
type: ConceptConcept
type: Concept
creator: Commission d'enrichissement de la langue française, FranceTerme
abbreviation: FTA @en
date parution JO: 2011-10-16
deconseille ou frequent: en clair
equivalent EN: FTA @en
equivalent EN: FTA (en)
equivalent EN: free-to-air @en
equivalent EN: free-to-air (en)
part of speech: locution adjectivale
definition: Se dit de tout système de diffusion et de réception d'un programme non crypté.
in scheme: Audiovisuel
in scheme: concepts
notation: CULT646

gomme à réserve
type: ConceptConcept
type: Concept
creator: Commission d'enrichissement de la langue française, FranceTerme
date parution JO: 2011-10-16
equivalent EN: drawing gum @en
equivalent EN: drawing gum (en)
definition: Produit servant à masquer certaines zones d'un support à peindre, que l'on enlève une fois la couleur appliquée.
in scheme: Arts
in scheme: concepts
notation: CULT647

plan d'identification d'un produit
type: ConceptConcept
type: Concept
creator: Commission d'enrichissement de la langue française, FranceTerme
source: révision de l'arrêté du 24 janvier 1983
date parution JO: 2000-09-22
equivalent EN: pack-shot @en
equivalent EN: pack-shot (en)
in scheme: Communication
in scheme: concept-SD-communication-publicite
in scheme: concepts
notation: CULT649

haut-parleur d'aigus
type: ConceptConcept
type: Concept
creator: Commission d'enrichissement de la langue française, FranceTerme
source: révision de l'arrêté du 10 octobre 1985
date parution JO: 2000-09-22
equivalent EN: tweeter @en
equivalent EN: tweeter (en)
definition: Haut-parleur spécialement conçu pour assurer la reproduction des fréquences élevées du spectre audible.
in scheme: Acoustique
in scheme: Audiovisuel
in scheme: concepts
notation: CULT65

diode électroluminescente
type: ConceptConcept
type: Concept
creator: Commission d'enrichissement de la langue française, FranceTerme
source: révision de l'arrêté du 10 octobre 1985
abbreviation: DEL
abbreviation: LED @en
date parution JO: 2000-09-22
equivalent EN: LED @en
equivalent EN: LED (en)
equivalent EN: light-emitting diode @en
equivalent EN: light-emitting diode (en)
definition: Diode semiconductrice à jonction qui émet une lumière colorée lorsqu'elle est traversée par un courant électrique.
in scheme: Électronique
in scheme: concept-SD-electronique-composants-electroniques
in scheme: concepts
notation: CULT652
note: L'emploi en français de l'abréviation anglaise LED ou de l'expression « diode LED » est déconseillé.
related: écoéclairage
related: diode électroluminescente organique
related: concept-TELE540
related: concept-TELE541
related: concept-TELE560

jeu de rôle en ligne multijoueur de masse
type: ConceptConcept
type: Concept
creator: Commission d'enrichissement de la langue française, FranceTerme
abbreviation: JRMM
date parution JO: 2017-04-08
deconseille ou frequent: jeu de rôle en ligne massivement multijoueur
equivalent EN: MMORPG @en
equivalent EN: MMORPG (en)
equivalent EN: massively multiplayer online role playing game @en
equivalent EN: massively multiplayer online role playing game (en)
definition: Jeu en ligne multijoueur de masse dans lequel le joueur interagit avec les autres joueurs et son environnement virtuel par le biais de son avatar.
in scheme: Audiovisuel
in scheme: concept-SD-audiovisuel-jeu-video
in scheme: concepts
notation: CULT653
note: On trouve aussi le terme « jeu de rôle en ligne massivement multijoueur ».
related: jeu en ligne multijoueur de masse

jeu vidéo en nuage
type: ConceptConcept
type: Concept
creator: Commission d'enrichissement de la langue française, FranceTerme
date parution JO: 2022-05-29
deconseille ou frequent: cloud game
deconseille ou frequent: gaming on demand
deconseille ou frequent: jeu dans le nuage
deconseille ou frequent: jeu en nuage
equivalent EN: cloud gaming @en
equivalent EN: cloud gaming (en)
part of speech: locution nominale masculine
definition: Technologie qui, grâce à l’informatique en nuage, permet de jouer à un jeu vidéo à distance sans téléchargement.
in scheme: Audiovisuel
in scheme: concept-SD-audiovisuel-jeu-video
in scheme: concepts
notation: CULT655
related: informatique en nuage
related: jeu vidéo à la demande

ludopublicité
type: ConceptConcept
type: Concept
creator: Commission d'enrichissement de la langue française, FranceTerme
date parution JO: 2020-05-23
deconseille ou frequent: jeu vidéo publicitaire
equivalent EN: advergaming @en
equivalent EN: advergaming (en)
part of speech: nom féminin
definition: Mode de publicité qui recourt aux jeux vidéo publicitaires.
in scheme: Audiovisuel
in scheme: Communication
in scheme: concept-SD-audiovisuel-publicite
in scheme: concept-SD-communication-publicite
in scheme: concepts
notation: CULT657
related: jeu vidéo publicitaire
related: publicité intrajeu
related: publicité-divertissement
related: ludification

jeu vidéo publicitaire
type: ConceptConcept
type: Concept
creator: Commission d'enrichissement de la langue française, FranceTerme
date parution JO: 2019-06-25
deconseille ou frequent: advertising game
equivalent EN: advergame @en
equivalent EN: advergame (en)
forme abregee: jeu publicitaire
definition: Jeu vidéo conçu pour faire la promotion d’un produit, d’un service, d’une marque ou d’un évènement.
in scheme: Audiovisuel
in scheme: Communication
in scheme: concept-SD-audiovisuel-publicite
in scheme: concept-SD-communication-publicite
in scheme: concepts
notation: CULT658
related: ludopublicité
related: publicité intrajeu
related: publicité-divertissement
related: ludification

publicité intrajeu
type: ConceptConcept
type: Concept
creator: Commission d'enrichissement de la langue française, FranceTerme
date parution JO: 2022-05-29
deconseille ou frequent: in game advertising
deconseille ou frequent: publicité in game
deconseille ou frequent: publicité intégrée au jeu
equivalent EN: IGA @en
equivalent EN: IGA (en)
equivalent EN: in-game advertising @en
equivalent EN: in-game advertising (en)
part of speech: locution nominale féminine
alternative label: publicité dans le jeu
definition: Pratique qui consiste à intégrer des messages publicitaires à l’intérieur d’un jeu vidéo.
in scheme: Audiovisuel
in scheme: Communication
in scheme: concept-SD-audiovisuel-publicite
in scheme: concept-SD-communication-publicite
in scheme: concepts
notation: CULT659
note: La publicité intrajeu peut prendre des formes différentes allant du placement de produit à l’insertion d’écrans publicitaires.
related: ludopublicité
related: jeu vidéo publicitaire

haut-parleur de graves
type: ConceptConcept
type: Concept
creator: Commission d'enrichissement de la langue française, FranceTerme
source: révision de l'arrêté du 10 octobre 1985
date parution JO: 2000-09-22
equivalent EN: boomer @en
equivalent EN: boomer (en)
equivalent EN: woofer @en
equivalent EN: woofer (en)
definition: Haut-parleur spécialement conçu pour assurer la reproduction des fréquences basses du spectre audible.
in scheme: Acoustique
in scheme: Audiovisuel
in scheme: concepts
notation: CULT66

joueur, -euse professionnel, -elle
type: ConceptConcept
type: Concept
creator: Commission d'enrichissement de la langue française, FranceTerme
date parution JO: 2022-05-29
deconseille ou frequent: PGM
deconseille ou frequent: e-sportif
deconseille ou frequent: e-sportive
deconseille ou frequent: esportif
deconseille ou frequent: esportive
deconseille ou frequent: gamer pro
deconseille ou frequent: pro gamer
equivalent EN: pro-gamer @en
equivalent EN: pro-gamer (en)
equivalent EN: progamer @en
equivalent EN: progamer (en)
definition: Joueur qui tire une part importante de ses revenus de la pratique du jeu vidéo de compétition.
in scheme: Audiovisuel
in scheme: concept-SD-audiovisuel-jeu-video
in scheme: concepts
notation: CULT660
related: hyperjoueur, -euse
related: joueur, -euse occasionnel, -elle
related: jeu vidéo de compétition

livre-magazine
type: ConceptConcept
type: Concept
creator: Commission d'enrichissement de la langue française, FranceTerme
date parution JO: 2019-06-25
equivalent EN: mook @en
equivalent EN: mook (en)
part of speech: nom masculin
definition: Publication périodique de forme hybride tenant à la fois de la revue, du magazine et du livre, qui associe une maquette soignée et très illustrée à un contenu textuel abondant.
in scheme: Édition et livre
in scheme: concepts
notation: CULT662
note: Le livre-magazine est distribué en librairie et en kiosque.

vérification des faits
type: ConceptConcept
type: Concept
creator: Commission d'enrichissement de la langue française, FranceTerme
date parution JO: 2017-04-08
equivalent EN: fact checking @en
equivalent EN: fact checking (en)
equivalent EN: reality check @en
equivalent EN: reality check (en)
definition: Vérification, le plus souvent par des journalistes, de l’exactitude de faits énoncés publiquement, notamment dans les médias.
in scheme: Communication
in scheme: concept-SD-communication-presse
in scheme: concepts
notation: CULT666

bande dessinée en ligne
type: ConceptConcept
type: Concept
creator: Commission d'enrichissement de la langue française, FranceTerme
date parution JO: 2019-06-25
deconseille ou frequent: web comic
deconseille ou frequent: webcomics
equivalent EN: webcomic @en
equivalent EN: webcomic (en)
forme abregee: BD en ligne
in scheme: Édition et livre
in scheme: concepts
notation: CULT668

images d'archives
type: ConceptConcept
type: Concept
creator: Commission d'enrichissement de la langue française, FranceTerme
source: révision de l'arrêté du 24 janvier 1983
date parution JO: 2000-09-22
equivalent EN: stock-shot @en
equivalent EN: stock-shot (en)
forme abregee: archives, n.f.pl.
definition: Images d'actualité de cinéma ou de télévision empruntées à des documents d'archives et insérées dans une œuvre postérieure de reportage ou de fiction.
in scheme: Audiovisuel
in scheme: concept-SD-audiovisuel-cinema
in scheme: concept-SD-audiovisuel-television
in scheme: concepts
notation: CULT67

niveau de jeu
type: ConceptConcept
type: Concept
creator: Commission d'enrichissement de la langue française, FranceTerme
date parution JO: 2017-04-08
equivalent EN: game level @en
equivalent EN: game level (en)
equivalent EN: level @en
equivalent EN: level (en)
definition: Chacune des étapes de la narration ou de la progression d’un jeu vidéo, dont la difficulté est généralement croissante.
in scheme: Audiovisuel
in scheme: concept-SD-audiovisuel-jeu-video
in scheme: concepts
notation: CULT670
related: concepteur, -trice de niveaux de jeu

pratique intensive
type: ConceptConcept
type: Concept
creator: Commission d'enrichissement de la langue française, FranceTerme
date parution JO: 2017-04-08
deconseille ou frequent: jeu intensif
equivalent EN: hardcore gaming @en
equivalent EN: hardcore gaming (en)
definition: Pratique très fréquente et experte du jeu vidéo.
in scheme: Audiovisuel
in scheme: concept-SD-audiovisuel-jeu-video
in scheme: concepts
notation: CULT671
related: hyperjoueur, -euse

jeu grand public
type: ConceptConcept
type: Concept
creator: Commission d'enrichissement de la langue française, FranceTerme
date parution JO: 2017-04-08
deconseille ou frequent: jeu casual
equivalent EN: casual game @en
equivalent EN: casual game (en)
definition: Jeu vidéo aux règles simples, destiné à un large public.
in scheme: Audiovisuel
in scheme: concept-SD-audiovisuel-jeu-video
in scheme: concepts
notation: CULT672
note: Le terme « jeu grand public » est à distinguer du terme « jeu occasionnel », qui est déconseillé dans ce sens.
related: pratique occasionnelle

joueur, -euse occasionnel, -elle
type: ConceptConcept
type: Concept
creator: Commission d'enrichissement de la langue française, FranceTerme
date parution JO: 2017-04-08
deconseille ou frequent: joueur casual
equivalent EN: casual gamer @en
equivalent EN: casual gamer (en)
in scheme: Audiovisuel
in scheme: concept-SD-audiovisuel-jeu-video
in scheme: concepts
notation: CULT673
related: joueur, -euse professionnel, -elle
related: pratique occasionnelle

pratique occasionnelle
type: ConceptConcept
type: Concept
creator: Commission d'enrichissement de la langue française, FranceTerme
date parution JO: 2017-04-08
deconseille ou frequent: jeu casual
deconseille ou frequent: jeu occasionnel
equivalent EN: casual gaming @en
equivalent EN: casual gaming (en)
definition: Pratique du jeu vidéo à laquelle une personne s’adonne de façon épisodique.
in scheme: Audiovisuel
in scheme: concept-SD-audiovisuel-jeu-video
in scheme: concepts
notation: CULT674
note: On trouve aussi le terme « jeu occasionnel ».
related: jeu grand public
related: joueur, -euse occasionnel, -elle

jeu en ligne multijoueur de masse
type: ConceptConcept
type: Concept
creator: Commission d'enrichissement de la langue française, FranceTerme
abbreviation: JMM
date parution JO: 2017-04-08
deconseille ou frequent: jeu en ligne massivement multijoueur
equivalent EN: MMO game @en
equivalent EN: MMO game (en)
equivalent EN: MMOG @en
equivalent EN: MMOG (en)
equivalent EN: massively multiplayer online game @en
equivalent EN: massively multiplayer online game (en)
definition: Jeu vidéo en réseau, accessible via l’internet, auquel un très grand nombre de joueurs peut participer simultanément et en temps réel.
in scheme: Audiovisuel
in scheme: concept-SD-audiovisuel-jeu-video
in scheme: concepts
notation: CULT675
note: On trouve aussi le terme « jeu en ligne massivement multijoueur ».
related: jeu de rôle en ligne multijoueur de masse
related: appariement de joueurs

vidéo à la demande par abonnement
type: ConceptConcept
type: Concept
creator: Commission d'enrichissement de la langue française, FranceTerme
abbreviation: VADA
date parution JO: 2017-04-08
equivalent EN: SVOD @en
equivalent EN: SVOD (en)
equivalent EN: subscription video on demand @en
equivalent EN: subscription video on demand (en)
in scheme: Audiovisuel
in scheme: Informatique
in scheme: concept-SD-audiovisuel-internet
in scheme: concept-SD-informatique-internet
in scheme: concepts
notation: CULT677
related: vidéo à la demande

vidéo à la demande
type: ConceptConcept
type: Concept
creator: Commission d'enrichissement de la langue française, FranceTerme
abbreviation: VAD
date parution JO: 2017-04-08
equivalent EN: VOD @en
equivalent EN: VOD (en)
equivalent EN: video on demand @en
equivalent EN: video on demand (en)
definition: Service de diffusion qui offre à l’usager la possibilité d’accéder à tout moment à un programme vidéo choisi dans un ensemble de titres proposés.
in scheme: Audiovisuel
in scheme: Informatique
in scheme: concept-SD-audiovisuel-internet
in scheme: concept-SD-informatique-internet
in scheme: concepts
notation: CULT678
related: vidéo à la demande par abonnement
related: vidéo à la demande en téléchargement définitif
related: audio
scope note: Cette publication annule et remplace celle du Journal officiel du 5 avril 2006.

vidéo à la demande en téléchargement définitif
type: ConceptConcept
type: Concept
creator: Commission d'enrichissement de la langue française, FranceTerme
abbreviation: VADTD
date parution JO: 2017-04-08
equivalent EN: EST @en
equivalent EN: EST (en)
equivalent EN: electronic sell through @en
equivalent EN: electronic sell through (en)
forme abregee: VAD en téléchargement définitif
in scheme: Audiovisuel
in scheme: Informatique
in scheme: concept-SD-audiovisuel-internet
in scheme: concept-SD-informatique-internet
in scheme: concepts
notation: CULT679
related: vidéo à la demande

visionnage boulimique
type: ConceptConcept
type: Concept
creator: Commission d'enrichissement de la langue française, FranceTerme
date parution JO: 2017-04-08
deconseille ou frequent: binge watcher
deconseille ou frequent: binge watcheur
deconseille ou frequent: binge watcheuse
deconseille ou frequent: visionneur boulimique
deconseille ou frequent: visionneuse boulimique
equivalent EN: binge viewing @en
equivalent EN: binge viewing (en)
equivalent EN: binge watching @en
equivalent EN: binge watching (en)
definition: Pratique qui consiste à regarder à la suite un très grand nombre de contenus audiovisuels, notamment les épisodes d’une même série télévisée.
in scheme: Audiovisuel
in scheme: concepts
notation: CULT680

jeu vidéo à réalité intégrée
type: ConceptConcept
type: Concept
creator: Commission d'enrichissement de la langue française, FranceTerme
abbreviation: JRI
date parution JO: 2017-04-08
deconseille ou frequent: jeu en réalité alternée
equivalent EN: ARG @en
equivalent EN: ARG (en)
equivalent EN: alternate reality game @en
equivalent EN: alternate reality game (en)
definition: Jeu vidéo transmédia mêlant dans la narration ou dans les expériences de jeu des éléments de fiction et des éléments du monde réel.
in scheme: Audiovisuel
in scheme: concept-SD-audiovisuel-jeu-video
in scheme: concepts
notation: CULT682
note: Le jeu vidéo à réalité intégrée, qui prend souvent la forme d’un jeu de piste, recourt à plusieurs supports ou médias tels que la messagerie électronique, les sites de l’internet, la téléphonie, la presse ou la télévision.
related: transmédia

jeu de tir en vue subjective
type: ConceptConcept
type: Concept
creator: Commission d'enrichissement de la langue française, FranceTerme
abbreviation: JTS
date parution JO: 2017-04-08
deconseille ou frequent: jeu de tir à la première personne
equivalent EN: FPS @en
equivalent EN: FPS (en)
equivalent EN: first person shooter @en
equivalent EN: first person shooter (en)
definition: Jeu de tir dans lequel le joueur voit ce que le personnage qu’il contrôle est censé voir.
in scheme: Audiovisuel
in scheme: concept-SD-audiovisuel-jeu-video
in scheme: concepts
notation: CULT683
note: On trouve aussi le terme « jeu de tir à la première personne ».
related: jeu de tir en vue objective

jeu de tir en vue objective
type: ConceptConcept
type: Concept
creator: Commission d'enrichissement de la langue française, FranceTerme
abbreviation: JTO
date parution JO: 2017-04-08
deconseille ou frequent: jeu de tir à la troisième personne
equivalent EN: TPS @en
equivalent EN: TPS (en)
equivalent EN: third person shooter @en
equivalent EN: third person shooter (en)
definition: Jeu de tir dans lequel le joueur voit à l’écran le personnage qu’il contrôle.
in scheme: Audiovisuel
in scheme: concept-SD-audiovisuel-jeu-video
in scheme: concepts
notation: CULT684
note: On trouve aussi le terme « jeu de tir à la troisième personne ».
related: jeu de tir en vue subjective

collagiste
type: ConceptConcept
type: Concept
creator: Commission d'enrichissement de la langue française, FranceTerme
date parution JO: 2018-04-19
equivalent EN: collagist @en
equivalent EN: collagist (en)
part of speech: nom
definition: Artiste pratiquant le collage.
in scheme: Arts
in scheme: concept-SD-arts-art-urbain
in scheme: concept-SD-arts-arts-plastiques
in scheme: concepts
notation: CULT686
related: collage

reconstitueur, -euse
type: ConceptConcept
type: Concept
creator: Commission d'enrichissement de la langue française, FranceTerme
date parution JO: 2018-04-19
deconseille ou frequent: reconstituant
deconseille ou frequent: reconstituante
deconseille ou frequent: reenacting
deconseille ou frequent: uniformologie
deconseille ou frequent: uniformologue
equivalent EN: reenactor @en
equivalent EN: reenactor (en)
part of speech: nom
definition: Personne qui organise une reconstitution historique ou qui y participe, en costume d’époque.
in scheme: Culture
in scheme: concept-SD-culture-patrimoine
in scheme: concepts
notation: CULT687

archéologie médicolégale
type: ConceptConcept
type: Concept
creator: Commission d'enrichissement de la langue française, FranceTerme
date parution JO: 2018-04-19
deconseille ou frequent: archéologie forensique
deconseille ou frequent: archéologie légale
deconseille ou frequent: archéologie médico-légale
equivalent EN: forensic archaeology @en
equivalent EN: forensic archaeology (en)
definition: Application, dans des contextes criminels, des méthodes de fouilles archéologiques à la recherche et à la découverte de corps enfouis illégalement.
in scheme: Culture
in scheme: Droit
in scheme: concept-SD-culture-patrimoine
in scheme: concept-SD-droit-patrimoine
in scheme: concepts
notation: CULT688

art du ruban
type: ConceptConcept
type: Concept
creator: Commission d'enrichissement de la langue française, FranceTerme
date parution JO: 2018-04-19
deconseille ou frequent: art au ruban
equivalent EN: tape art @en
equivalent EN: tape art (en)
forme abregee: ruban, n.m.
definition: Forme d'art urbain qui consiste à réaliser des œuvres, des installations ou des performances avec du ruban.
in scheme: Arts
in scheme: concept-SD-arts-art-urbain
in scheme: concepts
notation: CULT689

graffiti calligraphié
type: ConceptConcept
type: Concept
creator: Commission d'enrichissement de la langue française, FranceTerme
date parution JO: 2018-04-19
equivalent EN: calligraffiti
part of speech: nom masculin
alternative label: calligraffiti
definition: Pratique du graffiti ayant recours à l’écriture calligraphique ; par extension, graffiti ainsi obtenu.
in scheme: Arts
in scheme: concept-SD-arts-art-urbain
in scheme: concepts
notation: CULT690
note: Pluriel : calligraffitis, graffitis calligraphiés.

collectif
type: ConceptConcept
type: Concept
creator: Commission d'enrichissement de la langue française, FranceTerme
date parution JO: 2018-04-19
equivalent EN: crew @en
equivalent EN: crew (en)
part of speech: nom masculin
definition: Groupe de graffeurs qui collaborent ou ont la même approche de leur pratique.
in scheme: Arts
in scheme: concept-SD-arts-art-urbain
in scheme: concepts
notation: CULT691
note: 1. Les initiales d’un collectif peuvent figurer à côté de la griffe de chaque graffeur du groupe.
note: 2. Le terme « collectif » est également employé dans d’autres pratiques et disciplines artistiques.
related: griffe

dégraffitage
type: ConceptConcept
type: Concept
creator: Commission d'enrichissement de la langue française, FranceTerme
date parution JO: 2018-04-19
equivalent EN: buffing @en
equivalent EN: buffing (en)
part of speech: nom masculin
definition: Action d’effacer ou de recouvrir des graffitis ou d’autres types d’inscription murale sans dégrader leur support.
in scheme: Aménagement et urbanisme
in scheme: Arts
in scheme: concept-SD-amenagement-et-urbanisme-art-urbain
in scheme: concept-SD-arts-art-urbain
in scheme: concepts
notation: CULT693
note: Le dégraffitage relève soit d’une opération de nettoyage, soit d’une démarche artistique.

rapport sur les conditions d'exposition
type: ConceptConcept
type: Concept
creator: Commission d'enrichissement de la langue française, FranceTerme
abbreviation: RCE
date parution JO: 2018-04-19
deconseille ou frequent: facilities report
equivalent EN: facility report @en
equivalent EN: facility report (en)
definition: Document élaboré par le prêteur et rempli par l’emprunteur décrivant les dispositifs de mise en sécurité et de conservation des œuvres durant une exposition ou une manifestation.
in scheme: Culture
in scheme: concept-SD-culture-patrimoine
in scheme: concepts
notation: CULT694
scope note: Cette publication annule et remplace celle du terme « fiche technique » au Journal officiel du 16 septembre 2006.

gâcheur, -euse
type: ConceptConcept
type: Concept
creator: Commission d'enrichissement de la langue française, FranceTerme
date parution JO: 2018-04-19
deconseille ou frequent: toyer
equivalent EN: toy @en
equivalent EN: toy (en)
part of speech: nom
definition: Graffeur qui est inexpérimenté ou qui se montre malveillant à l’égard de ses pairs, par exemple en recouvrant un graffiti existant.
in scheme: Arts
in scheme: concept-SD-arts-art-urbain
in scheme: concepts
notation: CULT695

griffe
type: ConceptConcept
type: Concept
creator: Commission d'enrichissement de la langue française, FranceTerme
date parution JO: 2018-04-19
equivalent EN: hand-style @en
equivalent EN: hand-style (en)
equivalent EN: handstyle @en
equivalent EN: handstyle (en)
part of speech: nom féminin
definition: Signature ou style calligraphique propre à un graffeur.
in scheme: Arts
in scheme: concept-SD-arts-art-urbain
in scheme: concepts
notation: CULT696
related: collectif

joute
type: ConceptConcept
type: Concept
creator: Commission d'enrichissement de la langue française, FranceTerme
date parution JO: 2018-04-19
equivalent EN: battle @en
equivalent EN: battle (en)
part of speech: nom féminin
definition: Compétition de chant, de danse, de slam ou d’art oratoire arbitrée par un jury.
in scheme: Arts
in scheme: concept-SD-arts-arts-de-la-scene
in scheme: concepts
notation: CULT697

sgraffite
type: ConceptConcept
type: Concept
creator: Commission d'enrichissement de la langue française, FranceTerme
date parution JO: 2018-04-19
deconseille ou frequent: sgraffiti
deconseille ou frequent: sgraffitis
equivalent EN: scratching @en
equivalent EN: scratching (en)
part of speech: nom masculin
definition: Pratique qui consiste à creuser, à gratter ou à inciser une surface afin de créer un graffiti ; par extension, graffiti ainsi obtenu.
in scheme: Arts
in scheme: concept-SD-arts-art-urbain
in scheme: concepts
notation: CULT698
note: On trouve aussi le terme « sgraffiti » (pluriel : sgraffitis).

tag au laser
type: ConceptConcept
type: Concept
creator: Commission d'enrichissement de la langue française, FranceTerme
date parution JO: 2018-04-19
equivalent EN: laser tag @en
equivalent EN: laser tag (en)
equivalent EN: laser tagging @en
equivalent EN: laser tagging (en)
equivalent EN: lasertag @en
equivalent EN: lasertag (en)
definition: Forme d’art urbain qui consiste à réaliser des tags éphémères au moyen de faisceaux lumineux ; par extension, tag ainsi obtenu.
in scheme: Arts
in scheme: concept-SD-arts-art-urbain
in scheme: concepts
notation: CULT699

aguiche
type: ConceptConcept
type: Concept
creator: Commission d'enrichissement de la langue française, FranceTerme
source: révision de l'arrêté du 24 janvier 1983
date parution JO: 2000-09-22
equivalent EN: teaser @en
equivalent EN: teaser (en)
part of speech: nom féminin
definition: Phase initiale d'une campagne publicitaire se présentant sous forme d'énigme destinée à inciter et à maintenir l'attention du public.
in scheme: Communication
in scheme: concept-SD-communication-publicite
in scheme: concepts
notation: CULT7

maquette
type: ConceptConcept
type: Concept
creator: Commission d'enrichissement de la langue française, FranceTerme
source: révision de l'arrêté du 24 janvier 1983
date parution JO: 2000-09-22
equivalent EN: advanced lay-out @en
equivalent EN: advanced lay-out (en)
part of speech: nom féminin
definition: Projet permettant de donner l'aperçu le plus juste de ce que sera la réalisation.
in scheme: Audiovisuel
in scheme: Communication
in scheme: concepts
notation: CULT70
related: maquette

tricot urbain
type: ConceptConcept
type: Concept
creator: Commission d'enrichissement de la langue française, FranceTerme
date parution JO: 2018-04-19
equivalent EN: urban knitting @en
equivalent EN: urban knitting (en)
equivalent EN: yarn bombing @en
equivalent EN: yarn bombing (en)
definition: Forme d’art urbain qui consiste à habiller de pièces tricotées ou crochetées des éléments du mobilier ou du paysage urbains.
in scheme: Arts
in scheme: concept-SD-arts-art-urbain
in scheme: concepts
notation: CULT700

Recommandation sur les équivalents français à donner à l'expression fake news
type: ConceptConcept
type: Concept
creator: Commission d'enrichissement de la langue française, FranceTerme
date parution JO: 2018-10-04
deconseille ou frequent: fake news
deconseille ou frequent: fausse information
deconseille ou frequent: fausse nouvelle
deconseille ou frequent: information fallacieuse
deconseille ou frequent: information fausse
deconseille ou frequent: infox
deconseille ou frequent: nouvelle fausse
in scheme: Communication
in scheme: concepts
notation: CULT701
related: infox vidéo
related: infox
scope note: Lire la recommandation "http://www.culture.fr/Ressources/FranceTerme/Recommandations-d-usage/FAKE-NEWS" ; toutes les recommandations d'usage publiées par la Commission générale de terminologie et de néologie au Journal officiel à l'adresse suivante : "http://www.culture.fr/Ressources/FranceTerme/Recommandations-d-usage".

bande-annonce de livre
type: ConceptConcept
type: Concept
creator: Commission d'enrichissement de la langue française, FranceTerme
date parution JO: 2019-06-25
deconseille ou frequent: book trailer
equivalent EN: book trailer @en
equivalent EN: book trailer (en)
equivalent EN: booktrailer @en
equivalent EN: booktrailer (en)
forme abregee: bande-annonce, n.f.
definition: Document audiovisuel conçu pour promouvoir un livre.
in scheme: Audiovisuel
in scheme: Édition et livre
in scheme: concepts
notation: CULT702
related: bande-annonce

romance urbaine
type: ConceptConcept
type: Concept
creator: Commission d'enrichissement de la langue française, FranceTerme
date parution JO: 2020-05-23
deconseille ou frequent: chicklit
deconseille ou frequent: littérature de poulettes
deconseille ou frequent: néoromance
deconseille ou frequent: romance d'aujourd’hui
deconseille ou frequent: romance de filles
equivalent EN: chick lit @en
equivalent EN: chick lit (en)
equivalent EN: chick literature @en
equivalent EN: chick literature (en)
definition: Catégorie de roman qui met en scène avec humour et dérision une jeune citadine d’aujourd’hui.
in scheme: Édition et livre
in scheme: Littérature
in scheme: concepts
notation: CULT703
note: La romance urbaine vise principalement un public féminin.

fiction climatique
type: ConceptConcept
type: Concept
creator: Commission d'enrichissement de la langue française, FranceTerme
date parution JO: 2019-06-25
deconseille ou frequent: ficli
equivalent EN: cli-fi @en
equivalent EN: cli-fi (en)
equivalent EN: climate fiction @en
equivalent EN: climate fiction (en)
definition: Fiction d’anticipation qui traite du changement climatique et de ses conséquences possibles.
in scheme: Audiovisuel
in scheme: Édition et livre
in scheme: concepts
notation: CULT705
related: changement climatique

mise en page fixe
type: ConceptConcept
type: Concept
creator: Commission d'enrichissement de la langue française, FranceTerme
date parution JO: 2019-06-25
equivalent EN: fixed layout @en
equivalent EN: fixed layout (en)
definition: Mode d’affichage d’une publication numérique, généralement un livre, qui permet de maintenir la mise en page identique quel que soit le terminal de lecture.
in scheme: Édition et livre
in scheme: Informatique
in scheme: concepts
notation: CULT706
related: liseuse
related: livre numérique
related: mise en page adaptative

message publicitaire
type: ConceptConcept
type: Concept
creator: Commission d'enrichissement de la langue française, FranceTerme
source: révision de l'arrêté du 10 octobre 1985
date parution JO: 2000-09-22
equivalent EN: ad @en
equivalent EN: ad (en)
equivalent EN: advertisement @en
equivalent EN: advertisement (en)
equivalent EN: spot @en
equivalent EN: spot (en)
forme abregee: message, n.m.
definition: Annonce publicitaire ou promotionnelle de courte durée diffusée sur un support audiovisuel.
in scheme: Communication
in scheme: Économie et gestion d'entreprise
in scheme: concept-SD-communication-publicite
in scheme: concept-SD-economie-et-gestion-d-entreprise-publicite
in scheme: concepts
notation: CULT71

magalogue
type: ConceptConcept
type: Concept
creator: Commission d'enrichissement de la langue française, FranceTerme
date parution JO: 2019-06-25
equivalent EN: magalog @en
equivalent EN: magalog (en)
part of speech: nom masculin
definition: Catalogue de vente dont la présentation et le contenu éditorial s’apparentent à ceux d’un magazine.
in scheme: Économie et gestion d'entreprise
in scheme: Édition et livre
in scheme: concepts
notation: CULT711

publicité-divertissement
type: ConceptConcept
type: Concept
creator: Commission d'enrichissement de la langue française, FranceTerme
date parution JO: 2019-06-25
equivalent EN: advertainment @en
equivalent EN: advertainment (en)
forme abregee: publidivertissement, n.m.
part of speech: nom féminin
definition: Message publicitaire qui prend la forme d’un divertissement, dont les supports peuvent être des spots audiovisuels, des séries ou des jeux vidéo, conçus à cet effet.
in scheme: Audiovisuel
in scheme: Communication
in scheme: concept-SD-audiovisuel-publicite
in scheme: concept-SD-communication-publicite
in scheme: concepts
notation: CULT712
related: ludopublicité
related: jeu vidéo publicitaire

animateur, -trice vedette
type: ConceptConcept
type: Concept
creator: Commission d'enrichissement de la langue française, FranceTerme
date parution JO: 2019-06-25
equivalent EN: anchor @en
equivalent EN: anchor (en)
equivalent EN: anchorman @en
equivalent EN: anchorman (en)
equivalent EN: anchorperson @en
equivalent EN: anchorperson (en)
equivalent EN: anchorwoman @en
equivalent EN: anchorwoman (en)
alternative label: présentateur, -trice vedette
definition: Animateur principal d’une émission.
in scheme: Audiovisuel
in scheme: Communication
in scheme: concepts
notation: CULT713

éditeur, -trice de contenu
type: ConceptConcept
type: Concept
creator: Commission d'enrichissement de la langue française, FranceTerme
date parution JO: 2019-06-25
deconseille ou frequent: curateur de contenu
deconseille ou frequent: curatrice de contenu
deconseille ou frequent: éditeur de contenus
deconseille ou frequent: éditrice de contenus
equivalent EN: content curator @en
equivalent EN: content curator (en)
definition: Personne chargée de l’édition de contenu.
in scheme: Communication
in scheme: Informatique
in scheme: concept-SD-communication-internet
in scheme: concept-SD-informatique-internet
in scheme: concepts
notation: CULT714
related: édition de contenu

édition de contenu
type: ConceptConcept
type: Concept
creator: Commission d'enrichissement de la langue française, FranceTerme
date parution JO: 2019-06-25
deconseille ou frequent: curation de contenu
deconseille ou frequent: édition de contenus
equivalent EN: content curation @en
equivalent EN: content curation (en)
definition: Activité qui consiste à sélectionner, organiser et publier en ligne des documents textuels, iconographiques et audiovisuels sur un thème donné.
in scheme: Communication
in scheme: Informatique
in scheme: concept-SD-communication-internet
in scheme: concept-SD-informatique-internet
in scheme: concepts
notation: CULT715
related: éditeur, -trice de contenu

publicité caméléon
type: ConceptConcept
type: Concept
creator: Commission d'enrichissement de la langue française, FranceTerme
date parution JO: 2019-06-25
deconseille ou frequent: publicité intégrée
deconseille ou frequent: publicité native
deconseille ou frequent: publicité rédactionnelle
equivalent EN: native advertising @en
equivalent EN: native advertising (en)
alternative label: publicité mimétique
definition: Publicité en ligne, intégrée à un site dont elle adopte les codes formels, qui n’est pas toujours signalée comme telle.
in scheme: Communication
in scheme: Informatique
in scheme: concept-SD-communication-publicite
in scheme: concept-SD-informatique-publicite
in scheme: concepts
notation: CULT716

péage
type: ConceptConcept
type: Concept
creator: Commission d'enrichissement de la langue française, FranceTerme
date parution JO: 2019-06-25
deconseille ou frequent: barrière de péage
deconseille ou frequent: pay wall
equivalent EN: paywall @en
equivalent EN: paywall (en)
part of speech: nom masculin
definition: Droit d’accès payant à certains contenus numériques.
in scheme: Communication
in scheme: Informatique
in scheme: concept-SD-communication-presse
in scheme: concept-SD-informatique-presse
in scheme: concepts
notation: CULT717
note: Par exemple, l’accès à la lecture complète de certains articles en ligne peut être soumis à péage.

mise en page adaptative
type: ConceptConcept
type: Concept
creator: Commission d'enrichissement de la langue française, FranceTerme
date parution JO: 2019-06-25
equivalent EN: reflowable @en
equivalent EN: reflowable (en)
definition: Mode d’affichage d’une publication numérique, généralement un livre, qui permet d’adapter la mise en page au terminal de lecture.
in scheme: Édition et livre
in scheme: Informatique
in scheme: concepts
notation: CULT718
related: liseuse
related: livre numérique
related: mise en page fixe

message publiposté
type: ConceptConcept
type: Concept
creator: Commission d'enrichissement de la langue française, FranceTerme
source: révision de l'arrêté du 10 octobre 1985
date parution JO: 2000-09-22
equivalent EN: direct mail @en
equivalent EN: direct mail (en)
definition: Message publicitaire destiné au publipostage.
in scheme: Communication
in scheme: Économie et gestion d'entreprise
in scheme: concept-SD-communication-publicite
in scheme: concept-SD-economie-et-gestion-d-entreprise-publicite
in scheme: concepts
notation: CULT72
related: publipostage
related: publipostage direct
related: concept-TELE471

bannière mobile
type: ConceptConcept
type: Concept
creator: Commission d'enrichissement de la langue française, FranceTerme
date parution JO: 2019-06-25
deconseille ou frequent: bannière autoportante
deconseille ou frequent: kakémono autoportant
equivalent EN: roll up @en
equivalent EN: roll up (en)
equivalent EN: roll up banner @en
equivalent EN: roll up banner (en)
alternative label: kakémono mobile
definition: Bannière publicitaire ou informative déroulable, fixée sur un pied mobile.
in scheme: Communication
in scheme: concept-SD-communication-publicite
in scheme: concepts
notation: CULT722
note: On trouve aussi, dans l’usage, les termes « bannière autoportante » et « kakémono autoportant ».
related: bannière publicitaire

planche de tendances
type: ConceptConcept
type: Concept
creator: Commission d'enrichissement de la langue française, FranceTerme
date parution JO: 2019-06-25
deconseille ou frequent: tableau de tendances
equivalent EN: mood board @en
equivalent EN: mood board (en)
equivalent EN: moodboard @en
equivalent EN: moodboard (en)
definition: Assemblage d’éléments tels que des images, des objets, des échantillons, des mots, qui sert de support d’inspiration pour concevoir un univers stylistique.
in scheme: Habillement et mode
in scheme: concepts
notation: CULT723

magasin amiral
type: ConceptConcept
type: Concept
creator: Commission d'enrichissement de la langue française, FranceTerme
date parution JO: 2019-06-25
deconseille ou frequent: magasin phare
equivalent EN: flagship store @en
equivalent EN: flagship store (en)
definition: Magasin principal et emblématique d’une marque.
in scheme: Économie et gestion d'entreprise
in scheme: Habillement et mode
in scheme: concepts
notation: CULT724

collection capsule
type: ConceptConcept
type: Concept
creator: Commission d'enrichissement de la langue française, FranceTerme
date parution JO: 2019-06-25
forme abregee: capsule, n.f.
definition: Ligne de vêtements ou de produits composée de pièces fabriquées en série limitée, qui est diffusée pendant un temps assez court, en dehors des collections permanentes et saisonnières.
in scheme: Économie et gestion d'entreprise
in scheme: Habillement et mode
in scheme: concepts
notation: CULT725
related: vente surprise

catalogue de collection
type: ConceptConcept
type: Concept
creator: Commission d'enrichissement de la langue française, FranceTerme
date parution JO: 2019-06-25
deconseille ou frequent: catalogue de mode
deconseille ou frequent: lookbook
equivalent EN: look book @en
equivalent EN: look book (en)
definition: Catalogue photographique réalisé par une marque et destiné à présenter aux professionnels une collection de mode.
in scheme: Habillement et mode
in scheme: concepts
notation: CULT727

vu-acheté
type: ConceptConcept
type: Concept
creator: Commission d'enrichissement de la langue française, FranceTerme
date parution JO: 2019-06-25
equivalent EN: SNBN @en
equivalent EN: SNBN (en)
equivalent EN: see now buy now @en
equivalent EN: see now buy now (en)
part of speech: nom masculin
definition: Pratique commerciale qui permet au client d’acheter une nouvelle création quelques heures ou quelques jours après sa présentation lors d’un défilé.
in scheme: Économie et gestion d'entreprise
in scheme: Habillement et mode
in scheme: concepts
notation: CULT728

technologie de la mode
type: ConceptConcept
type: Concept
creator: Commission d'enrichissement de la langue française, FranceTerme
date parution JO: 2020-05-23
deconseille ou frequent: mode tech
equivalent EN: fashion tech @en
equivalent EN: fashion tech (en)
equivalent EN: fashion technology @en
equivalent EN: fashion technology (en)
forme abregee: technomode, n.f.
definition: Ensemble des techniques innovantes appliquées à la mode ; par extension, le secteur de la mode utilisant ces techniques.
in scheme: Habillement et mode
in scheme: concepts
notation: CULT729
note: La réalité augmentée, l’impression tridimensionnelle (3D), l’intelligence artificielle font partie de la technologie de la mode.
related: impression tridimensionnelle
related: concept-INFO948

microphone baladeur
type: ConceptConcept
type: Concept
creator: Commission d'enrichissement de la langue française, FranceTerme
source: révision de l'arrêté du 10 octobre 1985
date parution JO: 2000-09-22
equivalent EN: mobile microphone @en
equivalent EN: mobile microphone (en)
equivalent EN: moving microphone @en
equivalent EN: moving microphone (en)
equivalent EN: wandering microphone @en
equivalent EN: wandering microphone (en)
definition: Microphone utilisé notamment lors d'enregistrements publics pour se rendre d'un point à un autre d'une salle et recueillir les remarques du public.
in scheme: Audiovisuel
in scheme: concepts
notation: CULT73

interviews à la chaîne
type: ConceptConcept
type: Concept
creator: Commission d'enrichissement de la langue française, FranceTerme
date parution JO: 2019-06-25
equivalent EN: press junket @en
equivalent EN: press junket (en)
definition: Opération promotionnelle consistant en une succession de brefs entretiens qu’accorde une célébrité à de nombreux journalistes regroupés en un lieu pour l’occasion.
in scheme: Audiovisuel
in scheme: Communication
in scheme: concept-SD-audiovisuel-presse
in scheme: concept-SD-communication-presse
in scheme: concepts
notation: CULT730

avertissement au public
type: ConceptConcept
type: Concept
creator: Commission d'enrichissement de la langue française, FranceTerme
date parution JO: 2019-06-25
deconseille ou frequent: avertissement de contenu
deconseille ou frequent: trigger
equivalent EN: CW @en
equivalent EN: CW (en)
equivalent EN: TW @en
equivalent EN: TW (en)
equivalent EN: content warning @en
equivalent EN: content warning (en)
equivalent EN: trigger warning @en
equivalent EN: trigger warning (en)
forme abregee: avertissement, n.m.
definition: Message ou indication accompagnant la diffusion d’une œuvre ou d’un document, qui alerte le public du caractère potentiellement traumatisant de son contenu.
in scheme: Audiovisuel
in scheme: Communication
in scheme: concepts
notation: CULT731

journalisme de données
type: ConceptConcept
type: Concept
creator: Commission d'enrichissement de la langue française, FranceTerme
date parution JO: 2019-06-25
deconseille ou frequent: data journalist
deconseille ou frequent: journaliste de données
equivalent EN: data journalism @en
equivalent EN: data journalism (en)
definition: Journalisme qui exploite et analyse un très grand nombre de documents, le plus souvent numériques.
in scheme: Communication
in scheme: Informatique
in scheme: concept-SD-communication-presse
in scheme: concept-SD-informatique-presse
in scheme: concepts
notation: CULT732

boutique-concept
type: ConceptConcept
type: Concept
creator: Commission d'enrichissement de la langue française, FranceTerme
date parution JO: 2019-06-25
equivalent EN: concept store @en
equivalent EN: concept store (en)
part of speech: nom féminin
definition: Boutique présentant une sélection, limitée et fréquemment renouvelée, de créations dans les domaines les plus variés, notamment ceux de la mode, des accessoires de mode et de l’art de vivre.
in scheme: Économie et gestion d'entreprise
in scheme: Habillement et mode
in scheme: concepts
notation: CULT733

bannière publicitaire
type: ConceptConcept
type: Concept
creator: Commission d'enrichissement de la langue française, FranceTerme
date parution JO: 2019-06-25
equivalent EN: kakémono publicitaire
forme abregee: bannière, n.f.
forme abregee: kakémono, n.m.
alternative label: kakémono publicitaire
definition: Bande rectangulaire souple suspendue verticalement, qui sert de support à un message publicitaire.
in scheme: Communication
in scheme: concept-SD-communication-publicite
in scheme: concepts
notation: CULT734
related: bannière mobile
related: bannière
scope note: Cette publication annule et remplace celle du Journal officiel du 15 septembre 2006.

lecteur, -trice expert, -e
type: ConceptConcept
type: Concept
creator: Commission d'enrichissement de la langue française, FranceTerme
date parution JO: 2019-06-25
deconseille ou frequent: lecteur expert
deconseille ou frequent: lecteur-expert
deconseille ou frequent: lectrice experte
deconseille ou frequent: lectrice-experte
deconseille ou frequent: relecteur
deconseille ou frequent: relectrice
equivalent EN: referee @en
equivalent EN: referee (en)
equivalent EN: reviewer @en
equivalent EN: reviewer (en)
definition: Spécialiste chargé par un éditeur scientifique d’évaluer des projets de livres ou d’articles se rapportant à sa discipline et d’indiquer s’ils méritent d’être publiés.
in scheme: Édition et livre
in scheme: Recherche
in scheme: concepts
notation: CULT735
related: évaluation par les pairs

accrolivre
type: ConceptConcept
type: Concept
creator: Commission d'enrichissement de la langue française, FranceTerme
date parution JO: 2019-06-25
deconseille ou frequent: attrape-lecteur
deconseille ou frequent: livre captivant
deconseille ou frequent: livre passionnant
deconseille ou frequent: livre à dévorer
deconseille ou frequent: tourne-page
equivalent EN: page turner @en
equivalent EN: page turner (en)
part of speech: nom masculin
definition: Livre à ce point captivant qu’on le lit d’une traite.
in scheme: Édition et livre
in scheme: concepts
notation: CULT736

folioscope
type: ConceptConcept
type: Concept
creator: Commission d'enrichissement de la langue française, FranceTerme
date parution JO: 2019-06-25
equivalent EN: flick book @en
equivalent EN: flick book (en)
equivalent EN: flip book @en
equivalent EN: flip book (en)
equivalent EN: flipbook @en
equivalent EN: flipbook (en)
part of speech: nom masculin
definition: Petit livre qui, lorsqu’il est feuilleté rapidement à un rythme régulier, permet de voir une succession d’images créant l’illusion d’une séquence animée.
in scheme: Édition et livre
in scheme: concepts
notation: CULT737

livre en relief
type: ConceptConcept
type: Concept
creator: Commission d'enrichissement de la langue française, FranceTerme
date parution JO: 2019-06-25
deconseille ou frequent: livre animé
deconseille ou frequent: popup
equivalent EN: pop-up @en
equivalent EN: pop-up (en)
equivalent EN: pop-up book @en
equivalent EN: pop-up book (en)
definition: Livre dont certaines pages sont façonnées de manière que les illustrations qu’elles portent se déploient en trois dimensions.
in scheme: Édition et livre
in scheme: concepts
notation: CULT738
note: Les illustrations d’un livre en relief peuvent notamment être découpées, pliées ou reliées.

directeur, -trice de série
type: ConceptConcept
type: Concept
creator: Commission d'enrichissement de la langue française, FranceTerme
date parution JO: 2020-05-23
deconseille ou frequent: chef de série
deconseille ou frequent: conducteur de série
deconseille ou frequent: conductrice de série
deconseille ou frequent: pilote de série
deconseille ou frequent: showrunneur
deconseille ou frequent: showrunneuse
equivalent EN: show runner @en
equivalent EN: show runner (en)
equivalent EN: showrunner @en
equivalent EN: showrunner (en)
definition: Personne qui supervise l’écriture et la production d’une série, dont elle est souvent la créatrice.
in scheme: Audiovisuel
in scheme: concept-SD-audiovisuel-television
in scheme: concepts
notation: CULT739

modulation d'amplitude
type: ConceptConcept
type: Concept
creator: Commission d'enrichissement de la langue française, FranceTerme
source: révision de l'arrêté du 10 octobre 1985
abbreviation: AM @en
date parution JO: 2000-09-22
equivalent EN: AM @en
equivalent EN: AM (en)
equivalent EN: amplitude modulation @en
equivalent EN: amplitude modulation (en)
definition: Procédé de modulation consistant à faire varier l'amplitude d'une onde porteuse selon le signal à transmettre.
in scheme: Audiovisuel
in scheme: concept-SD-audiovisuel-radio
in scheme: concepts
notation: CULT74
related: concept-TELE541

ajustement automatique d'intonation
type: ConceptConcept
type: Concept
creator: Commission d'enrichissement de la langue française, FranceTerme
date parution JO: 2020-05-23
deconseille ou frequent: autoajustement
equivalent EN: auto-tune @en
equivalent EN: auto-tune (en)
equivalent EN: autotune @en
equivalent EN: autotune (en)
forme abregee: ajustement, n.m.
definition: Procédé sonore numérique qui permet, lors d’une séance d’enregistrement ou d’un concert, d’aligner la fréquence d’une voix sur une hauteur prédéfinie ; par extension, l’effet ainsi obtenu.
in scheme: Audiovisuel
in scheme: concepts
notation: CULT740
note: L’ajustement automatique d’intonation est utilisé pour corriger la hauteur d’une voix ou pour obtenir un effet artistique.

minialbum
type: ConceptConcept
type: Concept
creator: Commission d'enrichissement de la langue française, FranceTerme
date parution JO: 2020-05-23
equivalent EN: EP @en
equivalent EN: EP (en)
equivalent EN: extended play @en
equivalent EN: extended play (en)
part of speech: nom masculin
definition: Album musical qui présente au maximum six titres et moins de trente minutes de musique enregistrée.
in scheme: Audiovisuel
in scheme: concept-SD-audiovisuel-edition-musicale
in scheme: concepts
notation: CULT742
related: simple

démineur, -euse éditorial, -e
type: ConceptConcept
type: Concept
creator: Commission d'enrichissement de la langue française, FranceTerme
date parution JO: 2020-05-23
deconseille ou frequent: censeur
deconseille ou frequent: démineur de polémique
deconseille ou frequent: démineur éditorial
deconseille ou frequent: démineuse de polémique
deconseille ou frequent: démineuse éditoriale
deconseille ou frequent: lecteur de sensibilité
deconseille ou frequent: lecteur en sensibilité
deconseille ou frequent: lectrice de sensibilité
deconseille ou frequent: lectrice en sensibilité
equivalent EN: sensitivity reader @en
equivalent EN: sensitivity reader (en)
definition: Personne chargée, dans une maison d’édition, d’identifier avant publication les termes et les contenus susceptibles d’être considérés comme choquants ou offensants par certains lecteurs.
in scheme: Édition et livre
in scheme: Littérature
in scheme: concepts
notation: CULT743

divulgâcher
type: ConceptConcept
type: Concept
creator: Commission d'enrichissement de la langue française, FranceTerme
date parution JO: 2020-05-23
deconseille ou frequent: divulgâchage
deconseille ou frequent: divulgâcheur
deconseille ou frequent: divulgâcheuse
deconseille ou frequent: divulgâchis
deconseille ou frequent: spoil
deconseille ou frequent: spoiler
deconseille ou frequent: spoileur
deconseille ou frequent: spoileuse
deconseille ou frequent: spoiling
deconseille ou frequent: to spoil
equivalent EN: spoil @en
equivalent EN: spoil (en)
part of speech: verbe
definition: Gâcher l’effet de surprise chez le lecteur ou le spectateur en dévoilant tout ou partie de l’intrigue d’une œuvre de fiction.
in scheme: Audiovisuel
in scheme: Édition et livre
in scheme: concepts
notation: CULT745
note: On parle de « divulgâcheur, -euse » (en anglais : spoiler), pour désigner la personne qui divulgâche, de « divulgâchage » (en anglais : spoiling), pour désigner l’action de « divulgâcher », et de « divulgâchis » (en anglais : spoiler), pour désigner le résultat d’un divulgâchage.

hyperaccéléré
type: ConceptConcept
type: Concept
creator: Commission d'enrichissement de la langue française, FranceTerme
date parution JO: 2020-05-23
deconseille ou frequent: accéléré
deconseille ou frequent: chronophotographie
equivalent EN: time-lapse @en
equivalent EN: time-lapse (en)
equivalent EN: timelapse @en
equivalent EN: timelapse (en)
part of speech: nom masculin
definition: Technique qui consiste à effectuer des prises de vues d’un même objet à intervalles réguliers, sur une longue période, et à les assembler en une séquence vidéo de façon à obtenir un effet d’accéléré ; la séquence ou la vidéo ainsi réalisée.
in scheme: Audiovisuel
in scheme: concepts
notation: CULT746
note: L’hyperaccéléré permet, par exemple, de rendre compte d’une réalité qui s’accomplit lentement et est peu perceptible en temps réel, comme l’épanouissement d’une fleur ou le mouvement d’un astre.

mode express
type: ConceptConcept
type: Concept
creator: Commission d'enrichissement de la langue française, FranceTerme
date parution JO: 2020-05-23
deconseille ou frequent: collection éclair
equivalent EN: fast fashion @en
equivalent EN: fast fashion (en)
alternative label: mode éclair
definition: Secteur de la mode qui repose sur un modèle économique caractérisé par le renouvellement très rapide de collections d’articles à bas prix.
in scheme: Habillement et mode
in scheme: concepts
notation: CULT747
related: mode durable
related: coûts réduits (à)
scope note: Cette publication annule et remplace celle du terme « collection éclair » au Journal officiel du 13 mars 2013.

mode durable
type: ConceptConcept
type: Concept
creator: Commission d'enrichissement de la langue française, FranceTerme
date parution JO: 2020-05-23
equivalent EN: slow fashion @en
equivalent EN: slow fashion (en)
definition: Secteur de la mode qui repose sur un modèle économique privilégiant la qualité des articles, leur résistance aux variations des modes, et le respect des principes éthiques et environnementaux.
in scheme: Habillement et mode
in scheme: concepts
notation: CULT748
related: mode express

fresque vidéo
type: ConceptConcept
type: Concept
creator: Commission d'enrichissement de la langue française, FranceTerme
date parution JO: 2020-05-23
deconseille ou frequent: fresque lumineuse
deconseille ou frequent: mapping vidéo
deconseille ou frequent: projection illusionniste
deconseille ou frequent: projection vidéo 3D
deconseille ou frequent: videomapping
deconseille ou frequent: vidéo mapping
equivalent EN: mapping @en
equivalent EN: mapping (en)
equivalent EN: video mapping @en
equivalent EN: video mapping (en)
definition: Ensemble d’images fixes ou animées conçues pour être projetées à grande échelle sur une surface autre qu’un écran, souvent la façade d’un édifice.
in scheme: Arts
in scheme: Audiovisuel
in scheme: concepts
notation: CULT749

modulation de fréquence
type: ConceptConcept
type: Concept
creator: Commission d'enrichissement de la langue française, FranceTerme
source: révision de l'arrêté du 10 octobre 1985
abbreviation: MF
date parution JO: 2000-09-22
deconseille ou frequent: fréquence modulée
equivalent EN: FM @en
equivalent EN: FM (en)
equivalent EN: frequency modulation @en
equivalent EN: frequency modulation (en)
definition: Procédé de modulation consistant à faire varier la fréquence d'une onde porteuse au rythme du signal utile à transmettre.
in scheme: Audiovisuel
in scheme: concept-SD-audiovisuel-radio
in scheme: concepts
notation: CULT75
note: On dit aussi « fréquence modulée ».

responsable de la promotion en ligne
type: ConceptConcept
type: Concept
creator: Commission d'enrichissement de la langue française, FranceTerme
date parution JO: 2020-05-23
deconseille ou frequent: manager de trafic
deconseille ou frequent: responsable de l'audience en ligne
deconseille ou frequent: trafic manager
equivalent EN: traffic manager @en
equivalent EN: traffic manager (en)
definition: Personne chargée de la promotion de biens, de services ou de marques sur la toile et dans les réseaux sociaux, qui recourt notamment au référencement et au ciblage publicitaire.
in scheme: Communication
in scheme: Économie et gestion d'entreprise
in scheme: concept-SD-communication-publicite
in scheme: concept-SD-economie-et-gestion-d-entreprise-publicite
in scheme: concepts
notation: CULT750
related: animateur, -trice de communauté
related: responsable des réseaux sociaux
related: mercatique par réseaux sociaux
related: ciblage publicitaire

responsable des réseaux sociaux
type: ConceptConcept
type: Concept
creator: Commission d'enrichissement de la langue française, FranceTerme
date parution JO: 2020-05-23
deconseille ou frequent: manager de réseaux sociaux
deconseille ou frequent: manager des réseaux sociaux
deconseille ou frequent: responsable de réseaux sociaux
equivalent EN: social media manager @en
equivalent EN: social media manager (en)
equivalent EN: social media marketing manager @en
equivalent EN: social media marketing manager (en)
definition: Personne responsable de la stratégie de communication d’une entreprise ou d’une organisation, sur la toile et dans les réseaux sociaux.
in scheme: Communication
in scheme: Économie et gestion d'entreprise
in scheme: concepts
notation: CULT751
related: animateur, -trice de communauté
related: responsable de la promotion en ligne
related: mercatique par réseaux sociaux

piège à clics
type: ConceptConcept
type: Concept
creator: Commission d'enrichissement de la langue française, FranceTerme
date parution JO: 2020-05-23
deconseille ou frequent: attrape-clics
deconseille ou frequent: click bait
deconseille ou frequent: clickbaiting
deconseille ou frequent: piège à clic
deconseille ou frequent: putaclic
deconseille ou frequent: putaclics
equivalent EN: clickbait @en
equivalent EN: clickbait (en)
definition: Lien hypertextuel accrocheur conduisant à un contenu qui n’est qu’un leurre, mis en place à seule fin d’augmenter le trafic en incitant les internautes à cliquer ; par extension, le contenu lui-même.
in scheme: Communication
in scheme: Informatique
in scheme: concept-SD-communication-publicite
in scheme: concept-SD-informatique-publicite
in scheme: concepts
notation: CULT752
related: hypertextuel

infox vidéo
type: ConceptConcept
type: Concept
creator: Commission d'enrichissement de la langue française, FranceTerme
date parution JO: 2020-05-23
deconseille ou frequent: audio deep fake
deconseille ou frequent: audio deepfake
deconseille ou frequent: deep fake puppetry
deconseille ou frequent: deep fake video
deconseille ou frequent: deepfake puppetry
deconseille ou frequent: puppetry
equivalent EN: deep fake @en
equivalent EN: deep fake (en)
equivalent EN: deepfake @en
equivalent EN: deepfake (en)
alternative label: vidéotox
definition: Infox qui se présente sous la forme d’une vidéo falsifiée grâce aux techniques de l’intelligence artificielle, en particulier à celles de l’apprentissage profond.
in scheme: Communication
in scheme: Informatique
in scheme: concepts
notation: CULT753
note: La production d’infox vidéo fait notamment appel à l’analyse de l’expression faciale, à la synthèse vocale et à la synchronisation labiale.
related: Recommandation sur les équivalents français à donner à l'expression fake news
related: infox
related: substitution de visage
related: apprentissage profond

infox
type: ConceptConcept
type: Concept
creator: Commission d'enrichissement de la langue française, FranceTerme
date parution JO: 2020-05-23
deconseille ou frequent: fausse information
deconseille ou frequent: fausse nouvelle
deconseille ou frequent: information fausse
deconseille ou frequent: nouvelle fausse
equivalent EN: fake news @en
equivalent EN: fake news (en)
part of speech: nom féminin
alternative label: information fallacieuse
definition: Information mensongère ou délibérément biaisée.
in scheme: Communication
in scheme: concepts
notation: CULT754
note: Une infox peut servir, par exemple, à favoriser un parti politique au détriment d’un autre, à entacher la réputation d’une personnalité ou d’une entreprise, ou à contredire une vérité scientifique.
related: pouvoir de manipulation
related: Recommandation sur les équivalents français à donner à l'expression fake news
related: infox vidéo

audio
type: ConceptConcept
type: Concept
creator: Commission d'enrichissement de la langue française, FranceTerme
date parution JO: 2020-05-23
deconseille ou frequent: AAD
deconseille ou frequent: audio de rattrapage
deconseille ou frequent: audio en réécoute
deconseille ou frequent: audio original
deconseille ou frequent: baladodiffusion
deconseille ou frequent: diffusion pour baladeur
deconseille ou frequent: native podcast
deconseille ou frequent: podcast natif
deconseille ou frequent: rattrapage
deconseille ou frequent: réécoute
deconseille ou frequent: à la demande
equivalent EN: podcast @en
equivalent EN: podcast (en)
part of speech: nom masculin
definition: Contenu audio mis à la disposition du public dans l’internet.
in scheme: Audiovisuel
in scheme: Télécommunications
in scheme: concept-SD-audiovisuel-internet
in scheme: concept-SD-telecommunications-internet
in scheme: concepts
notation: CULT755
note: Lorsque l’audio est une émission de radio préalablement diffusée, on parle également d’« audio en réécoute » ou d’« audio de rattrapage » ; lorsque l’audio est créé spécialement pour l’internet, on parle d’« audio original » (en anglais : native podcast).
related: télévision de rattrapage
related: vidéo à la demande
related: Recommandation sur les équivalents français à donner au terme podcast et à ses dérivés
scope note: Cette publication annule et remplace celle du terme « diffusion pour baladeur » au Journal officiel du 25 mars 2006.

Recommandation sur les équivalents français à donner au terme podcast et à ses dérivés
type: ConceptConcept
type: Concept
creator: Commission d'enrichissement de la langue française, FranceTerme
date parution JO: 2020-05-23
deconseille ou frequent: AAD
deconseille ou frequent: audio en réécoute
deconseille ou frequent: audio original
deconseille ou frequent: audio à la demande
deconseille ou frequent: native podcast
deconseille ou frequent: podcast
deconseille ou frequent: podcast natif
deconseille ou frequent: podcaster
deconseille ou frequent: podcasting
deconseille ou frequent: réécoute
deconseille ou frequent: réécouter
deconseille ou frequent: to podcast
deconseille ou frequent: télécharger
deconseille ou frequent: à la demande
deconseille ou frequent: écouter
in scheme: Audiovisuel
in scheme: Télécommunications
in scheme: concept-SD-audiovisuel-internet
in scheme: concept-SD-telecommunications-internet
in scheme: concepts
notation: CULT756
related: audio
scope note: Lire la recommandation "http://www.culture.fr/Ressources/FranceTerme/Recommandations-d-usage/PODCAST-ING" ; toutes les recommandations d'usage publiées par la Commission générale de terminologie et de néologie au Journal officiel à l'adresse suivante : "http://www.culture.fr/Ressources/FranceTerme/Recommandations-d-usage".

relance
type: ConceptConcept
type: Concept
creator: Commission d'enrichissement de la langue française, FranceTerme
date parution JO: 2021-07-09
equivalent EN: reboot @en
equivalent EN: reboot (en)
part of speech: nom féminin
definition: Reprise de l’univers ou d’un personnage d’une saga cinématographique ou d’une série dans une nouvelle production ; par extension, cette production elle-même.
in scheme: Audiovisuel
in scheme: concept-SD-audiovisuel-cinema
in scheme: concept-SD-audiovisuel-television
in scheme: concepts
notation: CULT757
related: présuite

haineur, -euse
type: ConceptConcept
type: Concept
creator: Commission d'enrichissement de la langue française, FranceTerme
date parution JO: 2021-07-09
deconseille ou frequent: cyberharceleur
deconseille ou frequent: cyberharceleuse
deconseille ou frequent: fomentateur de haine
deconseille ou frequent: fomentatrice de haine
deconseille ou frequent: fomenteur de haine
deconseille ou frequent: fomenteuse de haine
deconseille ou frequent: haineux
deconseille ou frequent: haters
deconseille ou frequent: rageuse
deconseille ou frequent: rageux
deconseille ou frequent: semeur de haine
deconseille ou frequent: semeuse de haine
equivalent EN: hater @en
equivalent EN: hater (en)
part of speech: nom
alternative label: fauteur, -trice de haine
definition: Personne qui utilise la toile et les réseaux sociaux pour inciter à la haine envers un individu ou un groupe.
in scheme: Informatique
in scheme: Sciences humaines
in scheme: concept-SD-informatique-internet
in scheme: concept-SD-sciences-humaines-internet
in scheme: concepts
notation: CULT758
related: concept-JURI39

vente surprise
type: ConceptConcept
type: Concept
creator: Commission d'enrichissement de la langue française, FranceTerme
date parution JO: 2021-07-09
deconseille ou frequent: capsule
deconseille ou frequent: vente express
equivalent EN: drop @en
equivalent EN: drop (en)
definition: Vente d’une collection capsule qui n’est annoncée qu’à la dernière minute, et a lieu en ligne ou dans un ou plusieurs points de ventes sélectionnés.
in scheme: Habillement et mode
in scheme: concepts
notation: CULT759
related: collection capsule

moniteur
type: ConceptConcept
type: Concept
creator: Commission d'enrichissement de la langue française, FranceTerme
source: révision de l'arrêté du 24 janvier 1983
date parution JO: 2000-09-22
equivalent EN: monitor @en
equivalent EN: monitor (en)
part of speech: nom masculin
alternative label: écran de contrôle
alternative label: écran témoin
in scheme: Audiovisuel
in scheme: Informatique
in scheme: concepts
notation: CULT76

livre-jeu d'évasion
type: ConceptConcept
type: Concept
creator: Commission d'enrichissement de la langue française, FranceTerme
date parution JO: 2021-07-09
equivalent EN: escape book @en
equivalent EN: escape book (en)
forme abregee: livre d'évasion
definition: Livre dans lequel le héros, qui est le lecteur lui-même, doit résoudre une énigme afin de s’échapper du lieu où il est enfermé.
in scheme: Édition et livre
in scheme: concepts
notation: CULT760
note: Le livre-jeu d’évasion s’inspire du principe du jeu d’évasion.
related: jeu d'évasion

microrécit vidéo
type: ConceptConcept
type: Concept
creator: Commission d'enrichissement de la langue française, FranceTerme
date parution JO: 2021-07-09
deconseille ou frequent: brève
deconseille ou frequent: brève vidéo
deconseille ou frequent: fil d'actualité
deconseille ou frequent: stories
deconseille ou frequent: vidéorécit
equivalent EN: story @en
equivalent EN: story (en)
forme abregee: microrécit, n.m.
definition: Vidéo de format très court, mise en ligne pendant une période limitée, qui est utilisée sur les réseaux sociaux pour mettre en récit la vie quotidienne de son auteur.
in scheme: Audiovisuel
in scheme: Informatique
in scheme: concept-SD-audiovisuel-internet
in scheme: concept-SD-informatique-internet
in scheme: concepts
notation: CULT761
note: Le format narratif du microrécit vidéo peut également être utilisé plus largement, pour des fictions ou des publicités.

coffre-surprise
type: ConceptConcept
type: Concept
creator: Commission d'enrichissement de la langue française, FranceTerme
date parution JO: 2021-07-09
deconseille ou frequent: coffre surprise
deconseille ou frequent: coffre à butin
deconseille ou frequent: coffre à surprises
deconseille ou frequent: loot box
deconseille ou frequent: loot boxes
deconseille ou frequent: lootboxes
deconseille ou frequent: lot aléatoire
deconseille ou frequent: pochette-surprise
equivalent EN: lootbox @en
equivalent EN: lootbox (en)
part of speech: nom masculin
definition: Élément de jeu vidéo qui contient un ou plusieurs objets virtuels censés faciliter la progression du joueur ou enrichir son expérience d’utilisateur, ou parfois aucun objet, et dont le contenu n’est connu généralement qu’après paiement.
in scheme: Audiovisuel
in scheme: concept-SD-audiovisuel-jeu-video
in scheme: concepts
notation: CULT762
note: Les objets virtuels peuvent être, suivant les jeux, des armes, une vie supplémentaire, un bonus de temps.
related: bourse d'objets virtuels
related: payer pour gagner
related: concept-INFO953

stratège de la diffusion publicitaire
type: ConceptConcept
type: Concept
creator: Commission d'enrichissement de la langue française, FranceTerme
date parution JO: 2021-07-09
deconseille ou frequent: concepteur de campagne
deconseille ou frequent: planneur strat
deconseille ou frequent: planneur stratégique
equivalent EN: account planner @en
equivalent EN: account planner (en)
equivalent EN: advertising account planner @en
equivalent EN: advertising account planner (en)
equivalent EN: strategic planner @en
equivalent EN: strategic planner (en)
forme abregee: stratège publicitaire
definition: Spécialiste chargé de la stratégie de diffusion de campagnes publicitaires, qui s’appuie notamment sur l’étude des comportements et la perception des tendances dans un marché déterminé.
in scheme: Communication
in scheme: concept-SD-communication-publicite
in scheme: concepts
notation: CULT763
related: responsable du plan médias

contrefaçon d'opinion
type: ConceptConcept
type: Concept
creator: Commission d'enrichissement de la langue française, FranceTerme
date parution JO: 2021-07-09
deconseille ou frequent: astroturf
deconseille ou frequent: simulation d'opinion
equivalent EN: astroturfing @en
equivalent EN: astroturfing (en)
definition: Procédé de manipulation de l’information qui, à l’aide de moyens tels que de faux sondages, de fausses identités, de faux commentaires sur la toile et dans les réseaux sociaux, souvent amplifiés par des techniques algorithmiques, fait croire à l’existence d’un mouvement d’opinion.
in scheme: Communication
in scheme: concepts
notation: CULT764
related: pouvoir de manipulation

substitution de visage
type: ConceptConcept
type: Concept
creator: Commission d'enrichissement de la langue française, FranceTerme
date parution JO: 2021-07-09
deconseille ou frequent: face swapping
deconseille ou frequent: permutation de visage
deconseille ou frequent: permutation de visages
deconseille ou frequent: swapped face
deconseille ou frequent: swapping
deconseille ou frequent: échange de visage
deconseille ou frequent: échange de visages
equivalent EN: face swap @en
equivalent EN: face swap (en)
definition: Procédé qui permet de remplacer, partiellement ou en totalité, un visage par un autre sur une image fixe ou animée.
in scheme: Audiovisuel
in scheme: Informatique
in scheme: concepts
notation: CULT765
note: La substitution de visage peut être employée à des fins ludiques ou à des fins de manipulation.
related: infox vidéo

guide-hôte
type: ConceptConcept
type: Concept
creator: Commission d'enrichissement de la langue française, FranceTerme
date parution JO: 2021-07-09
equivalent EN: greeter @en
equivalent EN: greeter (en)
part of speech: nom
alternative label: guide bénévole
definition: Personne qui fait découvrir bénévolement à des touristes sa ville, son quartier et son cadre de vie.
in scheme: Tourisme
in scheme: concepts
notation: CULT766

culture de l'effacement
type: ConceptConcept
type: Concept
creator: Commission d'enrichissement de la langue française, FranceTerme
date parution JO: 2021-07-09
deconseille ou frequent: annulation culturelle
deconseille ou frequent: bannissement culturel
deconseille ou frequent: culture de l'annulation
deconseille ou frequent: culture du bannissement
deconseille ou frequent: effacement culturel
deconseille ou frequent: mise au ban
equivalent EN: cancel culture @en
equivalent EN: cancel culture (en)
forme abregee: effacement, n.m.
definition: Pratique de personnes ou de groupes de personnes qui s’efforcent, au nom de certaines valeurs, de bannir de l’espace public ou de la mémoire collective tant des personnalités que des œuvres, historiques ou contemporaines.
in scheme: Communication
in scheme: concepts
notation: CULT767
related: mise au pilori

exposition collective
type: ConceptConcept
type: Concept
creator: Commission d'enrichissement de la langue française, FranceTerme
date parution JO: 2021-07-09
equivalent EN: group show @en
equivalent EN: group show (en)
definition: Exposition qui présente les œuvres de plusieurs artistes indépendants, chaque artiste exposant une ou plusieurs œuvres.
in scheme: Arts
in scheme: Culture
in scheme: concepts
notation: CULT768
related: exposition personnelle

exposition personnelle
type: ConceptConcept
type: Concept
creator: Commission d'enrichissement de la langue française, FranceTerme
date parution JO: 2021-07-09
deconseille ou frequent: exposition solo
equivalent EN: solo show @en
equivalent EN: solo show (en)
alternative label: exposition individuelle
definition: Exposition qui présente les œuvres d’un seul artiste.
in scheme: Arts
in scheme: Culture
in scheme: concepts
notation: CULT769
note: On trouve aussi, dans le langage professionnel, le terme « exposition solo ».
related: exposition collective

montage sur copie
type: ConceptConcept
type: Concept
creator: Commission d'enrichissement de la langue française, FranceTerme
source: révision de l'arrêté du 24 janvier 1983
date parution JO: 2000-09-22
deconseille ou frequent: montage off line
equivalent EN: off-line editing @en
equivalent EN: off-line editing (en)
definition: Montage effectué à partir d'une bande vidéo copiée notamment sur une cassette.
in scheme: Audiovisuel
in scheme: concept-SD-audiovisuel-video
in scheme: concepts
notation: CULT77
note: L'expression « montage off line » ne doit pas être employée.

rétrojeu vidéo
type: ConceptConcept
type: Concept
creator: Commission d'enrichissement de la langue française, FranceTerme
date parution JO: 2022-05-29
deconseille ou frequent: old-school gaming
deconseille ou frequent: retrogame
equivalent EN: retro gaming @en
equivalent EN: retro gaming (en)
equivalent EN: retrogaming @en
equivalent EN: retrogaming (en)
forme abregee: jeu rétro, loc.n.m.
forme abregee: rétrojeu, n.m.
part of speech: locution nominale masculine
alternative label: jeu vidéo rétro
definition: Pratique consistant à jouer à des jeux vidéo anciens sur des consoles ou des ordinateurs d’origine ou sur des matériels récents adaptés à cet effet, et à collectionner ces jeux.
in scheme: Audiovisuel
in scheme: concept-SD-audiovisuel-jeu-video
in scheme: concepts
notation: CULT770

jeu vidéo de compétition
type: ConceptConcept
type: Concept
creator: Commission d'enrichissement de la langue française, FranceTerme
date parution JO: 2022-05-29
deconseille ou frequent: PGM
deconseille ou frequent: compétition de jeux vidéo
deconseille ou frequent: esport
deconseille ou frequent: pro gaming
deconseille ou frequent: sport électronique
equivalent EN: e-sport @en
equivalent EN: e-sport (en)
equivalent EN: pro-gaming @en
equivalent EN: pro-gaming (en)
equivalent EN: progaming @en
equivalent EN: progaming (en)
part of speech: locution nominale masculine
definition: Pratique compétitive, généralement professionnelle, du jeu vidéo qui est organisée dans le cadre de ligues nationales ou de championnats internationaux et peut faire l’objet de retransmissions.
in scheme: Audiovisuel
in scheme: concept-SD-audiovisuel-jeu-video
in scheme: concepts
notation: CULT771
note: On trouve aussi, dans l’usage, le terme « sport électronique », qui n’est pas recommandé.
related: joueur, -euse professionnel, -elle

accès anticipé
type: ConceptConcept
type: Concept
creator: Commission d'enrichissement de la langue française, FranceTerme
date parution JO: 2022-05-29
deconseille ou frequent: version de démonstration
equivalent EN: early access @en
equivalent EN: early access (en)
equivalent EN: early pass @en
equivalent EN: early pass (en)
part of speech: locution nominale masculine
definition: Offre gratuite ou payante qui permet d’utiliser une version préliminaire d’un jeu vidéo, avant la fin de son développement ou son lancement commercial.
in scheme: Audiovisuel
in scheme: concept-SD-audiovisuel-jeu-video
in scheme: concepts
notation: CULT772
note: L’accès anticipé permet, le cas échéant, au créateur du jeu vidéo de faire évoluer ce dernier grâce aux observations des utilisateurs.

appariement de joueurs
type: ConceptConcept
type: Concept
creator: Commission d'enrichissement de la langue française, FranceTerme
date parution JO: 2022-05-29
deconseille ou frequent: appariement
deconseille ou frequent: jumelage
deconseille ou frequent: match making
equivalent EN: matchmaking @en
equivalent EN: matchmaking (en)
part of speech: locution nominale masculine
definition: Processus algorithmique qui permet d’associer des joueurs, en fonction de critères tels que leur niveau, pour les faire s’affronter ou pour qu’ils collaborent en équipe dans un jeu vidéo en ligne multijoueur.
in scheme: Audiovisuel
in scheme: concept-SD-audiovisuel-jeu-video
in scheme: concepts
notation: CULT773
related: jeu en ligne multijoueur de masse

bourse d'objets virtuels
type: ConceptConcept
type: Concept
creator: Commission d'enrichissement de la langue française, FranceTerme
date parution JO: 2022-05-29
deconseille ou frequent: objet virtuel
equivalent EN: skin betting @en
equivalent EN: skin betting (en)
equivalent EN: skin gambling @en
equivalent EN: skin gambling (en)
part of speech: locution nominale féminine
definition: Revente ou mise aux enchères par leur propriétaire d’objets virtuels obtenus au cours d’un jeu vidéo.
in scheme: Audiovisuel
in scheme: concept-SD-audiovisuel-jeu-video
in scheme: concepts
notation: CULT774
note: Les objets virtuels peuvent être notamment des accessoires, une vie supplémentaire ou un bonus de temps.
related: coffre-surprise

contenu téléchargeable additionnel
type: ConceptConcept
type: Concept
creator: Commission d'enrichissement de la langue française, FranceTerme
abbreviation: CTA
date parution JO: 2022-05-29
deconseille ou frequent: contenu téléchargeable
equivalent EN: DLC @en
equivalent EN: DLC (en)
equivalent EN: downloadable content @en
equivalent EN: downloadable content (en)
equivalent EN: downloaded content @en
equivalent EN: downloaded content (en)
part of speech: locution nominale masculine
alternative label: extension téléchargeable
definition: Extension d’un jeu vidéo qu’un joueur peut télécharger, gratuitement ou non, pour enrichir son expérience.
in scheme: Audiovisuel
in scheme: concept-SD-audiovisuel-jeu-video
in scheme: concepts
notation: CULT775
note: Les contenus téléchargeables additionnels ne sont pas toujours disponibles dès la sortie du jeu.
related: passe saisonnier
related: concept-INFO953

passe saisonnier
type: ConceptConcept
type: Concept
creator: Commission d'enrichissement de la langue française, FranceTerme
date parution JO: 2022-05-29
deconseille ou frequent: pass de saison
deconseille ou frequent: pass saisonnier
deconseille ou frequent: passe de saison
equivalent EN: season pass @en
equivalent EN: season pass (en)
part of speech: locution nominale masculine
definition: Droit d’accès à un jeu, à un ensemble de jeux ainsi qu’à leurs contenus téléchargeables additionnels, ouvert pour une durée prédéterminée de l’ordre de quelques mois.
in scheme: Audiovisuel
in scheme: concept-SD-audiovisuel-jeu-video
in scheme: concepts
notation: CULT776
related: contenu téléchargeable additionnel

jeu vidéo à la demande
type: ConceptConcept
type: Concept
creator: Commission d'enrichissement de la langue française, FranceTerme
date parution JO: 2022-05-29
deconseille ou frequent: jeu en tant que service
deconseille ou frequent: jeu à la demande
equivalent EN: GaaS @en
equivalent EN: GaaS (en)
equivalent EN: game as a service @en
equivalent EN: game as a service (en)
part of speech: locution nominale masculine
definition: Offre commerciale qui propose l’utilisation d’un jeu vidéo en nuage, facturée pour un usage ponctuel ou, plus souvent, liée à un abonnement.
in scheme: Audiovisuel
in scheme: concept-SD-audiovisuel-jeu-video
in scheme: concepts
notation: CULT777
related: jeu vidéo en nuage
related: logiciel à la demande

jeu vidéo d'habileté
type: ConceptConcept
type: Concept
creator: Commission d'enrichissement de la langue française, FranceTerme
date parution JO: 2022-05-29
deconseille ou frequent: skill gaming
equivalent EN: skill game @en
equivalent EN: skill game (en)
forme abregee: jeu d'habileté, loc.n.m.
part of speech: locution nominale masculine
definition: Jeu vidéo dans lequel la réussite dépend des compétences et de l’habileté du joueur, plutôt que du hasard ou de la chance.
in scheme: Audiovisuel
in scheme: concept-SD-audiovisuel-jeu-video
in scheme: concepts
notation: CULT778

jeu social en ligne
type: ConceptConcept
type: Concept
creator: Commission d'enrichissement de la langue française, FranceTerme
date parution JO: 2022-05-29
deconseille ou frequent: social gaming
equivalent EN: social game @en
equivalent EN: social game (en)
forme abregee: jeu social, loc.n.m.
part of speech: locution nominale masculine
definition: Jeu vidéo qui utilise les modalités d’interaction des réseaux sociaux et qui, le plus souvent, est hébergé sur leurs plateformes.
in scheme: Audiovisuel
in scheme: concept-SD-audiovisuel-jeu-video
in scheme: concepts
notation: CULT779

montage sur original
type: ConceptConcept
type: Concept
creator: Commission d'enrichissement de la langue française, FranceTerme
source: révision de l'arrêté du 24 janvier 1983
date parution JO: 2000-09-22
deconseille ou frequent: montage on line
equivalent EN: on-line editing @en
equivalent EN: on-line editing (en)
definition: Montage effectué à partir d'une bande vidéo originale.
in scheme: Audiovisuel
in scheme: concept-SD-audiovisuel-video
in scheme: concepts
notation: CULT78
note: L'expression « montage on line » ne doit pas être employée.

jeu vidéo en accès gratuit
type: ConceptConcept
type: Concept
creator: Commission d'enrichissement de la langue française, FranceTerme
date parution JO: 2022-05-29
deconseille ou frequent: free to play
deconseille ou frequent: jeu gratuit
deconseille ou frequent: jeu vidéo gratuit
equivalent EN: F2P @en
equivalent EN: F2P (en)
equivalent EN: free-to-play @en
equivalent EN: free-to-play (en)
forme abregee: jeu vidéo gratuit
part of speech: locution nominale masculine
definition: Jeu vidéo dont la version de base est gratuite mais qui peut comporter des fonctionnalités payantes.
in scheme: Audiovisuel
in scheme: concept-SD-audiovisuel-jeu-video
in scheme: concepts
notation: CULT780
note: Le jeu vidéo en accès gratuit peut être soit accessible en ligne, soit téléchargé sur un ordinateur ou un autre support.
related: gratuit-payant

joueur, -euse-animateur, -trice en direct
type: ConceptConcept
type: Concept
creator: Commission d'enrichissement de la langue française, FranceTerme
date parution JO: 2022-05-29
deconseille ou frequent: instavidéaste
deconseille ou frequent: joueur en direct
deconseille ou frequent: joueur-animateur en direct
deconseille ou frequent: joueuse en direct
deconseille ou frequent: joueuse-animatrice en direct
deconseille ou frequent: streaming
equivalent EN: streamer @en
equivalent EN: streamer (en)
forme abregee: joueur, -euse en direct, loc.n.
definition: Joueur qui retransmet et commente en direct sur la toile sa propre partie de jeu vidéo, tout en interagissant avec sa communauté de spectateurs.
in scheme: Audiovisuel
in scheme: concept-SD-audiovisuel-jeu-video
in scheme: concepts
notation: CULT781

payer pour gagner
type: ConceptConcept
type: Concept
creator: Commission d'enrichissement de la langue française, FranceTerme
date parution JO: 2022-05-29
deconseille ou frequent: pay-to-win
equivalent EN: pay to win @en
equivalent EN: pay to win (en)
part of speech: locution nominale masculine
definition: Achat d’avantages dans un jeu vidéo en ligne afin d’éviter une épreuve, de progresser plus vite ou de gagner la partie.
in scheme: Audiovisuel
in scheme: concept-SD-audiovisuel-jeu-video
in scheme: concepts
notation: CULT782
note: Le payer pour gagner est considéré comme déloyal par certains joueurs.
related: coffre-surprise

squelettage
type: ConceptConcept
type: Concept
creator: Commission d'enrichissement de la langue française, FranceTerme
date parution JO: 2022-05-29
equivalent EN: rigging @en
equivalent EN: rigging (en)
part of speech: nom masculin
definition: Réalisation en images de synthèse d’une structure articulée d’un personnage ou d’un objet, dont chacune des parties peut être animée de sorte que les mouvements de l’ensemble soient coordonnés.
in scheme: Audiovisuel
in scheme: concepts
notation: CULT783

suivi des mains
type: ConceptConcept
type: Concept
creator: Commission d'enrichissement de la langue française, FranceTerme
date parution JO: 2022-05-29
deconseille ou frequent: hand tracking
equivalent EN: hand-tracking @en
equivalent EN: hand-tracking (en)
part of speech: locution nominale masculine
definition: Procédé qui permet de détecter et d’analyser les mouvements des mains de l’utilisateur d’un univers de réalité virtuelle en trois dimensions, afin de lui permettre d’interagir avec cet univers.
in scheme: Audiovisuel
in scheme: concept-SD-audiovisuel-jeu-video
in scheme: concepts
notation: CULT784
note: Le suivi des mains est par exemple utilisé dans les domaines des jeux vidéo et du cinéma.
related: capture de mouvement

monter sec
type: ConceptConcept
type: Concept
creator: Commission d'enrichissement de la langue française, FranceTerme
source: révision de l'arrêté du 24 janvier 1983
date parution JO: 2000-09-22
equivalent EN: tight editing @en
equivalent EN: tight editing (en)
definition: Faire un montage de plans sonores ou visuels coupés de manière brusque et nette.
in scheme: Audiovisuel
in scheme: concept-SD-audiovisuel-cinema
in scheme: concept-SD-audiovisuel-television
in scheme: concepts
notation: CULT79

ampli-syntoniseur
type: ConceptConcept
type: Concept
creator: Commission d'enrichissement de la langue française, FranceTerme
source: révision de l'arrêté du 24 janvier 1983
date parution JO: 2000-09-22
deconseille ou frequent: ampli-tuner
equivalent EN: receiver @en
equivalent EN: receiver (en)
part of speech: nom masculin
definition: Élément de chaîne électro-acoustique intégrant simultanément la fonction de syntoniseur et celle d'amplificateur dans la gamme des fréquences audibles (audiofréquences).
in scheme: Acoustique
in scheme: Audiovisuel
in scheme: concepts
notation: CULT8
note: Le terme « ampli-tuner » ne doit pas être employé.
related: syntoniseur
related: concept-TELE27

monter serré
type: ConceptConcept
type: Concept
creator: Commission d'enrichissement de la langue française, FranceTerme
source: révision de l'arrêté du 24 janvier 1983
date parution JO: 2000-09-22
equivalent EN: dynamic cutting @en
equivalent EN: dynamic cutting (en)
definition: Obtenir un rythme vif et soutenu par une succession de plans sonores ou visuels.
in scheme: Audiovisuel
in scheme: concept-SD-audiovisuel-cinema
in scheme: concept-SD-audiovisuel-television
in scheme: concepts
notation: CULT80

perchiste
type: ConceptConcept
type: Concept
creator: Commission d'enrichissement de la langue française, FranceTerme
source: révision de l'arrêté du 10 octobre 1985
date parution JO: 2000-09-22
equivalent EN: perchman @en
equivalent EN: perchman (en)
equivalent EN: perchwoman @en
equivalent EN: perchwoman (en)
part of speech: nom
definition: Technicien qui manie la perche à son au-dessus de la personne qui parle.
in scheme: Audiovisuel
in scheme: concept-SD-audiovisuel-cinema
in scheme: concept-SD-audiovisuel-television
in scheme: concepts
notation: CULT83

perte de signal
type: ConceptConcept
type: Concept
creator: Commission d'enrichissement de la langue française, FranceTerme
source: révision de l'arrêté du 24 janvier 1983
date parution JO: 2000-09-22
equivalent EN: drop-out @en
equivalent EN: drop-out (en)
definition: Affaiblissement brusque du signal sonore ou visuel.
in scheme: Audiovisuel
in scheme: concept-SD-audiovisuel-television
in scheme: concept-SD-audiovisuel-video
in scheme: concepts
notation: CULT84

piste d'asservissement
type: ConceptConcept
type: Concept
creator: Commission d'enrichissement de la langue française, FranceTerme
source: révision de l'arrêté du 24 janvier 1983
date parution JO: 2000-09-22
equivalent EN: control track @en
equivalent EN: control track (en)
definition: Piste sur la bande vidéo contenant des instructions destinées à un magnétoscope.
in scheme: Audiovisuel
in scheme: concept-SD-audiovisuel-video
in scheme: concepts
notation: CULT85

plan médias
type: ConceptConcept
type: Concept
creator: Commission d'enrichissement de la langue française, FranceTerme
source: révision de l'arrêté du 10 octobre 1985
date parution JO: 2000-09-22
equivalent EN: media planning @en
equivalent EN: media planning (en)
definition: Recherche d'une combinaison optimale des médias et supports permettant de répondre aux impératifs d'une stratégie de communication.
in scheme: Communication
in scheme: concept-SD-communication-publicite
in scheme: concepts
notation: CULT86
related: responsable du plan médias

plan rapproché
type: ConceptConcept
type: Concept
creator: Commission d'enrichissement de la langue française, FranceTerme
source: révision de l'arrêté du 24 janvier 1983
date parution JO: 2000-09-22
equivalent EN: medium close-up @en
equivalent EN: medium close-up (en)
definition: Plan cadrant un personnage au niveau des épaules ou de la poitrine.
in scheme: Audiovisuel
in scheme: concept-SD-audiovisuel-cinema
in scheme: concept-SD-audiovisuel-television
in scheme: concepts
notation: CULT87
related: très gros plan
related: gros plan

pleurage
type: ConceptConcept
type: Concept
creator: Commission d'enrichissement de la langue française, FranceTerme
source: révision de l'arrêté du 10 octobre 1985
date parution JO: 2000-09-22
equivalent EN: wow @en
equivalent EN: wow (en)
part of speech: nom masculin
definition: Fluctuation de la vitesse relative entre un support d'enregistrement et la tête d'enregistrement ou de lecture, dont la fréquence est comprise entre 0,1 et 10 hertz.
in scheme: Acoustique
in scheme: Audiovisuel
in scheme: concepts
notation: CULT88
related: scintillement
related: fluctuations de vitesse

point de coupure
type: ConceptConcept
type: Concept
creator: Commission d'enrichissement de la langue française, FranceTerme
source: révision de l'arrêté du 24 janvier 1983
date parution JO: 2000-09-22
equivalent EN: cut-off @en
equivalent EN: cut-off (en)
definition: Point de repère sur une courbe caractéristique de tube électronique ou de dispositif semi-conducteur, correspondant à l'arrêt du courant dans une électrode donnée.
in scheme: Audiovisuel
in scheme: Électronique
in scheme: concepts
notation: CULT89

amplificateur de sonorisation
type: ConceptConcept
type: Concept
creator: Commission d'enrichissement de la langue française, FranceTerme
source: révision de l'arrêté du 24 janvier 1983
date parution JO: 2000-09-22
deconseille ou frequent: amplificateur de public address
equivalent EN: public address amplifier @en
equivalent EN: public address amplifier (en)
definition: Amplificateur de puissance destiné à la sonorisation d'un local ou d'un espace important.
in scheme: Acoustique
in scheme: Audiovisuel
in scheme: concepts
notation: CULT9
note: L'expression « amplificateur de public address » ne doit pas être employée.
related: sonorisation
related: suramplificateur

polarisation
type: ConceptConcept
type: Concept
creator: Commission d'enrichissement de la langue française, FranceTerme
source: révision de l'arrêté du 10 octobre 1985
date parution JO: 2000-09-22
equivalent EN: bias @en
equivalent EN: bias (en)
equivalent EN: biasing @en
equivalent EN: biasing (en)
part of speech: nom féminin
definition: Décalage de la valeur d'une grandeur par rapport à une valeur de référence, effectué en vue de fixer les conditions de fonctionnement d'un système.
in scheme: Télécommunications
in scheme: concepts
notation: CULT90
note: 1. Ce terme s'applique par exemple à la tension de polarisation d'un transistor ou un champ de polarisation d'une bande magnétique.
note: 2. Ne pas confondre avec le terme « polarisation d'une antenne ».
related: polarisation d'une antenne

polarisation d'une antenne
type: ConceptConcept
type: Concept
creator: Commission d'enrichissement de la langue française, FranceTerme
source: révision de l'arrêté du 10 octobre 1985
date parution JO: 2000-09-22
equivalent EN: polarization @en
equivalent EN: polarization (en)
definition: Caractéristique d'une antenne traduisant son adaptation à l'orientation du champ électrique de l'onde reçue.
in scheme: Télécommunications
in scheme: concepts
notation: CULT91
note: En pratique, la polarisation est horizontale, verticale ou circulaire.
related: polarisation

prêt-à-monter
type: ConceptConcept
type: Concept
creator: Commission d'enrichissement de la langue française, FranceTerme
source: révision de l'arrêté du 24 janvier 1983
date parution JO: 2000-09-22
equivalent EN: kit @en
equivalent EN: kit (en)
part of speech: nom masculin
definition: Ensemble présenté en pièces détachées en vue d'être monté par l'utilisateur.
in scheme: Tous domaines
in scheme: concepts
notation: CULT92
note: Pluriel : prêts-à-monter.

rapport de tournage
type: ConceptConcept
type: Concept
creator: Commission d'enrichissement de la langue française, FranceTerme
source: révision de l'arrêté du 10 octobre 1985
date parution JO: 2000-09-22
equivalent EN: camera sheet @en
equivalent EN: camera sheet (en)
equivalent EN: dope-sheet @en
equivalent EN: dope-sheet (en)
definition: Feuille qui accompagne la pellicule impressionnée au laboratoire, mentionnant le métrage, les numéros, la longueur des plans et des prises tournées, les indications de tirage, l'effet de lumière souhaité.
in scheme: Audiovisuel
in scheme: concepts
notation: CULT93

récepteur à bande latérale unique
type: ConceptConcept
type: Concept
creator: Commission d'enrichissement de la langue française, FranceTerme
source: révision de l'arrêté du 10 octobre 1985
abbreviation: SSB receiver @en
date parution JO: 2000-09-22
equivalent EN: SSB receiver @en
equivalent EN: SSB receiver (en)
equivalent EN: single-sideband receiver @en
equivalent EN: single-sideband receiver (en)
forme abregee: récepteur BLU
definition: Récepteur capable de recevoir les émissions à bande latérale unique.
in scheme: Audiovisuel
in scheme: concepts
notation: CULT94
related: émission à bande latérale unique

réducteur de bruit
type: ConceptConcept
type: Concept
creator: Commission d'enrichissement de la langue française, FranceTerme
source: révision de l'arrêté du 10 octobre 1985
date parution JO: 2000-09-22
equivalent EN: noise reducer @en
equivalent EN: noise reducer (en)
definition: Dispositif électronique destiné à améliorer le rapport du signal utile sur un bruit de fond.
in scheme: Acoustique
in scheme: Audiovisuel
in scheme: concepts
notation: CULT95

régisseur de distribution
type: ConceptConcept
type: Concept
creator: Commission d'enrichissement de la langue française, FranceTerme
source: révision de l'arrêté du 24 janvier 1983
date parution JO: 2000-09-22
equivalent EN: casting director @en
equivalent EN: casting director (en)
definition: Responsable de la recherche des artistes et de l'attribution des rôles.
in scheme: Arts
in scheme: Audiovisuel
in scheme: concept-SD-arts-arts-de-la-scene
in scheme: concept-SD-audiovisuel-arts-de-la-scene
in scheme: concepts
notation: CULT96
related: audition
related: distribution

remue-méninges
type: ConceptConcept
type: Concept
creator: Commission d'enrichissement de la langue française, FranceTerme
source: révision de l'arrêté du 24 janvier 1983
date parution JO: 2000-09-22
deconseille ou frequent: brain storming
equivalent EN: brainstorming @en
equivalent EN: brainstorming (en)
part of speech: nom masculin
definition: Technique de groupe destinée à stimuler l'imagination des participants en vue de leur faire produire le maximum d'idées dans le minimum de temps.
in scheme: Tous domaines
in scheme: concepts
notation: CULT97

repérage
type: ConceptConcept
type: Concept
creator: Commission d'enrichissement de la langue française, FranceTerme
source: révision de l'arrêté du 10 octobre 1985
date parution JO: 2000-09-22
deconseille ou frequent: repérage arrière
deconseille ou frequent: repérage avant
equivalent EN: search @en
equivalent EN: search (en)
equivalent EN: searching @en
equivalent EN: searching (en)
part of speech: nom masculin
definition: Lecture rapide d'un support enregistré destiné à localiser un passage déterminé.
in scheme: Audiovisuel
in scheme: concepts
notation: CULT98
note: 1. Selon le sens de défilement, on parle de « repérage avant » ou de « repérage arrière ».
note: 2. Il existe aussi des procédés de repérage automatique.

resserrer un montage
type: ConceptConcept
type: Concept
creator: Commission d'enrichissement de la langue française, FranceTerme
source: révision de l'arrêté du 24 janvier 1983
date parution JO: 2000-09-22
definition: Accélérer le rythme d'un montage en en raccourcissant ou en supprimant certains plans ou séquences.
in scheme: Audiovisuel
in scheme: concept-SD-audiovisuel-cinema
in scheme: concept-SD-audiovisuel-television
in scheme: concepts
notation: CULT99

Acoustique
type: DomaineConcept
type: ConceptScheme
has part: concept-SD-acoustique-geophysique
has part: concept-SD-acoustique-moyens-d-essais
is part of: concepts
graphique: http://www.cite-acoustique.fr/m1r2_domaines.php
lien: https://en.wikipedia.org/wiki/Acoustics
lien: https://fr.wikipedia.org/wiki/Acoustique
url source: https://fr.wikipedia.org/wiki/Acoustique
definition: Acoustics is the science that deals with the production, control, transmission, reception and effects of sound. @en
definition: L’acoustique est la science du son, ce qui inclut sa production, son contrôle, sa transmission, sa réception et ses effets.
preferred label: Acoustics @en

Activités postales
type: DomaineConcept
type: ConceptScheme
has part: concept-SD-activites-postales-publicite
is part of: concepts
graphique: http://www.insee.fr/fr/themes/tableau.asp
url source: http://www.marche-public.fr/Marches-publics/Definitions/Entrees/services-postaux.htm
definition: Il s'agit de services, consistant en la levée, le tri, l'acheminement et la distribution d'envois postaux.
definition: Services which provide postal items collection, sorting and distribution. @en
preferred label: Postal activities @en

Aérodynamique
type: DomaineConcept
type: ConceptScheme
has part: concept-SD-aerodynamique-structures
is part of: concepts
url source: https://fr.wikipedia.org/wiki/A%C3%A9rodynamique
definition: Aerodynamics is the branch of fluid dynamics which deals with the understanding and analysis of airflows, and possibly their effects on the solid items surrounding them. @en
definition: L' aérodynamique est une branche de la dynamique des fluides qui porte sur la compréhension et l' analyse des écoulements d'air, ainsi qu'éventuellement sur leurs effets sur des éléments solides qu'ils environnent.
note: Aerodynamics applies to vehicles in motion in the air (aerodynes, automobiles, trains), propulsion systems (propellers, rotors,turbines, turbojets), fixed installations in a moving air undergoing the wind's effects (buildings, towers, bridges) or designed for the production of energy (wind energy), to the mechanical systems which transform an aerodynamic energy into a mechanical energy and vice versa (turbines, compressors). @en
note: L'aérodynamique s'applique aux véhicules en mouvement dans l'air (aérodynes,automobiles, trains), aux systèmes de propulsion (hélices, rotors, turbines,turboréacteurs ),aux installations fixes dans un air en mouvement subissant les effets du vent (bâtiments, tours, ponts) ou destinés à la production d'énergie (éoliennes), aux systèmes mécaniques transformant une énergie aérodynamique en énergie mécanique et vice-versa (turbines, compresseurs).
preferred label: Aerodynamics @en

Aéronautique
type: DomaineConcept
type: ConceptScheme
has part: concept-SD-aeronautique-operations
has part: concept-SD-aeronautique-physiologie
has part: concept-SD-aeronautique-pyrotechnie
has part: concept-SD-aeronautique-sports-aeriens
has part: concept-SD-aeronautique-transport-aerien
has part: concept-SD-aeronautique-vols-habites
is part of: concepts
graphique: http://www.planetoscope.com/transport/Avion
lien: https://en.wikipedia.org/wiki/Aeronautics
lien: https://fr.wikipedia.org/wiki/Aeronautique
url source: https://fr.wikipedia.org/wiki/A%C3%A9ronautique
definition: Aeronautics includes sciences and technologies aiming at building and making it possible for aircrafts to move in the Earth's atmosphere. @en
definition: L'aéronautique inclut les sciences et les technologies ayant pour but de construire et de faire évoluer un aéronef dans l'atmosphère terrestre.
preferred label: Aeronautics @en

Agriculture
type: DomaineConcept
type: ConceptScheme
has part: concept-SD-agriculture-agronomie
has part: concept-SD-agriculture-biochimie-et-biologie-moleculaire
has part: concept-SD-agriculture-economie-agricole
has part: concept-SD-agriculture-elevage
has part: concept-SD-agriculture-hydrologie
has part: concept-SD-agriculture-industries-agricoles-et-alimentaires
has part: concept-SD-agriculture-materiel-agricole-et-forestier
has part: concept-SD-agriculture-politique-agricole
has part: concept-SD-agriculture-sylviculture
is part of: concepts
graphique: http://ec.europa.eu/eurostat/statistics-explained/index.php/Agricultural_output,_price_indices_and_income/fr
graphique: http://ec.europa.eu/eurostat/statistics-explained/index.php/Agricultural_production_-_crops
url source: http://cnrtl.fr/definition/agriculture
definition: Activity whose goal is: cultivation of crops to feed humans and animals; also refers to animal farming. @en
definition: Activité ayant pour objet : principalement la culture des terres en vue de la production des végétaux utiles à l'homme et à l'élevage des animaux ; accessoirement l'élevage des animaux.

Alimentation
type: DomaineConcept
type: ConceptScheme
is part of: concepts
forme abregee: IAA
graphique: http://www.insee.fr/fr/themes/document.asp
lien: https://en.wikipedia.org/wiki/Food_industry
lien: https://fr.wikipedia.org/wiki/Secteur_agroalimentaire
url source: http://www.pole-emploi.fr/actualites/l-industrie-alimentaire-@/article.jspz
url source: https://www.insee.fr/fr/metadonnees/definition/c1900
definition: Ensemble des activités industrielles qui transforment des matières premières issues de l’agriculture, de l'élevage ou de la pêche en produits alimentaires destinés essentiellement à la consommation humaine.
definition: Industrial activities whose goal is the processing of agricultural, animal farming or fishing raw materials into food products, mainly for human consumption. @en
preferred label: Food @en

Aménagement et urbanisme
type: DomaineConcept
type: ConceptScheme
has part: concept-SD-amenagement-et-urbanisme-art-des-jardins
has part: concept-SD-amenagement-et-urbanisme-art-urbain
has part: concept-SD-amenagement-et-urbanisme-cartographie
has part: concept-SD-amenagement-et-urbanisme-transport-ferroviaire
has part: concept-SD-amenagement-et-urbanisme-transport-routier
is part of: concepts
url source: https://en.wikipedia.org/wiki/Urban_planning
url source: https://fr.wikipedia.org/wiki/Urbanisme
definition: Ensemble des techniques et des politiques relatives à l'organisation, à l'aménagement et aux infrastructures (transports, communications et réseaux de distribution) des espaces urbains.
definition: Technical and political process concerned with the development and design of land use and the built environment, including air, water, and the infrastructure passing into and out of urban areas, such as transportation, communications, and distribution networks. @en
note: L'urbanisme peut être sous tendu par une volonté d'assurer le bien-être de la population et d'améliorer les rapports sociaux et économiques en tenant compte de l'efficience, de l'hygiène et de la préservation des ressources environnementales.
note: The primary concern is the public welfare, which includes considerations of efficiency, sanitation, protection and use of the environment, as well as effects on social and economic activities. @en
preferred label: Urban planning @en

Armement
type: DomaineConcept
type: ConceptScheme
has part: concept-SD-armement-securite
is part of: concepts
graphique: http://ec.europa.eu/eurostat/statistics-explained/index.php/File:Total_general_government_expenditure_on_defence,_2014_%28%25_of_GDP%29.png @en
lien: https://fr.wikipedia.org/wiki/Armement
url source: http://www.larousse.fr/dictionnaires/francais/armement/5286
definition: All the weapons, weapons systems, materials and ammunition intended for the armed forces to enable them to fulfill their defence missions. @en
definition: Ensemble des armes, systèmes d'armes, matériels et munitions destinés aux forces armées pour leur permettre d'accomplir leurs missions de défense.
preferred label: Armament @en
preferred label: Weaponry @en

Arts
type: DomaineConcept
type: ConceptScheme
has part: concept-SD-arts-art-des-jardins
has part: concept-SD-arts-art-urbain
has part: concept-SD-arts-arts-de-la-scene
has part: concept-SD-arts-arts-plastiques
has part: concept-SD-arts-musees
has part: concept-SD-arts-musique
has part: concept-SD-arts-patrimoine
has part: concept-SD-arts-photographie
is part of: concepts
graphique: http://www.insee.fr/fr/bases-de-donnees/bsweb/graph.asp
url source: https://en.wikipedia.org/wiki/Art
definition: Art is a diverse range of human activities in creating visual, auditory or performing artifacts –artworks, expressing the author's imaginative or technical skill, intended to be appreciated for their beauty or emotional power. @en
definition: L'art regroupe des activités humaines diverses de création d’œuvres d'art visuelles, auditives ou de mises en scène qui reflètent les compétences imaginatives ou techniques de leur auteur, et destinées à être appréciées par leur beauté ou leur pouvoir émotionnel.

Assurance
type: DomaineConcept
type: ConceptScheme
has part: concept-SD-assurance-internet
is part of: concepts
graphique: http://stats.oecd.org/Index.aspx
url source: https://www.insee.fr/fr/metadonnees/definition/c1423
definition: Ensemble des sociétés et quasi-sociétés financières dont la fonction principale consiste à fournir des services d'intermédiation financière résultant de la mutualisation de risques.
definition: Set of financial companies and quasi-corporations the main function of which consists in providing financial intermediation services resulting from the pooling of risks. @en
preferred label: Insurance @en

Astronomie
type: DomaineConcept
type: ConceptScheme
has part: concept-SD-astronomie-astrophysique
has part: concept-SD-astronomie-cosmologie
has part: concept-SD-astronomie-geophysique
has part: concept-SD-astronomie-mecanique-celeste
has part: concept-SD-astronomie-planetologie
has part: concept-SD-astronomie-vehicules-spatiaux
is part of: concepts
url source: https://fr.wikipedia.org/wiki/Astronomie
definition: Astronomy is the science of astronomical observation, seeking to explain their origin, evolution, physical and chemical properties. @en
definition: L'astronomie est la science de l'observation des astres, cherchant à expliquer leur origine, leur évolution, leurs propriétés physiques et chimiques.
preferred label: Astronomy @en

Audiovisuel
type: DomaineConcept
type: ConceptScheme
has part: concept-SD-audiovisuel-arts-de-la-scene
has part: concept-SD-audiovisuel-cinema
has part: concept-SD-audiovisuel-edition-musicale
has part: concept-SD-audiovisuel-infographie
has part: concept-SD-audiovisuel-internet
has part: concept-SD-audiovisuel-jeu-video
has part: concept-SD-audiovisuel-presse
has part: concept-SD-audiovisuel-publicite
has part: concept-SD-audiovisuel-radio
has part: concept-SD-audiovisuel-television
has part: concept-SD-audiovisuel-transport-aerien
has part: concept-SD-audiovisuel-video
is part of: concepts
graphique: http://www.insee.fr/fr/themes/detail.asp
lien: https://fr.wikipedia.org/wiki/Audiovisuel
url source: https://www.insee.fr/fr/metadonnees/definition/c1843
definition: Au sens de la NAF rév. 2 (en vigueur depuis le 1er janvier 2008), les activités audiovisuelles comprennent : - la production de films cinématographiques, de vidéo et de programmes de télévision ; - les activités de post-production de films cinématographiques, de vidéo et de programmes de télévision ; - la distribution de films cinématographiques, de vidéo et de programmes de télévision ; - la projection de films cinématographiques ; - la production d'enregistrements sonores et l'édition musicale ; - la programmation et la diffusion de programmes de radio et de télévision. L'exploitation et la gestion des droits de propriété intellectuelle (copyright) de films ou d'autres productions audiovisuelles, font partie des activités audiovisuelles.
definition: In the sense of NAF rev. 2 (in force since 1 January 2008), audiovisual activities include : - the production of cinema films, videos and television programmes ; - post-production activities relating to cinema films, videos and television programmes ; - the distribution of cinema films, videos and television programmes ; - the screening of cinema films;- the production of sound recordings and music editing ; - the scheduling and broadcasting of radio and television programmes. The exploitation and management of copyright governing films or other audiovisual productions are considered to be audiovisual activities. @en
preferred label: Audiovisual media @en

Automatique
type: DomaineConcept
type: ConceptScheme
is part of: concepts
lien: https://fr.wikipedia.org/wiki/Automatique
url source: http://www.cnrtl.fr/lexicographie/automatique
definition: Science that aims at use of a machine without any human action other than the prior, intellectual and material, setup of a program to be ran by the machine itself, and modified by the machine's logic decisions made accordingly to the situation of operation. @en
definition: Science visant l'emploi d'une machine où l'intervention humaine est limitée à la préparation préalable, intellectuelle et matérielle, d'un programme incorporé à la machine qui le suivra seule, en le modifiant d'elle-même s'il y a lieu, par des décisions logiques conditionnées par les circonstances de déroulement des opérations.
preferred label: Automatic control @en

Automobile
type: DomaineConcept
type: ConceptScheme
has part: concept-SD-automobile-materiel-agricole-et-forestier
has part: concept-SD-automobile-moteurs
has part: concept-SD-automobile-radiocommunications
has part: concept-SD-automobile-sport-automobile
has part: concept-SD-automobile-transport-routier
is part of: concepts
graphique: http://ec.europa.eu/eurostat/statistics-explained/index.php/International_trade_in_motor_cars
lien: https://en.wikipedia.org/wiki/Automotive_industry
lien: https://fr.wikipedia.org/wiki/Construction_automobile
url source: https://www.insee.fr/fr/metadonnees/definition/c1184
definition: L'industrie automobile concerne aussi bien les équipementiers spécialisés que les constructeurs de voitures particulières, de véhicules de loisir, ou de véhicules utilitaires et les carrossiers.
definition: Manufacture of motor vehicles concerns specialised equipment manufacturers, as well as the manufacturers of private vehicles, recreational vehicles, commercial vehicles and bodywork. @en
note: Cette activité intègre donc la filière complète, y compris moteurs et organes mécaniques en amont, dès lors qu'ils sont principalement destinés à des véhicules automobiles. La construction automobile mêle étroitement des producteurs intégrés, des concepteurs, des assembleurs, des donneurs d'ordre et des sous-traitants, ainsi que des prestataires de services d'aménagement de véhicules automobiles.
note: This activity therefore covers the whole sector, including upstream manufacture of engines and mechanical parts providing they are destined for motor vehicles. Manufacture of motor vehicles closely combines integrated producers, designers, assemblers, prescribers and subcontractors, as well as motor vehicle fitting service providers. @en
preferred label: Automotive industry @en

Biologie
type: DomaineConcept
type: ConceptScheme
has part: concept-SD-biologie-bacteriologie
has part: concept-SD-biologie-biochimie-et-biologie-moleculaire
has part: concept-SD-biologie-bioinformatique
has part: concept-SD-biologie-biologie-cellulaire
has part: concept-SD-biologie-biologie-du-developpement
has part: concept-SD-biologie-biologie-vegetale
has part: concept-SD-biologie-chimie-analytique
has part: concept-SD-biologie-genetique
has part: concept-SD-biologie-genie-genetique
has part: concept-SD-biologie-immunologie
has part: concept-SD-biologie-pharmacologie
has part: concept-SD-biologie-physiologie
has part: concept-SD-biologie-virologie
is part of: concepts
lien: https://en.wikipedia.org/wiki/Biology
lien: https://fr.wikipedia.org/wiki/Biologie
url source: http://www.cnrtl.fr/definition/biologie
definition: Biology refers to life science and the study of living beings. @en
definition: La biologie est la science de la vie et l'étude des êtres vivants.
preferred label: Biology @en

Chimie
type: DomaineConcept
type: ConceptScheme
has part: concept-SD-chimie-biochimie
has part: concept-SD-chimie-bioinformatique
has part: concept-SD-chimie-chimie-analytique
has part: concept-SD-chimie-chimie-industrielle
has part: concept-SD-chimie-chimie-inorganique
has part: concept-SD-chimie-chimie-macromoleculaire
has part: concept-SD-chimie-chimie-nucleaire
has part: concept-SD-chimie-chimie-organique
has part: concept-SD-chimie-chimie-pharmaceutique
has part: concept-SD-chimie-chimie-physique
has part: concept-SD-chimie-combustible
has part: concept-SD-chimie-cycle-du-combustible
has part: concept-SD-chimie-genie-chimique
has part: concept-SD-chimie-mecanique-quantique
has part: concept-SD-chimie-nomenclature
has part: concept-SD-chimie-photochimie
has part: concept-SD-chimie-polymeres
has part: concept-SD-chimie-spectroscopie
has part: concept-SD-chimie-stereochimie
has part: concept-SD-chimie-thermodynamique
has part: concept-SD-chimie-verre-et-ceramique
is part of: concepts
url source: https://fr.wikipedia.org/wiki/Industrie_chimique
url source: https://fr.wikipedia.org/wiki/Synth%C3%A8se_chimique
definition: Industry sector whose activity consists in the production of products by the means of a chain of controlled reactions. @en
definition: Secteur industriel dont l'activité consiste à fabriquer des produits par un enchaînement de réactions contrôlées.
preferred label: Chemistry @en

Combustibles solides
type: DomaineConcept
type: ConceptScheme
is part of: concepts
graphique: http://ec.europa.eu/eurostat/statistics-explained/index.php/Energy_production_and_imports
graphique: http://ec.europa.eu/eurostat/statistics-explained/index.php/Energy_production_and_imports/fr
url source: https://en.wikipedia.org/wiki/Fuel#Solid_fuel
definition: Les combustibles solides désignent l'ensemble des matières solides utilisées en tant que combustible afin de produire de l'énergie et fournir de la chaleur, généralement libérée par combustion.
definition: Solid fuel refers to various types of solid material that are used as fuel to produce energy and provide heating, usually released through combustion. @en
preferred label: Solid fuels @en

Communication
type: DomaineConcept
type: ConceptScheme
has part: concept-SD-communication-infographie
has part: concept-SD-communication-internet
has part: concept-SD-communication-operations
has part: concept-SD-communication-presse
has part: concept-SD-communication-publicite
is part of: concepts
graphique: http://ec.europa.eu/eurostat/statistics-explained/index.php/Information_and_communication_service_statistics_-_NACE_Rev._2
graphique: http://www.insee.fr/fr/themes/document.asp
url source: https://fr.wikipedia.org/wiki/Communication
definition: Communication is the sum of interactions with others that transmit some information. Thus, it also refers to all the means and techniques enabling the delivery of a message to a particular audience. @en
definition: La communication est l'ensemble des interactions avec autrui qui transmettent quelque information. Il s'agit donc aussi de l'ensemble des moyens et techniques permettant la diffusion d'un message auprès d'une certaine audience.

Culture
type: DomaineConcept
type: ConceptScheme
has part: concept-SD-culture-musees
has part: concept-SD-culture-patrimoine
is part of: concepts
graphique: http://www.insee.fr/fr/themes/document.asp#inter2
lien: https://en.wikipedia.org/wiki/Culture
url source: http://portal.unesco.org/fr/ev.php-URL_ID=13179&URL_DO=DO_TOPIC&URL_SECTION=201.html
definition: Culture, in its broadest meaning, is considered as all the distinctive, spiritual or material, intellectual and emotional features, that characterize a society or a social group. Besides arts and letters, it includes lifestyles, fundamental rights, value systems of the human being, traditions and beliefs. @en
definition: La culture, dans son sens le plus large, est considérée comme l'ensemble des traits distinctifs, spirituels et matériels, intellectuels et affectifs, qui caractérisent une société ou un groupe social. Elle englobe, outre les arts et les lettres, les modes de vie, les droits fondamentaux de l'être humain, les systèmes de valeurs, les traditions et les croyances.

Cycle
type: DomaineConcept
type: ConceptScheme
is part of: concepts

Défense
type: DomaineConcept
type: ConceptScheme
has part: concept-SD-defense-armement
has part: concept-SD-defense-cartographie
has part: concept-SD-defense-construction-navale
has part: concept-SD-defense-guerre-electronique
has part: concept-SD-defense-ingenierie-des-systemes
has part: concept-SD-defense-logistique
has part: concept-SD-defense-materiaux-energetiques
has part: concept-SD-defense-materiel
has part: concept-SD-defense-nucleaire
has part: concept-SD-defense-operations
has part: concept-SD-defense-renseignement
has part: concept-SD-defense-securite
has part: concept-SD-defense-sports-aeriens
has part: concept-SD-defense-strategie
has part: concept-SD-defense-transmissions
is part of: concepts
graphique: http://ec.europa.eu/eurostat/statistics-explained/index.php/Government_expenditure_on_defence
lien: https://en.wikipedia.org/wiki/Defense
lien: https://fr.wikipedia.org/wiki/Defense
url source: http://www.vie-publique.fr/politiques-publiques/politique-defense/organisation-defense-nationale/
definition: Defence aims at ensuring at all times and in all circumstances and against any form of agression, the security and integrity of the territory, as well as the lives of the population. @en
definition: La défense a pour objet d’assurer en tout temps, en toutes circonstances et contre toutes les formes d’agression, la sécurité et l’intégrité du territoire, ainsi que la vie de la population.
preferred label: Defence @en

Droit
type: DomaineConcept
type: ConceptScheme
has part: concept-SD-droit-droit-de-la-famille
has part: concept-SD-droit-droit-des-entreprises
has part: concept-SD-droit-droit-international
has part: concept-SD-droit-internet
has part: concept-SD-droit-patrimoine
has part: concept-SD-droit-police-technique
has part: concept-SD-droit-propriete-intellectuelle
is part of: concepts
url source: http://www.dictionnaire-juridique.com/definition/droit.php
definition: Law refers to the set of interpretative provisions or guidelines which, at a specific time and in a particular state, settle the status of individuals and goods, as well as the way legal or natural persons interact with each other. @en
definition: Le Droit, est l'ensemble des dispositions interprétatives ou directives qui à un moment et dans un État déterminés, règlent le statut des personnes et des biens, ainsi que les rapports que les personnes publiques ou privées entretiennent.
preferred label: Law @en

Économie et gestion d'entreprise
type: DomaineConcept
type: ConceptScheme
has part: concept-SD-economie-et-gestion-d-entreprise-comptabilite
has part: concept-SD-economie-et-gestion-d-entreprise-cooperation-et-developpement
has part: concept-SD-economie-et-gestion-d-entreprise-fiscalite
has part: concept-SD-economie-et-gestion-d-entreprise-publicite
is part of: concepts
graphique: http://ec.europa.eu/eurostat/statistics-explained/index.php/Structural_business_statistics_overview
graphique: http://ec.europa.eu/eurostat/statistics-explained/index.php/Structural_business_statistics_overview/fr
lien: http://www.anc.gouv.fr/files/live/sites/anc/files/contributed/ANC/1.%20Normes%20fran%C3%A7aises/Recueils/PCG_Janvier2016/PCG%20JANVIER%202016.pdf
url source: https://fr.wikipedia.org/wiki/Gestion_d%27entreprise
definition: Business management is, according to the French General Accounting Plan, the implementation of the company's resources in order to achieve the pre-agreed goals (turnover, market shares) within the framework of a particular policy. @en
definition: La gestion d'entreprise est, d’après le Plan comptable général, la mise en œuvre des ressources de l’entreprise en vue d’atteindre les objectifs préalablement fixés (chiffre d’affaires, parts de marché, etc.) dans le cadre d’une politique déterminée.
preferred label: Economics and business management @en

Économie générale
type: DomaineConcept
type: ConceptScheme
has part: Industrie
has part: concept-SD-economie-generale-comptabilite
has part: concept-SD-economie-generale-cooperation-et-developpement
has part: concept-SD-economie-generale-economie-agricole
has part: concept-SD-economie-generale-fiscalite
is part of: concepts
url source: http://www.economie-generale.com/
definition: L'économie générale a pour objectif principal de faire le lien entre les diverses constantes macroéconomiques et le raisonnement économique.
definition: The principal objective of general economy is to link the various macroeconomic constants to the economic rationale. @en
preferred label: General economy @en

Édition et livre
type: DomaineConcept
type: ConceptScheme
has part: concept-SD-edition-et-livre-photographie
has part: concept-SD-edition-et-livre-presse
has part: concept-SD-edition-et-livre-television
is part of: concepts
graphique: http://ec.europa.eu/eurostat/statistics-explained/index.php/Publishing_activities_statistics_-_NACE_Rev._2
graphique: http://www.insee.fr/fr/themes/document.asp#graph1
url source: https://fr.wikipedia.org/wiki/%C3%89dition_%28activit%C3%A9%29
definition: L'édition consiste à présenter, reproduire, puis commercialiser la production intellectuelle d'un auteur. Éditer, au sens large, recouvre toutes formes de textes: littéraire, scientifique, partition musicale, code informatique, image, etc. Le support final est aujourd'hui multimédia, et non plus seulement papier.
definition: Publishing is the process of presenting, reproducing, then marketing an author's intellectual production. In a broader sense, publishing includes different types of texts: literary, scientific, musical score, computer code, image, etc. The ultimate medium today is no longer paper alone but multimedia. @en
preferred label: Publishing and books @en

Éducation
type: DomaineConcept
type: ConceptScheme
is part of: concepts
graphique: http://ec.europa.eu/eurostat/web/education-and-training
url source: https://fr.wikipedia.org/wiki/%C3%89ducation
definition: Education most commonly refers to the learning and acquisition of physical, psychological and intellectual skills, and the means and results of this development activity. Human education includes cultural skills and items characteristic of the geographical location and historical period. @en
definition: L'éducation signifie plus couramment l'apprentissage et le développement des facultés physiques, psychiques et intellectuelles, les moyens et les résultats de cette activité de développement. L'éducation humaine inclut des compétences et des éléments culturels caractéristiques du lieu géographique et de la période historique.
preferred label: Education @en

Électricité
type: DomaineConcept
type: ConceptScheme
is part of: Énergie
is part of: concepts
graphique: http://ec.europa.eu/eurostat/tgm/table.do
lien: https://en.wikipedia.org/wiki/Electricity
lien: https://fr.wikipedia.org/wiki/electricite
url source: http://encyclopedie-electricite.edf.com/electricite/definition.html
definition: Electricity is an energy-related phenomenon associated with the mobility or rest of positively or negatively charged particles. @en
definition: L'électricité est un phénomène énergétique associé à la mobilité ou au repos de particules chargées positivement ou négativement.
preferred label: Electricity @en

Électromécanique
type: DomaineConcept
type: ConceptScheme
is part of: concepts
url source: https://fr.wikipedia.org/wiki/%C3%89lectrom%C3%A9canique#cite_note-1
definition: Electromechanics,also called electrotechnics, is the combination of electrical and mechanical technologies. @en
definition: L'électromécanique, aussi appelée électrotechnique,est l'association des technologies de l'électricité et de la mécanique.
preferred label: Electromechanics @en

Électronique
type: DomaineConcept
type: ConceptScheme
has part: concept-SD-electronique-composants
has part: concept-SD-electronique-composants-electroniques
has part: concept-SD-electronique-radiocommunications
has part: concept-SD-electronique-techniques
is part of: concepts
url source: https://fr.wikipedia.org/wiki/%C3%89lectronique#D.C3.A9finition
definition: Electronics is a technical science, or engineering science, representing one of the most significant branches of applied physics, which studies and designs the structures making processing of electric signals, that is to say, electric currents or voltages, carriers of information. @en
definition: L’électronique est une science technique, ou science de l’ingénieur, constituant l'une des branches les plus importantes de la physique appliquée, qui étudie et conçoit les structures effectuant des traitements de signaux électriques, c'est-à-dire de courants ou de tensions électriques, porteurs d’informations.
preferred label: Electronics @en

Emploi et travail
type: DomaineConcept
type: ConceptScheme
is part of: concepts
graphique: http://ec.europa.eu/eurostat/statistics-explained/index.php/Employment_statistics
graphique: http://ec.europa.eu/eurostat/statistics-explained/index.php/Employment_statistics/fr
url source: https://fr.wikipedia.org/wiki/Travail
definition: Au sens économique usuel, le travail est l'activité rémunérée qui permet la production de biens et services . Avec le capital, c'est un facteur de production de l'économie. Il est essentiellement fourni par des employés en échange d'un salaire. Le processus d'entrée et de sortie de l'emploi se fait par le marché du travail.
definition: In the usual economic sense, work is the remunerated activity which allows the production of goods and services. It constitutes together with capital, a productive factor of the economy. It is mainly provided by employees in exchange of a salary. The hiring and retiring process is done via the labour market. @en
preferred label: Employment and work @en

Énergie
type: DomaineConcept
type: ConceptScheme
has part: Électricité
has part: concept-SD-energie-combustibles-solides
has part: concept-SD-energie-electricite
has part: concept-SD-energie-exploitation-des-reacteurs
has part: concept-SD-energie-fission
has part: concept-SD-energie-materiaux-de-construction
has part: concept-SD-energie-production
has part: concept-SD-energie-raffinage
has part: concept-SD-energie-thermique
is part of: concepts
graphique: http://ec.europa.eu/eurostat/statistics-explained/index.php/Consumption_of_energy
graphique: http://ec.europa.eu/eurostat/statistics-explained/index.php/Consumption_of_energy/fr
graphique: http://ec.europa.eu/eurostat/statistics-explained/index.php/Renewable_energy_statistics
graphique: http://ec.europa.eu/eurostat/statistics-explained/index.php/Renewable_energy_statistics/fr
lien: https://fr.wikipedia.org/wiki/%C3%89nergie#.C3.89tymologie_et_d.C3.A9finitions
url source: https://www.insee.fr/fr/metadonnees/definition/c1400
definition: Ces industries correspondent au code EG de la NES, nomenclature de synthèse qui a disparu avec le passage à la NAF Rév. 2 : - production de combustibles et de carburants (extraction de houille, de lignite et de tourbe, extraction d'hydrocarbures, extraction de minerais d'uranium, cokéfaction et industrie nucléaire, - eau, gaz, électricité (production et distribution d'électricité, de gaz et de chaleur, captage, traitement et distribution d'eau).
definition: These industries correspond to code EG of the NES classification, the summary economic classification which was in use until december 2007 : - production of fuels (extraction of fossil coal, lignite and peat, extraction of hydrocarbons, extraction of uranium ore, coking and nuclear industry, petroleum refining) ; - water, gas, electricity (production and distribution of electricity, gas and heat, collection, treatment and distribution of water). @en
note: Il n'y a pas de regroupement équivalent dans la NA qui a remplacé la NES depuis 2008. Le contour précis de l'énergie dans chaque opération statistique est donné par la liste des items retenus dans la nomenclature économique à laquelle cette opération se réfère.
note: There is no such grouping in NA, the agregated economic classification which replaced NES since 2008. The precise perimeter of energy in each statistical operation is given by the list of the items taken into account in the economic classification to which the operation refers. @en
preferred label: Energy @en

Enseignement supérieur
type: DomaineConcept
type: ConceptScheme
is part of: concepts
graphique: http://ec.europa.eu/eurostat/statistics-explained/index.php/Tertiary_education_statistics
graphique: http://ec.europa.eu/eurostat/statistics-explained/index.php/Tertiary_education_statistics/fr
lien: https://en.wikipedia.org/wiki/Higher_education
lien: https://fr.wikipedia.org/wiki/etudes_superieures
url source: http://www.insee.fr/fr/methodes/default.asp
definition: Higher education comprises education provided in universities, University Institutes of Technology (IUT) , Teacher Training Institutes, sections for higher technicians (STS), The Classes Préparatoires aux Grandes Ecoles, engineering schools, business, management, sales and accounting schools, paramedical and social schools, etc. @en
definition: L'enseignement supérieur regroupe l'enseignement dispensé dans les universités, les instituts universitaires de technologie , les instituts universitaires de formation des maîtres , les sections de techniciens supérieurs , les classes préparatoires aux grandes écoles , les écoles d'ingénieurs, les écoles de commerce, gestion, vente et comptabilité, les écoles paramédicales et sociales, etc.
preferred label: Higher education @en

Environnement
type: DomaineConcept
type: ConceptScheme
has part: concept-SD-environnement-amenagement-du-territoire
has part: concept-SD-environnement-dechets
has part: concept-SD-environnement-electricite
has part: concept-SD-environnement-fiscalite
has part: concept-SD-environnement-hydrologie
has part: concept-SD-environnement-oceanographie
has part: concept-SD-environnement-polymeres
has part: concept-SD-environnement-risques
is part of: concepts
graphique: http://ec.europa.eu/eurostat/statistics-explained/index.php/Environmental_protection_expenditure
graphique: http://ec.europa.eu/eurostat/statistics-explained/index.php/Environmental_protection_expenditure/fr
url source: https://fr.wikipedia.org/wiki/Environnement#cite_note-2
definition: L'environnement est défini comme l'ensemble des conditions naturelles (physiques, chimiques,biologiques) et culturelles (sociologiques) susceptibles d’agir sur les organismes vivants et les activités humaines.
definition: The environnement is defined as all the natural (physical, chemical, biological) and cultural (sociological) conditions that are likely to have an impact on living organisms and human activities. @en
preferred label: Environment @en

Finance
type: DomaineConcept
type: ConceptScheme
has part: concept-SD-finance-comptabilite
has part: concept-SD-finance-economie-du-petrole-et-du-gaz
has part: concept-SD-finance-fiscalite
has part: concept-SD-finance-internet
has part: concept-SD-finance-transport-maritime
is part of: concepts
lien: https://en.wikipedia.org/wiki/Finance
lien: https://fr.wikipedia.org/wiki/Finance
definition: Dans une compréhension large, la finance est l'ensemble des activités qui rendent possible et organisent le financement des agents économiques ayant des besoins de capitaux (comme par exemple les entreprises ou les états) par les agents ayant des surplus (typiquement les ménages épargnants).
definition: In its most general sense, finance is the set of activities which allow and organize the funding of those economic operators with capital requirements (such as companies or states) by other operators with surpluses (typically household savers). @en

Forêt
type: DomaineConcept
type: ConceptScheme
has part: concept-SD-foret-sylviculture
is part of: concepts
graphique: http://ec.europa.eu/eurostat/statistics-explained/index.php/Forestry_statistics_in_detail
lien: https://en.wikipedia.org/wiki/Forest
lien: https://fr.wikipedia.org/wiki/For%C3%AAt#D.C3.A9bat_sur_la_d.C3.A9finition
url source: http://www.fao.org/docrep/005/y2328f/y2328f24.htm#TopOfPage
definition: Land with tree crown cover (or equivalent stocking level) of more than 10 percent and area of more than 0.5 hectares (ha). The trees should be able to reach a minimum height of 5 meters (m) at maturity in situ. @en
definition: Terres portant un couvert arboré (ou un niveau équivalent de matériel sur pied) supérieur à 10 pour cent et une superficie de plus de 0,5 hectare (ha). Les arbres devraient pouvoir atteindre une hauteur minimale de 5 mètres (m) à maturité in situ.
preferred label: Forest @en

Formation
type: DomaineConcept
type: ConceptScheme
is part of: concepts
graphique: http://ec.europa.eu/eurostat/statistics-explained/index.php/Lifelong_learning_statistics/fr
graphique: http://ec.europa.eu/eurostat/tgm/table.do
lien: https://fr.wikipedia.org/wiki/Formation_professionnelle
url source: http://www.insee.fr/fr/methodes/default.asp
definition: Continuing training has been a legal obligation since 1971. Its purpose is to ensure that salaried employees, workers and job-seekers receive training intended to confirm, improve or add to their professional skills. According to Article L6111-1 of the Employment Code, “continuing training throughout life is a national obligation. It includes an initial training, and subsequent training periods aimed at adults and young people already in the working world or just starting out. These further training arrangements represent continuing professional education.” @en
definition: La formation continue est une obligation légale depuis 1971. Elle a pour but d'assurer aux salariés, employés ou demandeurs d'emploi, une formation destinée à conforter, améliorer ou acquérir des connaissances professionnelles. Selon l'article L6111-1 du Code du travail, "la formation professionnelle tout au long de la vie constitue une obligation nationale. Elle comporte une formation initiale et des formations ultérieures destinées aux adultes et aux jeunes déjà engagés dans la vie active ou qui s'y engagent. Ces formations ultérieures constituent la formation professionnelle continue".
preferred label: Training @en

Habillement et mode
type: DomaineConcept
type: ConceptScheme
has part: concept-SD-habillement-et-mode-sports-nautiques
is part of: concepts
url source: https://en.wikipedia.org/wiki/Fashion
url source: https://fr.wikipedia.org/wiki/Mode_(habillement)
definition: Fashion clothing consists in a distinctive and often constant trend in the style in which people present themselves in a given region. It is a phenomenon in which the society and its codes and preferences are taken into account as well as an individual own preferences. @en
definition: La mode vestimentaire, désigne la manière de se vêtir, conformément au goût d'une époque dans une région donnée. C'est un phénomène impliquant le collectif via la société, le regard qu'elle renvoie, les codes qu'elle impose et le goût individuel.
note: Fashion is one of the most powerful industries in the world with 6% of the global consumption of goods and an ever increasing growth. @en
note: La mode est l'une des plus puissantes industries du monde : elle représente 6 % de la consommation mondiale et est en croissance constante.
preferred label: Clothing fashion @en

Habitat et construction
type: DomaineConcept
type: ConceptScheme
has part: concept-SD-habitat-et-construction-architecture
has part: concept-SD-habitat-et-construction-engins
has part: concept-SD-habitat-et-construction-materiaux-de-construction
has part: concept-SD-habitat-et-construction-materiel-agricole-et-forestier
has part: concept-SD-habitat-et-construction-services
is part of: concepts
url source: https://en.wikipedia.org/wiki/Construction
url source: https://fr.wikipedia.org/wiki/Construction
definition: Construction is the process of constructing a building or infrastructure. Construction typically takes place on location for a known client. @en
definition: La construction est le processus de fabrication d'un bâtiment ou d'une infrastructure à un emplacement donné pour un client donné.
note: Construction as an industry comprises six to nine percent of the gross domestic product of developed countries. Construction starts with planning, design, and financing; it continues until the project is built and ready for use. @en
note: L'industrie du bâtiment constitue entre 6 et 9% du PIB des pays développés. La construction commence par la planification, la conception et le financement et continue jusqu'à ce que le projet soit construit et prêt à l'emploi.
preferred label: Housing and construction @en

Hydraulique
type: DomaineConcept
type: ConceptScheme
has part: concept-SD-hydraulique-drainage-agricole
has part: concept-SD-hydraulique-hydrogeologie
has part: concept-SD-hydraulique-physique-du-sol
is part of: concepts
graphique: http://ec.europa.eu/eurostat/statistics-explained/index.php/Renewable_energy_statistics
graphique: http://ec.europa.eu/eurostat/statistics-explained/index.php/Renewable_energy_statistics/fr
lien: https://en.wikipedia.org/wiki/Hydraulics
lien: https://fr.wikipedia.org/wiki/Hydraulique
url source: http://www.cnrtl.fr/lexicographie/hydraulique
definition: Branch of physics which studies the flow of liquids and the mechanical problems caused by the use of water. @en
definition: Branche de la physique qui a pour objet l'étude de l'écoulement des liquides et des problèmes mécaniques posés par l'utilisation de l'eau.
preferred label: Hydraulics @en

Industrie
type: DomaineConcept
type: ConceptScheme
has part: concept-SD-industrie-armement
has part: concept-SD-industrie-risques
has part: concept-SD-industrie-securite
is part of: Économie générale
is part of: concepts
graphique: http://ec.europa.eu/eurostat/statistics-explained/index.php/Industrial_production_statistics
graphique: http://ec.europa.eu/eurostat/statistics-explained/index.php/Industrial_production_statistics/fr
lien: https://fr.wikipedia.org/wiki/Portail:Industrie
url source: http://www.insee.fr/fr/methodes/default.asp
definition: At first approximation, the economic activities that combine production factors ( facilities, supplies, work, knowledge) in order to produce material goods aimed at the market, are considered to be part of the industry. @en
definition: En première approximation, relèvent de l'industrie les activités économiques qui combinent des facteurs de production (installations,approvisionnements, travail, savoir) pour produire des biens matériels destinés au marché.
preferred label: Industry @en

Informatique
type: DomaineConcept
type: ConceptScheme
has part: concept-SD-informatique-architecture
has part: concept-SD-informatique-composants-electroniques
has part: concept-SD-informatique-droit-international
has part: concept-SD-informatique-informatique-quantique
has part: concept-SD-informatique-internet
has part: concept-SD-informatique-mecanique-quantique
has part: concept-SD-informatique-operations
has part: concept-SD-informatique-physique-quantique
has part: concept-SD-informatique-presse
has part: concept-SD-informatique-publicite
has part: concept-SD-informatique-radiocommunications
has part: concept-SD-informatique-reseaux
has part: concept-SD-informatique-sociologie
has part: concept-SD-informatique-techniques
is part of: concepts
graphique: http://ec.europa.eu/eurostat/statistics-explained/index.php/Digital_economy_and_society_statistics_-_enterprises
graphique: http://ec.europa.eu/eurostat/statistics-explained/index.php/Digital_economy_and_society_statistics_-_enterprises/fr
url source: https://fr.wikipedia.org/wiki/Informatique
definition: Computer science is the field of scientific, technical and industrial activity which deals with the automatic processing of information through the implementation of computer programmes by machines: embedded systems, computers, robots, automatons, etc. @en
definition: L'informatique est un domaine d'activité scientifique, technique et industriel concernant le traitement automatique de l'information par l'exécution de programmes informatiques par des machines : des systèmes embarqués, des ordinateurs, des robots, des automates, etc.
preferred label: Computer science @en

Ingénierie nucléaire
type: DomaineConcept
type: ConceptScheme
has part: concept-SD-ingenierie-nucleaire-cycle-du-combustible
has part: concept-SD-ingenierie-nucleaire-deconstruction
has part: concept-SD-ingenierie-nucleaire-exploitation-des-reacteurs
has part: concept-SD-ingenierie-nucleaire-fission
has part: concept-SD-ingenierie-nucleaire-fusion
has part: concept-SD-ingenierie-nucleaire-physique-des-reacteurs
has part: concept-SD-ingenierie-nucleaire-radioprotection
has part: concept-SD-ingenierie-nucleaire-reglementation-nucleaire
has part: concept-SD-ingenierie-nucleaire-securite-nucleaire
has part: concept-SD-ingenierie-nucleaire-technologie-des-reacteurs
is part of: concepts
url source: https://www.connaissancedesenergies.org/fiche-pedagogique/industrie-de-l-energie-nucleaire
definition: L’industrie nucléaire rassemble les activités fournissant les équipements et tous les services nécessaires à la construction, à l’alimentation et à l’exploitation des centrales nucléaires productrices d’électricité.
definition: Nuclear industry is the set of activities which provide the equipment and all the necessary services to the construction, feeding, and operation of a nuclear power plant. @en
note: L’utilisation de l’énergie nucléaire mobilise un ensemble complexe d’industries et fédère de multiples sous-traitants maîtrisant des technologies très diverses. Il s’agit d’une part de construire et de maintenir en bon état des centrales de production d’énergie et d’autre part de fournir les éléments combustibles qui permettront les réactions nucléaires et in fine la production d'électricité au sein de ces centrales. Ces dernières activités, regroupées sous le vocable « cycle du combustible », vont de l’extraction de la matière première, l’uranium, jusqu’au traitement des éléments usés et au stockage des déchets ultimes. S'y ajoutent les opérations de démantèlement des installations obsolètes ou inutilisées.
note: The use of nuclear power mobilises a complex set of industries and rallies a large number of subcontractors who master various technologies. On the one hand, the construction and maintenance of the power plants, and on the other hand the supply of the nuclear fuel which enables nuclear reactions and ultimately energy production. These activities, known as the "fuel cycle", begin from the mining of the raw material, uranium, to the final waste conditioning. It also includes the dismantling of obsolete or unused plants. @en
preferred label: Nuclear engineering @en

Littérature
type: DomaineConcept
type: ConceptScheme
is part of: concepts
graphique: http://www.bnf.fr/fr/professionnels/anx_depot_legal/a.stats_biblio_livres.html
url source: https://fr.wikipedia.org/wiki/Litt%C3%A9rature
definition: Ensemble des œuvres écrites ou orales comportant une dimension esthétique ou activité participant à leur élaboration.
definition: The set of written or oral productions with an aesthetic dimension or the activity participating in their preparation. @en
preferred label: Literature @en

Loisirs
type: DomaineConcept
type: ConceptScheme
is part of: concepts
graphique: http://ec.europa.eu/eurostat/statistics-explained/index.php/Government_expenditure_on_recreation,_culture_and_religion @en
url source: https://fr.wikipedia.org/wiki/Loisir
definition: Le loisir est l'activité que l'on effectue durant le temps libre dont on peut disposer. Ce temps libre s'oppose au temps prescrit, c'est-à-dire contraint par les occupations habituelles (emploi, activités domestiques, éducation des enfants...) ou les servitudes qu’elles imposent (transport, par exemple).
definition: Recreation is an activity of leisure, leisure being discretionary time. This free time is opposed to prescribed time, that is to say the time limited by normal daily routine (job, domestic activities, children education...) or the easements it requires. ( transportation for example). @en
preferred label: Recreation @en

Marine
type: DomaineConcept
type: ConceptScheme
has part: concept-SD-marine-construction-navale
has part: concept-SD-marine-fission
has part: concept-SD-marine-forage
has part: concept-SD-marine-manutention
has part: concept-SD-marine-technologie-des-reacteurs
is part of: concepts
graphique: http://ec.europa.eu/eurostat/statistics-explained/index.php/Maritime_economy_statistics_-_coastal_regions_and_sectoral_perspective
url source: https://fr.wikipedia.org/wiki/Marine
definition: La marine désigne l'ensemble des moyens (personnel et navires) qui relèvent de l'activité maritime, c'est-à-dire relative à la mer et aux déplacements sur l'eau.
definition: The navy refers to all the means (staff and vessels) that are part of the maritime activity, that is to say relating to the sea and to the movements on the water. @en
preferred label: Navy @en

Matériaux
type: DomaineConcept
type: ConceptScheme
has part: concept-SD-materiaux-ceramique
has part: concept-SD-materiaux-chimie-pharmaceutique
has part: concept-SD-materiaux-chimie-physique
has part: concept-SD-materiaux-metallurgie
has part: concept-SD-materiaux-polymeres
has part: concept-SD-materiaux-thermodynamique
has part: concept-SD-materiaux-verre-et-ceramique
is part of: concepts
graphique: http://www.insee.fr/fr/themes/detail.asp
url source: http://www.cnrtl.fr/lexicographie/mat%C3%A9riau
url source: https://en.wikipedia.org/wiki/Material
definition: Type de matière qui entre dans la construction d'un objet fabriqué.
definition: Type of matter used to manufacture objects. @en
note: D'un point de vue scientifique, un matériau désigne toute matière non vivante, qu'elle soit d'origine naturelle ou artificielle. Les matériaux sont classés selon leur propriétés physiques, chimiques, géologiques, et dans certains cas, biologiques. La science des matériaux est chargée de leur étude. D'un point de vue industriel, les matériaux sont considérés comme intrants dans des processus de production ou de fabrication. Ce sont souvent des matières premières ; toutefois, ils sont parfois traités avant d'être utilisés dans des processus de production avancés. Les différents types de matériaux sont : - les biomatériaux, d'origine biologique ; - les matériaux composites, constitués de plusieurs matériaux aux propriétés physiques différentes ; - les textiles, parfois appelés "matériaux".
note: In the scientific sense, materials are any non-living matter, whether natural or man-made. They are given a classification based on the different properties defined as physical, chemical, geological, and in some cases, biological. Materials are studied in materials science. In the industrial sense, materials are inputs to production or manufacturing processes. They are often raw, but are sometimes processed before being used in more advanced production processes. Types of materials include : - biomaterial, of biological origin ; - composite material, composed of multiple materials with differing physical properties ; - textiles, sometimes referred to as "material". @en
preferred label: Materials @en

Mathématiques
type: DomaineConcept
type: ConceptScheme
has part: concept-SD-mathematiques-mathematiques-appliquees
is part of: concepts
url source: https://fr.wikipedia.org/wiki/Math%C3%A9matiques
definition: Les mathématiques sont un ensemble de connaissances abstraites résultant de raisonnements logiques appliqués à des objets divers tels que les nombres,les figures, les structures et les transformations. Les mathématiques sont aussi le domaine de recherche développant ces connaissances, ainsi que la discipline qui les enseigne.
definition: Mathematics is a set of abstract forms of knowledge which arise out of logical arguments applied to various objects such as numbers, figures,structures and transformations. Mathematics is also the research area developing these forms of knowledge, as well as the discipline that teaches them. @en
preferred label: Mathematics @en

Mécanique des fluides
type: DomaineConcept
type: ConceptScheme
is part of: concepts
url source: https://fr.wikipedia.org/wiki/M%C3%A9canique_des_fluides
definition: Fluid mechanics is the study of fluid behaviour and associated internal forces. It is a branch of continuum mechanics modelling the material with the help of particles which are, at the same time, small enough to be considered part of mathematical analysis, and big enough by comparison with the molecules, to be described by continuous functions. @en
definition: La mécanique des fluides est l’étude du comportement des fluides et des forces internes associées. C’est une branche de la mécanique des milieux continus qui modélise la matière à l’aide de particules assez petites pour relever de l’analyse mathématique mais assez grandes par rapport aux molécules pour être décrites par des fonctions continues.
preferred label: Fluid mechanics @en

Météorologie
type: DomaineConcept
type: ConceptScheme
is part of: concepts
graphique: http://ec.europa.eu/eurostat/statistics-explained/index.php/Europe_2020_indicators_-_climate_change_and_energy
url source: https://fr.wikipedia.org/wiki/M%C3%A9t%C3%A9orologie
definition: La météorologie est une science qui a pour objet l'étude des phénomènes atmosphériques tels que les nuages, les précipitations ou le vent dans le but de comprendre comment ils se forment et évoluent en fonction des paramètres mesurés tels que la pression, la température et l'humidité.
definition: Meteorology is the science that studies atmospheric phenomena such as clouds, rainfalls or wind in order to understand how they form and develop according to measured parameters such as pressure, temperature and humidity. @en
preferred label: Meteorology @en

Métrologie
type: DomaineConcept
type: ConceptScheme
is part of: concepts
url source: https://fr.wikipedia.org/wiki/M%C3%A9trologie#cite_note-2
definition: La métrologie est la science des mesurages et ses applications; elle comprend tous les aspects théoriques et pratiques des mesurages, quels que soient l'incertitude de mesure et le domaine d'application.
definition: Metrology is the science of measurements and its applications: it includes all theoretical and practical aspects of measurements, regardless the uncertainty of measurement and the field of application. @en
preferred label: Metrology @en

Moteur thermique
type: DomaineConcept
type: ConceptScheme
has part: concept-SD-moteur-thermique-propulsion
is part of: concepts
url source: https://en.wikipedia.org/wiki/Heat_engine#cite_note-1
definition: En thermodynamique, un moteur thermique est un système qui transforme l'énergie thermique- et l'énergie chimique- en énergie mécanique, qui peut par la suite être utilisée pour faire du travail mécanique.
definition: In thermodynamics,a heat engine is a system that converts heat or thermal energy—and chemical energy-to mechanical energy, which can then be used to do mechanical work. @en
preferred label: Heat engine @en

Motocycle
type: DomaineConcept
type: ConceptScheme
has part: concept-SD-motocycle-sports-mecaniques
is part of: concepts

Motocycle et cycle
type: DomaineConcept
type: ConceptScheme
has part: concept-SD-motocycle-et-cycle-sports-mecaniques
is part of: concepts
graphique: http://www.insee.fr/fr/themes/detail.asp
url source: http://www.cnrtl.fr/lexicographie/motocycle
url source: https://fr.wiktionary.org/wiki/cycle#Nom_commun_2
definition: A motorcycle is a two-wheeled motor vehicle ( moped, motorcycle,scooter, motorbike). A cycle includes the category of bicycles, tricycles, monocycles which are either human powered only or have an assisted propulsion with a legally defined electric assistance. @en
definition: Un motocycle est un véhicule automoteur à deux roues(cyclomoteur, moto(cyclette), scooter, vélomoteur). Un cycle est la catégorie des bicyclettes,tricycles, unicycles à propulsion humaine exclusive, ou à propulsion assistée possédant une assistance électrique définie légalement.
preferred label: Motorcycle and cycle @en

Nucléaire
type: DomaineConcept
type: ConceptScheme
has part: concept-SD-nucleaire-combustible
has part: concept-SD-nucleaire-dechets
has part: concept-SD-nucleaire-fission
has part: concept-SD-nucleaire-fusion
is part of: concepts

Optique
type: DomaineConcept
type: ConceptScheme
is part of: concepts
graphique: http://www.insee.fr/fr/themes/document.asp
url source: https://fr.wikipedia.org/wiki/Optique
definition: L'optique est la branche de la physique qui traite de la lumière et de ses propriétés, du rayonnement électromagnétique, de la vision ainsi que les systèmes utilisant ou émettant de la lumière. Du fait de ses propriétés ondulatoires, le domaine de la lumière peut couvrir le lointain UV jusqu'au lointain IR en passant par les longueurs d'onde visibles.
definition: Optics is the branch of physics which deals with light and its properties, electromagnetic radiation, vision as well as the systems which use or release light. Owing to its wave nature, the field of light is able to cover a spectral range from the far UV to the far IR and including visible wavelengths. @en
preferred label: Optics @en

Pêche et aquaculture
type: DomaineConcept
type: ConceptScheme
has part: concept-SD-peche-et-aquaculture-peche-maritime
is part of: concepts
graphique: http://ec.europa.eu/eurostat/statistics-explained/index.php/Fishery_statistics
graphique: http://ec.europa.eu/eurostat/statistics-explained/index.php/Fishery_statistics/fr
url source: http://www.futura-sciences.com/magazines/nature/infos/dico/d/botanique-peche-7357/
url source: http://www.insee.fr/fr/methodes/default.asp
definition: Fishing is the activity which consists of taking aquatic species in the seas and oceans for food trade. Aquaculture is the set of crop cultivation and animal breeding activities whether in continental or sea water, with the aim of improving production, which implies the individual or lawful possession of the breeding stock. @en
definition: La pêche est l'activité consistant à prélever des espèces aquatiques dans les mers et océans afin d'en faire du commerce alimentaire. L'aquaculture est l'ensemble des activités de culture de plantes et d'élevage d'animaux en eau continentale ou marine en vue d'en améliorer la production, impliquant la possession individuelle ou juridique du stock en élevage.
preferred label: Fishing and aquaculture @en

Pétrole et gaz
type: DomaineConcept
type: ConceptScheme
has part: concept-SD-petrole-et-gaz-distribution
has part: concept-SD-petrole-et-gaz-economie-du-petrole-et-du-gaz
has part: concept-SD-petrole-et-gaz-exploration
has part: concept-SD-petrole-et-gaz-forage
has part: concept-SD-petrole-et-gaz-geologie
has part: concept-SD-petrole-et-gaz-geophysique
has part: concept-SD-petrole-et-gaz-ingenierie
has part: concept-SD-petrole-et-gaz-installations
has part: concept-SD-petrole-et-gaz-marches
has part: concept-SD-petrole-et-gaz-petrochimie
has part: concept-SD-petrole-et-gaz-production
has part: concept-SD-petrole-et-gaz-prospection
has part: concept-SD-petrole-et-gaz-raffinage
has part: concept-SD-petrole-et-gaz-transport
has part: concept-SD-petrole-et-gaz-transport-maritime
is part of: concepts
graphique: http://ec.europa.eu/eurostat/statistics-explained/index.php/Energy_production_and_imports
graphique: http://ec.europa.eu/eurostat/statistics-explained/index.php/Energy_production_and_imports/fr
url source: https://fr.wikipedia.org/wiki/Gaz
url source: https://fr.wikipedia.org/wiki/P%C3%A9trole
definition: Le pétrole est une roche liquide d'origine naturelle, une huile minérale composée d'une multitude de composés organiques, essentiellement des hydrocarbures, piégée dans des formations géologiques particulières. Un gaz est un ensemble d'atomes ou de molécules très faiblement liés et quasi indépendants.
definition: Oil is a liquid rock of natural origin, a mineral oil composed of a multitude of organic components, essentially hydrocarbures, trapped in particular geologic formations. A gas is a set of very weakly-bound and almost independent atoms or molecules. @en
preferred label: Oil and gas @en

Physique
type: DomaineConcept
type: ConceptScheme
has part: concept-SD-physique-geophysique
has part: concept-SD-physique-informatique-quantique
has part: concept-SD-physique-mathematiques-appliquees
has part: concept-SD-physique-mecanique-des-structures
has part: concept-SD-physique-mecanique-quantique
has part: concept-SD-physique-metrologie
has part: concept-SD-physique-physique-quantique
has part: concept-SD-physique-radiocommunications
has part: concept-SD-physique-thermodynamique
is part of: concepts
url source: https://fr.wikipedia.org/wiki/Physique
definition: La physique est la science qui tente de comprendre, de modéliser, voire d'expliquer les phénomènes naturels de l'univers. Elle correspond à l'étude du monde qui nous entoure sous toutes ses formes, des lois de sa variation et de son évolution.
definition: Physics is the science that tries to understand, model, or explain the natural phenomena of the universe. It studies the world around us in all its forms, the laws of its variation and evolution. @en
preferred label: Physics @en

Physique de l'atmosphère
type: DomaineConcept
type: ConceptScheme
has part: concept-SD-physique-de-l-atmosphere-geophysique
is part of: concepts
url source: https://fr.wikipedia.org/wiki/Physique_atmosph%C3%A9rique
definition: Atmospheric physics is the application of physics to the study of the atmosphere of the Earth and that of other planets. @en
definition: La physique atmosphérique est l'application de la physique à l'étude de l'atmosphère de la Terre et des autres planètes.
preferred label: Atmospheric physics @en

Politique
type: DomaineConcept
type: ConceptScheme
has part: concept-SD-politique-politique-internationale
is part of: concepts
graphique: http://ec.europa.eu/eurostat/statistics-explained/index.php/Quality_of_life_indicators_-_governance_and_basic_rights
url source: https://fr.wikipedia.org/wiki/Politique
definition: La politique concerne la structure et le fonctionnement (méthodique, théorique et pratique) d'une communauté, d'une société, d'un groupe social. La politique porte sur les actions, l’équilibre, le développement interne ou externe de cette société, ses rapports internes et ses rapports à d'autres ensembles. La politique est donc principalement ce qui a trait au collectif, à une somme d'individualités et/ou de multiplicités.
definition: Politics involves the structure and working (methodical, theoretical and practical) of a community, a society, a social group. Politics focuses on the society's actions,balance and internal or external development, its internal relations and its relations with other sets. Politics is thus mostly to do with the mass, the sum of individualities and/or multiplicities. @en
preferred label: Politics @en

Recherche
type: DomaineConcept
type: ConceptScheme
is part of: concepts
graphique: http://ec.europa.eu/eurostat/statistics-explained/index.php/Research_and_innovation_statistics_at_regional_level
graphique: http://ec.europa.eu/eurostat/statistics-explained/index.php/Research_and_innovation_statistics_at_regional_level/fr
lien: https://en.wikipedia.org/wiki/Research
lien: https://fr.wikipedia.org/wiki/Recherche
url source: http://www.cnrtl.fr/definition/recherche
definition: Activités intellectuelles, travaux ayant pour objet la découverte, l'invention, la progression des connaissances nouvelles.
definition: Intellectual activities and works aimed at the discovery, invention, advancement of new knowledge. @en
preferred label: Research @en

Relations internationales
type: DomaineConcept
type: ConceptScheme
has part: concept-SD-relations-internationales-cooperation-et-developpement
has part: concept-SD-relations-internationales-droit-international
has part: concept-SD-relations-internationales-negociations
is part of: concepts
url source: https://fr.wikipedia.org/wiki/Relations_internationales
definition: International relations generally refer to the study of foreign affairs and the major issues of the international system: the role of States, international organisations, non-governemental organisations (ONG) as well as multinational companies. @en
definition: Les relations internationales sont en général l'étude des affaires étrangères et des grandes questions du système international: rôle des États, des organisations internationales, des organisations non gouvernementales (ONG) ainsi que des entreprises multinationales.(...)
preferred label: International affairs @en
preferred label: International relations @en

Restauration
type: DomaineConcept
type: ConceptScheme
has part: concept-SD-restauration-transport-aerien
is part of: concepts
graphique: http://ec.europa.eu/eurostat/statistics-explained/index.php/Food_and_beverage_services_statistics_-_NACE_Rev._2
url source: http://academie-des-sciences-commerciales.org/dictionnaire_new/definition.php
definition: Ensemble des établissements où l'on sert des repas ou divers aliments.
definition: The facilities in which meals or various food products are served. @en
preferred label: Catering @en

Robotique
type: DomaineConcept
type: ConceptScheme
is part of: concepts
graphique: https://ec.europa.eu/digital-single-market/en/news/robots-more-europeans-know-them-more-they-them
url source: https://fr.wikipedia.org/wiki/Robotique
definition: La robotique est l'ensemble des techniques permettant la conception et la réalisation de machines automatiques ou de robots.
definition: Robotics refers to the set of techniques that enable the design and building of automatic machines or robots. @en
preferred label: Robotics @en

Santé animale
type: DomaineConcept
type: ConceptScheme
has part: concept-SD-sante-animale-elevage
has part: concept-SD-sante-animale-psychiatrie
is part of: concepts
graphique: http://www.ahi.org/about-animal-medicines/industry-statistics/
url source: https://fr.wikipedia.org/wiki/Sant%C3%A9_animale
definition: Animal health is a continual cause of worry both for breeders and veterinarians. It aims at securing a maximum of qualitative and quantitative productivity, while allowing the animals to remain as healthy as possible. @en
definition: La santé animale est un souci constant de la part des éleveurs et des vétérinaires. Elle cherche à assurer un maximum de productivité qualitative et quantitative, tout en maintenant les animaux dans le meilleur état de santé possible.
preferred label: Animal health @en

Santé et médecine
type: DomaineConcept
type: ConceptScheme
has part: concept-SD-sante-et-medecine-anatomie
has part: concept-SD-sante-et-medecine-anesthesiologie
has part: concept-SD-sante-et-medecine-bacteriologie
has part: concept-SD-sante-et-medecine-biochimie-et-biologie-moleculaire
has part: concept-SD-sante-et-medecine-biostatistique
has part: concept-SD-sante-et-medecine-chirurgie
has part: concept-SD-sante-et-medecine-endocrinologie
has part: concept-SD-sante-et-medecine-epidemiologie
has part: concept-SD-sante-et-medecine-essais-therapeutiques
has part: concept-SD-sante-et-medecine-genetique
has part: concept-SD-sante-et-medecine-gymnastique
has part: concept-SD-sante-et-medecine-handisport
has part: concept-SD-sante-et-medecine-hematologie
has part: concept-SD-sante-et-medecine-imagerie
has part: concept-SD-sante-et-medecine-immunologie
has part: concept-SD-sante-et-medecine-jeu-video
has part: concept-SD-sante-et-medecine-medecine-legale
has part: concept-SD-sante-et-medecine-neurologie
has part: concept-SD-sante-et-medecine-orthopedie
has part: concept-SD-sante-et-medecine-pharmacologie
has part: concept-SD-sante-et-medecine-physiologie
has part: concept-SD-sante-et-medecine-politique-agricole
has part: concept-SD-sante-et-medecine-psychiatrie
has part: concept-SD-sante-et-medecine-psychologie
has part: concept-SD-sante-et-medecine-psychotherapie
has part: concept-SD-sante-et-medecine-radioprotection
has part: concept-SD-sante-et-medecine-risques
has part: concept-SD-sante-et-medecine-toxicologie
has part: concept-SD-sante-et-medecine-virologie
is part of: concepts
graphique: http://ec.europa.eu/eurostat/statistics-explained/index.php/Healthcare_provision_statistics
graphique: http://ec.europa.eu/eurostat/statistics-explained/index.php/Healthcare_provision_statistics/fr
url source: http://www.cnrtl.fr/definition/medecine
url source: http://www.who.int/about/mission/fr/
definition: Health is a state of complete physical, mental, and social well-being and not merely the absence of disease or infirmity. Medecine is the science of disease studying,treatment and prevention. @en
definition: La santé est un état de complet bien-être physique, mental et social, et ne consiste pas seulement en une absence de maladie ou d'infirmité. La médecine est la science qui a pour objet l'étude, le traitement, la prévention des maladies.
preferred label: Health and medicine @en

Sciences
type: DomaineConcept
type: ConceptScheme
is part of: concepts
url source: https://fr.wikipedia.org/wiki/Science#cite_note-6
definition: Science is the clear and certain knowledge of something, based on either certain obvious principles and demonstrations, or on experimental reasoning, or also, on the analysis of societies and human facts. @en
definition: la science est la connaissance claire et certaine de quelque chose, fondée soit sur des principes évidents et des démonstrations, soit sur des raisonnements expérimentaux, ou encore sur l'analyse des sociétés et des faits humains.
preferred label: Science @en

Sciences de la nature
type: DomaineConcept
type: ConceptScheme
is part of: concepts
url source: https://en.wikipedia.org/wiki/Natural_science
definition: Les sciences de la nature sont une branche de la science qui décrit, prédit et cherche à comprendre les phénomènes naturels, fondée sur des preuves observationnelles et empiriques. La validité, la précision et les mécanismes sociaux garantissant le contrôle de la qualité, tel que l'examen par les pairs et la répétabilité des conclusions, font partie des critères et des méthodes employés à cet effet.
definition: Natural science is a branch of science concerned with the description, prediction, and understanding of natural phenomena, based on observational and empirical evidence. Validity, accuracy, and social mechanisms ensuring quality control, such as peer review and repeatability of findings, are amongst the criteria and methods used for this purpose. @en
preferred label: Natural sciences @en

Sciences de la Terre
type: DomaineConcept
type: ConceptScheme
has part: concept-SD-sciences-de-la-terre-astrophysique
has part: concept-SD-sciences-de-la-terre-geologie
has part: concept-SD-sciences-de-la-terre-geophysique
has part: concept-SD-sciences-de-la-terre-hydrogeologie
has part: concept-SD-sciences-de-la-terre-hydrologie
has part: concept-SD-sciences-de-la-terre-oceanographie
has part: concept-SD-sciences-de-la-terre-pedologie
has part: concept-SD-sciences-de-la-terre-physique-du-sol
is part of: concepts
url source: https://fr.wikipedia.org/wiki/Portail:Sciences_de_la_Terre_et_de_l%27Univers
definition: Earth sciences ( also known as geosciences) refer to the set of sciences involved in the study of planet Earth. They include various groups of sciences, each pertaining to one of the four ''spheres'' making up the Earth: the atmosphere, the hydrosphere, the litosphere and the biosphere. @en
definition: Les sciences de la Terre (aussi appelées géosciences) désignent l'ensemble des sciences dont les études sont relatives à la planète Terre. Elles se décomposent en divers groupes de sciences, chacun étant relatif à l'une des quatre sphères composant la Terre: l'atmosphère, l'hydrosphère,la lithosphère et la biosphère. (...)
preferred label: Earth sciences @en
preferred label: Geosciences @en

Sciences humaines
type: DomaineConcept
type: ConceptScheme
has part: concept-SD-sciences-humaines-cooperation-et-developpement
has part: concept-SD-sciences-humaines-droit-de-la-famille
has part: concept-SD-sciences-humaines-etude-du-langage
has part: concept-SD-sciences-humaines-internet
has part: concept-SD-sciences-humaines-sciences-sociales
has part: concept-SD-sciences-humaines-sociologie
is part of: concepts
url source: https://en.wikipedia.org/wiki/Human_science
definition: Human science is the study and interpretation of the experiences, activities, constructs, and artifacts associated with human beings. (...) @en
definition: Les sciences humaines désignent l'étude et l'interprétation des expériences, activités, conceptions, et objets qui ont un lien avec l'Homme.
preferred label: Human sciences @en

Social
type: DomaineConcept
type: ConceptScheme
is part of: concepts
graphique: http://ec.europa.eu/eurostat/statistics-explained/index.php/Social_inclusion_statistics
graphique: http://ec.europa.eu/eurostat/statistics-explained/index.php/Social_inclusion_statistics/fr
url source: https://en.wikipedia.org/wiki/Social
definition: Le terme social renvoie à une particularité des êtres vivants qui s'applique aux populations des êtres humains et des autres animaux. Il fait toujours référence à l'interaction d'organismes avec d'autres organismes et à leur coexistence collective, qu'ils en soient conscients ou non, et que cette interaction soit volontaire ou involontaire.
definition: The term social refers to a characteristic of living organisms as applied to populations of humans and other animals. It always refers to the interaction of organisms with other organisms and to their collective co-existence, irrespective of whether they are aware of it or not, and irrespective of whether the interaction is voluntary or involuntary. @en

Spatiologie
type: DomaineConcept
type: ConceptScheme
has part: concept-SD-spatiologie-astrophysique
has part: concept-SD-spatiologie-composants
has part: concept-SD-spatiologie-composants-electroniques
has part: concept-SD-spatiologie-construction-mecanique
has part: concept-SD-spatiologie-electromagnetisme
has part: concept-SD-spatiologie-equipements
has part: concept-SD-spatiologie-essais
has part: concept-SD-spatiologie-exploitation
has part: concept-SD-spatiologie-fiabilite
has part: concept-SD-spatiologie-geophysique
has part: concept-SD-spatiologie-guidage
has part: concept-SD-spatiologie-infrastructure-orbitale
has part: concept-SD-spatiologie-infrastructures
has part: concept-SD-spatiologie-localisation
has part: concept-SD-spatiologie-materiaux
has part: concept-SD-spatiologie-mecanique-celeste
has part: concept-SD-spatiologie-mecanique-des-structures
has part: concept-SD-spatiologie-mecanique-du-vol
has part: concept-SD-spatiologie-mecanique-spatiale
has part: concept-SD-spatiologie-medecine
has part: concept-SD-spatiologie-mesures
has part: concept-SD-spatiologie-metrologie
has part: concept-SD-spatiologie-moyens-d-essais
has part: concept-SD-spatiologie-moyens-de-lancement
has part: concept-SD-spatiologie-navigation
has part: concept-SD-spatiologie-operations
has part: concept-SD-spatiologie-photogrammetrie
has part: concept-SD-spatiologie-physiologie
has part: concept-SD-spatiologie-physique-optique
has part: concept-SD-spatiologie-pilotage
has part: concept-SD-spatiologie-planetologie
has part: concept-SD-spatiologie-propulsion
has part: concept-SD-spatiologie-pyrotechnie
has part: concept-SD-spatiologie-qualite
has part: concept-SD-spatiologie-radiocommunications
has part: concept-SD-spatiologie-securite
has part: concept-SD-spatiologie-stabilisation
has part: concept-SD-spatiologie-structures
has part: concept-SD-spatiologie-technologie-spatiale
has part: concept-SD-spatiologie-teledetection
has part: concept-SD-spatiologie-thermique
has part: concept-SD-spatiologie-traitement-d-image
has part: concept-SD-spatiologie-traitement-de-donnees
has part: concept-SD-spatiologie-vehicules-aerospatiaux
has part: concept-SD-spatiologie-vehicules-spatiaux
has part: concept-SD-spatiologie-vols-habites
is part of: concepts
url source: https://fr.wikipedia.org/wiki/Astronautique
definition: Astronautics is made up of the set of sciences and techniques aimed at sending in the extraterrestrial space a manned vehicle or not, to navigate outside the earth's atmosphere, and to operate spacecrafts. @en
definition: L'astronautique est constituée par l'ensemble des sciences et des techniques visant à envoyer dans l'espace extraterrestre un véhicule habité ou non, à naviguer à l'extérieur de l'atmosphère terrestre, et à exploiter des engins spatiaux.
preferred label: Space sciences and techniques @en

Sports
type: DomaineConcept
type: ConceptScheme
has part: concept-SD-sports-aeromodelisme
has part: concept-SD-sports-alpinisme
has part: concept-SD-sports-athletisme
has part: concept-SD-sports-ballon
has part: concept-SD-sports-basket-ball
has part: concept-SD-sports-boxe
has part: concept-SD-sports-chasse
has part: concept-SD-sports-course
has part: concept-SD-sports-danse
has part: concept-SD-sports-equitation
has part: concept-SD-sports-football
has part: concept-SD-sports-golf
has part: concept-SD-sports-gymnastique
has part: concept-SD-sports-handball
has part: concept-SD-sports-handisport
has part: concept-SD-sports-hockey-sur-glace
has part: concept-SD-sports-natation
has part: concept-SD-sports-oceanographie
has part: concept-SD-sports-patinage-sur-glace
has part: concept-SD-sports-plaisance
has part: concept-SD-sports-planche-a-voile
has part: concept-SD-sports-rugby
has part: concept-SD-sports-ski
has part: concept-SD-sports-ski-de-fond
has part: concept-SD-sports-sports-aeriens
has part: concept-SD-sports-sports-collectifs
has part: concept-SD-sports-sports-d-hiver
has part: concept-SD-sports-sports-de-boules
has part: concept-SD-sports-sports-de-combat
has part: concept-SD-sports-sports-de-competition
has part: concept-SD-sports-sports-de-glisse
has part: concept-SD-sports-sports-de-rue
has part: concept-SD-sports-sports-mecaniques
has part: concept-SD-sports-sports-nautiques
has part: concept-SD-sports-tennis
has part: concept-SD-sports-transport-maritime
has part: concept-SD-sports-voile
has part: concept-SD-sports-volley-ball
is part of: concepts
graphique: http://ec.europa.eu/eurostat/statistics-explained/index.php/Employment_in_sport
lien: https://en.wikipedia.org/wiki/Sport
lien: https://fr.wikipedia.org/wiki/Sport
url source: http://portal.unesco.org/education/fr/ev.php-URL_ID=2221&URL_DO=DO_TOPIC&URL_SECTION=201.html
definition: ''Sport'' means all forms of physical and sport activities that, through an organised participation or not, aim at expressing or improving the physical and mental condition, forming social relationships or obtaining results in competition at all levels. @en
definition: On entend par «sport» toutes formes d’activités physiques et sportives qui, à travers une participation organisée ou non, ont pour objectif l’expression ou l’amélioration de la condition physique et psychique, le développement des relations sociales ou l’obtention de résultats en compétition de tous niveaux.

Statistique
type: DomaineConcept
type: ConceptScheme
is part of: concepts
graphique: http://ec.europa.eu/eurostat/fr
url source: https://fr.wikipedia.org/wiki/Statistique#D.C3.A9finition
definition: La statistique est l'ensemble des méthodes qui ont pour objet la collecte, le traitement et l'interprétation de données d'observation relatives à un groupe d'individus ou d'unités.
definition: Statistics is the set of methods aiming at collecting, processing and interpreting observation data relating to a group of individuals or units. @en
preferred label: Statistics @en

Télécommunications
type: DomaineConcept
type: ConceptScheme
has part: concept-SD-telecommunications-informatique-quantique
has part: concept-SD-telecommunications-internet
has part: concept-SD-telecommunications-radiocommunications
has part: concept-SD-telecommunications-reseaux
has part: concept-SD-telecommunications-services
has part: concept-SD-telecommunications-techniques
has part: concept-SD-telecommunications-telephonie
has part: concept-SD-telecommunications-transport-ferroviaire
is part of: concepts
graphique: http://ec.europa.eu/eurostat/statistics-explained/index.php/Archive:Telecommunication_statistics
graphique: http://ec.europa.eu/eurostat/statistics-explained/index.php
url source: https://fr.wikipedia.org/wiki/T%C3%A9l%C3%A9communications#cite_note-3
definition: On entend par télécommunications toute transmission, émission et réception à distance, de signes, de signaux, d’écrits, d’images,de sons ou de renseignements de toutes natures, par fil électrique, radioélectricité, liaison optique, ou autres systèmes électromagnétiques.
definition: Telecommunication refers to any remote transmission, emission and reception of signs, signals, texts, images, sounds or recordings of different types, by electric wire, radioelectricity, optical link, or other electromagnetic systems. @en
preferred label: Telecommunication @en

Télédétection spatiale
type: DomaineConcept
type: ConceptScheme
has part: concept-SD-teledetection-spatiale-metrologie
has part: concept-SD-teledetection-spatiale-photogrammetrie
has part: concept-SD-teledetection-spatiale-physique-optique
has part: concept-SD-teledetection-spatiale-technologie-des-hyperfrequences
has part: concept-SD-teledetection-spatiale-traitement-d-image
has part: concept-SD-teledetection-spatiale-traitement-de-donnees
is part of: concepts
url source: http://www.culture.fr/franceterme/result
definition: Remote sensing in which data collection is based on instruments carried on space vehicles. @en
definition: Télédétection dans laquelle la saisie des données est faite à partir d'instruments embarqués sur des véhicules spatiaux.
preferred label: spaceborne remote sensing @en

Tourisme
type: DomaineConcept
type: ConceptScheme
has part: concept-SD-tourisme-alpinisme
has part: concept-SD-tourisme-plaisance
has part: concept-SD-tourisme-sports-d-hiver
has part: concept-SD-tourisme-sports-nautiques
has part: concept-SD-tourisme-transport-aerien
is part of: concepts
graphique: http://ec.europa.eu/eurostat/statistics-explained/index.php/Tourism_statistics
graphique: http://ec.europa.eu/eurostat/statistics-explained/index.php/Tourism_statistics/fr
lien: https://en.wikipedia.org/wiki/Tourism
lien: https://fr.wikipedia.org/wiki/Tourisme
url source: http://www.insee.fr/fr/methodes/default.asp
definition: Le tourisme comprend les activités déployées par les personnes au cours de leurs voyages et séjours dans des lieux situés en dehors de leur environnement habituel pour une période consécutive qui ne dépasse pas une année, à des fins de loisirs, pour affaires et autres motifs non liés à l'exercice d'une activité rémunérée dans le lieu visité.
definition: Tourism includes the activities of persons travelling to and staying in places outside their usual environment for not more than one consecutive year for leisure, business and other purposes that are not linked to the performance of a remunerated activity in the place being visited. @en
preferred label: Tourism @en

Tous domaines
type: DomaineConcept
type: ConceptScheme
is part of: concepts
definition: Concepts pouvant exister dans tous les domaines de spécialité.
definition: Notions that exist in all specialized fields. @en
preferred label: All fields @en

Transports et mobilité
type: DomaineConcept
type: ConceptScheme
has part: concept-SD-transports-et-mobilite-cartographie
has part: concept-SD-transports-et-mobilite-operations
has part: concept-SD-transports-et-mobilite-plaisance
has part: concept-SD-transports-et-mobilite-securite
has part: concept-SD-transports-et-mobilite-transport-aerien
has part: concept-SD-transports-et-mobilite-transport-de-marchandises
has part: concept-SD-transports-et-mobilite-transport-ferroviaire
has part: concept-SD-transports-et-mobilite-transport-fluvial
has part: concept-SD-transports-et-mobilite-transport-maritime
has part: concept-SD-transports-et-mobilite-transport-routier
has part: concept-SD-transports-et-mobilite-transport-terrestre
is part of: concepts
url source: https://en.wikipedia.org/wiki/Transport
url source: https://fr.wikipedia.org/wiki/Mobilit%C3%A9_spatiale
definition: Le transport ou la mobilité est la capacité ou propriété pour des personnes ou des objets à se déplacer dans un espace physique : par la circulation de biens (on parle alors de fret ou de transport de marchandises) et de personnes en fonction de la capacité de systèmes techniques à les satisfaire.
definition: Transport or mobility is the ability or property for people or goods to move within a physical space: with the movement of goods (freight) or people accordingly to the capacity of technical systems to do so. @en
preferred label: Transport and mobility @en

amortisseur à fluide
type: ConceptConcept
type: Concept
creator: Commission d'enrichissement de la langue française, FranceTerme
source: révision de l'arrêté du 12 août 1976
date parution JO: 2000-09-22
equivalent EN: dash-pot @en
equivalent EN: dash-pot (en)
definition: Amortisseur fonctionnant par laminage d'un fluide à travers un piston.
in scheme: Tous domaines
in scheme: concepts
notation: DEFE10
related: amortisseur

élingue de retenue
type: ConceptConcept
type: Concept
creator: Commission d'enrichissement de la langue française, FranceTerme
source: révision de l'arrêté du 5 octobre 1984
date parution JO: 2000-09-22
equivalent EN: hold back @en
equivalent EN: hold back (en)
definition: Éprouvette tarée qui relie, par l'intermédiaire d'un câble, un point d'accrochage situé à la partie inférieure arrière d'un avion embarqué à un point d'ancrage situé sur le pont d'un porte-avions, et qui permet de maintenir l'appareil à l'arrêt avant le catapultage, tant que la poussée des réacteurs ne dépasse pas une valeur bien définie.
in scheme: Aéronautique
in scheme: Défense
in scheme: concepts
notation: DEFE100

enregistreur de maintenance
type: ConceptConcept
type: Concept
creator: Commission d'enrichissement de la langue française, FranceTerme
source: révision de l'arrêté du 5 octobre 1984
abbreviation: AIDS @en
date parution JO: 2000-09-22
equivalent EN: AIDS @en
equivalent EN: AIDS (en)
equivalent EN: aircraft integrated data system @en
equivalent EN: aircraft integrated data system (en)
definition: Dispositif qui, en vol, enregistre et compare automatiquement les paramètres de fonctionnement de l'aéronef, des moteurs et des principaux équipements de façon à déterminer les opérations de maintenance à effectuer au sol.
in scheme: Aéronautique
in scheme: Défense
in scheme: concepts
notation: DEFE102

entaille de bord d'attaque
type: ConceptConcept
type: Concept
creator: Commission d'enrichissement de la langue française, FranceTerme
source: révision de l'arrêté du 5 octobre 1984
date parution JO: 2000-09-22
equivalent EN: notch @en
equivalent EN: notch (en)
forme abregee: entaille, n.f.
definition: Saignée pratiquée dans le bord d'attaque d'une voilure, en vue d'en améliorer les caractéristiques aérodynamiques par une modification locale de l'écoulement.
in scheme: Aéronautique
in scheme: Défense
in scheme: concepts
notation: DEFE104

équilibrage
type: ConceptConcept
type: Concept
creator: Commission d'enrichissement de la langue française, FranceTerme
source: révision de l'arrêté du 12 août 1976
date parution JO: 2000-09-22
equivalent EN: trim @en
equivalent EN: trim (en)
part of speech: nom masculin
definition: Réglage de l'assiette d'un avion en vol rectiligne horizontal de façon qu'il atteigne une position d'équilibre convenable.
in scheme: Aéronautique
in scheme: Défense
in scheme: concepts
notation: DEFE106
note: L'équilibrage est généralement obtenu par une action sur les compensateurs.
related: compensation
related: assiette

équipe mobile de réparation
type: ConceptConcept
type: Concept
creator: Commission d'enrichissement de la langue française, FranceTerme
source: révision de l'arrêté du 12 août 1976
date parution JO: 2000-09-22
equivalent EN: contact party @en
equivalent EN: contact party (en)
definition: Détachement du service du matériel, envoyé à la demande ou sur ordre, dans un corps ou une unité pour procéder à des réparations dans un domaine déterminé (auto, armement, optique, etc.).
in scheme: Défense
in scheme: concepts
notation: DEFE107

étage vernier
type: ConceptConcept
type: Concept
creator: Commission d'enrichissement de la langue française, FranceTerme
source: révision de l'arrêté du 5 octobre 1984
abbreviation: PBV @en
date parution JO: 2000-09-22
equivalent EN: PBV @en
equivalent EN: PBV (en)
equivalent EN: post boost vehicle @en
equivalent EN: post boost vehicle (en)
definition: Étage additionnel, ne faisant pas partie du lanceur, d'un missile balistique multicharge destiné à faire d'infimes corrections de trajectoire ou à injecter les différents corps de rentrée sur des trajectoires aboutissant aux objectifs qui leur sont assignés.
in scheme: Défense
in scheme: Spatiologie
in scheme: concepts
notation: DEFE108
related: concept-SPAT1583

étanchement
type: ConceptConcept
type: Concept
creator: Commission d'enrichissement de la langue française, FranceTerme
source: révision de l'arrêté du 5 octobre 1984
date parution JO: 2000-09-22
equivalent EN: sealing up @en
equivalent EN: sealing up (en)
part of speech: nom masculin
definition: Ensemble d'opérations visant à réaliser l'étanchéité d'un matériel, par exemple avant un franchissement en submersion.
in scheme: Défense
in scheme: concept-SD-defense-materiel
in scheme: concepts
notation: DEFE109

amortisseur de lacet
type: ConceptConcept
type: Concept
creator: Commission d'enrichissement de la langue française, FranceTerme
source: révision de l'arrêté du 12 août 1976
date parution JO: 2000-09-22
deconseille ou frequent: axe de lacet
equivalent EN: yaw damper @en
equivalent EN: yaw damper (en)
definition: Dispositif de stabilisation automatique atténuant les oscillations d'un aéronef autour de son axe vertical (axe de lacet).
in scheme: Aéronautique
in scheme: Défense
in scheme: concepts
notation: DEFE11

extensomètre
type: ConceptConcept
type: Concept
creator: Commission d'enrichissement de la langue française, FranceTerme
source: révision de l'arrêté du 12 août 1976
date parution JO: 2000-09-22
equivalent EN: strain gage @en
equivalent EN: strain gage (en)
equivalent EN: strain gauge @en
equivalent EN: strain gauge (en)
part of speech: nom masculin
definition: Appareil permettant de mesurer les déformations d'une pièce soumise à des contraintes au moyen des variations de résistance électrique d'un fil fixé à sa surface.
in scheme: Tous domaines
in scheme: concepts
notation: DEFE110

facteur d'atténuation
type: ConceptConcept
type: Concept
creator: Commission d'enrichissement de la langue française, FranceTerme
source: révision de l'arrêté du 5 octobre 1984
date parution JO: 2000-09-22
equivalent EN: attenuation factor @en
equivalent EN: attenuation factor (en)
definition: Rapport de la quantité de rayonnements ionisants incidents à la quantité de rayonnements ionisants ayant traversé un écran protecteur.
in scheme: Défense
in scheme: concept-SD-defense-nucleaire
in scheme: concepts
notation: DEFE111
note: L'inverse du facteur d'atténuation est le facteur de transmission de dose.
related: facteur de transmission de dose

facteur de transmission de dose
type: ConceptConcept
type: Concept
creator: Commission d'enrichissement de la langue française, FranceTerme
source: révision de l'arrêté du 5 octobre 1984
date parution JO: 2000-09-22
equivalent EN: dose transmission factor @en
equivalent EN: dose transmission factor (en)
definition: Rapport de la quantité de rayonnements ionisants ayant traversé un écran protecteur à la quantité de rayonnements ionisants incidents.
in scheme: Défense
in scheme: concept-SD-defense-nucleaire
in scheme: concepts
notation: DEFE112
note: L'inverse du facteur de transmission de dose est le facteur d'atténuation.
related: facteur d'atténuation

faisceau (en)
type: ConceptConcept
type: Concept
creator: Commission d'enrichissement de la langue française, FranceTerme
source: révision de l'arrêté du 12 août 1976
date parution JO: 2000-09-22
deconseille ou frequent: en faisceau
deconseille ou frequent: faisceau
equivalent EN: cluster @en
equivalent EN: cluster (en)
part of speech: locution adjectivale
definition: Se dit de la disposition de divers matériels en groupe ou assemblage allongé.
in scheme: Tous domaines
in scheme: concepts
notation: DEFE113

faisceau inverse
type: ConceptConcept
type: Concept
creator: Commission d'enrichissement de la langue française, FranceTerme
source: révision de l'arrêté du 12 août 1976
date parution JO: 2000-09-22
equivalent EN: back beam @en
equivalent EN: back beam (en)
definition: Faisceau électromagnétique reçu par un aéronef s'éloignant de la station émettrice.
in scheme: Aéronautique
in scheme: Défense
in scheme: concepts
notation: DEFE114

flottement
type: ConceptConcept
type: Concept
creator: Commission d'enrichissement de la langue française, FranceTerme
source: révision de l'arrêté du 12 août 1976
date parution JO: 2000-09-22
equivalent EN: flutter @en
equivalent EN: flutter (en)
part of speech: nom masculin
definition: Vibrations aéroélastiques de haute fréquence, entretenues et parfois divergentes, affectant la cellule d'un avion.
in scheme: Aéronautique
in scheme: Défense
in scheme: concepts
notation: DEFE115

fuseau
type: ConceptConcept
type: Concept
creator: Commission d'enrichissement de la langue française, FranceTerme
source: révision de l'arrêté du 12 août 1976
date parution JO: 2000-09-22
deconseille ou frequent: fuseau-moteur
deconseille ou frequent: fuseau-réacteur
deconseille ou frequent: nacelle
equivalent EN: pod @en
equivalent EN: pod (en)
part of speech: nom masculin
definition: Élément fuselé généralement placé à l'extérieur d'un avion et pouvant loger un moteur (fuseau-moteur), un réacteur (fuseau-réacteur), des équipements, etc.
in scheme: Aéronautique
in scheme: Défense
in scheme: concepts
notation: DEFE117
note: On trouve aussi, dans une acception voisine, « nacelle ».

fuseau
type: ConceptConcept
type: Concept
creator: Commission d'enrichissement de la langue française, FranceTerme
source: révision de l'arrêté du 5 octobre 1984
date parution JO: 2000-09-22
part of speech: nom masculin
definition: Découpage du terrain autour des pénétrantes.
in scheme: Défense
in scheme: concept-SD-defense-armement
in scheme: concepts
notation: DEFE118
note: Exemples : fuseaux d'itinéraires ou fuseaux d'obstacles.

fusée de signalisation
type: ConceptConcept
type: Concept
creator: Commission d'enrichissement de la langue française, FranceTerme
source: révision de l'arrêté du 12 août 1976
date parution JO: 2000-09-22
equivalent EN: flare @en
equivalent EN: flare (en)
definition: Artifice lumineux lancé d'un navire ou d'un aéronef en vue de repérer ou d'identifier une position, signaler une opération, etc.
in scheme: Défense
in scheme: concepts
notation: DEFE119
related: fusée éclairante

amortisseur de tangage
type: ConceptConcept
type: Concept
creator: Commission d'enrichissement de la langue française, FranceTerme
source: révision de l'arrêté du 12 août 1976
date parution JO: 2000-09-22
equivalent EN: pitch damper @en
equivalent EN: pitch damper (en)
definition: Dispositif de stabilisation automatique atténuant les oscillations d'un aéronef autour de l'axe de tangage.
in scheme: Aéronautique
in scheme: Défense
in scheme: concepts
notation: DEFE12

fusée éclairante
type: ConceptConcept
type: Concept
creator: Commission d'enrichissement de la langue française, FranceTerme
source: révision de l'arrêté du 12 août 1976
date parution JO: 2000-09-22
equivalent EN: flare @en
equivalent EN: flare (en)
definition: Artifice lumineux lancé du sol, d'un navire ou d'un aéronef en vue d'illuminer une zone.
in scheme: Défense
in scheme: concepts
notation: DEFE120
related: fusée de signalisation

gaine
type: ConceptConcept
type: Concept
creator: Commission d'enrichissement de la langue française, FranceTerme
source: révision de l'arrêté du 12 août 1976
date parution JO: 2000-09-22
equivalent EN: container @en
equivalent EN: container (en)
part of speech: nom féminin
definition: Emballage souple ou rigide servant au parachutage du matériel.
in scheme: Aéronautique
in scheme: Défense
in scheme: concepts
notation: DEFE121

gaine de jambe
type: ConceptConcept
type: Concept
creator: Commission d'enrichissement de la langue française, FranceTerme
source: révision de l'arrêté du 12 août 1976
date parution JO: 2000-09-22
equivalent EN: leg bag @en
equivalent EN: leg bag (en)
definition: Sac fixé à la jambe du parachutiste et qui contient divers équipements.
in scheme: Aéronautique
in scheme: Défense
in scheme: concepts
notation: DEFE122
note: Après l'ouverture du parachute, ce sac est libéré et reste suspendu à une corde qui lui permet de prendre contact avec le sol avant le parachutiste.

générateur auxiliaire de bord
type: ConceptConcept
type: Concept
creator: Commission d'enrichissement de la langue française, FranceTerme
source: révision de l'arrêté du 5 octobre 1984
abbreviation: APU @en
date parution JO: 2000-09-22
equivalent EN: APU @en
equivalent EN: APU (en)
equivalent EN: auxiliary power unit @en
equivalent EN: auxiliary power unit (en)
definition: Installation autonome fournissant des énergies de servitude utilisée en particulier pour le démarrage et le conditionnement d'air avant le décollage d'un avion.
in scheme: Aéronautique
in scheme: Défense
in scheme: concepts
notation: DEFE123

générateur de tourbillons
type: ConceptConcept
type: Concept
creator: Commission d'enrichissement de la langue française, FranceTerme
source: révision de l'arrêté du 12 août 1976
date parution JO: 2000-09-22
equivalent EN: vortex generator @en
equivalent EN: vortex generator (en)
definition: Obstacle placé à la surface d'une voilure pour créer des tourbillons aérodynamiques.
in scheme: Aéronautique
in scheme: Défense
in scheme: concepts
notation: DEFE124

gouverner à un cap
type: ConceptConcept
type: Concept
creator: Commission d'enrichissement de la langue française, FranceTerme
source: révision de l'arrêté du 12 août 1976
date parution JO: 2000-09-22
deconseille ou frequent: to steer
equivalent EN: steer @en
equivalent EN: steer (en)
definition: Action d'orienter une embarcation ou un navire dans une direction donnée selon les indications d'un compas.
in scheme: Marine
in scheme: concepts
notation: DEFE125
related: voler à un cap

grenaillage
type: ConceptConcept
type: Concept
creator: Commission d'enrichissement de la langue française, FranceTerme
source: révision de l'arrêté du 12 août 1976
date parution JO: 2000-09-22
equivalent EN: shot peening @en
equivalent EN: shot peening (en)
part of speech: nom masculin
definition: Technique de nettoyage ou d'écrouissage d'une surface métallique consistant en une projection de grenaille à grande vitesse sur cette surface.
in scheme: Matériaux
in scheme: concept-SD-materiaux-metallurgie
in scheme: concepts
notation: DEFE126

gros-porteur
type: ConceptConcept
type: Concept
creator: Commission d'enrichissement de la langue française, FranceTerme
source: révision de l'arrêté du 12 août 1976
date parution JO: 2000-09-22
equivalent EN: heavy jet @en
equivalent EN: heavy jet (en)
equivalent EN: jumbo jet @en
equivalent EN: jumbo jet (en)
equivalent EN: wide body aircraft @en
equivalent EN: wide body aircraft (en)
part of speech: nom masculin
definition: Avion de grande capacité.
in scheme: Aéronautique
in scheme: Transports et mobilité
in scheme: concepts
notation: DEFE127

groupe de saut
type: ConceptConcept
type: Concept
creator: Commission d'enrichissement de la langue française, FranceTerme
source: révision de l'arrêté du 12 août 1976
date parution JO: 2000-09-22
equivalent EN: stick @en
equivalent EN: stick (en)
definition: Équipe de parachutistes devant sauter par la même porte d'un aéronef au cours d'un même passage sur la zone de saut.
in scheme: Aéronautique
in scheme: Défense
in scheme: concepts
notation: DEFE128

habitacle
type: ConceptConcept
type: Concept
creator: Commission d'enrichissement de la langue française, FranceTerme
source: révision de l'arrêté du 12 août 1976
date parution JO: 2000-09-22
deconseille ou frequent: cockpit
equivalent EN: poste de pilotage
part of speech: nom masculin
alternative label: poste de pilotage
definition: Compartiment d'un avion logeant l'équipage et tous les équipements de pilotage et de contrôle du vol.
in scheme: Aéronautique
in scheme: Défense
in scheme: concepts
notation: DEFE129
note: On dit aussi, dans le langage courant, « cockpit ».
related: verrière

analyse d'objectif
type: ConceptConcept
type: Concept
creator: Commission d'enrichissement de la langue française, FranceTerme
source: révision de l'arrêté du 5 octobre 1984
date parution JO: 2000-09-22
equivalent EN: target analysis @en
equivalent EN: target analysis (en)
definition: Étude simultanée des caractéristiques et des possibilités des systèmes d'armes disponibles, menée en vue d'estimer les dommages pouvant être causés par ces armes à tel ou tel objectif.
in scheme: Défense
in scheme: concept-SD-defense-armement
in scheme: concepts
notation: DEFE13

hélice carénée
type: ConceptConcept
type: Concept
creator: Commission d'enrichissement de la langue française, FranceTerme
source: révision de l'arrêté du 12 août 1976
date parution JO: 2000-09-22
equivalent EN: ducted propeller @en
equivalent EN: ducted propeller (en)
equivalent EN: shrouded propeller @en
equivalent EN: shrouded propeller (en)
definition: Hélice de navire ou d'aéroglisseur placée à l'intérieur d'un carénage annulaire destiné à en améliorer le rendement.
in scheme: Marine
in scheme: concepts
notation: DEFE130

hiver nucléaire
type: ConceptConcept
type: Concept
creator: Commission d'enrichissement de la langue française, FranceTerme
source: révision de l'arrêté du 17 avril 1989
date parution JO: 2000-09-22
equivalent EN: nuclear winter @en
equivalent EN: nuclear winter (en)
definition: Refroidissement considérable de l'atmosphère, dû aux nuages de poussière et de fumées consécutifs à une guerre thermonucléaire.
in scheme: Défense
in scheme: concept-SD-defense-nucleaire
in scheme: concepts
notation: DEFE131

hydrojet
type: ConceptConcept
type: Concept
creator: Commission d'enrichissement de la langue française, FranceTerme
source: révision de l'arrêté du 12 août 1976
date parution JO: 2000-09-22
equivalent EN: hydrojet @en
equivalent EN: hydrojet (en)
part of speech: nom masculin
definition: Dispositif de propulsion fonctionnant par jet d'eau vers l'arrière.
in scheme: Défense
in scheme: Marine
in scheme: concept-SD-defense-construction-navale
in scheme: concept-SD-marine-construction-navale
in scheme: concepts
notation: DEFE132

hydroptère
type: ConceptConcept
type: Concept
creator: Commission d'enrichissement de la langue française, FranceTerme
source: révision de l'arrêté du 12 août 1976
date parution JO: 2000-09-22
equivalent EN: hydrofoil @en
equivalent EN: hydrofoil (en)
part of speech: nom masculin
definition: Navire rapide dont la coque est munie d'ailes à surface portante hydrodynamique lui permettant de se soulever au-dessus de l'eau, au-delà d'une certaine vitesse.
in scheme: Transports et mobilité
in scheme: concept-SD-transports-et-mobilite-transport-maritime
in scheme: concepts
notation: DEFE133

hypersustentateur
type: ConceptConcept
type: Concept
creator: Commission d'enrichissement de la langue française, FranceTerme
source: révision de l'arrêté du 5 octobre 1984
date parution JO: 2000-09-22
equivalent EN: high lift device @en
equivalent EN: high lift device (en)
part of speech: adjectif
definition: Qualifie les dispositifs, généralement implantés au bord d'attaque et au bord de fuite d'une voilure qui, par combinaison de différents effets, permettent à une incidence donnée d'augmenter le coefficient de portance de l'avion.
in scheme: Aéronautique
in scheme: Défense
in scheme: concepts
notation: DEFE134

intégration
type: ConceptConcept
type: Concept
creator: Commission d'enrichissement de la langue française, FranceTerme
source: révision de l'arrêté du 5 octobre 1984
date parution JO: 2000-09-22
equivalent EN: integration @en
equivalent EN: integration (en)
part of speech: nom féminin
definition: Opération qui consiste à relier temporairement une voie radio à une voie filaire pour permettre l'échange de communications, généralement en alternat, entre un poste radio mobile et un poste radio filaire.
in scheme: Défense
in scheme: concept-SD-defense-transmissions
in scheme: concepts
notation: DEFE135

intervalle éclair-son
type: ConceptConcept
type: Concept
creator: Commission d'enrichissement de la langue française, FranceTerme
source: révision de l'arrêté du 15 juin 1991
date parution JO: 2000-09-22
equivalent EN: flash-to-bang time @en
equivalent EN: flash-to-bang time (en)
definition: En un point, temps qui s'écoule entre la perception de l'éclair et l'arrivée du bruit d'une explosion nucléaire.
in scheme: Défense
in scheme: concept-SD-defense-nucleaire
in scheme: concepts
notation: DEFE136

inverseur de poussée
type: ConceptConcept
type: Concept
creator: Commission d'enrichissement de la langue française, FranceTerme
source: révision de l'arrêté du 12 août 1976
abbreviation: reverser @en
date parution JO: 2000-09-22
equivalent EN: reverser @en
equivalent EN: reverser (en)
equivalent EN: thrust reverser @en
equivalent EN: thrust reverser (en)
definition: Dispositif permettant, par interposition d'un obstacle dans le jet de sortie d'un réacteur, de dévier ce jet vers l'avant afin de freiner l'avion au sol.
in scheme: Aéronautique
in scheme: Défense
in scheme: concepts
notation: DEFE137
related: inversion de poussée

inversion de pas
type: ConceptConcept
type: Concept
creator: Commission d'enrichissement de la langue française, FranceTerme
source: révision de l'arrêté du 12 août 1976
date parution JO: 2000-09-22
equivalent EN: pitch reverse @en
equivalent EN: pitch reverse (en)
equivalent EN: pitch reversing @en
equivalent EN: pitch reversing (en)
definition: Passage d'une hélice au pas négatif (pas inverse) afin de freiner l'aéronef au sol.
in scheme: Aéronautique
in scheme: Défense
in scheme: concepts
notation: DEFE138
related: inversion de poussée

inversion de poussée
type: ConceptConcept
type: Concept
creator: Commission d'enrichissement de la langue française, FranceTerme
source: révision de l'arrêté du 12 août 1976
date parution JO: 2000-09-22
equivalent EN: thrust reverse @en
equivalent EN: thrust reverse (en)
equivalent EN: thrust reversing @en
equivalent EN: thrust reversing (en)
definition: Déviation vers l'avant du jet d'un réacteur, obtenue à l'aide d'un inverseur de poussée.
in scheme: Aéronautique
in scheme: Défense
in scheme: concepts
notation: DEFE139
related: inverseur de poussée
related: inversion de pas

aperçu
type: ConceptConcept
type: Concept
creator: Commission d'enrichissement de la langue française, FranceTerme
source: révision de l'arrêté du 5 octobre 1984
abbreviation: ACK @en
date parution JO: 2000-09-22
equivalent EN: ACK @en
equivalent EN: ACK (en)
equivalent EN: acknowledgment @en
equivalent EN: acknowledgment (en)
part of speech: nom masculin
definition: Réaction de l'autorité destinataire signifiant qu'elle a bien reçu et compris un message.
in scheme: Défense
in scheme: concept-SD-defense-transmissions
in scheme: concepts
notation: DEFE14

largage
type: ConceptConcept
type: Concept
creator: Commission d'enrichissement de la langue française, FranceTerme
source: révision de l'arrêté du 12 août 1976
date parution JO: 2000-09-22
equivalent EN: dispatching @en
equivalent EN: dispatching (en)
equivalent EN: dropping @en
equivalent EN: dropping (en)
part of speech: nom masculin
definition: Parachutage de personnel ou de matériel.
in scheme: Aéronautique
in scheme: Défense
in scheme: concepts
notation: DEFE140

largueur
type: ConceptConcept
type: Concept
creator: Commission d'enrichissement de la langue française, FranceTerme
source: révision de l'arrêté du 12 août 1976
date parution JO: 2000-09-22
equivalent EN: dispatcher @en
equivalent EN: dispatcher (en)
part of speech: nom masculin
definition: Spécialiste chargé, à bord d'un aéronef, du parachutage de personnel ou de matériel.
in scheme: Aéronautique
in scheme: Défense
in scheme: concepts
notation: DEFE141

ligne d'alimentation
type: ConceptConcept
type: Concept
creator: Commission d'enrichissement de la langue française, FranceTerme
source: révision de l'arrêté du 12 août 1976
date parution JO: 2000-09-22
equivalent EN: feeder @en
equivalent EN: feeder (en)
definition: Ligne de transport d'énergie électrique reliant directement un générateur au réseau de distribution ou un émetteur-récepteur à l'antenne.
in scheme: Électricité
in scheme: Énergie
in scheme: concepts
notation: DEFE142
related: câble coaxial

limite de manœuvre
type: ConceptConcept
type: Concept
creator: Commission d'enrichissement de la langue française, FranceTerme
source: révision de l'arrêté du 5 octobre 1984
date parution JO: 2000-09-22
deconseille ou frequent: limite de manoeuvre
equivalent EN: manoeuvre limit @en
equivalent EN: manoeuvre limit (en)
definition: Valeur maximale du facteur de charge normal acceptable pour le pilotage d'un avion en évolution.
in scheme: Aéronautique
in scheme: Défense
in scheme: concepts
notation: DEFE143
note: Cette limite peut être déterminée par l'apparition de phénomènes incontrôlables, échappée de roulis, autocabrage, ou par des vibrations trop intenses.

liste de vérification
type: ConceptConcept
type: Concept
creator: Commission d'enrichissement de la langue française, FranceTerme
source: révision de l'arrêté du 12 août 1976
date parution JO: 2000-09-22
deconseille ou frequent: check-list
deconseille ou frequent: checklist
equivalent EN: check list @en
equivalent EN: check list (en)
definition: Document écrit servant d'aide-mémoire, indiquant dans l'ordre les différentes opérations ou vérifications à effectuer avant, pendant ou après la mise en œuvre d'un matériel.
in scheme: Tous domaines
in scheme: concepts
notation: DEFE144

manomètre à écrasement
type: ConceptConcept
type: Concept
creator: Commission d'enrichissement de la langue française, FranceTerme
source: révision de l'arrêté du 12 août 1976
date parution JO: 2000-09-22
equivalent EN: crusher @en
equivalent EN: crusher (en)
definition: Dispositif de mesure des pressions très élevées par écrasement d'un cylindre de cuivre pur.
in scheme: Tous domaines
in scheme: concepts
notation: DEFE145

marge de manœuvre
type: ConceptConcept
type: Concept
creator: Commission d'enrichissement de la langue française, FranceTerme
source: révision de l'arrêté du 5 octobre 1984
date parution JO: 2000-09-22
deconseille ou frequent: marge de manoeuvre
equivalent EN: manoeuvre margin @en
equivalent EN: manoeuvre margin (en)
definition: Valeur maximale du facteur de charge normal qu'il est possible de maintenir en virage stabilisé, à une altitude, un nombre de Mach et une température extérieure bien définis.
in scheme: Aéronautique
in scheme: Défense
in scheme: concepts
notation: DEFE146

marquage
type: ConceptConcept
type: Concept
creator: Commission d'enrichissement de la langue française, FranceTerme
source: révision de l'arrêté du 15 juin 1991
date parution JO: 2000-09-22
equivalent EN: marking @en
equivalent EN: marking (en)
part of speech: nom masculin
definition: En opérations navales, tâche qui est confiée à une unité navale et qui consiste à suivre les mouvements d'un mobile désigné.
in scheme: Défense
in scheme: Marine
in scheme: concepts
notation: DEFE147
related: contact

marsouinage
type: ConceptConcept
type: Concept
creator: Commission d'enrichissement de la langue française, FranceTerme
source: révision de l'arrêté du 12 août 1976
date parution JO: 2000-09-22
deconseille ou frequent: hydroplanage
equivalent EN: porpoising @en
equivalent EN: porpoising (en)
part of speech: nom masculin
definition: Oscillations longitudinales, régulières et de basse fréquence d'un aéronef en vol.
in scheme: Aéronautique
in scheme: Défense
in scheme: concepts
notation: DEFE149
related: marsouinage

aquaplanage
type: ConceptConcept
type: Concept
creator: Commission d'enrichissement de la langue française, FranceTerme
source: révision de l'arrêté du 5 octobre 1984
date parution JO: 2000-09-22
deconseille ou frequent: hydroplanage
equivalent EN: aquaplaning @en
equivalent EN: aquaplaning (en)
equivalent EN: hydroplaning @en
equivalent EN: hydroplaning (en)
part of speech: nom masculin
definition: Perte d'adhérence des roues d'un véhicule sur une surface mouillée due à la formation d'une pellicule d'eau entre les pneus et cette surface.
in scheme: Transports et mobilité
in scheme: concepts
notation: DEFE15
note: Ce terme ne doit pas être confondu avec « hydroplanage » ou « navigation sur le redan d'un hydravion ».

métallisation
type: ConceptConcept
type: Concept
creator: Commission d'enrichissement de la langue française, FranceTerme
source: révision de l'arrêté du 12 août 1976
abbreviation: bonding @en
date parution JO: 2000-09-22
equivalent EN: bonding @en
equivalent EN: bonding (en)
equivalent EN: electric bonding @en
equivalent EN: electric bonding (en)
part of speech: nom féminin
definition: Liaison électrique entre les éléments métalliques d'un aéronef réalisée en vue d'obtenir une répartition sûre des charges et intensités.
in scheme: Aéronautique
in scheme: Électricité
in scheme: Énergie
in scheme: concepts
notation: DEFE150

mise en pression
type: ConceptConcept
type: Concept
creator: Commission d'enrichissement de la langue française, FranceTerme
source: révision de l'arrêté du 12 août 1976
date parution JO: 2000-09-22
deconseille ou frequent: pressurisation
deconseille ou frequent: pressurization
equivalent EN: pressurisation (GB) @en
equivalent EN: pressurisation (en-GB)
equivalent EN: pressurization (US) @en
equivalent EN: pressurization (en-US)
definition: Rétablissement de la pression de l'air à un niveau normal dans la cabine d'un aéronef volant à haute altitude.
in scheme: Aéronautique
in scheme: Défense
in scheme: concepts
notation: DEFE151

missile aérodynamique
type: ConceptConcept
type: Concept
creator: Commission d'enrichissement de la langue française, FranceTerme
source: révision de l'arrêté du 5 octobre 1984
date parution JO: 2000-09-22
equivalent EN: aerodynamic missile @en
equivalent EN: aerodynamic missile (en)
definition: Missile dont la sustentation ou la manœuvrabilité est obtenue principalement par des forces aérodynamiques et qui, de ce fait, ne peut voler qu'à l'intérieur d'une atmosphère suffisamment dense.
in scheme: Défense
in scheme: concept-SD-defense-armement
in scheme: concepts
notation: DEFE152

missile balistique
type: ConceptConcept
type: Concept
creator: Commission d'enrichissement de la langue française, FranceTerme
source: révision de l'arrêté du 5 octobre 1984
date parution JO: 2000-09-22
equivalent EN: ballistic missile @en
equivalent EN: ballistic missile (en)
definition: Missile qui, en dehors des phases de vol propulsé, initiale et éventuellement terminale, décrit une trajectoire régie en première approximation par les seules forces de gravitation.
in scheme: Défense
in scheme: concept-SD-defense-armement
in scheme: concepts
notation: DEFE153

missile de croisière
type: ConceptConcept
type: Concept
creator: Commission d'enrichissement de la langue française, FranceTerme
source: révision de l'arrêté du 5 octobre 1984
date parution JO: 2000-09-22
equivalent EN: cruise missile @en
equivalent EN: cruise missile (en)
definition: Missile aérodynamique, effectuant la plus grande partie de son parcours en vol de croisière tout en étant propulsé avec un guidage autonome.
in scheme: Défense
in scheme: concept-SD-defense-armement
in scheme: concepts
notation: DEFE154

mitraillage au sol
type: ConceptConcept
type: Concept
creator: Commission d'enrichissement de la langue française, FranceTerme
source: révision de l'arrêté du 12 août 1976
date parution JO: 2000-09-22
equivalent EN: strafing @en
equivalent EN: strafing (en)
definition: Tir sur objectifs de surface effectué d'un aéronef au moyen de ses armes de bord.
in scheme: Aéronautique
in scheme: Défense
in scheme: concepts
notation: DEFE155

moteur de croisière
type: ConceptConcept
type: Concept
creator: Commission d'enrichissement de la langue française, FranceTerme
source: révision de l'arrêté du 5 octobre 1984
date parution JO: 2000-09-22
equivalent EN: sustainer @en
equivalent EN: sustainer (en)
definition: Propulseur principal d'une durée de fonctionnement relativement longue et d'une poussée telle qu'elle maintient approximativement constante la vitesse d'un missile.
in scheme: Défense
in scheme: concepts
notation: DEFE156

munition à agents multiples
type: ConceptConcept
type: Concept
creator: Commission d'enrichissement de la langue française, FranceTerme
source: révision de l'arrêté du 17 avril 1989
date parution JO: 2000-09-22
equivalent EN: multi-agent munition @en
equivalent EN: multi-agent munition (en)
definition: Munition capable de disperser deux ou plusieurs agents chimiques, biologiques ou combinés.
in scheme: Défense
in scheme: concepts
notation: DEFE157

munition à fragmentation
type: ConceptConcept
type: Concept
creator: Commission d'enrichissement de la langue française, FranceTerme
source: révision de l'arrêté du 5 octobre 1984
date parution JO: 2000-09-22
equivalent EN: fragmentation charge @en
equivalent EN: fragmentation charge (en)
definition: Munition comportant une enveloppe préfragmentée en vue d'obtenir, au moment de l'explosion de la charge, la projection d'éclats d'un calibre donné.
in scheme: Défense
in scheme: concept-SD-defense-armement
in scheme: concepts
notation: DEFE158

munition chimique binaire
type: ConceptConcept
type: Concept
creator: Commission d'enrichissement de la langue française, FranceTerme
source: révision de l'arrêté du 17 avril 1989
date parution JO: 2000-09-22
equivalent EN: binary chemical munition @en
equivalent EN: binary chemical munition (en)
definition: Munition dans laquelle deux substances chimiques placées dans des conteneurs séparés, réagissent, une fois mélangées par le tir, le lancement ou un quelconque système d'amorçage, pour donner un agent chimique ou toxique.
in scheme: Défense
in scheme: concept-SD-defense-armement
in scheme: concepts
notation: DEFE159

arme à implosion
type: ConceptConcept
type: Concept
creator: Commission d'enrichissement de la langue française, FranceTerme
source: révision de l'arrêté du 17 avril 1989
date parution JO: 2000-09-22
equivalent EN: implosion weapon @en
equivalent EN: implosion weapon (en)
definition: Arme nucléaire dans laquelle un élément de matière fissile à l'état sous-critique diminue brusquement de volume à la suite d'une compression qui l'amène à l'état surcritique, rendant ainsi possible une explosion.
in scheme: Défense
in scheme: concept-SD-defense-armement
in scheme: concepts
notation: DEFE16

navire quittant
type: ConceptConcept
type: Concept
creator: Commission d'enrichissement de la langue française, FranceTerme
source: révision de l'arrêté du 15 juin 1991
date parution JO: 2000-09-22
equivalent EN: leaver @en
equivalent EN: leaver (en)
definition: Navire marchand qui se sépare d'un convoi pour faire route vers une destination différente et qui devient un navire isolé.
in scheme: Défense
in scheme: Marine
in scheme: concepts
notation: DEFE160
related: navire ralliant

navire ralliant
type: ConceptConcept
type: Concept
creator: Commission d'enrichissement de la langue française, FranceTerme
source: révision de l'arrêté du 15 juin 1991
date parution JO: 2000-09-22
equivalent EN: joiner @en
equivalent EN: joiner (en)
definition: Navire marchand isolé, en route pour rejoindre un convoi.
in scheme: Défense
in scheme: Marine
in scheme: concepts
notation: DEFE161
related: navire quittant

nettoyage aérodynamique
type: ConceptConcept
type: Concept
creator: Commission d'enrichissement de la langue française, FranceTerme
source: révision de l'arrêté du 5 octobre 1984
date parution JO: 2000-09-22
equivalent EN: aerodynamic clean-up @en
equivalent EN: aerodynamic clean-up (en)
definition: Élimination des excroissances et des discontinuités de raccordement sur les parois d'un avion ou d'un missile ; par extension, résultat de cette action.
in scheme: Aéronautique
in scheme: Défense
in scheme: concepts
notation: DEFE162

nourrice
type: ConceptConcept
type: Concept
creator: Commission d'enrichissement de la langue française, FranceTerme
source: révision de l'arrêté du 5 octobre 1984
date parution JO: 2000-09-22
equivalent EN: jerrican @en
equivalent EN: jerrican (en)
equivalent EN: jerrycan @en
equivalent EN: jerrycan (en)
part of speech: nom féminin
alternative label: jerricane
definition: Bidon à poignée utilisé pour la manutention et la distribution de liquide.
in scheme: Tous domaines
in scheme: concepts
notation: DEFE164

onduleur
type: ConceptConcept
type: Concept
creator: Commission d'enrichissement de la langue française, FranceTerme
source: révision de l'arrêté du 12 août 1976
date parution JO: 2000-09-22
equivalent EN: converter @en
equivalent EN: converter (en)
equivalent EN: inverter @en
equivalent EN: inverter (en)
part of speech: nom masculin
definition: Machine électrique destinée à transformer un courant continu en courant alternatif.
in scheme: Défense
in scheme: Électricité
in scheme: Énergie
in scheme: concepts
notation: DEFE165
related: convertisseur

optoélectronique
type: ConceptConcept
type: Concept
creator: Commission d'enrichissement de la langue française, FranceTerme
source: révision de l'arrêté du 5 octobre 1984
date parution JO: 2000-09-22
equivalent EN: optoelectronics @en
equivalent EN: optoelectronics (en)
equivalent EN: optronics @en
equivalent EN: optronics (en)
part of speech: nom féminin
definition: Technique utilisant simultanément l'optique et l'électronique.
in scheme: Électronique
in scheme: concepts
notation: DEFE166
related: concept-electronique

orienteur-marqueur
type: ConceptConcept
type: Concept
creator: Commission d'enrichissement de la langue française, FranceTerme
source: révision de l'arrêté du 12 août 1976
date parution JO: 2000-09-22
equivalent EN: pathfinder @en
equivalent EN: pathfinder (en)
part of speech: nom masculin
definition: Parachutiste sautant en éclaireur pour disposer sur le terrain les instruments qui guideront les aéronefs transportant la troupe aéroportée.
in scheme: Aéronautique
in scheme: Défense
in scheme: concepts
notation: DEFE167
related: chuteur opérationnel

paillette
type: ConceptConcept
type: Concept
creator: Commission d'enrichissement de la langue française, FranceTerme
source: révision de l'arrêté du 12 août 1976
date parution JO: 2000-09-22
equivalent EN: chaff @en
equivalent EN: chaff (en)
equivalent EN: rope @en
equivalent EN: rope (en)
equivalent EN: window @en
equivalent EN: window (en)
part of speech: nom féminin
definition: Type de réflecteur léger utilisé en grand nombre pour former des nuages destinés à leurrer les radars et les autodirecteurs de missiles.
in scheme: Défense
in scheme: Télédétection spatiale
in scheme: concepts
notation: DEFE168
note: La paillette peut se présenter sous forme d'aiguille, de bandelette ou de ruban métallique ou métallisé.
related: autodirecteur

passage de lignes
type: ConceptConcept
type: Concept
creator: Commission d'enrichissement de la langue française, FranceTerme
source: révision de l'arrêté du 17 avril 1989
date parution JO: 2000-09-22
equivalent EN: passage of lines @en
equivalent EN: passage of lines (en)
definition: Opération par laquelle une force se déplace vers l'avant ou vers l'arrière à travers les positions de combat d'une autre force pour engager ou rompre le contact avec l'ennemi.
in scheme: Défense
in scheme: concepts
notation: DEFE169

arrondi
type: ConceptConcept
type: Concept
creator: Commission d'enrichissement de la langue française, FranceTerme
source: révision de l'arrêté du 12 août 1976
date parution JO: 2000-09-22
equivalent EN: flare @en
equivalent EN: flare (en)
equivalent EN: flare-out @en
equivalent EN: flare-out (en)
part of speech: nom masculin
definition: Manœuvre de redressement d'un aéronef précédant généralement l'atterrissage.
in scheme: Aéronautique
in scheme: Défense
in scheme: concepts
notation: DEFE17

piège
type: ConceptConcept
type: Concept
creator: Commission d'enrichissement de la langue française, FranceTerme
source: révision de l'arrêté du 12 août 1976
date parution JO: 2000-09-22
equivalent EN: booby-trap @en
equivalent EN: booby-trap (en)
part of speech: nom masculin
definition: Dispositif dissimulé ou d'aspect inoffensif destiné à prendre par surprise un adversaire pour le blesser ou le tuer.
in scheme: Défense
in scheme: concepts
notation: DEFE170

pile d'attente
type: ConceptConcept
type: Concept
creator: Commission d'enrichissement de la langue française, FranceTerme
source: révision de l'arrêté du 5 octobre 1984
abbreviation: stack @en
date parution JO: 2000-09-22
equivalent EN: holding stack @en
equivalent EN: holding stack (en)
equivalent EN: stack @en
equivalent EN: stack (en)
definition: Ensemble des aéronefs évoluant à diverses altitudes sur des trajectoires d'attente dans un espace spécifié par le contrôle de la circulation aérienne.
in scheme: Aéronautique
in scheme: Défense
in scheme: concepts
notation: DEFE171

planification
type: ConceptConcept
type: Concept
creator: Commission d'enrichissement de la langue française, FranceTerme
source: révision de l'arrêté du 12 août 1976
date parution JO: 2000-09-22
deconseille ou frequent: calendrier
deconseille ou frequent: plan
deconseille ou frequent: programmation
deconseille ou frequent: programme
equivalent EN: planning @en
equivalent EN: planning (en)
part of speech: nom féminin
definition: Organisation suivant un plan.
in scheme: Tous domaines
in scheme: concepts
notation: DEFE172
note: Selon le contexte, on peut préférer « plan », « programme », « programmation », « calendrier », etc.
related: calendrier
related: planigramme

planigramme
type: ConceptConcept
type: Concept
creator: Commission d'enrichissement de la langue française, FranceTerme
source: révision de l'arrêté du 12 août 1976
date parution JO: 2000-09-22
equivalent EN: planning @en
equivalent EN: planning (en)
part of speech: nom masculin
definition: Matérialisation graphique d'une planification.
in scheme: Tous domaines
in scheme: concepts
notation: DEFE173
related: planification

point
type: ConceptConcept
type: Concept
creator: Commission d'enrichissement de la langue française, FranceTerme
source: révision de l'arrêté du 12 août 1976
date parution JO: 2000-09-22
deconseille ou frequent: position
equivalent EN: fix @en
equivalent EN: fix (en)
part of speech: nom masculin
definition: Position géographique d'un navire ou d'un aéronef déterminée par des observations optiques, radioélectroniques, etc.
in scheme: Aéronautique
in scheme: Marine
in scheme: concepts
notation: DEFE174
note: Dans cette acception, on dit aussi « position ».

point de cheminement
type: ConceptConcept
type: Concept
creator: Commission d'enrichissement de la langue française, FranceTerme
source: révision de l'arrêté du 5 octobre 1984
date parution JO: 2000-09-22
deconseille ou frequent: waypoint
equivalent EN: way point @en
equivalent EN: way point (en)
definition: Dans un système de navigation de zone, point non balisé, prédéterminé par ordinateur, par lequel passe la route à suivre.
in scheme: Aéronautique
in scheme: concepts
notation: DEFE175
related: concept-aeronautique

point zéro
type: ConceptConcept
type: Concept
creator: Commission d'enrichissement de la langue française, FranceTerme
source: révision de l'arrêté du 5 octobre 1984
date parution JO: 2000-09-22
equivalent EN: ground zero @en
equivalent EN: ground zero (en)
definition: Point obtenu par la projection verticale, sur la surface terrestre, du point d'explosion.
in scheme: Défense
in scheme: concepts
notation: DEFE176

pompe auxiliaire
type: ConceptConcept
type: Concept
creator: Commission d'enrichissement de la langue française, FranceTerme
source: révision de l'arrêté du 12 août 1976
date parution JO: 2000-09-22
equivalent EN: backing pump @en
equivalent EN: backing pump (en)
definition: Pompe destinée à suppléer une défaillance de la pompe principale d'un circuit ou à maintenir la pression du fluide dans ce dernier.
in scheme: Moteur thermique
in scheme: concepts
notation: DEFE177
related: pompe de suralimentation

pompe de suralimentation
type: ConceptConcept
type: Concept
creator: Commission d'enrichissement de la langue française, FranceTerme
source: révision de l'arrêté du 12 août 1976
date parution JO: 2000-09-22
equivalent EN: booster pump @en
equivalent EN: booster pump (en)
definition: Pompe auxiliaire de carburant utilisée pour empêcher le désamorçage de la pompe d'alimentation du moteur.
in scheme: Moteur thermique
in scheme: concepts
notation: DEFE178
related: pompe auxiliaire

posé-décollé
type: ConceptConcept
type: Concept
creator: Commission d'enrichissement de la langue française, FranceTerme
source: révision de l'arrêté du 12 août 1976
date parution JO: 2000-09-22
deconseille ou frequent: touch & go
equivalent EN: touch-and-go @en
equivalent EN: touch-and-go (en)
part of speech: nom masculin
definition: Atterrissage d'un aéronef suivi immédiatement d'un décollage.
in scheme: Aéronautique
in scheme: Défense
in scheme: concepts
notation: DEFE179

assiette
type: ConceptConcept
type: Concept
creator: Commission d'enrichissement de la langue française, FranceTerme
source: révision de l'arrêté du 12 août 1976
date parution JO: 2000-09-22
equivalent EN: trim @en
equivalent EN: trim (en)
part of speech: nom féminin
definition: Angle que fait l'axe longitudinal d'un bâtiment avec le plan horizontal.
in scheme: Marine
in scheme: concepts
notation: DEFE18

position identifiée
type: ConceptConcept
type: Concept
creator: Commission d'enrichissement de la langue française, FranceTerme
source: révision de l'arrêté du 12 août 1976
date parution JO: 2000-09-22
equivalent EN: pinpoint @en
equivalent EN: pinpoint (en)
definition: Position d'un avion par rapport au sol, déterminée par l'identification d'un point de la surface terrestre.
in scheme: Aéronautique
in scheme: Défense
in scheme: concepts
notation: DEFE180

post-combustion
type: ConceptConcept
type: Concept
creator: Commission d'enrichissement de la langue française, FranceTerme
source: révision de l'arrêté du 12 août 1976
date parution JO: 2000-09-22
equivalent EN: afterburner @en
equivalent EN: afterburner (en)
equivalent EN: reheat @en
equivalent EN: reheat (en)
part of speech: nom féminin
alternative label: réchauffe
definition: Procédé visant à augmenter la poussée d'un réacteur par injection de carburant en aval de la turbine.
in scheme: Aéronautique
in scheme: Défense
in scheme: concepts
notation: DEFE181

entrée d'air variable
type: ConceptConcept
type: Concept
creator: Commission d'enrichissement de la langue française, FranceTerme
source: révision de l'arrêté du 12 août 1976
date parution JO: 2000-09-22
deconseille ou frequent: entrée d'air à géométrie variable
equivalent EN: variable geometry inlet @en
equivalent EN: variable geometry inlet (en)
equivalent EN: variable geometry intake @en
equivalent EN: variable geometry intake (en)
alternative label: prise d'air variable
definition: Prise d'air utilisée sur les avions supersoniques et possédant des parois internes ou externes mobiles de manière à adapter le fonctionnement du réacteur aux différentes vitesses de vol de l'avion.
in scheme: Aéronautique
in scheme: Défense
in scheme: concepts
notation: DEFE182
note: L'expression « entrée d'air à géométrie variable » est déconseillée.

quille
type: ConceptConcept
type: Concept
creator: Commission d'enrichissement de la langue française, FranceTerme
source: révision de l'arrêté du 5 octobre 1984
date parution JO: 2000-09-22
equivalent EN: ventral fin @en
equivalent EN: ventral fin (en)
part of speech: nom féminin
definition: Élément profilé de faible allongement fixé à la partie inférieure du fuselage, en vue d'augmenter la stabilité latérale de l'avion ou d'éviter qu'il se mette en vrille.
in scheme: Aéronautique
in scheme: Défense
in scheme: concepts
notation: DEFE183

raccordement d'aile
type: ConceptConcept
type: Concept
creator: Commission d'enrichissement de la langue française, FranceTerme
source: révision de l'arrêté du 12 août 1976
date parution JO: 2000-09-22
deconseille ou frequent: karman
equivalent EN: wing fillet @en
equivalent EN: wing fillet (en)
definition: Carénage placé à la jonction de l'aile et du fuselage pour améliorer l'écoulement de l'air.
in scheme: Aéronautique
in scheme: Défense
in scheme: concepts
notation: DEFE184
note: Le terme « karman » est à éviter.

radioalignement de descente
type: ConceptConcept
type: Concept
creator: Commission d'enrichissement de la langue française, FranceTerme
source: révision de l'arrêté du 12 août 1976
date parution JO: 2000-09-22
equivalent EN: glide path @en
equivalent EN: glide path (en)
equivalent EN: glide slope @en
equivalent EN: glide slope (en)
definition: Dans le système d'atterrissage aux instruments ILS, dispositif indiquant l'écart vertical de l'aéronef par rapport à sa trajectoire de descente optimale.
in scheme: Aéronautique
in scheme: Défense
in scheme: concepts
notation: DEFE185

radioborne
type: ConceptConcept
type: Concept
creator: Commission d'enrichissement de la langue française, FranceTerme
source: révision de l'arrêté du 12 août 1976
date parution JO: 2000-09-22
equivalent EN: marker beacon @en
equivalent EN: marker beacon (en)
part of speech: nom féminin
definition: Émetteur de radionavigation qui rayonne un faisceau vertical en vue de fournir à un aéronef une indication de position.
in scheme: Aéronautique
in scheme: Défense
in scheme: concepts
notation: DEFE186

radiophare
type: ConceptConcept
type: Concept
creator: Commission d'enrichissement de la langue française, FranceTerme
source: révision de l'arrêté du 12 août 1976
date parution JO: 2000-09-22
equivalent EN: radio beacon @en
equivalent EN: radio beacon (en)
part of speech: nom masculin
definition: Émetteur de radionavigation destiné à permettre à un aéronef ou à un navire de déterminer son relèvement ou sa direction par rapport à l'antenne de cet émetteur.
in scheme: Aéronautique
in scheme: Défense
in scheme: concepts
notation: DEFE187
related: radiophare d'alignement

radiophare d'alignement
type: ConceptConcept
type: Concept
creator: Commission d'enrichissement de la langue française, FranceTerme
source: révision de l'arrêté du 12 août 1976
date parution JO: 2000-09-22
equivalent EN: radio range @en
equivalent EN: radio range (en)
equivalent EN: range @en
equivalent EN: range (en)
definition: Radiophare définissant dans l'espace un ou plusieurs plans verticaux séparant des régions distinctes.
in scheme: Aéronautique
in scheme: Défense
in scheme: concepts
notation: DEFE188
related: radiophare

radioralliement
type: ConceptConcept
type: Concept
creator: Commission d'enrichissement de la langue française, FranceTerme
source: révision de l'arrêté du 12 août 1976
date parution JO: 2000-09-22
deconseille ou frequent: ralliement
equivalent EN: homing @en
equivalent EN: homing (en)
part of speech: nom masculin
definition: Navigation d'un aéronef se dirigeant continuellement vers une station émettrice grâce aux signaux émis par cette station.
in scheme: Aéronautique
in scheme: Défense
in scheme: concepts
notation: DEFE189
note: Peut être abrégé en « ralliement » s'il n'y a pas d'ambiguïté.

réacteur à double flux
type: ConceptConcept
type: Concept
creator: Commission d'enrichissement de la langue française, FranceTerme
source: révision de l'arrêté du 12 août 1976
date parution JO: 2000-09-22
equivalent EN: by-pass engine @en
equivalent EN: by-pass engine (en)
equivalent EN: fan engine @en
equivalent EN: fan engine (en)
equivalent EN: fan jet @en
equivalent EN: fan jet (en)
equivalent EN: turbofan @en
equivalent EN: turbofan (en)
definition: Turboréacteur fondé sur le principe de la dilution, mélange du flux primaire chaud passant par la turbine avec un flux secondaire froid provenant d'une soufflante.
in scheme: Aéronautique
in scheme: Défense
in scheme: concepts
notation: DEFE190
related: taux de dilution
related: soufflante

réducteur de portance
type: ConceptConcept
type: Concept
creator: Commission d'enrichissement de la langue française, FranceTerme
source: révision de l'arrêté du 12 août 1976
date parution JO: 2000-09-22
equivalent EN: spoiler @en
equivalent EN: spoiler (en)
definition: Dispositif aérodynamique provoquant une diminution de la portance d'une voilure ou de la poussée d'un réacteur ou d'un moteur-fusée.
in scheme: Aéronautique
in scheme: Défense
in scheme: concepts
notation: DEFE191

refroidissement par film fluide
type: ConceptConcept
type: Concept
creator: Commission d'enrichissement de la langue française, FranceTerme
source: révision de l'arrêté du 12 août 1976
date parution JO: 2000-09-22
equivalent EN: film cooling @en
equivalent EN: film cooling (en)
definition: Refroidissement d'une surface comme celle d'une aube de turbine, d'une tête de missile, etc., portée à très haute température par projection continue sur cette surface d'une couche mince de fluide réfrigérant.
in scheme: Défense
in scheme: concepts
notation: DEFE192

rupteur
type: ConceptConcept
type: Concept
creator: Commission d'enrichissement de la langue française, FranceTerme
source: révision de l'arrêté du 12 août 1976
date parution JO: 2000-09-22
equivalent EN: breaker @en
equivalent EN: breaker (en)
part of speech: nom masculin
definition: Dans une bobine d'induction, appareil servant à interrompre et rétablir successivement le courant primaire.
in scheme: Électricité
in scheme: Énergie
in scheme: concepts
notation: DEFE193
related: sectionneur

sangle de sauvetage
type: ConceptConcept
type: Concept
creator: Commission d'enrichissement de la langue française, FranceTerme
source: révision de l'arrêté du 17 avril 1989
date parution JO: 2000-09-22
equivalent EN: horse collar @en
equivalent EN: horse collar (en)
equivalent EN: rescue sling @en
equivalent EN: rescue sling (en)
equivalent EN: rescue strap @en
equivalent EN: rescue strap (en)
definition: Partie d'un équipement de sauvetage qui, placée autour de la poitrine d'une personne, permet de l'attacher à une ligne de sauvetage ou au câble du treuil d'un hélicoptère.
in scheme: Aéronautique
in scheme: Défense
in scheme: concepts
notation: DEFE194

sangle d'ouverture automatique
type: ConceptConcept
type: Concept
creator: Commission d'enrichissement de la langue française, FranceTerme
source: révision de l'arrêté du 12 août 1976
abbreviation: SOA
date parution JO: 2000-09-22
equivalent EN: static line @en
equivalent EN: static line (en)
definition: Sangle dont une extrémité est accrochée avant un saut en parachute à un point fixe de l'aéronef, et qui se délove au début du saut pour provoquer automatiquement l'ouverture du parachute lorsqu'elle est tendue.
in scheme: Aéronautique
in scheme: Défense
in scheme: concepts
notation: DEFE195

sectionneur
type: ConceptConcept
type: Concept
creator: Commission d'enrichissement de la langue française, FranceTerme
source: révision de l'arrêté du 12 août 1976
date parution JO: 2000-09-22
equivalent EN: breaker @en
equivalent EN: breaker (en)
part of speech: nom masculin
definition: Appareil qui sert à couper le courant sur une section de ligne pour y permettre des réparations.
in scheme: Électricité
in scheme: Énergie
in scheme: concepts
notation: DEFE196
related: rupteur

serpentage
type: ConceptConcept
type: Concept
creator: Commission d'enrichissement de la langue française, FranceTerme
source: révision de l'arrêté du 12 août 1976
date parution JO: 2000-09-22
equivalent EN: snaking @en
equivalent EN: snaking (en)
part of speech: nom masculin
definition: Oscillations assez rapides d'un aéronef autour de l'axe de lacet.
in scheme: Aéronautique
in scheme: Défense
in scheme: concepts
notation: DEFE197

silence radio
type: ConceptConcept
type: Concept
creator: Commission d'enrichissement de la langue française, FranceTerme
source: révision de l'arrêté du 12 août 1976
date parution JO: 2000-09-22
deconseille ou frequent: blackout
equivalent EN: black-out @en
equivalent EN: black-out (en)
definition: Interruption de toute émission électromagnétique en vue d'éviter de signaler sa position à l'ennemi.
in scheme: Aéronautique
in scheme: Défense
in scheme: concepts
notation: DEFE198

simulateur de vol
type: ConceptConcept
type: Concept
creator: Commission d'enrichissement de la langue française, FranceTerme
source: révision de l'arrêté du 12 août 1976
date parution JO: 2000-09-22
equivalent EN: flight simulator @en
equivalent EN: flight simulator (en)
equivalent EN: link trainer @en
equivalent EN: link trainer (en)
definition: Installation servant à l'instruction au sol du personnel navigant et capable de reproduire les différentes conditions de vol ainsi que les organes de commande et de contrôle.
in scheme: Aéronautique
in scheme: Défense
in scheme: concepts
notation: DEFE199

adaptateur de phase
type: ConceptConcept
type: Concept
creator: Commission d'enrichissement de la langue française, FranceTerme
source: révision de l'arrêté du 12 août 1976
date parution JO: 2000-09-22
equivalent EN: phase adapter @en
equivalent EN: phase adapter (en)
definition: Dispositif couplant les phases de deux courants alternatifs.
in scheme: Électronique
in scheme: concepts
notation: DEFE2

attaque à dose totale
type: ConceptConcept
type: Concept
creator: Commission d'enrichissement de la langue française, FranceTerme
source: révision de l'arrêté du 17 avril 1989
date parution JO: 2000-09-22
equivalent EN: total dose attack @en
equivalent EN: total dose attack (en)
definition: Opérations chimiques n'impliquant pas une limitation de temps pour la mise en œuvre de la quantité de toxique requise.
in scheme: Défense
in scheme: concepts
notation: DEFE20

soutien logistique à la mer
type: ConceptConcept
type: Concept
creator: Commission d'enrichissement de la langue française, FranceTerme
source: révision de l'arrêté du 15 juin 1991
date parution JO: 2000-09-22
equivalent EN: afloat support @en
equivalent EN: afloat support (en)
definition: Soutien apporté en dehors des limites d'un port et au cours duquel l'approvisionnement des forces navales est assuré en route ou au mouillage.
in scheme: Défense
in scheme: Marine
in scheme: concepts
notation: DEFE202

suivi du terrain
type: ConceptConcept
type: Concept
creator: Commission d'enrichissement de la langue française, FranceTerme
source: révision de l'arrêté du 5 octobre 1984
date parution JO: 2000-09-22
equivalent EN: ground following @en
equivalent EN: ground following (en)
definition: Méthode de navigation à basse altitude, permettant le maintien d'une hauteur constante au-dessus du sol, grâce à la mise en œuvre d'équipements ou d'une technique de pilotage appropriée.
in scheme: Aéronautique
in scheme: Défense
in scheme: concepts
notation: DEFE203

superdécrochage
type: ConceptConcept
type: Concept
creator: Commission d'enrichissement de la langue française, FranceTerme
source: révision de l'arrêté du 5 octobre 1984
date parution JO: 2000-09-22
equivalent EN: deep stall @en
equivalent EN: deep stall (en)
part of speech: nom masculin
definition: Régime de vol critique dans lequel l'aéronef se stabilise à une incidence supérieure à l'incidence normale de décrochage de sa voilure.
in scheme: Aéronautique
in scheme: Défense
in scheme: concepts
notation: DEFE204

support élastique
type: ConceptConcept
type: Concept
creator: Commission d'enrichissement de la langue française, FranceTerme
source: révision de l'arrêté du 12 août 1976
date parution JO: 2000-09-22
deconseille ou frequent: Silent-Block
deconseille ou frequent: silentblock
definition: Articulation ou fixation en matériau souple destinée à amortir les vibrations et, accessoirement, le bruit de l'élément supporté.
in scheme: Tous domaines
in scheme: concepts
notation: DEFE205
note: « Silent-Block », marque déposée, ne doit pas être employé.

suraccélération
type: ConceptConcept
type: Concept
creator: Commission d'enrichissement de la langue française, FranceTerme
source: révision de l'arrêté du 12 août 1976
date parution JO: 2000-09-22
equivalent EN: jerk @en
equivalent EN: jerk (en)
part of speech: nom féminin
definition: Dérivée troisième de l'espace par rapport au temps.
in scheme: Défense
in scheme: concepts
notation: DEFE206

symétrique
type: ConceptConcept
type: Concept
creator: Commission d'enrichissement de la langue française, FranceTerme
source: révision de l'arrêté du 12 août 1976
date parution JO: 2000-09-22
equivalent EN: push-pull @en
equivalent EN: push-pull (en)
part of speech: adjectif
definition: Se dit d'un montage électronique souvent utilisé dans les amplificateurs et dont les deux éléments fonctionnent constamment en opposition de phase.
in scheme: Électronique
in scheme: concepts
notation: DEFE207

système antipatinage
type: ConceptConcept
type: Concept
creator: Commission d'enrichissement de la langue française, FranceTerme
source: révision de l'arrêté du 5 octobre 1984
date parution JO: 2000-09-22
equivalent EN: anti-skid @en
equivalent EN: anti-skid (en)
definition: Dispositif permettant, en cours de freinage à l'atterrissage, d'éviter tout blocage des roues d'un avion, et d'assurer ainsi une meilleure efficacité de ses freins.
in scheme: Aéronautique
in scheme: Défense
in scheme: concepts
notation: DEFE208

système d'armes
type: ConceptConcept
type: Concept
creator: Commission d'enrichissement de la langue française, FranceTerme
source: révision de l'arrêté du 17 avril 1989
date parution JO: 2000-09-22
equivalent EN: weapons system @en
equivalent EN: weapons system (en)
definition: Ensemble comportant une ou plusieurs armes, ainsi que l'équipement, le matériel, les services, le personnel, les moyens de déplacement et de lancement nécessaires à son autonomie.
in scheme: Défense
in scheme: concepts
notation: DEFE209
related: drone armé
related: système d'armes létal autonome

attente (en)
type: ConceptConcept
type: Concept
creator: Commission d'enrichissement de la langue française, FranceTerme
source: révision de l'arrêté du 12 août 1976
date parution JO: 2000-09-22
deconseille ou frequent: attente
deconseille ou frequent: en attente
deconseille ou frequent: en stand-by
equivalent EN: stand-by @en
equivalent EN: stand-by (en)
part of speech: locution adjectivale
definition: Placé sur une liste d'attente.
in scheme: Transports et mobilité
in scheme: concept-SD-transports-et-mobilite-transport-aerien
in scheme: concepts
notation: DEFE21
note: 1. Exemple : un passager en attente.
note: 2. L'expression « en stand-by » ne doit pas être utilisée.

système de rentrée
type: ConceptConcept
type: Concept
creator: Commission d'enrichissement de la langue française, FranceTerme
source: révision de l'arrêté du 5 octobre 1984
date parution JO: 2000-09-22
equivalent EN: reentry system @en
equivalent EN: reentry system (en)
definition: Sur un missile balistique ou un astronef, ensemble constitué par le ou les corps de rentrée et leur support.
in scheme: Aéronautique
in scheme: Défense
in scheme: concepts
notation: DEFE210
related: corps de rentrée

taux de dilution
type: ConceptConcept
type: Concept
creator: Commission d'enrichissement de la langue française, FranceTerme
source: révision de l'arrêté du 12 août 1976
date parution JO: 2000-09-22
equivalent EN: bypass ratio @en
equivalent EN: bypass ratio (en)
definition: Dans un réacteur à double flux, rapport du débit du flux secondaire à celui du flux primaire.
in scheme: Aéronautique
in scheme: Défense
in scheme: concepts
notation: DEFE211
related: réacteur à double flux

tirefort
type: ConceptConcept
type: Concept
creator: Commission d'enrichissement de la langue française, FranceTerme
source: révision de l'arrêté du 5 octobre 1984
date parution JO: 2000-09-22
equivalent EN: tackle @en
equivalent EN: tackle (en)
part of speech: nom masculin
definition: Appareil de traction par câble conçu pour des emplois mobiles et semi-fixes.
in scheme: Défense
in scheme: concept-SD-defense-materiel
in scheme: concepts
notation: DEFE212

transport à l'élingue
type: ConceptConcept
type: Concept
creator: Commission d'enrichissement de la langue française, FranceTerme
source: révision de l'arrêté du 5 octobre 1984
date parution JO: 2000-09-22
equivalent EN: sling transport @en
equivalent EN: sling transport (en)
definition: Technique de transport permettant de déplacer une charge accrochée sous un hélicoptère par une ou plusieurs élingues.
in scheme: Aéronautique
in scheme: Défense
in scheme: concepts
notation: DEFE213

transporteur de palettes
type: ConceptConcept
type: Concept
creator: Commission d'enrichissement de la langue française, FranceTerme
source: révision de l'arrêté du 5 octobre 1984
date parution JO: 2000-09-22
deconseille ou frequent: transpalette
equivalent EN: pallet truck @en
equivalent EN: pallet truck (en)
equivalent EN: transpallet @en
equivalent EN: transpallet (en)
definition: Chariot, en général sans moteur, servant au déplacement au sol de charges sur de courtes distances.
in scheme: Transports et mobilité
in scheme: concepts
notation: DEFE214
note: Le terme « transpalette » est l'abréviation usuelle de « transporteur de palettes ».

tremblement
type: ConceptConcept
type: Concept
creator: Commission d'enrichissement de la langue française, FranceTerme
source: révision de l'arrêté du 12 août 1976
date parution JO: 2000-09-22
equivalent EN: buffeting @en
equivalent EN: buffeting (en)
part of speech: nom masculin
definition: Vibrations aéroélastiques, irrégulières et de basse fréquence, affectant la cellule d'un avion.
in scheme: Aéronautique
in scheme: Défense
in scheme: concepts
notation: DEFE215

turbulence par temps clair
type: ConceptConcept
type: Concept
creator: Commission d'enrichissement de la langue française, FranceTerme
source: révision de l'arrêté du 12 août 1976
date parution JO: 2000-09-22
equivalent EN: clear air turbulence @en
equivalent EN: clear air turbulence (en)
definition: Dans l'atmosphère libre, turbulence non associée à des nuages.
in scheme: Défense
in scheme: concepts
notation: DEFE216

utilitaire
type: ConceptConcept
type: Concept
creator: Commission d'enrichissement de la langue française, FranceTerme
source: révision de l'arrêté du 12 août 1976
date parution JO: 2000-09-22
deconseille ou frequent: usage multiple
deconseille ou frequent: à usage multiple
equivalent EN: utility @en
equivalent EN: utility (en)
part of speech: adjectif
alternative label: usage multiple (à)
definition: Se dit d'un véhicule capable d'assurer des fonctions très différentes : transport de matériel et de personnes, évacuation sanitaire, missions de combat, etc.
in scheme: Tous domaines
in scheme: concepts
notation: DEFE217

verrière
type: ConceptConcept
type: Concept
creator: Commission d'enrichissement de la langue française, FranceTerme
source: révision de l'arrêté du 12 août 1976
date parution JO: 2000-09-22
equivalent EN: canopy @en
equivalent EN: canopy (en)
part of speech: nom féminin
definition: Partie vitrée du poste de pilotage d'un aéronef.
in scheme: Aéronautique
in scheme: Défense
in scheme: concepts
notation: DEFE219
related: habitacle

attente (en)
type: ConceptConcept
type: Concept
creator: Commission d'enrichissement de la langue française, FranceTerme
source: révision de l'arrêté du 5 octobre 1984
date parution JO: 2000-09-22
deconseille ou frequent: attente
deconseille ou frequent: en attente
equivalent EN: holding @en
equivalent EN: holding (en)
part of speech: locution adjectivale
definition: À qui on n'a pas donné l'autorisation d'entreprendre ou de poursuivre sa manœuvre.
in scheme: Transports et mobilité
in scheme: concept-SD-transports-et-mobilite-transport-aerien
in scheme: concepts
notation: DEFE22
note: Exemple : un aéronef en attente.

vibreur de manche
type: ConceptConcept
type: Concept
creator: Commission d'enrichissement de la langue française, FranceTerme
source: révision de l'arrêté du 5 octobre 1984
date parution JO: 2000-09-22
equivalent EN: stick shaker @en
equivalent EN: stick shaker (en)
definition: Dispositif permettant d'avertir le pilote de la proximité de l'incidence limite, grâce à une agitation artificielle du manche.
in scheme: Aéronautique
in scheme: Défense
in scheme: concepts
notation: DEFE220

vibreur de palonnier
type: ConceptConcept
type: Concept
creator: Commission d'enrichissement de la langue française, FranceTerme
source: révision de l'arrêté du 5 octobre 1984
date parution JO: 2000-09-22
equivalent EN: pedal shaker @en
equivalent EN: pedal shaker (en)
definition: Dispositif permettant d'avertir le pilote de la proximité de la perte de contrôle latéral à grande incidence, grâce à une agitation artificielle du palonnier.
in scheme: Aéronautique
in scheme: Défense
in scheme: concepts
notation: DEFE221

vitesse décisive
type: ConceptConcept
type: Concept
creator: Commission d'enrichissement de la langue française, FranceTerme
source: révision de l'arrêté du 5 octobre 1984
date parution JO: 2000-09-22
equivalent EN: decision speed @en
equivalent EN: decision speed (en)
definition: Vitesse maximale d'un aéronef en deçà de laquelle le pilote peut décider d'interrompre le décollage.
in scheme: Aéronautique
in scheme: Défense
in scheme: concepts
notation: DEFE222

vitesse de décrochage
type: ConceptConcept
type: Concept
creator: Commission d'enrichissement de la langue française, FranceTerme
source: révision de l'arrêté du 5 octobre 1984
date parution JO: 2000-09-22
equivalent EN: stalling speed @en
equivalent EN: stalling speed (en)
definition: Vitesse d'un avion dans une configuration déterminée, à laquelle se produit la perte de contrôle de l'appareil autour de l'un quelconque de ses trois axes de référence.
in scheme: Aéronautique
in scheme: Défense
in scheme: concepts
notation: DEFE223

volet fluide
type: ConceptConcept
type: Concept
creator: Commission d'enrichissement de la langue française, FranceTerme
source: révision de l'arrêté du 17 avril 1989
date parution JO: 2000-09-22
equivalent EN: jet flap @en
equivalent EN: jet flap (en)
definition: Système hypersustentateur dans lequel une nappe d'air soufflé éjectée vers le bas du bord de fuite de l'aile remplace les volets classiques.
in scheme: Aéronautique
in scheme: Défense
in scheme: concepts
notation: DEFE224

vol tactique
type: ConceptConcept
type: Concept
creator: Commission d'enrichissement de la langue française, FranceTerme
source: révision de l'arrêté du 17 avril 1989
date parution JO: 2000-09-22
equivalent EN: terrain flight @en
equivalent EN: terrain flight (en)
definition: Vol près du sol au cours duquel la vitesse, la hauteur ou l'altitude sont adaptées au relief et aux obstacles dans le but d'éviter la détection et le feu de l'ennemi.
in scheme: Aéronautique
in scheme: Défense
in scheme: concepts
notation: DEFE225

vulnérabilité électromagnétique
type: ConceptConcept
type: Concept
creator: Commission d'enrichissement de la langue française, FranceTerme
source: révision de l'arrêté du 15 juin 1991
date parution JO: 2000-09-22
equivalent EN: electromagnetic vulnerability @en
equivalent EN: electromagnetic vulnerability (en)
definition: Caractéristiques d'un système susceptible d'être perturbé ou rendu inopérant par des interférences électromagnétiques.
in scheme: Défense
in scheme: concepts
notation: DEFE226

aéronef à décollage court et atterrissage vertical
type: ConceptConcept
type: Concept
creator: Commission d'enrichissement de la langue française, FranceTerme
abbreviation: ADCAV
abbreviation: STOVL aircraft @en
date parution JO: 2001-04-18
equivalent EN: STOVL aircraft @en
equivalent EN: STOVL aircraft (en)
equivalent EN: short take-off and vertical landing aircraft @en
equivalent EN: short take-off and vertical landing aircraft (en)
definition: Avion capable de franchir un obstacle de 15 m de hauteur situé à 450 m du début de la course au décollage et d'atterrir verticalement.
in scheme: Aéronautique
in scheme: Défense
in scheme: concepts
notation: DEFE227

allumage
type: ConceptConcept
type: Concept
creator: Commission d'enrichissement de la langue française, FranceTerme
date parution JO: 2001-04-18
equivalent EN: firing @en
equivalent EN: firing (en)
equivalent EN: ignition @en
equivalent EN: ignition (en)
part of speech: nom masculin
definition: Opération donnant naissance à la combustion d'une poudre ou d'une charge propulsive.
in scheme: Défense
in scheme: concept-SD-defense-armement
in scheme: concept-SD-defense-materiaux-energetiques
in scheme: concepts
notation: DEFE228
related: allumeur de charges propulsives

allumeur de charges propulsives
type: ConceptConcept
type: Concept
creator: Commission d'enrichissement de la langue française, FranceTerme
date parution JO: 2001-04-18
definition: Dispositif pyrotechnique comprenant un inflammateur et qui remplit la fonction d'allumage d'une charge propulsive.
in scheme: Défense
in scheme: Spatiologie
in scheme: concepts
notation: DEFE229
related: allumage
related: inflammateur

atterrissage sur le ventre
type: ConceptConcept
type: Concept
creator: Commission d'enrichissement de la langue française, FranceTerme
source: révision de l'arrêté du 5 octobre 1984
date parution JO: 2000-09-22
equivalent EN: belly landing @en
equivalent EN: belly landing (en)
definition: Atterrissage d'un aéronef, à caractère accidentel ou exceptionnel, le plus souvent dû à une défectuosité du système de sortie du train.
in scheme: Aéronautique
in scheme: Défense
in scheme: concepts
notation: DEFE23

autopropulsion à poudre
type: ConceptConcept
type: Concept
creator: Commission d'enrichissement de la langue française, FranceTerme
date parution JO: 2001-04-18
definition: Système de propulsion de type fusée dont la poussée est assurée par la combustion d'une poudre dont l'engin est lui-même porteur.
in scheme: Défense
in scheme: concept-SD-defense-armement
in scheme: concept-SD-defense-materiaux-energetiques
in scheme: concepts
notation: DEFE230

blindage réactif
type: ConceptConcept
type: Concept
creator: Commission d'enrichissement de la langue française, FranceTerme
date parution JO: 2001-04-18
deconseille ou frequent: explosive reactive armor
deconseille ou frequent: explosive reactive armour
equivalent EN: explosive reactive armor (US) @en
equivalent EN: explosive reactive armor (en-US)
equivalent EN: explosive reactive armour (GB) @en
equivalent EN: explosive reactive armour (en-GB)
equivalent EN: explosive-based reactive armour @en
equivalent EN: explosive-based reactive armour (en)
definition: Blindage comportant, intercalée dans sa structure, une couche d'explosif qui contribue à réduire les effets d'une charge creuse.
in scheme: Défense
in scheme: concept-SD-defense-armement
in scheme: concept-SD-defense-materiaux-energetiques
in scheme: concepts
notation: DEFE231

charge creuse
type: ConceptConcept
type: Concept
creator: Commission d'enrichissement de la langue française, FranceTerme
date parution JO: 2001-04-18
equivalent EN: shaped-charge cone @en
equivalent EN: shaped-charge cone (en)
definition: Charge explosive présentant un évidement aménagé de façon à augmenter la puissance perforante.
in scheme: Défense
in scheme: concept-SD-defense-armement
in scheme: concept-SD-defense-materiaux-energetiques
in scheme: concepts
notation: DEFE232

chargement bicomposé
type: ConceptConcept
type: Concept
creator: Commission d'enrichissement de la langue française, FranceTerme
date parution JO: 2001-04-18
equivalent EN: bi-loading grain @en
equivalent EN: bi-loading grain (en)
definition: Chargement particulier d'un propulseur obtenu en coulant successivement dans son enveloppe, deux propergols de vitesses de combustion différentes.
in scheme: Défense
in scheme: concept-SD-defense-armement
in scheme: concept-SD-defense-materiaux-energetiques
in scheme: concepts
notation: DEFE233

cycle du renseignement
type: ConceptConcept
type: Concept
creator: Commission d'enrichissement de la langue française, FranceTerme
date parution JO: 2001-04-18
equivalent EN: intelligence cycle @en
equivalent EN: intelligence cycle (en)
definition: Séquence des opérations par lesquelles les renseignements bruts sont obtenus, regroupés et rendus exploitables.
in scheme: Défense
in scheme: concept-SD-defense-renseignement
in scheme: concepts
notation: DEFE234
note: Ces opérations comprennent : l'orientation, la recherche, l'exploitation et la diffusion.
related: orientation de renseignement
related: recherche de renseignements

fusionnement
type: ConceptConcept
type: Concept
creator: Commission d'enrichissement de la langue française, FranceTerme
date parution JO: 2001-04-18
equivalent EN: processing @en
equivalent EN: processing (en)
part of speech: nom masculin
definition: Regroupement de renseignements, bruts ou non, qui proviennent de sources ou d'organismes différents et dont l'origine ne doit alors plus être apparente.
in scheme: Défense
in scheme: concept-SD-defense-renseignement
in scheme: concepts
notation: DEFE235

inflammateur
type: ConceptConcept
type: Concept
creator: Commission d'enrichissement de la langue française, FranceTerme
date parution JO: 2001-04-18
equivalent EN: squib @en
equivalent EN: squib (en)
part of speech: nom masculin
definition: Amorce pyrotechnique produisant principalement une flamme et utilisée dans la constitution des allumeurs de charges propulsives.
in scheme: Défense
in scheme: concept-SD-defense-armement
in scheme: concept-SD-defense-materiaux-energetiques
in scheme: concepts
notation: DEFE236
related: allumeur de charges propulsives

inhibage
type: ConceptConcept
type: Concept
creator: Commission d'enrichissement de la langue française, FranceTerme
date parution JO: 2001-04-18
equivalent EN: lining @en
equivalent EN: lining (en)
part of speech: nom masculin
definition: Opération qui consiste à revêtir avec un produit incombustible une partie de la surface d'un chargement de propergol solide afin de l'empêcher de s'allumer.
in scheme: Défense
in scheme: concept-SD-defense-armement
in scheme: concept-SD-defense-materiaux-energetiques
in scheme: concepts
notation: DEFE237

inhibiteur
type: ConceptConcept
type: Concept
creator: Commission d'enrichissement de la langue française, FranceTerme
date parution JO: 2001-04-18
equivalent EN: liner @en
equivalent EN: liner (en)
part of speech: nom masculin
definition: Produit incombustible dont on revêt une partie de la surface d'un chargement de propergol solide afin de l'empêcher de s'allumer.
in scheme: Défense
in scheme: concept-SD-defense-materiaux-energetiques
in scheme: concept-SD-defense-nucleaire
in scheme: concepts
notation: DEFE238

matériaux énergétiques de défense
type: ConceptConcept
type: Concept
creator: Commission d'enrichissement de la langue française, FranceTerme
abbreviation: MED
date parution JO: 2001-04-18
equivalent EN: defense energetic materials @en
equivalent EN: defense energetic materials (en)
definition: Ensemble de substances explosives à usage militaire (poudre pour armes, explosifs, propergols solides).
in scheme: Défense
in scheme: concept-SD-defense-armement
in scheme: concept-SD-defense-materiaux-energetiques
in scheme: concepts
notation: DEFE239

authentification
type: ConceptConcept
type: Concept
creator: Commission d'enrichissement de la langue française, FranceTerme
source: révision de l'arrêté du 5 octobre 1984
date parution JO: 2000-09-22
equivalent EN: authentication @en
equivalent EN: authentication (en)
part of speech: nom féminin
definition: Le fait de s'assurer, par une procédure conventionnelle, de la qualité de son correspondant.
in scheme: Défense
in scheme: concept-SD-defense-transmissions
in scheme: concepts
notation: DEFE24

mesures de soutien de guerre électronique
type: ConceptConcept
type: Concept
creator: Commission d'enrichissement de la langue française, FranceTerme
abbreviation: EWSM @en
date parution JO: 2001-04-18
equivalent EN: EWSM @en
equivalent EN: EWSM (en)
equivalent EN: electronic warfare support measures @en
equivalent EN: electronic warfare support measures (en)
broader: concept-defense
definition: Recherche, interception, identification et localisation des rayonnements électromagnétiques permettant de reconnaître une menace immédiate.
definition: Search, interception, identification and tracking of electromagnetic radiations allowing for an immediate threat to be identified. @en
in scheme: Défense
in scheme: concept-SD-defense-guerre-electronique
in scheme: concepts
notation: DEFE240
note: Information obtained this way is necessary in the application of electronic countermeasures and other tactical measures such as evading and selecting targets, or processing and guiding methods. @en
note: Les informations ainsi obtenues sont nécessaires à l'application de contremesures électroniques, ainsi que d'autres mesures d'ordre tactique telles que l'esquive, le choix des objectifs, des moyens de traitement et de guidage.
preferred label: electronic warfare support measures @en

mine télécommandable
type: ConceptConcept
type: Concept
creator: Commission d'enrichissement de la langue française, FranceTerme
date parution JO: 2001-04-18
equivalent EN: controllable mine @en
equivalent EN: controllable mine (en)
definition: Mine dont le fonctionnement peut être commandé à distance après sa pose ou son mouillage.
in scheme: Défense
in scheme: concept-SD-defense-armement
in scheme: concepts
notation: DEFE241

orientation de renseignement
type: ConceptConcept
type: Concept
creator: Commission d'enrichissement de la langue française, FranceTerme
date parution JO: 2001-04-18
equivalent EN: animating @en
equivalent EN: animating (en)
equivalent EN: directing @en
equivalent EN: directing (en)
forme abregee: orientation, n.f.
definition: Détermination des besoins, établissement du plan de recherche, envoi de demandes et d'ordres aux organismes de renseignement, contrôle de leur production.
in scheme: Défense
in scheme: concept-SD-defense-renseignement
in scheme: concepts
notation: DEFE242
related: cycle du renseignement

poudrion
type: ConceptConcept
type: Concept
creator: Commission d'enrichissement de la langue française, FranceTerme
date parution JO: 2001-04-18
part of speech: nom masculin
definition: Insigne des poudriers représentant un foudre ailé.
in scheme: Défense
in scheme: concept-SD-defense-armement
in scheme: concept-SD-defense-materiaux-energetiques
in scheme: concepts
notation: DEFE243

protection thermique
type: ConceptConcept
type: Concept
creator: Commission d'enrichissement de la langue française, FranceTerme
date parution JO: 2001-04-18
equivalent EN: thermal protection @en
equivalent EN: thermal protection (en)
definition: Opération qui consiste à interposer entre une source de chaleur et une structure un matériau capable de préserver l'intégrité de cette dernière pendant la durée de combustion du propergol.
in scheme: Défense
in scheme: concept-SD-defense-armement
in scheme: concept-SD-defense-materiaux-energetiques
in scheme: concepts
notation: DEFE244

recherche de renseignements
type: ConceptConcept
type: Concept
creator: Commission d'enrichissement de la langue française, FranceTerme
date parution JO: 2001-04-18
equivalent EN: collecting @en
equivalent EN: collecting (en)
forme abregee: recherche, n.f.
definition: Collecte des renseignements bruts par les organismes qualifiés et transmission de ces renseignements aux organismes d'exploitation.
in scheme: Défense
in scheme: concept-SD-defense-renseignement
in scheme: concepts
notation: DEFE245
related: cycle du renseignement
related: exploitation de site tactique

réducteur de traînée de culot
type: ConceptConcept
type: Concept
creator: Commission d'enrichissement de la langue française, FranceTerme
abbreviation: RTC
date parution JO: 2001-04-18
deconseille ou frequent: boute-culot
deconseille ou frequent: pousse-culot
equivalent EN: base-bleed @en
equivalent EN: base-bleed (en)
definition: Dispositif placé sur le culot d'un obus et actionné à la sortie de la bouche du canon, qui permet d'augmenter la portée par réduction de la traînée aérodynamique de l'obus.
in scheme: Défense
in scheme: concept-SD-defense-armement
in scheme: concept-SD-defense-materiaux-energetiques
in scheme: concepts
notation: DEFE246
note: Les termes « boute-culot » (langage professionnel) et « pousse-culot » (langage professionnel) sont des synonymes usuels.

renseignement brut
type: ConceptConcept
type: Concept
creator: Commission d'enrichissement de la langue française, FranceTerme
date parution JO: 2001-04-18
equivalent EN: information @en
equivalent EN: information (en)
definition: Donnée non traitée, de toute nature, qui peut être utilisée pour l'élaboration du renseignement.
in scheme: Défense
in scheme: concept-SD-defense-renseignement
in scheme: concepts
notation: DEFE247

tube porte-amorce
type: ConceptConcept
type: Concept
creator: Commission d'enrichissement de la langue française, FranceTerme
abbreviation: TPA
date parution JO: 2001-04-18
definition: Dispositif d'allumage d'une charge explosive, constitué d'une pièce tubulaire percée d'évents, d'une charge d'allumage et d'une amorce.
in scheme: Défense
in scheme: concept-SD-defense-armement
in scheme: concepts
notation: DEFE248

vivacité d'une poudre
type: ConceptConcept
type: Concept
creator: Commission d'enrichissement de la langue française, FranceTerme
date parution JO: 2001-04-18
forme abregee: vivacité, n.f.
definition: Aptitude d'une poudre ou d'un chargement propulsif à brûler plus ou moins vite en fonction de la composition chimique et de la forme géométrique des grains ou des brins de poudre.
in scheme: Défense
in scheme: concept-SD-defense-armement
in scheme: concept-SD-defense-materiaux-energetiques
in scheme: concepts
notation: DEFE249

autodirecteur
type: ConceptConcept
type: Concept
creator: Commission d'enrichissement de la langue française, FranceTerme
source: révision de l'arrêté du 12 août 1976
date parution JO: 2000-09-22
equivalent EN: homing head @en
equivalent EN: homing head (en)
equivalent EN: seeker head @en
equivalent EN: seeker head (en)
part of speech: adjectif
definition: Se dit d'un dispositif de bord électromagnétique, optique ou acoustique, servant à guider automatiquement un missile ou une torpille vers l'objectif.
in scheme: Défense
in scheme: concepts
notation: DEFE26
related: paillette

autorité des transports maritimes
type: ConceptConcept
type: Concept
creator: Commission d'enrichissement de la langue française, FranceTerme
source: révision de l'arrêté du 15 juin 1991
date parution JO: 2000-09-22
deconseille ou frequent: defence shipping authority
deconseille ou frequent: defense shipping authority
equivalent EN: defence shipping authority (GB) @en
equivalent EN: defence shipping authority (en-GB)
equivalent EN: defense shipping authority (US) @en
equivalent EN: defense shipping authority (en-US)
definition: Agence civile de l'OTAN, activée en temps de guerre ou de crise, dont le rôle est de répartir le plus efficacement possible les navires marchands affectés à la flotte alliée de transport maritime dans le but d'assurer le soutien optimal de l'effort commun.
in scheme: Défense
in scheme: Transports et mobilité
in scheme: concepts
notation: DEFE28

avion à flèche variable
type: ConceptConcept
type: Concept
creator: Commission d'enrichissement de la langue française, FranceTerme
source: révision de l'arrêté du 12 août 1976
date parution JO: 2000-09-22
equivalent EN: swing-wing aircraft @en
equivalent EN: swing-wing aircraft (en)
equivalent EN: variable geometry aircraft @en
equivalent EN: variable geometry aircraft (en)
definition: Avion dont la voilure peut pivoter en vol de façon à en faire varier la flèche dans certaines limites.
in scheme: Aéronautique
in scheme: Défense
in scheme: concepts
notation: DEFE29

adaptation aérodynamique
type: ConceptConcept
type: Concept
creator: Commission d'enrichissement de la langue française, FranceTerme
source: révision de l'arrêté du 5 octobre 1984
date parution JO: 2000-09-22
equivalent EN: aerodynamic matching @en
equivalent EN: aerodynamic matching (en)
definition: Pour des conditions de vol déterminées, le fait d'améliorer au maximum le fonctionnement, le rendement, etc., d'une entrée d'air ou de tout autre élément influant sur les caractéristiques aérodynamiques.
in scheme: Aérodynamique
in scheme: Aéronautique
in scheme: concepts
notation: DEFE3
related: concept-aerodynamique

balayage
type: ConceptConcept
type: Concept
creator: Commission d'enrichissement de la langue française, FranceTerme
source: révision de l'arrêté du 12 août 1976
date parution JO: 2000-09-22
equivalent EN: scanning @en
equivalent EN: scanning (en)
part of speech: nom masculin
definition: En technologie radar, exploration d'une zone à l'aide d'un faisceau électromagnétique.
in scheme: Défense
in scheme: concepts
notation: DEFE30

balayage en ligne
type: ConceptConcept
type: Concept
creator: Commission d'enrichissement de la langue française, FranceTerme
source: révision de l'arrêté du 12 août 1976
date parution JO: 2000-09-22
equivalent EN: line scanning @en
equivalent EN: line scanning (en)
definition: En technologie radar, exploration linéaire par un faisceau électromagnétique.
in scheme: Défense
in scheme: concepts
notation: DEFE31

balise
type: ConceptConcept
type: Concept
creator: Commission d'enrichissement de la langue française, FranceTerme
source: révision de l'arrêté du 12 août 1976
date parution JO: 2000-09-22
equivalent EN: marker @en
equivalent EN: marker (en)
part of speech: nom féminin
definition: Tout moyen de marquage d'un point de la surface terrestre.
in scheme: Tous domaines
in scheme: concepts
notation: DEFE32

balise de ralliement
type: ConceptConcept
type: Concept
creator: Commission d'enrichissement de la langue française, FranceTerme
source: révision de l'arrêté du 12 août 1976
date parution JO: 2000-09-22
equivalent EN: locator @en
equivalent EN: locator (en)
definition: Radiophare de faible puissance servant à faciliter l'approche au radiocompas.
in scheme: Défense
in scheme: concepts
notation: DEFE33

bande d'atterrissage
type: ConceptConcept
type: Concept
creator: Commission d'enrichissement de la langue française, FranceTerme
source: révision de l'arrêté du 12 août 1976
date parution JO: 2000-09-22
equivalent EN: air strip @en
equivalent EN: air strip (en)
equivalent EN: runway strip @en
equivalent EN: runway strip (en)
definition: Portion de terrain rectangulaire aménagée pour le décollage et l'atterrissage des aéronefs et comprenant parfois une piste en dur.
in scheme: Aéronautique
in scheme: Défense
in scheme: concepts
notation: DEFE34

bande photographique
type: ConceptConcept
type: Concept
creator: Commission d'enrichissement de la langue française, FranceTerme
source: révision de l'arrêté du 12 août 1976
date parution JO: 2000-09-22
equivalent EN: strip @en
equivalent EN: strip (en)
definition: En aviation de reconnaissance, photographie aérienne d'une portion étroite de terrain.
in scheme: Aéronautique
in scheme: Défense
in scheme: concepts
notation: DEFE35

barbe
type: ConceptConcept
type: Concept
creator: Commission d'enrichissement de la langue française, FranceTerme
source: révision de l'arrêté du 12 août 1976
date parution JO: 2000-09-22
deconseille ou frequent: trichite
equivalent EN: whisker @en
equivalent EN: whisker (en)
part of speech: nom féminin
alternative label: trichite
definition: Filament monocristallin qui se développe à partir d'une surface métallique et dont la résistance à la rupture est très élevée.
in scheme: Matériaux
in scheme: concept-SD-materiaux-metallurgie
in scheme: concepts
notation: DEFE36

bec à fente
type: ConceptConcept
type: Concept
creator: Commission d'enrichissement de la langue française, FranceTerme
source: révision de l'arrêté du 5 octobre 1984
date parution JO: 2000-09-22
equivalent EN: slot @en
equivalent EN: slot (en)
definition: Système hypersustentateur de bord d'attaque de voilure qui, en position sortie, agit par un double effet de cambrure et de fente.
in scheme: Aéronautique
in scheme: Défense
in scheme: concepts
notation: DEFE37

bec basculant
type: ConceptConcept
type: Concept
creator: Commission d'enrichissement de la langue française, FranceTerme
source: révision de l'arrêté du 5 octobre 1984
date parution JO: 2000-09-22
equivalent EN: drooped nose @en
equivalent EN: drooped nose (en)
equivalent EN: drooping leading edge @en
equivalent EN: drooping leading edge (en)
definition: Système hypersustentateur, implanté au bord d'attaque d'une voilure et qui, par le basculement de la partie avant du profil, permet de créer un effet de cambrure approprié.
in scheme: Aéronautique
in scheme: Défense
in scheme: concepts
notation: DEFE38

bêche d'ancrage
type: ConceptConcept
type: Concept
creator: Commission d'enrichissement de la langue française, FranceTerme
source: révision de l'arrêté du 5 octobre 1984
date parution JO: 2000-09-22
equivalent EN: recoil-checking spade @en
equivalent EN: recoil-checking spade (en)
definition: Dispositif permettant, par appui sur le sol, d'augmenter l'adhérence et la stabilité à l'arrêt des véhicules et engins.
in scheme: Transports et mobilité
in scheme: concepts
notation: DEFE39

adaptation à l'usager
type: ConceptConcept
type: Concept
creator: Commission d'enrichissement de la langue française, FranceTerme
source: révision de l'arrêté du 12 août 1976
date parution JO: 2000-09-22
deconseille ou frequent: customisation
deconseille ou frequent: customization
equivalent EN: customisation (GB) @en
equivalent EN: customisation (en-GB)
equivalent EN: customization (US) @en
equivalent EN: customization (en-US)
alternative label: adaptation au client
definition: Adaptation d'un matériel fabriqué en série aux exigences particulières d'un usager.
in scheme: Tous domaines
in scheme: concepts
notation: DEFE4
related: personnalisation

bicylindre à plat
type: ConceptConcept
type: Concept
creator: Commission d'enrichissement de la langue française, FranceTerme
source: révision de l'arrêté du 12 août 1976
date parution JO: 2000-09-22
deconseille ou frequent: boxer
deconseille ou frequent: flat-four
deconseille ou frequent: quadricylindre à plat
equivalent EN: flat-twin @en
equivalent EN: flat-twin (en)
definition: Moteur à explosion à deux cylindres opposés et à axes parallèles.
in scheme: Moteur thermique
in scheme: concepts
notation: DEFE40
note: De même : quadricylindre à plat (en anglais : flat-four), etc.

blanc
type: ConceptConcept
type: Concept
creator: Commission d'enrichissement de la langue française, FranceTerme
source: révision de l'arrêté du 12 août 1976
date parution JO: 2000-09-22
equivalent EN: look-through @en
equivalent EN: look-through (en)
part of speech: nom masculin
definition: Interruption périodique et très brève d'une émission de brouillage afin de contrôler l'émission de l'adversaire pour suivre ses variations de fréquence ou interrompre le brouillage en temps voulu.
in scheme: Défense
in scheme: concept-SD-defense-guerre-electronique
in scheme: concepts
notation: DEFE41

bobine de démarrage
type: ConceptConcept
type: Concept
creator: Commission d'enrichissement de la langue française, FranceTerme
source: révision de l'arrêté du 12 août 1976
date parution JO: 2000-09-22
equivalent EN: booster coil @en
equivalent EN: booster coil (en)
alternative label: survolteur
definition: Bobine d'induction excitée par la batterie et destinée à fournir un courant de rupture permettant le démarrage d'un moteur à explosion.
in scheme: Moteur thermique
in scheme: concepts
notation: DEFE42

bombe guidée
type: ConceptConcept
type: Concept
creator: Commission d'enrichissement de la langue française, FranceTerme
source: révision de l'arrêté du 5 octobre 1984
date parution JO: 2000-09-22
equivalent EN: guided bomb @en
equivalent EN: guided bomb (en)
equivalent EN: smart bomb @en
equivalent EN: smart bomb (en)
definition: Projectile largué d'un avion, non propulsé mais guidé.
in scheme: Défense
in scheme: concept-SD-defense-armement
in scheme: concepts
notation: DEFE43

bombe orbitale
type: ConceptConcept
type: Concept
creator: Commission d'enrichissement de la langue française, FranceTerme
source: révision de l'arrêté du 5 octobre 1984
abbreviation: FOBS @en
date parution JO: 2000-09-22
equivalent EN: FOBS @en
equivalent EN: FOBS (en)
equivalent EN: fractional orbit bombardment system @en
equivalent EN: fractional orbit bombardment system (en)
definition: Projectile contenant une charge explosive, chimique, etc., qui est satellisé avant d'être dirigé, par l'action de rétrofusées, vers l'objectif qui lui est assigné.
in scheme: Défense
in scheme: concept-SD-defense-armement
in scheme: concepts
notation: DEFE44

bouchon de vapeur
type: ConceptConcept
type: Concept
creator: Commission d'enrichissement de la langue française, FranceTerme
source: révision de l'arrêté du 12 août 1976
date parution JO: 2000-09-22
deconseille ou frequent: vapor lock
deconseille ou frequent: vapour lock
equivalent EN: air lock @en
equivalent EN: air lock (en)
equivalent EN: vapor lock (US) @en
equivalent EN: vapor lock (en-US)
equivalent EN: vapour lock (GB) @en
equivalent EN: vapour lock (en-GB)
definition: Vapeur de carburant dont la présence dans une canalisation d'alimentation d'un moteur provoque l'arrêt ou la diminution du débit.
in scheme: Moteur thermique
in scheme: concepts
notation: DEFE45

boucle
type: ConceptConcept
type: Concept
creator: Commission d'enrichissement de la langue française, FranceTerme
source: révision de l'arrêté du 12 août 1976
date parution JO: 2000-09-22
deconseille ou frequent: looping
equivalent EN: loop @en
equivalent EN: loop (en)
part of speech: nom féminin
definition: Figure de voltige aérienne dans laquelle l'avion décrit une boucle fermée dans un plan vertical.
in scheme: Aéronautique
in scheme: Défense
in scheme: concepts
notation: DEFE46
note: On dit aussi « looping ».

bourdonnement
type: ConceptConcept
type: Concept
creator: Commission d'enrichissement de la langue française, FranceTerme
source: révision de l'arrêté du 12 août 1976
date parution JO: 2000-09-22
equivalent EN: buzz @en
equivalent EN: buzz (en)
part of speech: nom masculin
definition: Vibrations aéroélastiques de faible amplitude affectant la cellule d'un avion.
in scheme: Aéronautique
in scheme: Défense
in scheme: concepts
notation: DEFE47

brisance
type: ConceptConcept
type: Concept
creator: Commission d'enrichissement de la langue française, FranceTerme
source: révision de l'arrêté du 5 octobre 1984
date parution JO: 2000-09-22
equivalent EN: brisance @en
equivalent EN: brisance (en)
part of speech: nom féminin
definition: Aptitude d'un explosif à briser, sans bourrage préalable, tout corps solide mis à son contact.
in scheme: Défense
in scheme: concept-SD-defense-armement
in scheme: concepts
notation: DEFE48

brouillage
type: ConceptConcept
type: Concept
creator: Commission d'enrichissement de la langue française, FranceTerme
source: révision de l'arrêté du 12 août 1976
date parution JO: 2000-09-22
equivalent EN: jam @en
equivalent EN: jam (en)
equivalent EN: jamming @en
equivalent EN: jamming (en)
part of speech: nom masculin
definition: Émission, réémission ou réflexion de signaux électromagnétiques perturbant le fonctionnement de moyens de détection ou de radiocommunication.
in scheme: Défense
in scheme: concepts
notation: DEFE49
note: Le brouillage peut être délibéré ou accidentel.
related: brouilleur

aérodistorsion
type: ConceptConcept
type: Concept
creator: Commission d'enrichissement de la langue française, FranceTerme
source: révision de l'arrêté du 5 octobre 1984
date parution JO: 2000-09-22
equivalent EN: aeroelastic distortion @en
equivalent EN: aeroelastic distortion (en)
part of speech: nom féminin
definition: Déformation d'une structure sous l'influence des efforts aérodynamiques.
in scheme: Aérodynamique
in scheme: concepts
notation: DEFE5

brouilleur
type: ConceptConcept
type: Concept
creator: Commission d'enrichissement de la langue française, FranceTerme
source: révision de l'arrêté du 12 août 1976
date parution JO: 2000-09-22
equivalent EN: jammer @en
equivalent EN: jammer (en)
part of speech: nom masculin
definition: Émetteur radioélectrique destiné à produire un brouillage.
in scheme: Défense
in scheme: concepts
notation: DEFE50
related: brouillage

brûleur à double débit
type: ConceptConcept
type: Concept
creator: Commission d'enrichissement de la langue française, FranceTerme
source: révision de l'arrêté du 12 août 1976
date parution JO: 2000-09-22
deconseille ou frequent: brûleur duplex
equivalent EN: duplex burner @en
equivalent EN: duplex burner (en)
definition: Brûleur de turbomachine possédant deux orifices d'admission de carburant et un seul orifice de sortie.
in scheme: Aéronautique
in scheme: Défense
in scheme: concepts
notation: DEFE51
note: Le terme « brûleur duplex » est déconseillé.

câble coaxial
type: ConceptConcept
type: Concept
creator: Commission d'enrichissement de la langue française, FranceTerme
source: révision de l'arrêté du 12 août 1976
date parution JO: 2000-09-22
deconseille ou frequent: coaxial
equivalent EN: feeder @en
equivalent EN: feeder (en)
definition: Câble formé de deux conducteurs concentriques isolés, utilisé notamment pour l'alimentation électrique de certains types d'antennes.
in scheme: Électricité
in scheme: Énergie
in scheme: concepts
notation: DEFE52
note: On dit aussi, substantivement, « un coaxial » (langage professionnel).
related: ligne d'alimentation

cartouche de référence
type: ConceptConcept
type: Concept
creator: Commission d'enrichissement de la langue française, FranceTerme
source: révision de l'arrêté du 15 juin 1991
date parution JO: 2000-09-22
equivalent EN: reference box @en
equivalent EN: reference box (en)
definition: Cadre d'identification d'une carte placé dans la marge et contenant la désignation de série, le numéro de la feuille et le numéro d'édition sous une forme convenue.
in scheme: Défense
in scheme: concept-SD-defense-cartographie
in scheme: concepts
notation: DEFE54

centrale aérodynamique
type: ConceptConcept
type: Concept
creator: Commission d'enrichissement de la langue française, FranceTerme
source: révision de l'arrêté du 5 octobre 1984
date parution JO: 2000-09-22
equivalent EN: air data computer @en
equivalent EN: air data computer (en)
definition: Calculateur de bord qui centralise les données brutes fournies par des capteurs aérodynamiques, par exemple sur les pressions, les températures, et les transforme en informations utilisables directement dans le système de pilotage et de navigation de l'aéronef.
in scheme: Aérodynamique
in scheme: Aéronautique
in scheme: concepts
notation: DEFE55

charge offerte
type: ConceptConcept
type: Concept
creator: Commission d'enrichissement de la langue française, FranceTerme
source: révision de l'arrêté du 17 avril 1989
date parution JO: 2000-09-22
equivalent EN: allowable load @en
equivalent EN: allowable load (en)
definition: Charge maximale qu'un aéronef peut transporter sur une distance déterminée.
in scheme: Aéronautique
in scheme: Défense
in scheme: concepts
notation: DEFE56

charge sous élingue
type: ConceptConcept
type: Concept
creator: Commission d'enrichissement de la langue française, FranceTerme
source: révision de l'arrêté du 15 juin 1991
date parution JO: 2000-09-22
equivalent EN: underslung load @en
equivalent EN: underslung load (en)
definition: En héliportage, toute charge suspendue sous le fuselage d'un hélicoptère.
in scheme: Défense
in scheme: concept-SD-defense-logistique
in scheme: concept-SD-defense-operations
in scheme: concepts
notation: DEFE57

charge utile
type: ConceptConcept
type: Concept
creator: Commission d'enrichissement de la langue française, FranceTerme
source: révision de l'arrêté du 5 octobre 1984
date parution JO: 2000-09-22
equivalent EN: payload @en
equivalent EN: payload (en)
definition: Masse pour le transport de laquelle a été spécialement conçu un véhicule.
in scheme: Transports et mobilité
in scheme: concepts
notation: DEFE58

châssis-support
type: ConceptConcept
type: Concept
creator: Commission d'enrichissement de la langue française, FranceTerme
source: révision de l'arrêté du 12 août 1976
date parution JO: 2000-09-22
equivalent EN: mounting @en
equivalent EN: mounting (en)
part of speech: nom masculin
definition: Bâti destiné à recevoir un matériel, de transmission par exemple.
in scheme: Tous domaines
in scheme: concepts
notation: DEFE59

aéroélasticité
type: ConceptConcept
type: Concept
creator: Commission d'enrichissement de la langue française, FranceTerme
source: révision de l'arrêté du 5 octobre 1984
date parution JO: 2000-09-22
equivalent EN: aeroelasticity @en
equivalent EN: aeroelasticity (en)
part of speech: nom féminin
definition: Propriété qu'ont certains corps de reprendre, au moins partiellement, leur forme et leur volume primitifs quand la contrainte aérodynamique qui s'exerçait sur eux cesse d'agir.
in scheme: Aérodynamique
in scheme: concepts
notation: DEFE6

clameau
type: ConceptConcept
type: Concept
creator: Commission d'enrichissement de la langue française, FranceTerme
source: révision de l'arrêté du 5 octobre 1984
date parution JO: 2000-09-22
equivalent EN: cramp @en
equivalent EN: cramp (en) [En fer.]
equivalent EN: dog @en
equivalent EN: dog (en) [En bois.]
part of speech: nom masculin
definition: Pièce servant à réunir rapidement de grosses pièces de bois.
in scheme: Habitat et construction
in scheme: concept-SD-habitat-et-construction-materiaux-de-construction
in scheme: concepts
notation: DEFE60

cloison de décrochage
type: ConceptConcept
type: Concept
creator: Commission d'enrichissement de la langue française, FranceTerme
source: révision de l'arrêté du 12 août 1976
date parution JO: 2000-09-22
deconseille ou frequent: cloison
equivalent EN: fence @en
equivalent EN: fence (en)
equivalent EN: stall fence @en
equivalent EN: stall fence (en)
equivalent EN: wing fence @en
equivalent EN: wing fence (en)
definition: Lame parallèle à l'axe d'un avion guidant l'écoulement de l'air sur sa voilure.
in scheme: Aéronautique
in scheme: Défense
in scheme: concepts
notation: DEFE61
note: Peut être abrégé en « cloison » s'il n'y a pas ambiguïté.

collimateur de pilotage
type: ConceptConcept
type: Concept
creator: Commission d'enrichissement de la langue française, FranceTerme
source: révision de l'arrêté du 12 août 1976
abbreviation: HUD @en
date parution JO: 2000-09-22
equivalent EN: HUD @en
equivalent EN: HUD (en)
equivalent EN: head-up display @en
equivalent EN: head-up display (en)
definition: Dispositif de visualisation présentant les indications d'un groupe d'instruments de vol dans le champ de vision normal du pilote.
in scheme: Aéronautique
in scheme: Défense
in scheme: concepts
notation: DEFE62
related: concept-SPAT1373
related: concept-SPAT1374
related: concept-SPAT1375

combiné
type: ConceptConcept
type: Concept
creator: Commission d'enrichissement de la langue française, FranceTerme
source: révision de l'arrêté du 12 août 1976
abbreviation: compound @en
date parution JO: 2000-09-22
equivalent EN: compound @en
equivalent EN: compound (en)
equivalent EN: compound helicopter @en
equivalent EN: compound helicopter (en)
part of speech: nom masculin
definition: Giravion possédant une voilure tournante d'hélicoptère pour le vol vertical ou stationnaire en plus d'une voilure fixe et d'un propulseur d'avion pour le vol en translation.
in scheme: Aéronautique
in scheme: Défense
in scheme: concepts
notation: DEFE63

commande automatique généralisée
type: ConceptConcept
type: Concept
creator: Commission d'enrichissement de la langue française, FranceTerme
source: révision de l'arrêté du 5 octobre 1984
abbreviation: CAG
abbreviation: CCV @en
date parution JO: 2000-09-22
equivalent EN: CCV @en
equivalent EN: CCV (en)
equivalent EN: control configured vehicle @en
equivalent EN: control configured vehicle (en)
definition: Système de commande d'un aéronef, basé sur l'emploi de gouvernes commandées par calculateur, afin d'assurer notamment l'autostabilisation, l'atténuation des effets de la turbulence, la limitation des charges de manœuvre et l'élimination du flottement.
in scheme: Aéronautique
in scheme: Défense
in scheme: concepts
notation: DEFE64

commande de vol électrique
type: ConceptConcept
type: Concept
creator: Commission d'enrichissement de la langue française, FranceTerme
source: révision de l'arrêté du 5 octobre 1984
date parution JO: 2000-09-22
equivalent EN: fly-by-wire @en
equivalent EN: fly-by-wire (en)
definition: Système de pilotage dans lequel la timonerie mécanique entre pilote et vérins de commande est remplacée intégralement, sans commande de secours mécanique, par une transmission électrique avec interposition d'un calculateur analogique ou numérique.
in scheme: Aéronautique
in scheme: Défense
in scheme: concepts
notation: DEFE65
related: concept-aeronautique

commande directe de portance
type: ConceptConcept
type: Concept
creator: Commission d'enrichissement de la langue française, FranceTerme
source: révision de l'arrêté du 5 octobre 1984
date parution JO: 2000-09-22
equivalent EN: direct lift control @en
equivalent EN: direct lift control (en)
definition: Sur un aéronef à commande automatique généralisée, chaîne de commande agissant directement sur des gouvernes spéciales comme les volets, les plans canard, les déporteurs, en conjugaison avec des gouvernes classiques, pour accroître ou diminuer rapidement la portance et modifier ainsi la trajectoire de vol dans le plan de symétrie, sans créer de moment aérodynamique.
in scheme: Aéronautique
in scheme: Défense
in scheme: concepts
notation: DEFE66

commande latérale directe
type: ConceptConcept
type: Concept
creator: Commission d'enrichissement de la langue française, FranceTerme
source: révision de l'arrêté du 5 octobre 1984
date parution JO: 2000-09-22
equivalent EN: direct sideforce control @en
equivalent EN: direct sideforce control (en)
definition: Sur un aéronef à commande automatique généralisée, chaîne de commande agissant directement sur une ou des gouvernes spéciales comme les plans canard, en conjugaison avec les gouvernes classiques, pour modifier la trajectoire de vol perpendiculairement au plan de symétrie sans créer de moment aérodynamique.
in scheme: Aéronautique
in scheme: Défense
in scheme: concepts
notation: DEFE67

commandement de zone
type: ConceptConcept
type: Concept
creator: Commission d'enrichissement de la langue française, FranceTerme
source: révision de l'arrêté du 17 avril 1989
date parution JO: 2000-09-22
equivalent EN: area command @en
equivalent EN: area command (en)
definition: Commandement qui comprend des éléments organisés appartenant à une ou plusieurs forces ou armées destinées à opérer dans une zone géographique déterminée, et qui sont aux ordres d'un même chef.
in scheme: Défense
in scheme: concepts
notation: DEFE68

compatibilité électromagnétique
type: ConceptConcept
type: Concept
creator: Commission d'enrichissement de la langue française, FranceTerme
source: révision de l'arrêté du 17 avril 1989
date parution JO: 2000-09-22
equivalent EN: electromagnetic compatibility @en
equivalent EN: electromagnetic compatibility (en)
definition: Propriété d'un système, d'un équipement ou d'un dispositif, qui lui permet de fonctionner à plein rendement en présence d'un rayonnement électromagnétique donné, avec une marge de sécurité donnée, sans qu'il y ait perte de performance imputable au rayonnement reçu, ou perte inacceptable de performance d'un matériel attribuable au rayonnement émis.
in scheme: Défense
in scheme: concept-SD-defense-materiel
in scheme: concepts
notation: DEFE69

aide mutuelle
type: ConceptConcept
type: Concept
creator: Commission d'enrichissement de la langue française, FranceTerme
source: révision de l'arrêté du 12 août 1976
date parution JO: 2000-09-22
equivalent EN: cross-servicing @en
equivalent EN: cross-servicing (en)
alternative label: soutien logistique mutuel
definition: Fournitures de matériels ou prestations de services effectuées par un élément d'une armée ou d'une nation à une autre armée ou à une autre nation, éventuellement à titre onéreux.
in scheme: Défense
in scheme: concepts
notation: DEFE7

compensateur
type: ConceptConcept
type: Concept
creator: Commission d'enrichissement de la langue française, FranceTerme
source: révision de l'arrêté du 12 août 1976
date parution JO: 2000-09-22
equivalent EN: flettner @en
equivalent EN: flettner (en)
equivalent EN: tab @en
equivalent EN: tab (en)
part of speech: nom masculin
definition: Volet auxiliaire monté au bord de fuite d'une gouverne en vue de réaliser une compensation aérodynamique.
in scheme: Aéronautique
in scheme: Défense
in scheme: concepts
notation: DEFE70
note: Il peut être fixe, commandé ou automatique.
related: compensation

compensateur à ressort
type: ConceptConcept
type: Concept
creator: Commission d'enrichissement de la langue française, FranceTerme
source: révision de l'arrêté du 12 août 1976
date parution JO: 2000-09-22
equivalent EN: spring tab @en
equivalent EN: spring tab (en)
definition: Volet compensateur d'une gouverne muni d'un ressort.
in scheme: Aéronautique
in scheme: Défense
in scheme: concepts
notation: DEFE71

compensation
type: ConceptConcept
type: Concept
creator: Commission d'enrichissement de la langue française, FranceTerme
source: révision de l'arrêté du 12 août 1976
date parution JO: 2000-09-22
equivalent EN: trim @en
equivalent EN: trim (en)
part of speech: nom féminin
definition: Correction de l'effet des réactions aérodynamiques sur les gouvernes d'un avion en vue de réduire les efforts sur les commandes de vol généralement obtenue à l'aide de surfaces auxiliaires appelées « compensateurs ».
in scheme: Aéronautique
in scheme: Défense
in scheme: concepts
notation: DEFE72
related: équilibrage
related: compensateur
related: assiette

ordre d'opération
type: ConceptConcept
type: Concept
creator: Commission d'enrichissement de la langue française, FranceTerme
date parution JO: 2001-04-18
equivalent EN: operation order @en
equivalent EN: operation order (en)
in scheme: Défense
in scheme: concept-SD-defense-operations
in scheme: concepts
notation: DEFE726

désengagement
type: ConceptConcept
type: Concept
creator: Commission d'enrichissement de la langue française, FranceTerme
date parution JO: 2001-04-18
equivalent EN: withdrawal operation @en
equivalent EN: withdrawal operation (en)
part of speech: nom masculin
in scheme: Défense
in scheme: concept-SD-defense-operations
in scheme: concepts
notation: DEFE727

aire
type: ConceptConcept
type: Concept
creator: Commission d'enrichissement de la langue française, FranceTerme
source: révision de l'arrêté du 12 août 1976
date parution JO: 2000-09-22
equivalent EN: area @en
equivalent EN: area (en)
part of speech: nom féminin
in scheme: Défense
in scheme: concepts
notation: DEFE728

avion à décollage et atterrissage courts
type: ConceptConcept
type: Concept
creator: Commission d'enrichissement de la langue française, FranceTerme
source: révision de l'arrêté du 12 août 1976
abbreviation: ADAC
abbreviation: STOL aircraft @en
date parution JO: 2000-09-22
equivalent EN: STOL aircraft @en
equivalent EN: STOL aircraft (en)
equivalent EN: short take-off and landing aircraft @en
equivalent EN: short take-off and landing aircraft (en)
in scheme: Aéronautique
in scheme: Défense
in scheme: concepts
notation: DEFE729

convertisseur
type: ConceptConcept
type: Concept
creator: Commission d'enrichissement de la langue française, FranceTerme
source: révision de l'arrêté du 12 août 1976
date parution JO: 2000-09-22
equivalent EN: converter @en
equivalent EN: converter (en)
equivalent EN: inverter @en
equivalent EN: inverter (en)
part of speech: nom masculin
definition: Machine électrique destinée à changer les caractéristiques d'un courant électrique.
in scheme: Électricité
in scheme: Énergie
in scheme: concepts
notation: DEFE73
related: onduleur

amerrissage forcé
type: ConceptConcept
type: Concept
creator: Commission d'enrichissement de la langue française, FranceTerme
source: révision de l'arrêté du 12 août 1976
date parution JO: 2000-09-22
equivalent EN: ditching @en
equivalent EN: ditching (en)
in scheme: Aéronautique
in scheme: Défense
in scheme: concepts
notation: DEFE730
related: concept-aeronautique

avion à décollage et atterrissage verticaux
type: ConceptConcept
type: Concept
creator: Commission d'enrichissement de la langue française, FranceTerme
source: révision de l'arrêté du 12 août 1976
abbreviation: ADAV
abbreviation: VTOL aircraft @en
date parution JO: 2000-09-22
equivalent EN: VTOL aircraft @en
equivalent EN: VTOL aircraft (en)
equivalent EN: vertical take-off and landing aircraft @en
equivalent EN: vertical take-off and landing aircraft (en)
in scheme: Aéronautique
in scheme: Défense
in scheme: concepts
notation: DEFE731

balle traçante
type: ConceptConcept
type: Concept
creator: Commission d'enrichissement de la langue française, FranceTerme
source: révision de l'arrêté du 12 août 1976
date parution JO: 2000-09-22
equivalent EN: tracer @en
equivalent EN: tracer (en)
in scheme: Défense
in scheme: concept-SD-defense-armement
in scheme: concepts
notation: DEFE732

bande
type: ConceptConcept
type: Concept
creator: Commission d'enrichissement de la langue française, FranceTerme
source: révision de l'arrêté du 12 août 1976
date parution JO: 2000-09-22
equivalent EN: strip @en
equivalent EN: strip (en)
part of speech: nom féminin
in scheme: Défense
in scheme: concepts
notation: DEFE733

chef des navigateurs
type: ConceptConcept
type: Concept
creator: Commission d'enrichissement de la langue française, FranceTerme
source: révision de l'arrêté du 12 août 1976
date parution JO: 2000-09-22
equivalent EN: leader navigator @en
equivalent EN: leader navigator (en)
in scheme: Aéronautique
in scheme: Défense
in scheme: concepts
notation: DEFE735

chef des pilotes
type: ConceptConcept
type: Concept
creator: Commission d'enrichissement de la langue française, FranceTerme
source: révision de l'arrêté du 12 août 1976
date parution JO: 2000-09-22
equivalent EN: leader pilot @en
equivalent EN: leader pilot (en)
in scheme: Aéronautique
in scheme: Défense
in scheme: concepts
notation: DEFE736

collage
type: ConceptConcept
type: Concept
creator: Commission d'enrichissement de la langue française, FranceTerme
source: révision de l'arrêté du 12 août 1976
date parution JO: 2000-09-22
equivalent EN: bonding @en
equivalent EN: bonding (en)
part of speech: nom masculin
in scheme: Défense
in scheme: concepts
notation: DEFE737

commande à distance
type: ConceptConcept
type: Concept
creator: Commission d'enrichissement de la langue française, FranceTerme
source: révision de l'arrêté du 12 août 1976
date parution JO: 2000-09-22
equivalent EN: remote control @en
equivalent EN: remote control (en)
in scheme: Défense
in scheme: concepts
notation: DEFE738

contrôle opérationnel
type: ConceptConcept
type: Concept
creator: Commission d'enrichissement de la langue française, FranceTerme
source: révision de l'arrêté du 17 avril 1989
date parution JO: 2000-09-22
equivalent EN: operational control @en
equivalent EN: operational control (en)
in scheme: Défense
in scheme: concept-SD-defense-operations
in scheme: concepts
notation: DEFE739

corps de rentrée
type: ConceptConcept
type: Concept
creator: Commission d'enrichissement de la langue française, FranceTerme
source: révision de l'arrêté du 5 octobre 1984
date parution JO: 2000-09-22
equivalent EN: reentry vehicle @en
equivalent EN: reentry vehicle (en)
definition: Partie d'un missile balistique ou d'un spationef qui effectue une rentrée dans l'atmosphère, constituée du bouclier thermique, de la charge utile, et du dispositif de stabilisation.
in scheme: Défense
in scheme: Spatiologie
in scheme: concepts
notation: DEFE74
related: système de rentrée

densitomètre
type: ConceptConcept
type: Concept
creator: Commission d'enrichissement de la langue française, FranceTerme
source: révision de l'arrêté du 5 octobre 1984
date parution JO: 2000-09-22
equivalent EN: densitometer @en
equivalent EN: densitometer (en)
part of speech: nom masculin
in scheme: Défense
in scheme: concept-SD-defense-materiel
in scheme: concepts
notation: DEFE740

disjoncteur
type: ConceptConcept
type: Concept
creator: Commission d'enrichissement de la langue française, FranceTerme
source: révision de l'arrêté du 12 août 1976
abbreviation: breaker @en
date parution JO: 2000-09-22
equivalent EN: breaker @en
equivalent EN: breaker (en)
equivalent EN: circuit breaker @en
equivalent EN: circuit breaker (en)
part of speech: nom masculin
in scheme: Défense
in scheme: Électricité
in scheme: Énergie
in scheme: concepts
notation: DEFE741

entretien courant
type: ConceptConcept
type: Concept
creator: Commission d'enrichissement de la langue française, FranceTerme
source: révision de l'arrêté du 12 août 1976
date parution JO: 2000-09-22
equivalent EN: servicing @en
equivalent EN: servicing (en)
alternative label: service courant
in scheme: Défense
in scheme: concepts
notation: DEFE742

formation
type: ConceptConcept
type: Concept
creator: Commission d'enrichissement de la langue française, FranceTerme
source: révision de l'arrêté du 12 août 1976
date parution JO: 2000-09-22
equivalent EN: training @en
equivalent EN: training (en)
part of speech: nom féminin
in scheme: Tous domaines
in scheme: concepts
notation: DEFE744
related: formation en ligne

franchissement dans la foulée
type: ConceptConcept
type: Concept
creator: Commission d'enrichissement de la langue française, FranceTerme
source: révision de l'arrêté du 15 juin 1991
date parution JO: 2000-09-22
equivalent EN: hasty crossing @en
equivalent EN: hasty crossing (en)
in scheme: Défense
in scheme: concepts
notation: DEFE745

franchissement préparé
type: ConceptConcept
type: Concept
creator: Commission d'enrichissement de la langue française, FranceTerme
source: révision de l'arrêté du 17 avril 1989
date parution JO: 2000-09-22
equivalent EN: deliberate crossing @en
equivalent EN: deliberate crossing (en)
in scheme: Défense
in scheme: concepts
notation: DEFE746

gilet de sauvetage
type: ConceptConcept
type: Concept
creator: Commission d'enrichissement de la langue française, FranceTerme
source: révision de l'arrêté du 12 août 1976
date parution JO: 2000-09-22
equivalent EN: Mae West @en
equivalent EN: Mae West (en)
equivalent EN: life vest @en
equivalent EN: life vest (en)
in scheme: Aéronautique
in scheme: Défense
in scheme: concepts
notation: DEFE747

groupement temporaire
type: ConceptConcept
type: Concept
creator: Commission d'enrichissement de la langue française, FranceTerme
source: révision de l'arrêté du 6 janvier 1989
date parution JO: 2000-09-22
equivalent EN: TF @en
equivalent EN: TF (en)
equivalent EN: task force @en
equivalent EN: task force (en)
in scheme: Défense
in scheme: concepts
notation: DEFE748
related: force opérationnelle

guerre électronique
type: ConceptConcept
type: Concept
creator: Commission d'enrichissement de la langue française, FranceTerme
source: révision de l'arrêté du 17 avril 1989
date parution JO: 2000-09-22
equivalent EN: electronic warfare @en
equivalent EN: electronic warfare (en)
in scheme: Défense
in scheme: concept-SD-defense-guerre-electronique
in scheme: concepts
notation: DEFE749
related: concept-defense

hélicoptère antichar
type: ConceptConcept
type: Concept
creator: Commission d'enrichissement de la langue française, FranceTerme
source: révision de l'arrêté du 17 avril 1989
date parution JO: 2000-09-22
equivalent EN: antitank helicopter @en
equivalent EN: antitank helicopter (en)
in scheme: Défense
in scheme: concepts
notation: DEFE750

indicateur de zéro
type: ConceptConcept
type: Concept
creator: Commission d'enrichissement de la langue française, FranceTerme
source: révision de l'arrêté du 12 août 1976
date parution JO: 2000-09-22
equivalent EN: zero reading instrument @en
equivalent EN: zero reading instrument (en)
in scheme: Défense
in scheme: concepts
notation: DEFE751

indication d'élévation maximale
type: ConceptConcept
type: Concept
creator: Commission d'enrichissement de la langue française, FranceTerme
source: révision de l'arrêté du 17 avril 1989
date parution JO: 2000-09-22
equivalent EN: elevation figure @en
equivalent EN: elevation figure (en)
in scheme: Aéronautique
in scheme: Défense
in scheme: concepts
notation: DEFE752

journal de bord
type: ConceptConcept
type: Concept
creator: Commission d'enrichissement de la langue française, FranceTerme
source: révision de l'arrêté du 12 août 1976
date parution JO: 2000-09-22
equivalent EN: flight log @en
equivalent EN: flight log (en)
equivalent EN: log book @en
equivalent EN: log book (en)
in scheme: Aéronautique
in scheme: Défense
in scheme: concepts
notation: DEFE753

pas
type: ConceptConcept
type: Concept
creator: Commission d'enrichissement de la langue française, FranceTerme
source: révision de l'arrêté du 12 août 1976
date parution JO: 2000-09-22
equivalent EN: pitch @en
equivalent EN: pitch (en)
part of speech: nom masculin
in scheme: Aéronautique
in scheme: Défense
in scheme: concepts
notation: DEFE754

récupération
type: ConceptConcept
type: Concept
creator: Commission d'enrichissement de la langue française, FranceTerme
source: révision de l'arrêté du 15 juin 1991
date parution JO: 2000-09-22
equivalent EN: salvage @en
equivalent EN: salvage (en)
part of speech: nom féminin
in scheme: Défense
in scheme: concept-SD-defense-logistique
in scheme: concepts
notation: DEFE756

repère lumineux
type: ConceptConcept
type: Concept
creator: Commission d'enrichissement de la langue française, FranceTerme
source: révision de l'arrêté du 12 août 1976
date parution JO: 2000-09-22
equivalent EN: spot @en
equivalent EN: spot (en)
forme abregee: repère, n.m.
in scheme: Défense
in scheme: concepts
notation: DEFE757

réservoir
type: ConceptConcept
type: Concept
creator: Commission d'enrichissement de la langue française, FranceTerme
source: révision de l'arrêté du 12 août 1976
date parution JO: 2000-09-22
equivalent EN: tank @en
equivalent EN: tank (en)
part of speech: nom masculin
in scheme: Transports et mobilité
in scheme: concepts
notation: DEFE758

résistance à l'écrasement
type: ConceptConcept
type: Concept
creator: Commission d'enrichissement de la langue française, FranceTerme
source: révision de l'arrêté du 5 octobre 1984
date parution JO: 2000-09-22
equivalent EN: crashworthiness @en
equivalent EN: crashworthiness (en)
in scheme: Aéronautique
in scheme: Défense
in scheme: concepts
notation: DEFE759

couplage
type: ConceptConcept
type: Concept
creator: Commission d'enrichissement de la langue française, FranceTerme
source: révision de l'arrêté du 5 octobre 1984
date parution JO: 2000-09-22
equivalent EN: coupling @en
equivalent EN: coupling (en)
part of speech: nom masculin
definition: Liaison univoque entre deux ou plusieurs entrées d'un même système.
in scheme: Aéronautique
in scheme: Défense
in scheme: concepts
notation: DEFE76
note: Pour les commandes en vol d'un avion, il y a par exemple couplage entre les braquages de deux ou plusieurs gouvernes.

servitude (de)
type: ConceptConcept
type: Concept
creator: Commission d'enrichissement de la langue française, FranceTerme
source: révision de l'arrêté du 12 août 1976
date parution JO: 2000-09-22
deconseille ou frequent: de servitude
deconseille ou frequent: servitude
equivalent EN: utility @en
equivalent EN: utility (en)
part of speech: locution adjectivale
in scheme: Défense
in scheme: concepts
notation: DEFE761

soudage
type: ConceptConcept
type: Concept
creator: Commission d'enrichissement de la langue française, FranceTerme
source: révision de l'arrêté du 12 août 1976
date parution JO: 2000-09-22
equivalent EN: bonding @en
equivalent EN: bonding (en)
equivalent EN: welding @en
equivalent EN: welding (en)
part of speech: nom masculin
in scheme: Matériaux
in scheme: concept-SD-materiaux-metallurgie
in scheme: concepts
notation: DEFE762

tireur isolé
type: ConceptConcept
type: Concept
creator: Commission d'enrichissement de la langue française, FranceTerme
source: révision de l'arrêté du 12 août 1976
date parution JO: 2000-09-22
equivalent EN: sniper @en
equivalent EN: sniper (en)
in scheme: Défense
in scheme: concepts
notation: DEFE764

vérin
type: ConceptConcept
type: Concept
creator: Commission d'enrichissement de la langue française, FranceTerme
source: révision de l'arrêté du 12 août 1976
date parution JO: 2000-09-22
equivalent EN: actuator @en
equivalent EN: actuator (en)
equivalent EN: jack @en
equivalent EN: jack (en)
part of speech: nom masculin
in scheme: Défense
in scheme: concepts
notation: DEFE765

voler à un cap
type: ConceptConcept
type: Concept
creator: Commission d'enrichissement de la langue française, FranceTerme
source: révision de l'arrêté du 12 août 1976
date parution JO: 2000-09-22
deconseille ou frequent: to steer
equivalent EN: steer @en
equivalent EN: steer (en)
in scheme: Aéronautique
in scheme: Défense
in scheme: concepts
notation: DEFE766
related: gouverner à un cap

zone de saut
type: ConceptConcept
type: Concept
creator: Commission d'enrichissement de la langue française, FranceTerme
source: révision de l'arrêté du 12 août 1976
date parution JO: 2000-09-22
equivalent EN: drop zone @en
equivalent EN: drop zone (en)
equivalent EN: dropping zone @en
equivalent EN: dropping zone (en)
in scheme: Défense
in scheme: concepts
notation: DEFE767

courant d'altitude
type: ConceptConcept
type: Concept
creator: Commission d'enrichissement de la langue française, FranceTerme
source: révision de l'arrêté du 12 août 1976
date parution JO: 2000-09-22
equivalent EN: jet stream @en
equivalent EN: jet stream (en)
definition: Courant atmosphérique horizontal rapide, de forme tubulaire aplatie, qui existe dans ou au-dessus de la tropopause.
in scheme: Aérodynamique
in scheme: concepts
notation: DEFE77

quasi-collision
type: ConceptConcept
type: Concept
creator: Commission d'enrichissement de la langue française, FranceTerme
source: révision de l'arrêté du 5 octobre 1984
date parution JO: 2000-09-22
equivalent EN: air miss @en
equivalent EN: air miss (en)
equivalent EN: near collision @en
equivalent EN: near collision (en)
equivalent EN: near miss @en
equivalent EN: near miss (en)
part of speech: nom féminin
in scheme: Aéronautique
in scheme: Défense
in scheme: concepts
notation: DEFE770

camouflage électronique
type: ConceptConcept
type: Concept
creator: Commission d'enrichissement de la langue française, FranceTerme
date parution JO: 2005-02-10
deconseille ou frequent: camouflage électronique actif
deconseille ou frequent: camouflage électronique passif
equivalent EN: electronic masking @en
equivalent EN: electronic masking (en)
definition: Ensemble des mesures de sûreté, actives ou passives, destinées à soustraire à la détection des capteurs électromagnétiques ennemis le personnel, le matériel et les fréquences utilisées.
in scheme: Défense
in scheme: concept-SD-defense-guerre-electronique
in scheme: concepts
notation: DEFE771
note: On distingue le « camouflage électronique actif » et le « camouflage électronique passif ».

canne d'allumage
type: ConceptConcept
type: Concept
creator: Commission d'enrichissement de la langue française, FranceTerme
date parution JO: 2005-02-10
equivalent EN: tube ignitor @en
equivalent EN: tube ignitor (en)
definition: Dispositif pyrotechnique de forme allongée, utilisé pour allumer à cœur un chargement de propergol solide.
in scheme: Défense
in scheme: concept-SD-defense-materiaux-energetiques
in scheme: concepts
notation: DEFE772

carte-index
type: ConceptConcept
type: Concept
creator: Commission d'enrichissement de la langue française, FranceTerme
date parution JO: 2005-02-10
equivalent EN: chart index @en
equivalent EN: chart index (en)
equivalent EN: map index @en
equivalent EN: map index (en)
part of speech: nom féminin
alternative label: tableau d'assemblage
definition: Carte simplifiée représentant les limites des feuilles d'une carte d'échelle supérieure ou de l'ensemble des cartes d'un système cartographique.
in scheme: Défense
in scheme: concept-SD-defense-cartographie
in scheme: concepts
notation: DEFE773
note: Ne pas confondre avec « carton-index ».
related: carton-index

carton-index
type: ConceptConcept
type: Concept
creator: Commission d'enrichissement de la langue française, FranceTerme
date parution JO: 2005-02-10
equivalent EN: inter-chart relationship diagram @en
equivalent EN: inter-chart relationship diagram (en)
part of speech: nom masculin
definition: Petite carte supplémentaire figurant sur une carte principale et qui sert à situer celle-ci par rapport aux cartes adjacentes de la même série ou de séries associées.
in scheme: Défense
in scheme: concept-SD-defense-cartographie
in scheme: concepts
notation: DEFE774
related: carte-index

commandant de composante
type: ConceptConcept
type: Concept
creator: Commission d'enrichissement de la langue française, FranceTerme
date parution JO: 2005-02-10
equivalent EN: component commander @en
equivalent EN: component commander (en)
definition: Officier chargé, au sein d'une force interarmées, de la planification et de la conduite d'une opération maritime, terrestre, aérienne ou autre.
in scheme: Défense
in scheme: concept-SD-defense-operations
in scheme: concepts
notation: DEFE775

contact
type: ConceptConcept
type: Concept
creator: Commission d'enrichissement de la langue française, FranceTerme
date parution JO: 2005-02-10
deconseille ou frequent: contact radar
deconseille ou frequent: contact sonar
deconseille ou frequent: marking
deconseille ou frequent: shadowing
part of speech: nom masculin
definition: En opérations navales, unité ennemie ou non identifiée dont la présence a été décelée.
in scheme: Défense
in scheme: concept-SD-defense-operations
in scheme: concepts
notation: DEFE776
note: 1. Ce terme est souvent suivi d'un substantif en apposition. Exemples : contact radar, contact sonar.
note: 2. Le contact peut être tenu de manière « souple » (en anglais : shadowing) ou « serrée » (en anglais : marking).
related: marquage

véhicule à châssis articulé
type: ConceptConcept
type: Concept
creator: Commission d'enrichissement de la langue française, FranceTerme
abbreviation: VCA
date parution JO: 2005-02-10
equivalent EN: twister @en
equivalent EN: twister (en)
definition: Véhicule dont le châssis est constitué de deux ou plusieurs éléments attelés par un ou plusieurs joints à trois degrés de liberté.
in scheme: Défense
in scheme: concept-SD-defense-materiel
in scheme: concepts
notation: DEFE777

harcèlement
type: ConceptConcept
type: Concept
creator: Commission d'enrichissement de la langue française, FranceTerme
date parution JO: 2005-02-10
equivalent EN: harassment @en
equivalent EN: harassment (en)
part of speech: nom masculin
in scheme: Défense
in scheme: concepts
notation: DEFE778

renseignement
type: ConceptConcept
type: Concept
creator: Commission d'enrichissement de la langue française, FranceTerme
date parution JO: 2005-02-10
equivalent EN: intelligence @en
equivalent EN: intelligence (en)
part of speech: nom masculin
in scheme: Défense
in scheme: concept-SD-defense-renseignement
in scheme: concepts
notation: DEFE779
related: concept-defense

courbe isodébit
type: ConceptConcept
type: Concept
creator: Commission d'enrichissement de la langue française, FranceTerme
source: révision de l'arrêté du 5 octobre 1984
date parution JO: 2000-09-22
definition: Ligne reliant des points situés à un mètre au-dessus du sol et ayant le même débit de dose à un instant donné, généralement une heure après une explosion nucléaire.
in scheme: Défense
in scheme: concept-SD-defense-nucleaire
in scheme: concepts
notation: DEFE78
related: débit de dose

arme maîtresse
type: ConceptConcept
type: Concept
creator: Commission d'enrichissement de la langue française, FranceTerme
date parution JO: 2005-02-10
equivalent EN: master weapon @en
equivalent EN: master weapon (en)
in scheme: Défense
in scheme: concepts
notation: DEFE780

équipage
type: ConceptConcept
type: Concept
creator: Commission d'enrichissement de la langue française, FranceTerme
source: révision de l'arrêté du 12 août 1976
date parution JO: 2000-09-22
equivalent EN: crew @en
equivalent EN: crew (en)
part of speech: nom masculin
in scheme: Aéronautique
in scheme: Transports et mobilité
in scheme: concepts
notation: DEFE781

art opératif
type: ConceptConcept
type: Concept
creator: Commission d'enrichissement de la langue française, FranceTerme
date parution JO: 2008-02-02
equivalent EN: operational art @en
equivalent EN: operational art (en)
definition: Théorie et pratique de la préparation et de la conduite, au niveau du théâtre d'opérations, des actions menées par les grandes formations des différentes armées.
in scheme: Défense
in scheme: concept-SD-defense-operations
in scheme: concepts
notation: DEFE782
note: L'art opératif fait partie intégrante de l'art de la guerre. Occupant une position intermédiaire entre la stratégie et la tactique militaire, il est subordonné à la stratégie et, à son tour, détermine les missions et les orientations du développement tactique.

capacité militaire
type: ConceptConcept
type: Concept
creator: Commission d'enrichissement de la langue française, FranceTerme
date parution JO: 2008-02-02
equivalent EN: military capacity @en
equivalent EN: military capacity (en)
definition: Potentiel militaire évalué sur le plan qualitatif et quantitatif.
in scheme: Défense
in scheme: concept-SD-defense-operations
in scheme: concepts
notation: DEFE783

centre de gravité
type: ConceptConcept
type: Concept
creator: Commission d'enrichissement de la langue française, FranceTerme
date parution JO: 2008-02-02
equivalent EN: center of gravity (US) @en
equivalent EN: center of gravity (en-US)
equivalent EN: centre of gravity (GB) @en
equivalent EN: centre of gravity (en-GB)
definition: Élément, matériel ou immatériel, dont un pays, ou un ensemble de pays, une collectivité, une force militaire, tire sa puissance, sa liberté d'action ou sa volonté de combattre.
in scheme: Défense
in scheme: concept-SD-defense-operations
in scheme: concepts
notation: DEFE785
note: Le centre de gravité peut être, selon le niveau d'analyse (stratégique, opératif ou tactique), d'ordre strictement militaire, économique, politique, géographique ou psychologique.

communication locale
type: ConceptConcept
type: Concept
creator: Commission d'enrichissement de la langue française, FranceTerme
date parution JO: 2008-02-02
equivalent EN: local communication @en
equivalent EN: local communication (en)
definition: Communication aux populations et aux autorités locales, dans leur propre langue, d'informations concernant le déroulement des opérations sur un théâtre donné.
in scheme: Défense
in scheme: concept-SD-defense-operations
in scheme: concepts
notation: DEFE786
related: communication opérationnelle

communication opérationnelle
type: ConceptConcept
type: Concept
creator: Commission d'enrichissement de la langue française, FranceTerme
date parution JO: 2008-02-02
equivalent EN: operational communication @en
equivalent EN: operational communication (en)
definition: Communication aux acteurs concernés d'informations relatives à une opération ou à un exercice destinées à leur en faire comprendre la finalité ou la portée et à en donner l'image souhaitée.
in scheme: Défense
in scheme: concept-SD-defense-operations
in scheme: concepts
notation: DEFE787
related: communication locale

concept d'opérations
type: ConceptConcept
type: Concept
creator: Commission d'enrichissement de la langue française, FranceTerme
abbreviation: CONOPS @en
date parution JO: 2008-02-02
equivalent EN: CONOPS @en
equivalent EN: CONOPS (en)
equivalent EN: concept of operations @en
equivalent EN: concept of operations (en)
alternative label: idée de manœuvre
definition: Formulation claire et concise de la manœuvre choisie par un chef militaire pour exécuter la mission qui lui a été assignée.
in scheme: Défense
in scheme: concept-SD-defense-operations
in scheme: concepts
notation: DEFE788

concept d'opérations
type: ConceptConcept
type: Concept
creator: Commission d'enrichissement de la langue française, FranceTerme
abbreviation: CONOPS @en
date parution JO: 2008-02-02
equivalent EN: CONOPS @en
equivalent EN: CONOPS (en)
equivalent EN: concept of operations @en
equivalent EN: concept of operations (en)
definition: Document qui décrit la manière d'utiliser les forces, la chronologie retenue pour atteindre les objectifs fixés, et la façon dont il convient de synchroniser les différents moyens et ressources mis à disposition.
in scheme: Défense
in scheme: concept-SD-defense-operations
in scheme: concepts
notation: DEFE789

crosse d'arrêt
type: ConceptConcept
type: Concept
creator: Commission d'enrichissement de la langue française, FranceTerme
source: révision de l'arrêté du 5 octobre 1984
date parution JO: 2000-09-22
equivalent EN: arrester hook @en
equivalent EN: arrester hook (en)
definition: Bras escamotable muni d'un croc de forme appropriée, situé à la partie inférieure d'un avion, et qui, en position sortie, permet, lors d'un atterrissage ou d'un appontage, d'accrocher les brins d'arrêt disposés en travers d'une piste ou d'un pont de porte-avions.
in scheme: Aéronautique
in scheme: Défense
in scheme: concepts
notation: DEFE79

concept stratégique
type: ConceptConcept
type: Concept
creator: Commission d'enrichissement de la langue française, FranceTerme
date parution JO: 2008-02-02
equivalent EN: strategic concept @en
equivalent EN: strategic concept (en)
definition: Ligne d'action adoptée en considération de la situation générale.
in scheme: Défense
in scheme: concept-SD-defense-operations
in scheme: concepts
notation: DEFE790
note: Le concept stratégique est défini d'une manière suffisamment large pour fournir le cadre des mesures militaires, diplomatiques, économiques, psychologiques et autres qui en découlent.

contrôle
type: ConceptConcept
type: Concept
creator: Commission d'enrichissement de la langue française, FranceTerme
date parution JO: 2008-02-02
equivalent EN: check-out @en
equivalent EN: check-out (en)
equivalent EN: checking @en
equivalent EN: checking (en)
part of speech: nom masculin
definition: Surveillance ou vérification de l'état d'un système, généralement par la lecture de valeurs de paramètres ou la consultation d'indicateurs.
in scheme: Défense
in scheme: concept-SD-defense-ingenierie-des-systemes
in scheme: concepts
notation: DEFE791
related: concept-SPAT1305

gestion des ressources de la patrouille d'aéronefs
type: ConceptConcept
type: Concept
creator: Commission d'enrichissement de la langue française, FranceTerme
abbreviation: GRPA
abbreviation: PRM @en
date parution JO: 2008-02-02
equivalent EN: PRM @en
equivalent EN: PRM (en)
equivalent EN: patrol resource management @en
equivalent EN: patrol resource management (en)
definition: Ensemble des méthodes de compréhension des comportements humains visant à améliorer la communication et l'utilisation des compétences au sein d'une patrouille de combat, afin d'y développer une synergie, de réduire le risque d'erreur et d'augmenter la sécurité des vols.
in scheme: Aéronautique
in scheme: Défense
in scheme: concepts
notation: DEFE792
related: gestion des ressources du poste de pilotage

gestion des ressources du poste de pilotage
type: ConceptConcept
type: Concept
creator: Commission d'enrichissement de la langue française, FranceTerme
abbreviation: CRM @en
abbreviation: GRPP
date parution JO: 2008-02-02
equivalent EN: CRM @en
equivalent EN: CRM (en)
equivalent EN: cockpit resource management @en
equivalent EN: cockpit resource management (en)
definition: Ensemble des méthodes de compréhension des comportements humains visant à améliorer la communication et l'utilisation des compétences au sein d'un équipage, afin d'y développer une synergie, de réduire le risque d'erreur et d'augmenter la sécurité des vols.
in scheme: Aéronautique
in scheme: Défense
in scheme: concepts
notation: DEFE793
related: gestion des ressources de la patrouille d'aéronefs

marge statique
type: ConceptConcept
type: Concept
creator: Commission d'enrichissement de la langue française, FranceTerme
date parution JO: 2008-02-02
equivalent EN: static margin @en
equivalent EN: static margin (en)
definition: Grandeur physique qui permet d'évaluer la maniabilité et la stabilité d'un aéronef.
in scheme: Aéronautique
in scheme: concepts
notation: DEFE794
note: La marge statique correspond à la valeur algébrique de la distance entre les projections du centre de gravité et du foyer aérodynamique d'un avion sur une corde de référence longitudinale, exprimée en pourcentage de la longueur de cette corde, et considérée comme positive lorsque le foyer est en arrière du centre de gravité.

mise en commun
type: ConceptConcept
type: Concept
creator: Commission d'enrichissement de la langue française, FranceTerme
date parution JO: 2008-02-02
equivalent EN: pooling @en
equivalent EN: pooling (en)
definition: Action consistant à regrouper divers moyens, en vue de parvenir à un résultat déterminé.
in scheme: Tous domaines
in scheme: concepts
notation: DEFE795

ailette de bout d'aile
type: ConceptConcept
type: Concept
creator: Commission d'enrichissement de la langue française, FranceTerme
date parution JO: 2011-06-19
equivalent EN: winglet @en
equivalent EN: winglet (en)
definition: Élément de voilure placé obliquement ou orthogonalement à l'extrémité de l'aile d'un aéronef de manière à accroître la finesse aérodynamique en réduisant l'intensité du sillage tourbillonnaire issu de l'aile.
in scheme: Aéronautique
in scheme: concepts
notation: DEFE799
related: concept-aeronautique
scope note: Cette publication annule et remplace celle du terme « ailerette» au Journal officiel du 22 septembre 2000.

alignement des pales
type: ConceptConcept
type: Concept
creator: Commission d'enrichissement de la langue française, FranceTerme
source: révision de l'arrêté du 12 août 1976
date parution JO: 2000-09-22
equivalent EN: tracking @en
equivalent EN: tracking (en)
definition: Sur un hélicoptère, contrôle et réglage au sol des pales du ou des rotors de manière qu'elles soient toutes contenues dans le plan de rotation.
in scheme: Aéronautique
in scheme: Défense
in scheme: concepts
notation: DEFE8

débit de dose
type: ConceptConcept
type: Concept
creator: Commission d'enrichissement de la langue française, FranceTerme
source: révision de l'arrêté du 5 octobre 1984
date parution JO: 2000-09-22
equivalent EN: dose rate @en
equivalent EN: dose rate (en)
definition: Quantité de rayonnements ionisants qui, à irradiation d'intensité constante, est absorbée dans un élément de matière par unité de temps.
in scheme: Défense
in scheme: concept-SD-defense-nucleaire
in scheme: concepts
notation: DEFE80
note: Le débit de dose s'exprime en rad par heure (rd/h).
related: courbe isodébit

gyromètre
type: ConceptConcept
type: Concept
creator: Commission d'enrichissement de la langue française, FranceTerme
date parution JO: 2011-06-19
equivalent EN: gyrometer @en
equivalent EN: gyrometer (en)
equivalent EN: rate gyro @en
equivalent EN: rate gyro (en)
part of speech: nom masculin
definition: Appareil gyroscopique servant à déceler et à mesurer les vitesses de rotation d'un engin aérien ou spatial par rapport à un repère terrestre, et, de ce fait, ses changements d'inclinaison ou de direction.
in scheme: Aéronautique
in scheme: Défense
in scheme: concepts
notation: DEFE800
related: gyrolaser

gyrolaser
type: ConceptConcept
type: Concept
creator: Commission d'enrichissement de la langue française, FranceTerme
date parution JO: 2011-06-19
equivalent EN: laser gyro @en
equivalent EN: laser gyro (en)
equivalent EN: laser gyrometer @en
equivalent EN: laser gyrometer (en)
part of speech: nom masculin
definition: Gyromètre recourant à la technique du laser.
in scheme: Aéronautique
in scheme: Défense
in scheme: concepts
notation: DEFE801
related: gyromètre

qualification croisée d'équipage
type: ConceptConcept
type: Concept
creator: Commission d'enrichissement de la langue française, FranceTerme
abbreviation: CCQ @en
date parution JO: 2011-06-19
equivalent EN: CCQ @en
equivalent EN: CCQ (en)
equivalent EN: cross crew qualification @en
equivalent EN: cross crew qualification (en)
definition: Qualification permettant à un membre d'équipage, à l'issue d'une formation complémentaire, de passer indifféremment d'un aéronef à un autre de la même famille.
in scheme: Aéronautique
in scheme: concepts
notation: DEFE803
note: La formation pour ce type de qualification ne porte que sur les différences entre les deux aéronefs concernés.

radio-altimètre
type: ConceptConcept
type: Concept
creator: Commission d'enrichissement de la langue française, FranceTerme
date parution JO: 2011-06-19
deconseille ou frequent: radioaltimeter
equivalent EN: radio altimeter @en
equivalent EN: radio altimeter (en)
part of speech: nom masculin
alternative label: radiosonde
definition: Altimètre qui utilise le principe du radar pour calculer la hauteur d'un aéronef par rapport au sol.
in scheme: Aéronautique
in scheme: Défense
in scheme: concepts
notation: DEFE804
related: concept-SPAT1445

rafale descendante
type: ConceptConcept
type: Concept
creator: Commission d'enrichissement de la langue française, FranceTerme
date parution JO: 2011-06-19
equivalent EN: downburst @en
equivalent EN: downburst (en)
definition: Effondrement d'une masse d'air froid produisant localement de forts cisaillements de vents verticaux et des turbulences intenses au voisinage du sol.
in scheme: Aéronautique
in scheme: Météorologie
in scheme: concepts
notation: DEFE805
note: Les rafales descendantes peuvent présenter un danger pour les avions, en particulier lors du décollage et de l'atterrissage.

reconnaissance de cibles non coopératives
type: ConceptConcept
type: Concept
creator: Commission d'enrichissement de la langue française, FranceTerme
abbreviation: NCTR @en
abbreviation: RCNC
date parution JO: 2011-06-19
deconseille ou frequent: IFF
deconseille ou frequent: identification friend or foe
equivalent EN: NCTR @en
equivalent EN: NCTR (en)
equivalent EN: non-cooperative target recognition @en
equivalent EN: non-cooperative target recognition (en)
definition: Système permettant d'identifier un aéronef à partir de l'analyse de la déformation de l'onde émise par un radar embarqué après la réflexion de cette onde sur des parties caractéristiques du moteur de la cible.
in scheme: Aéronautique
in scheme: Défense
in scheme: concepts
notation: DEFE806
note: La reconnaissance de cibles non coopératives ne nécessite aucune action de la part de la cible, à l'inverse d'une interrogation d'identification ami-ennemi (en anglais : identification friend or foe, IFF).

chuteur opérationnel
type: ConceptConcept
type: Concept
creator: Commission d'enrichissement de la langue française, FranceTerme
date parution JO: 2011-06-19
deconseille ou frequent: chutop
deconseille ou frequent: chutops
equivalent EN: operational jumper @en
equivalent EN: operational jumper (en)
definition: Parachutiste militaire apte à la pratique du saut à ouverture commandée retardée, à grande ou très grande hauteur, avec charge et armement, en équipe, de jour comme de nuit.
in scheme: Défense
in scheme: concept-SD-defense-operations
in scheme: concepts
notation: DEFE807
note: 1. On trouve aussi, dans le langage professionnel, le terme « chutops ».
note: 2. Une des missions du chuteur opérationnel est celle de l'orienteur-marqueur.
related: orienteur-marqueur

démonstration de force
type: ConceptConcept
type: Concept
creator: Commission d'enrichissement de la langue française, FranceTerme
date parution JO: 2011-06-19
equivalent EN: show of force @en
equivalent EN: show of force (en)
definition: Action militaire à forte visibilité, offensive ou non, effectuée à des fins d'intimidation.
in scheme: Défense
in scheme: concept-SD-defense-strategie
in scheme: concepts
notation: DEFE808

mobilité opérative
type: ConceptConcept
type: Concept
creator: Commission d'enrichissement de la langue française, FranceTerme
date parution JO: 2011-06-19
equivalent EN: operational mobility @en
equivalent EN: operational mobility (en)
definition: Aptitude à déplacer rapidement des forces et leur logistique à l'intérieur d'un même théâtre d'opérations, et à organiser leur retour à l'issue d'une mission.
in scheme: Défense
in scheme: concept-SD-defense-operations
in scheme: concepts
notation: DEFE809
note: Les déplacements peuvent s'effectuer soit entre une zone de déploiement et une zone d'engagement, soit entre plusieurs zones d'engagement.
related: mobilité stratégique
related: mobilité tactique

déborder
type: ConceptConcept
type: Concept
creator: Commission d'enrichissement de la langue française, FranceTerme
source: révision de l'arrêté du 5 octobre 1984
date parution JO: 2000-09-22
deconseille ou frequent: to overshoot
equivalent EN: overshoot @en
equivalent EN: overshoot (en)
part of speech: verbe
alternative label: atterrir trop long
alternative label: dépasser
definition: Effectuer un débordement par rapport à un point ou à un axe de référence au cours des évolutions d'un aéronef.
in scheme: Aéronautique
in scheme: Défense
in scheme: concepts
notation: DEFE81

mobilité stratégique
type: ConceptConcept
type: Concept
creator: Commission d'enrichissement de la langue française, FranceTerme
date parution JO: 2011-06-19
equivalent EN: strategic mobility @en
equivalent EN: strategic mobility (en)
definition: Aptitude à déplacer rapidement des forces et leur logistique sur de longues distances, d'un théâtre d'opérations ou d'une région à l'autre.
in scheme: Défense
in scheme: concept-SD-defense-operations
in scheme: concepts
notation: DEFE810
related: mobilité opérative
related: mobilité tactique

mobilité tactique
type: ConceptConcept
type: Concept
creator: Commission d'enrichissement de la langue française, FranceTerme
date parution JO: 2011-06-19
equivalent EN: tactical mobility @en
equivalent EN: tactical mobility (en)
definition: Aptitude des unités à manœuvrer sur le terrain.
in scheme: Défense
in scheme: concept-SD-defense-operations
in scheme: concepts
notation: DEFE811
note: La mobilité tactique recouvre trois types d'opérations : la projection des forces, les opérations aéroportées et aéromobiles et les opérations amphibies.
related: mobilité opérative
related: mobilité stratégique

montée en puissance opérationnelle
type: ConceptConcept
type: Concept
creator: Commission d'enrichissement de la langue française, FranceTerme
date parution JO: 2015-09-23
equivalent EN: build-up @en
equivalent EN: build-up (en)
definition: Ensemble planifié de mesures visant à assurer progressivement, dans des délais déterminés, l’adéquation des moyens à une mission.
in scheme: Défense
in scheme: concept-SD-defense-operations
in scheme: concepts
notation: DEFE812
note: La phase de montée en puissance opérationnelle suit celle de mise sur pied opérationnelle.
related: mise sur pied opérationnelle
related: capacité opérationnelle

mission de surveillance et de contrôle
type: ConceptConcept
type: Concept
creator: Commission d'enrichissement de la langue française, FranceTerme
date parution JO: 2011-06-19
equivalent EN: monitoring mission @en
equivalent EN: monitoring mission (en)
forme abregee: surveillance et contrôle
definition: Mission consistant à s'assurer, par l'observation et la collecte d'informations, de l'application d'un accord et, si nécessaire, à proposer des mesures correctives.
in scheme: Défense
in scheme: concept-SD-defense-operations
in scheme: concepts
notation: DEFE813
note: Les missions de surveillance et de contrôle sont notamment mises en œuvre au cours des opérations de soutien de la paix menées par un État ou une coalition d'États sous l'égide de l'ONU, de l'Union européenne ou de l'OTAN.

drone
type: ConceptConcept
type: Concept
creator: Commission d'enrichissement de la langue française, FranceTerme
date parution JO: 2011-06-19
equivalent EN: drone @en
equivalent EN: drone (en)
part of speech: nom masculin
definition: Engin mobile terrestre, aérien ou naval, sans équipage embarqué, programmé ou télécommandé, et qui peut être réutilisé.
in scheme: Tous domaines
in scheme: concepts
notation: DEFE814
note: Les drones militaires sont équipés de systèmes d'armes ou de collecte d'informations.
related: drone armé
related: concept-PETR340
related: concept-PETR341
scope note: Cette publication annule et remplace celle du Journal officiel du 22 septembre 2000.

furtivité
type: ConceptConcept
type: Concept
creator: Commission d'enrichissement de la langue française, FranceTerme
date parution JO: 2011-06-19
equivalent EN: stealth @en
equivalent EN: stealth (en)
equivalent EN: stealthiness @en
equivalent EN: stealthiness (en)
part of speech: nom féminin
definition: Caractéristique d'un engin terrestre, aérien ou naval, dont la signature est rendue difficilement détectable.
in scheme: Défense
in scheme: concepts
notation: DEFE815
related: signature
scope note: Cette publication annule et remplace celle du Journal officiel du 22 septembre 2000.

signature
type: ConceptConcept
type: Concept
creator: Commission d'enrichissement de la langue française, FranceTerme
date parution JO: 2011-06-19
equivalent EN: signature @en
equivalent EN: signature (en)
part of speech: nom féminin
definition: Ensemble des caractéristiques d'un signal qui permettent l'identification d'une cible.
in scheme: Défense
in scheme: concepts
notation: DEFE816
note: 1. La signature peut être passive, comme la signature thermique d'un véhicule, ou active, comme une signature radar.
note: 2. La signature peut être acoustique, électromagnétique, magnétique, radar ou thermique.
related: furtivité

laboratoire technico-opérationnel
type: ConceptConcept
type: Concept
creator: Commission d'enrichissement de la langue française, FranceTerme
abbreviation: LTO
date parution JO: 2013-12-05
equivalent EN: battlelab @en
equivalent EN: battlelab (en)
definition: Entité de recherche et d’expérimentation qui élabore et met en œuvre des méthodes permettant de simuler des situations, actuelles ou futures, d’engagement des forces armées, afin d’orienter la prise de décision relative aux capacités attendues de ces forces et aux moyens nécessaires à leur mission.
in scheme: Défense
in scheme: concept-SD-defense-operations
in scheme: concepts
notation: DEFE817

propulsion anaérobie
type: ConceptConcept
type: Concept
creator: Commission d'enrichissement de la langue française, FranceTerme
abbreviation: AIP @en
date parution JO: 2011-06-19
equivalent EN: AIP @en
equivalent EN: AIP (en)
equivalent EN: air independent propulsion @en
equivalent EN: air independent propulsion (en)
definition: Système de propulsion qui permet à un sous-marin de fonctionner longtemps sans utiliser l'air extérieur et sans remonter à la surface.
in scheme: Défense
in scheme: Marine
in scheme: concepts
notation: DEFE818
note: La propulsion anaérobie permet d'accroître l'autonomie en plongée du sous-marin, qui peut passer de quelques heures à quelques jours, et, par voie de conséquence, de diminuer les risques de détection.

capacité de suggestion
type: ConceptConcept
type: Concept
creator: Commission d'enrichissement de la langue française, FranceTerme
date parution JO: 2011-06-19
equivalent EN: affordance @en
equivalent EN: affordance (en)
definition: Capacité d'une commande ou d'une représentation symbolique à inciter l'utilisateur à effectuer la manœuvre permettant d'obtenir le résultat souhaité.
in scheme: Tous domaines
in scheme: concepts
notation: DEFE819

décontamination
type: ConceptConcept
type: Concept
creator: Commission d'enrichissement de la langue française, FranceTerme
source: révision de l'arrêté du 5 octobre 1984
date parution JO: 2000-09-22
equivalent EN: decontamination @en
equivalent EN: decontamination (en)
part of speech: nom féminin
definition: Réduction ou élimination des matières radioactives ou chimiques déposées sur une installation, un espace découvert, un matériel ou du personnel.
in scheme: Défense
in scheme: concept-SD-defense-nucleaire
in scheme: concepts
notation: DEFE82

approche en descente continue
type: ConceptConcept
type: Concept
creator: Commission d'enrichissement de la langue française, FranceTerme
abbreviation: ADC
abbreviation: CDA @en
date parution JO: 2013-12-05
equivalent EN: CDA @en
equivalent EN: CDA (en)
equivalent EN: continuous descent approach @en
equivalent EN: continuous descent approach (en)
definition: Procédure selon laquelle un avion effectue une arrivée en descente sans palier depuis un niveau de vol élevé jusqu’à la piste.
in scheme: Aéronautique
in scheme: Défense
in scheme: concepts
notation: DEFE820
note: L’approche en descente continue permet de réduire de façon significative les nuisances sonores, la consommation de carburant et les émissions de produits polluants.

système de gestion de vol
type: ConceptConcept
type: Concept
creator: Commission d'enrichissement de la langue française, FranceTerme
abbreviation: FMS @en
abbreviation: SGV
date parution JO: 2013-12-05
equivalent EN: FMS @en
equivalent EN: FMS (en)
equivalent EN: flight management system @en
equivalent EN: flight management system (en)
definition: Système informatique embarqué qui, à partir du traitement de paramètres de vol ainsi que de données relevées par l’équipage, détermine la trajectoire optimale de l’aéronef en fonction des conditions du moment.
in scheme: Aéronautique
in scheme: Défense
in scheme: concepts
notation: DEFE823

composante de force
type: ConceptConcept
type: Concept
creator: Commission d'enrichissement de la langue française, FranceTerme
date parution JO: 2013-12-05
equivalent EN: force component @en
equivalent EN: force component (en)
definition: Partie d’une force interarmées ou d’une force internationale en opération, qui correspond à l’ensemble des moyens fournis par l’une des trois armées ou par les forces spéciales.
in scheme: Défense
in scheme: concept-SD-defense-operations
in scheme: concepts
notation: DEFE824

déception
type: ConceptConcept
type: Concept
creator: Commission d'enrichissement de la langue française, FranceTerme
abbreviation: MD @en
date parution JO: 2013-12-05
equivalent EN: MD @en
equivalent EN: MD (en)
equivalent EN: deception @en
equivalent EN: deception (en)
equivalent EN: military deception @en
equivalent EN: military deception (en)
part of speech: nom féminin
definition: Ensemble des mesures visant à tromper l’adversaire et à le faire réagir de façon préjudiciable à ses propres intérêts.
in scheme: Défense
in scheme: concepts
notation: DEFE825

élément organique
type: ConceptConcept
type: Concept
creator: Commission d'enrichissement de la langue française, FranceTerme
date parution JO: 2013-12-05
definition: Ensemble cohérent de forces militaires disposant des capacités nécessaires pour accomplir de manière autonome une ou plusieurs tâches spécifiques s’inscrivant dans le cadre d’une mission.
in scheme: Défense
in scheme: concept-SD-defense-operations
in scheme: concepts
notation: DEFE827
note: Un élément organique est doté de capacités de commandement, d’appui et de soutien logistique.
related: modularité
related: force modulaire

modularité
type: ConceptConcept
type: Concept
creator: Commission d'enrichissement de la langue française, FranceTerme
date parution JO: 2013-12-05
equivalent EN: modularity @en
equivalent EN: modularity (en)
part of speech: nom féminin
definition: Structuration des forces militaires consistant à composer un état-major ou une force adaptée à une mission, à partir d’éléments organiques.
in scheme: Défense
in scheme: concept-SD-defense-operations
in scheme: concepts
notation: DEFE828
related: élément organique
related: force modulaire

projection
type: ConceptConcept
type: Concept
creator: Commission d'enrichissement de la langue française, FranceTerme
date parution JO: 2015-09-23
equivalent EN: projection @en
equivalent EN: projection (en)
part of speech: nom féminin
definition: Acheminement, par voie aérienne, maritime ou terrestre, d’une force militaire loin de son lieu habituel de stationnement.
in scheme: Défense
in scheme: concept-SD-defense-operations
in scheme: concepts
notation: DEFE829
related: force projetable
related: capacité de projection

défense aérienne active
type: ConceptConcept
type: Concept
creator: Commission d'enrichissement de la langue française, FranceTerme
source: révision de l'arrêté du 17 avril 1989
date parution JO: 2000-09-22
deconseille ou frequent: active air defence
deconseille ou frequent: active air defense
equivalent EN: active air defence (GB) @en
equivalent EN: active air defence (en-GB)
equivalent EN: active air defense (US) @en
equivalent EN: active air defense (en-US)
broader: concept-defense
definition: Action défensive visant à supprimer ou réduire l'efficacité d'une action aérienne ennemie.
in scheme: Défense
in scheme: concepts
notation: DEFE83
note: Elle inclut l'emploi d'aéronefs, de systèmes d'armes antiaériens, d'armes dont la capacité première n'est pas la défense aérienne, et l'usage de la guerre électronique.

force modulaire
type: ConceptConcept
type: Concept
creator: Commission d'enrichissement de la langue française, FranceTerme
date parution JO: 2013-12-05
equivalent EN: modular force @en
equivalent EN: modular force (en)
definition: Force militaire constituée d’éléments organiques projetables.
in scheme: Défense
in scheme: concept-SD-defense-operations
in scheme: concepts
notation: DEFE830
related: élément organique
related: modularité
related: force de réaction embarquée
related: force projetable

force décisive
type: ConceptConcept
type: Concept
creator: Commission d'enrichissement de la langue française, FranceTerme
date parution JO: 2013-12-05
deconseille ou frequent: force de décision
equivalent EN: decisive force @en
equivalent EN: decisive force (en)
definition: Force militaire de capacité suffisante, par sa taille et sa composition, pour emporter la décision tactique sur le terrain.
in scheme: Défense
in scheme: concept-SD-defense-operations
in scheme: concepts
notation: DEFE831

force de présence
type: ConceptConcept
type: Concept
creator: Commission d'enrichissement de la langue française, FranceTerme
date parution JO: 2013-12-05
equivalent EN: standing out-of-area force @en
equivalent EN: standing out-of-area force (en)
definition: Force militaire déployée en permanence par un État dans les zones maritimes ou sur le territoire d’un autre État, conformément à un accord conclu entre eux.
in scheme: Défense
in scheme: concepts
notation: DEFE832
note: Une force de présence assure des missions de veille et de renseignement ainsi que l’accueil et l’entraînement des forces d’intervention.

force de réaction embarquée
type: ConceptConcept
type: Concept
creator: Commission d'enrichissement de la langue française, FranceTerme
abbreviation: FRE
date parution JO: 2013-12-05
equivalent EN: shipborne reaction force @en
equivalent EN: shipborne reaction force (en)
definition: Force modulaire embarquée sur des navires, qui est constituée pour accomplir une mission à terre.
in scheme: Défense
in scheme: concept-SD-defense-operations
in scheme: concepts
notation: DEFE833
related: force modulaire

force de sécurité civile
type: ConceptConcept
type: Concept
creator: Commission d'enrichissement de la langue française, FranceTerme
date parution JO: 2013-12-05
equivalent EN: civil security force @en
equivalent EN: civil security force (en)
definition: Unité civile ou militaire spécialisée, chargée de missions d’aide aux populations civiles telles que le sauvetage, la lutte contre les incendies, l’assistance en cas de catastrophes naturelles ou techniques, ainsi que des opérations de déminage et de dépollution.
in scheme: Défense
in scheme: Relations internationales
in scheme: concepts
notation: DEFE834

force de sécurité publique
type: ConceptConcept
type: Concept
creator: Commission d'enrichissement de la langue française, FranceTerme
date parution JO: 2013-12-05
equivalent EN: public safety force @en
equivalent EN: public safety force (en)
definition: Ensemble des forces civiles et militaires chargées de la protection et de la sécurité des personnes et des biens, ainsi que des opérations de maintien de l’ordre.
in scheme: Défense
in scheme: concepts
notation: DEFE835

force de souveraineté
type: ConceptConcept
type: Concept
creator: Commission d'enrichissement de la langue française, FranceTerme
date parution JO: 2013-12-05
equivalent EN: sovereignty force @en
equivalent EN: sovereignty force (en)
definition: Force militaire stationnée dans les départements et les collectivités d’outre-mer, qui assure des missions de protection ou d’intervention dans les zones de responsabilité permanente confiées aux commandements supérieurs interarmées.
in scheme: Défense
in scheme: concepts
notation: DEFE836

force multinationale permanente
type: ConceptConcept
type: Concept
creator: Commission d'enrichissement de la langue française, FranceTerme
date parution JO: 2015-09-23
equivalent EN: standing multinational force @en
equivalent EN: standing multinational force (en)
definition: Force militaire dotée d’un état-major multinational permanent, composée d’unités pré-affectées et pourvue de capacités prédéfinies, qui est placée sous commandement multinational dès le temps de paix.
in scheme: Défense
in scheme: concept-SD-defense-operations
in scheme: concepts
notation: DEFE837

force multirôle
type: ConceptConcept
type: Concept
creator: Commission d'enrichissement de la langue française, FranceTerme
date parution JO: 2013-12-05
equivalent EN: multi-role force @en
equivalent EN: multi-role force (en)
equivalent EN: multitask force @en
equivalent EN: multitask force (en)
definition: Force militaire qui dispose à la fois d’une capacité de projection rapide et de moyens suffisants pour remplir, en fonction de l’évolution de la situation, des missions diverses dans des opérations de moyenne ou de haute intensité.
in scheme: Défense
in scheme: concept-SD-defense-operations
in scheme: concepts
notation: DEFE838

force projetable
type: ConceptConcept
type: Concept
creator: Commission d'enrichissement de la langue française, FranceTerme
date parution JO: 2013-12-05
equivalent EN: deployable force @en
equivalent EN: deployable force (en)
definition: Force capable d’intervenir rapidement loin de son lieu habituel de stationnement.
in scheme: Défense
in scheme: concept-SD-defense-operations
in scheme: concepts
notation: DEFE839
related: projection
related: force modulaire
related: conseiller juridique en opération

défense aérienne passive
type: ConceptConcept
type: Concept
creator: Commission d'enrichissement de la langue française, FranceTerme
source: révision de l'arrêté du 17 avril 1989
date parution JO: 2000-09-22
deconseille ou frequent: passive air defence
deconseille ou frequent: passive air defense
equivalent EN: passive air defence (GB) @en
equivalent EN: passive air defence (en-GB)
equivalent EN: passive air defense (US) @en
equivalent EN: passive air defense (en-US)
broader: concept-defense
definition: Ensemble des mesures autres que celles de défense aérienne active, prises pour réduire le plus possible l'efficacité de l'action aérienne ennemie.
in scheme: Défense
in scheme: concepts
notation: DEFE84
note: Elle comporte notamment la détection, la dispersion et l'utilisation d'abris.

mutualisation interarmées
type: ConceptConcept
type: Concept
creator: Commission d'enrichissement de la langue française, FranceTerme
date parution JO: 2013-12-05
equivalent EN: jointization @en
equivalent EN: jointization (en)
equivalent EN: jointness @en
equivalent EN: jointness (en)
alternative label: interarmisation
definition: Mise en commun de moyens, de procédures et de techniques de différentes armées d’un même État, en vue d’optimiser l’utilisation des ressources et d’améliorer l’efficacité opérationnelle.
in scheme: Défense
in scheme: concepts
notation: DEFE840
related: mutualisation interétatique

mise sur pied opérationnelle
type: ConceptConcept
type: Concept
creator: Commission d'enrichissement de la langue française, FranceTerme
date parution JO: 2015-09-23
equivalent EN: operational readiness @en
equivalent EN: operational readiness (en)
definition: Regroupement des effectifs, des équipements et des moyens logistiques nécessaires à une opération, suivi de l’entraînement adapté des unités ainsi constituées.
in scheme: Défense
in scheme: concept-SD-defense-operations
in scheme: concepts
notation: DEFE841
note: La mise sur pied opérationnelle précède généralement la montée en puissance opérationnelle.
related: montée en puissance opérationnelle
related: capacité opérationnelle

stratégie de stabilisation
type: ConceptConcept
type: Concept
creator: Commission d'enrichissement de la langue française, FranceTerme
date parution JO: 2013-12-05
equivalent EN: stabilization strategy @en
equivalent EN: stabilization strategy (en)
definition: Stratégie de gestion de crise qui vise à rétablir les conditions de la vie civile dans un secteur ou une région, en mettant fin à la violence et en jetant les bases politiques, économiques et sociales d’un processus de reconstruction.
in scheme: Défense
in scheme: Relations internationales
in scheme: concepts
notation: DEFE844
related: reconstruction de l'État
related: stratégie de retrait
related: force de transition

société militaire privée
type: ConceptConcept
type: Concept
creator: Commission d'enrichissement de la langue française, FranceTerme
abbreviation: PMF @en
abbreviation: SMP
date parution JO: 2013-12-05
equivalent EN: PMF @en
equivalent EN: PMF (en)
equivalent EN: private military firm @en
equivalent EN: private military firm (en)
definition: Société commerciale privée qui, dans le cadre d’opérations militaires, propose des prestations d’aide, de conseil et de soutien aux forces armées.
in scheme: Défense
in scheme: concepts
notation: DEFE845

capacité de survie
type: ConceptConcept
type: Concept
creator: Commission d'enrichissement de la langue française, FranceTerme
date parution JO: 2013-12-05
deconseille ou frequent: survivabilité
equivalent EN: survivability @en
equivalent EN: survivability (en)
definition: Capacité d’un matériel à continuer de fonctionner en dépit de circonstances défavorables ou d’un milieu hostile, même lorsqu’il est endommagé.
in scheme: Défense
in scheme: concepts
notation: DEFE846

tir fratricide
type: ConceptConcept
type: Concept
creator: Commission d'enrichissement de la langue française, FranceTerme
date parution JO: 2013-12-05
deconseille ou frequent: friendly fire
deconseille ou frequent: tir ami
equivalent EN: blue on blue @en
equivalent EN: blue on blue (en)
equivalent EN: fratricide fire @en
equivalent EN: fratricide fire (en)
equivalent EN: friendly fire @en
equivalent EN: friendly fire (en)
definition: Tir létal effectué contre son propre camp.
in scheme: Défense
in scheme: concept-SD-defense-operations
in scheme: concepts
notation: DEFE848
note: On trouve aussi l’expression « tir ami », qui est déconseillée.
related: attaque de l’intérieur

zone d'action
type: ConceptConcept
type: Concept
creator: Commission d'enrichissement de la langue française, FranceTerme
date parution JO: 2013-12-05
equivalent EN: area of action @en
equivalent EN: area of action (en)
equivalent EN: zone of action @en
equivalent EN: zone of action (en)
definition: Subdivision de la zone des opérations, dont la responsabilité opérationnelle est confiée à une unité tactique.
in scheme: Défense
in scheme: concept-SD-defense-operations
in scheme: concepts
notation: DEFE849
related: zone d'engagement
related: zone lacunaire

défense biologique
type: ConceptConcept
type: Concept
creator: Commission d'enrichissement de la langue française, FranceTerme
source: révision de l'arrêté du 15 juin 1991
date parution JO: 2000-09-22
equivalent EN: biological defence (GB) @en
equivalent EN: biological defence (en-GB)
equivalent EN: biological defense (US) @en
equivalent EN: biological defense (en-US)
definition: Méthodes, plans, procédures et moyens destinés à la lutte contre les attaques par agents infectieux et toxines.
in scheme: Défense
in scheme: concepts
notation: DEFE85
note: Elle comporte notamment la détection, la dispersion et l'utilisation d'abris.

zone d'engagement
type: ConceptConcept
type: Concept
creator: Commission d'enrichissement de la langue française, FranceTerme
date parution JO: 2013-12-05
equivalent EN: engagement area @en
equivalent EN: engagement area (en)
definition: Zone située au sein d’une zone d’action, qui est retenue par le commandant d’une unité tactique pour exécuter sa mission.
in scheme: Défense
in scheme: concept-SD-defense-operations
in scheme: concepts
notation: DEFE850
note: La zone d’engagement résulte des choix tactiques du commandant chargé de la zone d’action.
related: zone d'action
related: zone lacunaire
related: évacuation médicale

zone lacunaire
type: ConceptConcept
type: Concept
creator: Commission d'enrichissement de la langue française, FranceTerme
date parution JO: 2013-12-05
definition: Zone d’action qui comporte des espaces vides de force, notamment lorsque les zones d’engagement sont disjointes.
in scheme: Défense
in scheme: concept-SD-defense-operations
in scheme: concepts
notation: DEFE851
related: zone d'action
related: zone d'engagement

capacité de projection
type: ConceptConcept
type: Concept
creator: Commission d'enrichissement de la langue française, FranceTerme
date parution JO: 2015-09-23
equivalent EN: power projection capacity @en
equivalent EN: power projection capacity (en)
definition: Ensemble des moyens qui permettent d’acheminer une force militaire, parfois avec un préavis très court, loin de son lieu habituel de stationnement, pour exécuter, aussi longtemps que nécessaire, une mission.
in scheme: Défense
in scheme: concept-SD-defense-operations
in scheme: concepts
notation: DEFE852
related: projection

aéronef de combat
type: ConceptConcept
type: Concept
creator: Commission d'enrichissement de la langue française, FranceTerme
date parution JO: 2015-09-23
equivalent EN: combat aircraft @en
equivalent EN: combat aircraft (en)
definition: Aéronef militaire à voilure fixe ou tournante, destiné à effectuer des missions de combat visant des objectifs aériens, terrestres ou maritimes.
in scheme: Aéronautique
in scheme: Défense
in scheme: concept-SD-aeronautique-operations
in scheme: concept-SD-defense-operations
in scheme: concepts
notation: DEFE853
related: aéronef polyvalent
related: concept-aeronautique

attaque de l’intérieur
type: ConceptConcept
type: Concept
creator: Commission d'enrichissement de la langue française, FranceTerme
date parution JO: 2015-09-23
equivalent EN: green on blue @en
equivalent EN: green on blue (en)
equivalent EN: green on blue attack @en
equivalent EN: green on blue attack (en)
equivalent EN: insider attack @en
equivalent EN: insider attack (en)
definition: Attaque délibérément effectuée contre son propre camp ou un allié par un individu, un groupe ou une unité constituée.
in scheme: Défense
in scheme: concept-SD-defense-operations
in scheme: concepts
notation: DEFE855
related: tir fratricide

mutualisation interétatique
type: ConceptConcept
type: Concept
creator: Commission d'enrichissement de la langue française, FranceTerme
abbreviation: P&S @en
date parution JO: 2015-09-23
equivalent EN: P&S @en
equivalent EN: P&S (en)
equivalent EN: pooling and sharing @en
equivalent EN: pooling and sharing (en)
definition: Mise en commun par différents États de capacités, essentiellement dans les domaines de la logistique, du soutien, de la formation et de l’entraînement.
in scheme: Défense
in scheme: concepts
notation: DEFE857
note: 1. La mutualisation interétatique a pour but de développer la synergie entre les États partenaires, notamment européens.
note: 2. On trouve aussi, dans le langage professionnel, le terme « mutualisation et partage ».
related: mutualisation interarmées

espace public mondial
type: ConceptConcept
type: Concept
creator: Commission d'enrichissement de la langue française, FranceTerme
abbreviation: EPM
abbreviation: GC @en
date parution JO: 2015-09-23
equivalent EN: GC @en
equivalent EN: GC (en)
equivalent EN: global commons @en
equivalent EN: global commons (en)
definition: Espace ne ressortissant à aucune souveraineté nationale et qui, dans l’intérêt commun, fait l’objet d’une règlementation internationale.
in scheme: Défense
in scheme: Relations internationales
in scheme: concepts
notation: DEFE862
note: Le cyberespace, l’espace extra-atmosphérique, l’espace aérien international et l’espace maritime international sont des espaces publics mondiaux.
related: bien public mondial
related: concept-SPAT362

maritimisation
type: ConceptConcept
type: Concept
creator: Commission d'enrichissement de la langue française, FranceTerme
date parution JO: 2015-09-23
part of speech: nom féminin
definition: Rôle croissant joué par les espaces maritimes dans la sécurité d’un pays, ses approvisionnements et sa prospérité.
in scheme: Défense
in scheme: Relations internationales
in scheme: concepts
notation: DEFE863

pistolet à impulsion électrique
type: ConceptConcept
type: Concept
creator: Commission d'enrichissement de la langue française, FranceTerme
abbreviation: PIE
date parution JO: 2015-09-23
deconseille ou frequent: Taser
forme abregee: pistolet électrique
definition: Arme individuelle permettant de paralyser un adversaire par l’envoi d’une impulsion électrique.
in scheme: Armement
in scheme: Défense
in scheme: concept-SD-armement-securite
in scheme: concept-SD-defense-securite
in scheme: concepts
notation: DEFE864
note: « Taser », qui est un nom de marque, ne doit pas être employé.

engin explosif artisanal
type: ConceptConcept
type: Concept
creator: Commission d'enrichissement de la langue française, FranceTerme
abbreviation: EEA
abbreviation: IED @en
date parution JO: 2015-09-23
deconseille ou frequent: EEI
deconseille ou frequent: engin explosif improvisé
equivalent EN: IED @en
equivalent EN: IED (en)
equivalent EN: improvised explosive device @en
equivalent EN: improvised explosive device (en)
definition: Dispositif explosif fabriqué de façon rudimentaire à partir des ressources disponibles, et constitué de composants hétérogènes, militaires ou non militaires.
in scheme: Défense
in scheme: concept-SD-defense-armement
in scheme: concepts
notation: DEFE865
note: On trouve aussi, dans le langage professionnel, le terme « engin explosif improvisé (EEI) ».

fouille opérationnelle
type: ConceptConcept
type: Concept
creator: Commission d'enrichissement de la langue française, FranceTerme
abbreviation: FO
date parution JO: 2015-09-23
deconseille ou frequent: fops
equivalent EN: military search @en
equivalent EN: military search (en)
definition: Recherche effectuée par une force militaire pour trouver des personnes, des ressources ou des informations dissimulées par l’adversaire.
in scheme: Défense
in scheme: concept-SD-defense-operations
in scheme: concepts
notation: DEFE866
note: On trouve aussi, dans le langage professionnel, le terme « fops ».

conseiller pour les affaires politiques
type: ConceptConcept
type: Concept
creator: Commission d'enrichissement de la langue française, FranceTerme
date parution JO: 2015-09-23
equivalent EN: polad @en
equivalent EN: polad (en)
equivalent EN: political advisor @en
equivalent EN: political advisor (en)
definition: Expert affecté auprès du commandant d’une force projetée pour conseiller ce dernier dans toutes les questions d’ordre politique, tant locales et régionales qu’internationales, en rapport avec sa mission.
in scheme: Défense
in scheme: Relations internationales
in scheme: concepts
notation: DEFE867
related: conseiller juridique en opération

aéronef polyvalent
type: ConceptConcept
type: Concept
creator: Commission d'enrichissement de la langue française, FranceTerme
date parution JO: 2016-09-20
equivalent EN: multirole aircraft @en
equivalent EN: multirole aircraft (en)
definition: Aéronef conçu pour effectuer plusieurs types de missions, avec ou sans changement de configuration.
in scheme: Aéronautique
in scheme: Défense
in scheme: concept-SD-aeronautique-operations
in scheme: concept-SD-defense-operations
in scheme: concepts
notation: DEFE869
related: aéronef de combat
related: avion de transport et de ravitaillement

déflecteur de volet
type: ConceptConcept
type: Concept
creator: Commission d'enrichissement de la langue française, FranceTerme
source: révision de l'arrêté du 5 octobre 1984
date parution JO: 2000-09-22
equivalent EN: vane @en
equivalent EN: vane (en)
definition: Élément profilé fixé en avant du bord d'attaque d'un volet de courbure et permettant, grâce à un effet de fente supplémentaire, d'assurer un meilleur guidage de l'écoulement entre l'intrados et l'extrados, lorsque le volet est braqué.
in scheme: Aéronautique
in scheme: Défense
in scheme: concepts
notation: DEFE87

facilitateur
type: ConceptConcept
type: Concept
creator: Commission d'enrichissement de la langue française, FranceTerme
date parution JO: 2016-09-20
equivalent EN: enabler @en
equivalent EN: enabler (en)
equivalent EN: facilitator @en
equivalent EN: facilitator (en)
part of speech: nom masculin
definition: Entité ou personne physique à qui on fait appel pour créer les conditions propices à l'exécution d’une mission ou à l'aboutissement d'une négociation, en raison de l'autorité morale que lui reconnaissent l’ensemble des parties prenantes.
in scheme: Défense
in scheme: Relations internationales
in scheme: concepts
notation: DEFE873

force de transition
type: ConceptConcept
type: Concept
creator: Commission d'enrichissement de la langue française, FranceTerme
date parution JO: 2016-09-20
equivalent EN: bridging force @en
equivalent EN: bridging force (en)
alternative label: force d'intervention transitoire
definition: Force d'intervention destinée à enrayer l'aggravation d'une crise avant d'en transmettre la gestion militaire à une force de stabilisation.
in scheme: Défense
in scheme: Relations internationales
in scheme: concepts
notation: DEFE874
related: stratégie de stabilisation

neutralisation d'engins explosifs
type: ConceptConcept
type: Concept
creator: Commission d'enrichissement de la langue française, FranceTerme
date parution JO: 2016-09-20
deconseille ou frequent: NEDEX
deconseille ou frequent: enlèvement et destruction d'engins explosifs
deconseille ou frequent: neutralisation
equivalent EN: EOD @en
equivalent EN: EOD (en)
equivalent EN: explosive ordnance disposal @en
equivalent EN: explosive ordnance disposal (en)
definition: Ensemble des opérations consistant à détecter et à identifier des engins explosifs ou des munitions, à évaluer le danger qu'ils représentent puis à les mettre hors d'état de fonctionner, avant de les enlever et de les éliminer.
in scheme: Défense
in scheme: concepts
notation: DEFE875
note: On trouve aussi, dans le langage professionnel, le terme « neutralisation, enlèvement et destruction d’engins explosifs (NEDEX) ».

zone aéroportuaire d'embarquement
type: ConceptConcept
type: Concept
creator: Commission d'enrichissement de la langue française, FranceTerme
abbreviation: ZAE
date parution JO: 2016-09-20
equivalent EN: APOE @en
equivalent EN: APOE (en)
equivalent EN: airport of embarkation @en
equivalent EN: airport of embarkation (en)
definition: Plateforme aéroportuaire située en dehors d'un théâtre d’opérations, qui permet d'embarquer des personnes, des matériels, des équipements et des approvisionnements.
in scheme: Défense
in scheme: concept-SD-defense-operations
in scheme: concepts
notation: DEFE876
related: zone aéroportuaire de débarquement

zone aéroportuaire de débarquement
type: ConceptConcept
type: Concept
creator: Commission d'enrichissement de la langue française, FranceTerme
abbreviation: ZAD
date parution JO: 2016-09-20
equivalent EN: APOD @en
equivalent EN: APOD (en)
equivalent EN: airport of debarkation @en
equivalent EN: airport of debarkation (en)
definition: Plateforme aéroportuaire située sur un théâtre d'opérations ou à proximité de celui-ci, qui permet de débarquer des personnes, des matériels, des équipements et des approvisionnements.
in scheme: Défense
in scheme: concept-SD-defense-operations
in scheme: concepts
notation: DEFE877
related: zone aéroportuaire d'embarquement

propulseur de plongée
type: ConceptConcept
type: Concept
creator: Commission d'enrichissement de la langue française, FranceTerme
date parution JO: 2016-09-20
deconseille ou frequent: SISNC
deconseille ou frequent: système d'insertion subaquatique pour nageur de combat
equivalent EN: DPD @en
equivalent EN: DPD (en)
equivalent EN: DPV @en
equivalent EN: DPV (en)
equivalent EN: diver propulsion device @en
equivalent EN: diver propulsion device (en)
equivalent EN: diver propulsion vehicle @en
equivalent EN: diver propulsion vehicle (en)
alternative label: propulseur sous-marin
definition: Engin motorisé subaquatique destiné à augmenter le rayon d'action des plongeurs autonomes et leur capacité d’emport de matériel.
in scheme: Défense
in scheme: Sports
in scheme: concepts
notation: DEFE879
note: Dans le domaine militaire, on trouve aussi le terme « système d'insertion subaquatique pour nageur de combat (SISNC) ».

dégagement
type: ConceptConcept
type: Concept
creator: Commission d'enrichissement de la langue française, FranceTerme
source: révision de l'arrêté du 5 octobre 1984
date parution JO: 2000-09-22
equivalent EN: break @en
equivalent EN: break (en)
part of speech: nom masculin
definition: Manœuvre soudaine effectuée par un aéronef pour modifier sa ligne de vol, par exemple avant l'atterrissage ou en combat.
in scheme: Aéronautique
in scheme: Défense
in scheme: concepts
notation: DEFE88

base opérationnelle avancée
type: ConceptConcept
type: Concept
creator: Commission d'enrichissement de la langue française, FranceTerme
abbreviation: BOA
date parution JO: 2016-09-20
equivalent EN: FOB @en
equivalent EN: FOB (en)
equivalent EN: forward operating base @en
equivalent EN: forward operating base (en)
definition: Base militaire située en zone de combat, qui assure le soutien logistique des unités de cette zone et contribue à la sécurité et à la bonne exécution des missions opérationnelles.
in scheme: Défense
in scheme: concepts
notation: DEFE880
related: base opérationnelle projetée

base opérationnelle projetée
type: ConceptConcept
type: Concept
creator: Commission d'enrichissement de la langue française, FranceTerme
abbreviation: BOP
date parution JO: 2016-09-20
equivalent EN: DOB @en
equivalent EN: DOB (en)
equivalent EN: deployed operating base @en
equivalent EN: deployed operating base (en)
equivalent EN: deployed operation base @en
equivalent EN: deployed operation base (en)
definition: Base militaire hébergeant une plateforme aérienne, qui est implantée sur un théâtre d'opérations pour assurer le soutien logistique et contribuer à la sécurité et à la bonne exécution des missions opérationnelles.
in scheme: Défense
in scheme: concept-SD-defense-operations
in scheme: concepts
notation: DEFE881
related: base opérationnelle avancée

cyberattaque
type: ConceptConcept
type: Concept
creator: Commission d'enrichissement de la langue française, FranceTerme
date parution JO: 2017-09-19
deconseille ou frequent: cyber-attaque
equivalent EN: cyber attack @en
equivalent EN: cyber attack (en)
equivalent EN: cyberattack @en
equivalent EN: cyberattack (en)
part of speech: nom féminin
definition: Ensemble coordonné d’actions menées dans le cyberespace qui visent des informations ou les systèmes qui les traitent, en portant atteinte à leur disponibilité, à leur intégrité ou à leur confidentialité.
in scheme: Défense
in scheme: Informatique
in scheme: concepts
notation: DEFE882
note: Une cyberattaque peut être ponctuelle ou s’inscrire dans la durée.
related: cyberespace
related: cyberprotection
related: cyberrésilience
related: lutte informatique défensive
related: cyberattaque persistante
related: cyberguerre
related: logiciel rançonneur
related: concept-INFO968
related: concept-JURI36
related: concept-JURI44

cyberespace
type: ConceptConcept
type: Concept
creator: Commission d'enrichissement de la langue française, FranceTerme
date parution JO: 2017-09-19
deconseille ou frequent: cyber-espace
deconseille ou frequent: cybermonde
equivalent EN: cyberspace @en
equivalent EN: cyberspace (en)
part of speech: nom masculin
definition: Espace constitué par les infrastructures interconnectées relevant des technologies de l’information, notamment l’internet, et par les données qui y sont traitées.
in scheme: Informatique
in scheme: Télécommunications
in scheme: concepts
notation: DEFE883
note: 1. Le cyberespace inclut les opérateurs de services en ligne.
note: 2. On trouve aussi le terme « cybermonde », parfois utilisé dans ce sens.
related: cyberattaque
related: cyberdéfense
related: cyberdéfense militaire
related: cyberrésilience
related: lutte informatique offensive
related: renseignement intéressant la cyberdéfense militaire
related: cyberrenseignement
related: cyberguerre
related: concept-JURI36

cybersécurité
type: ConceptConcept
type: Concept
creator: Commission d'enrichissement de la langue française, FranceTerme
date parution JO: 2017-09-19
deconseille ou frequent: cyber-sécurité
equivalent EN: cyber security @en
equivalent EN: cyber security (en)
equivalent EN: cybersecurity @en
equivalent EN: cybersecurity (en)
part of speech: nom féminin
definition: État d’un système d’information qui résiste aux cyberattaques et aux pannes accidentelles survenant dans le cyberespace.
in scheme: Défense
in scheme: Informatique
in scheme: concepts
notation: DEFE884
note: La cybersécurité est assurée par la cyberprotection ainsi que, dans le cas d’un État, par la cyberdéfense.
related: cyberprotection
related: cyberdéfense
related: cyberdéfense militaire
related: prime à la faille détectée

cyberprotection
type: ConceptConcept
type: Concept
creator: Commission d'enrichissement de la langue française, FranceTerme
date parution JO: 2017-09-19
equivalent EN: cyber protection @en
equivalent EN: cyber protection (en)
equivalent EN: cyberprotection @en
equivalent EN: cyberprotection (en)
part of speech: nom féminin
definition: Ensemble des moyens, techniques ou juridiques, qui contribuent à assurer la cybersécurité.
in scheme: Défense
in scheme: Informatique
in scheme: concept-SD-defense-operations
in scheme: concept-SD-informatique-operations
in scheme: concepts
notation: DEFE885
note: La cyberprotection s’appuie notamment sur des mesures prises pour préserver la sécurité des systèmes d’information.
related: cyberattaque
related: cybersécurité
related: cyberdéfense
related: cyberdéfense militaire
related: cyberattaque persistante

cyberdéfense
type: ConceptConcept
type: Concept
creator: Commission d'enrichissement de la langue française, FranceTerme
date parution JO: 2017-09-19
deconseille ou frequent: cyber defense
deconseille ou frequent: cyberdefense
equivalent EN: cyber defence @en
equivalent EN: cyber defence (en)
equivalent EN: cyberdefence @en
equivalent EN: cyberdefence (en)
part of speech: nom féminin
definition: Ensemble des moyens mis en place par un État pour défendre dans le cyberespace les systèmes d’information jugés d’importance vitale, qui contribuent à assurer la cybersécurité.
in scheme: Défense
in scheme: Informatique
in scheme: concept-SD-defense-operations
in scheme: concept-SD-informatique-operations
in scheme: concepts
notation: DEFE886
note: La cyberdéfense met notamment en œuvre la lutte informatique défensive et la lutte informatique offensive.
related: cyberespace
related: cybersécurité
related: cyberprotection
related: cyberdéfense militaire
related: lutte informatique défensive
related: lutte informatique offensive
related: cyberguerre

cyberdéfense militaire
type: ConceptConcept
type: Concept
creator: Commission d'enrichissement de la langue française, FranceTerme
date parution JO: 2017-09-19
deconseille ou frequent: military cyber defense
deconseille ou frequent: military cyberdefense
equivalent EN: military cyber defence @en
equivalent EN: military cyber defence (en)
equivalent EN: military cyberdefence @en
equivalent EN: military cyberdefence (en)
definition: Ensemble coordonné d’actions défensives et offensives menées dans le cyberespace lors de la planification, de la préparation ou de la conduite d’opérations militaires.
in scheme: Défense
in scheme: concept-SD-defense-operations
in scheme: concepts
notation: DEFE887
note: La cyberdéfense militaire s’appuie sur des opérations dans le cyberespace ainsi que sur des actions de renforcement de la cyberrésilience.
related: cyberespace
related: cybersécurité
related: cyberprotection
related: cyberdéfense
related: cyberrésilience
related: opérations dans le cyberespace
related: renseignement intéressant la cyberdéfense militaire

cyberrésilience
type: ConceptConcept
type: Concept
creator: Commission d'enrichissement de la langue française, FranceTerme
date parution JO: 2017-09-19
deconseille ou frequent: cyber-résilience
equivalent EN: cyber resilience @en
equivalent EN: cyber resilience (en)
equivalent EN: cyberresilience @en
equivalent EN: cyberresilience (en)
part of speech: nom féminin
definition: Capacité d’un système d’information à résister aux cyberattaques et aux pannes accidentelles, puis à revenir à un état de fonctionnement et de sécurité satisfaisant.
in scheme: Défense
in scheme: Informatique
in scheme: concepts
notation: DEFE888
related: cyberattaque
related: cyberespace
related: cyberdéfense militaire

opérateur d'importance vitale
type: ConceptConcept
type: Concept
creator: Commission d'enrichissement de la langue française, FranceTerme
abbreviation: OIV
date parution JO: 2017-09-19
definition: Personne morale publique ou privée qui gère ou utilise des établissements ou des ouvrages dont la destruction ou même l’indisponibilité obéreraient gravement le potentiel militaire, la force économique, la sécurité, voire la capacité de survie d’un État, ou mettraient en danger sa population.
in scheme: Défense
in scheme: concept-SD-defense-operations
in scheme: concepts
notation: DEFE889
related: concept-JURI44

démarreur
type: ConceptConcept
type: Concept
creator: Commission d'enrichissement de la langue française, FranceTerme
source: révision de l'arrêté du 12 août 1976
date parution JO: 2000-09-22
equivalent EN: starter @en
equivalent EN: starter (en)
part of speech: nom masculin
definition: Appareil servant à mettre en marche un propulseur ou un moteur.
in scheme: Automobile
in scheme: Moteur thermique
in scheme: concepts
notation: DEFE89
related: concept-automobile

opérations dans le cyberespace
type: ConceptConcept
type: Concept
creator: Commission d'enrichissement de la langue française, FranceTerme
date parution JO: 2017-09-19
deconseille ou frequent: opération dans le cyberespace
equivalent EN: CNO @en
equivalent EN: CNO (en)
equivalent EN: computer network operations @en
equivalent EN: computer network operations (en)
definition: Actions relatives à la lutte informatique défensive, à la lutte informatique offensive et au cyberrenseignement.
in scheme: Défense
in scheme: concept-SD-defense-operations
in scheme: concepts
notation: DEFE890
note: Les opérations dans le cyberespace constituent l’une des composantes de la cyberdéfense militaire.
related: cyberdéfense militaire
related: lutte informatique défensive
related: lutte informatique offensive
related: cyberrenseignement
related: cyberguerre

lutte informatique défensive
type: ConceptConcept
type: Concept
creator: Commission d'enrichissement de la langue française, FranceTerme
abbreviation: LID
date parution JO: 2017-09-19
equivalent EN: CND @en
equivalent EN: CND (en)
equivalent EN: computer network defence @en
equivalent EN: computer network defence (en)
definition: Ensemble coordonné d’actions menées par un État, qui consistent à détecter, à analyser et à prévenir des cyberattaques, et à y réagir le cas échéant.
in scheme: Défense
in scheme: Informatique
in scheme: concepts
notation: DEFE892
related: cyberattaque
related: cyberdéfense
related: opérations dans le cyberespace
related: lutte informatique offensive
related: cyberguerre

lutte informatique offensive
type: ConceptConcept
type: Concept
creator: Commission d'enrichissement de la langue française, FranceTerme
abbreviation: LIO
date parution JO: 2017-09-19
equivalent EN: CNA @en
equivalent EN: CNA (en)
equivalent EN: computer network attacks @en
equivalent EN: computer network attacks (en)
definition: Ensemble coordonné d’actions menées dans le cyberespace par un État contre des systèmes d’information ou de données pour les perturber, les modifier, les dégrader ou les détruire.
in scheme: Défense
in scheme: Informatique
in scheme: concepts
notation: DEFE893
related: cyberespace
related: cyberdéfense
related: opérations dans le cyberespace
related: lutte informatique défensive
related: cyberguerre

renseignement intéressant la cyberdéfense militaire
type: ConceptConcept
type: Concept
creator: Commission d'enrichissement de la langue française, FranceTerme
abbreviation: RICM
date parution JO: 2017-09-19
deconseille ou frequent: RIC
deconseille ou frequent: renseignement d'intérêt cyber
deconseille ou frequent: renseignement intéressant la cyberdéfense
definition: Renseignement qui apporte à la chaîne de commandement opérationnel de la cyberdéfense militaire les informations dont la connaissance est nécessaire pour conduire des opérations dans le cyberespace.
in scheme: Défense
in scheme: concept-SD-defense-operations
in scheme: concepts
notation: DEFE894
note: On trouve aussi, dans le langage professionnel, le terme « renseignement d’intérêt cyber (RIC) ».
related: cyberespace
related: cyberdéfense militaire
related: cyberrenseignement

cyberattaque persistante
type: ConceptConcept
type: Concept
creator: Commission d'enrichissement de la langue française, FranceTerme
abbreviation: CP
date parution JO: 2017-09-19
deconseille ou frequent: cyber-attaque persistante
deconseille ou frequent: cyberattaque sophistiquée persistante
deconseille ou frequent: menace persistante avancée
equivalent EN: APT @en
equivalent EN: APT (en)
equivalent EN: advanced persistent threat @en
equivalent EN: advanced persistent threat (en)
definition: Cyberattaque qui met en œuvre des moyens humains et techniques importants pour infiltrer durablement les systèmes d’information vitaux d’une organisation.
in scheme: Défense
in scheme: Informatique
in scheme: concepts
notation: DEFE895
note: Une cyberattaque persistante recourt à des techniques furtives qui s’adaptent graduellement aux actions de cyberprotection qu’elle suscite.
related: cyberattaque
related: cyberprotection
related: concept-JURI62

évacuation médicale
type: ConceptConcept
type: Concept
creator: Commission d'enrichissement de la langue française, FranceTerme
abbreviation: EVAMED
date parution JO: 2019-06-29
deconseille ou frequent: EVASAN
deconseille ou frequent: évacuation sanitaire
equivalent EN: MEDEVAC @en
equivalent EN: MEDEVAC (en)
equivalent EN: medical evacuation @en
equivalent EN: medical evacuation (en)
definition: Déplacement de personnes blessées ou malades d’une zone d’engagement vers une installation sanitaire, qui s’effectue sous surveillance médicale.
in scheme: Défense
in scheme: Santé et médecine
in scheme: concepts
notation: DEFE896
note: On trouve aussi l’expression « évacuation sanitaire » (EVASAN).
related: zone d'engagement

force opérationnelle
type: ConceptConcept
type: Concept
creator: Commission d'enrichissement de la langue française, FranceTerme
date parution JO: 2019-06-29
deconseille ou frequent: TF
equivalent EN: operational force @en
equivalent EN: operational force (en)
equivalent EN: readiness force @en
equivalent EN: readiness force (en)
equivalent EN: task force @en
equivalent EN: task force (en)
definition: Ensemble des moyens militaires, tant humains que matériels, choisis et organisés en vue d’une opération déterminée.
in scheme: Défense
in scheme: concept-SD-defense-operations
in scheme: concepts
notation: DEFE898
related: groupement temporaire
related: capacité opérationnelle
related: régénération de force
scope note: Cette publication annule et remplace celle publiée au Journal officiel le 22 septembre 2000.

capacité opérationnelle
type: ConceptConcept
type: Concept
creator: Commission d'enrichissement de la langue française, FranceTerme
date parution JO: 2019-06-29
equivalent EN: operational capability @en
equivalent EN: operational capability (en)
definition: Aptitude d’une force opérationnelle à remplir sa mission.
in scheme: Défense
in scheme: concept-SD-defense-operations
in scheme: concepts
notation: DEFE899
note: La mise sur pied puis la montée en puissance opérationnelles permettent d’atteindre la capacité opérationnelle.
related: montée en puissance opérationnelle
related: mise sur pied opérationnelle
related: force opérationnelle
related: guerre dissymétrique
related: régénération de force
scope note: Cette publication annule et remplace celle du Journal officiel du 2 février 2008.

amortisseur
type: ConceptConcept
type: Concept
creator: Commission d'enrichissement de la langue française, FranceTerme
source: révision de l'arrêté du 12 août 1976
date parution JO: 2000-09-22
equivalent EN: damper @en
equivalent EN: damper (en)
part of speech: nom masculin
definition: Dispositif mécanique, électrique, hydraulique ou pneumatique destiné à atténuer des chocs, des vibrations, un bruit, etc.
in scheme: Tous domaines
in scheme: concepts
notation: DEFE9
related: amortisseur à fluide

dépanneuse lourde
type: ConceptConcept
type: Concept
creator: Commission d'enrichissement de la langue française, FranceTerme
source: révision de l'arrêté du 12 août 1976
date parution JO: 2000-09-22
equivalent EN: wrecker @en
equivalent EN: wrecker (en)
definition: Engin mécanique automoteur destiné à la récupération sur le terrain des véhicules accidentés.
in scheme: Défense
in scheme: Transports et mobilité
in scheme: concepts
notation: DEFE90

génération de force
type: ConceptConcept
type: Concept
creator: Commission d'enrichissement de la langue française, FranceTerme
equivalent EN: force generation @en
equivalent EN: force generation (en)
definition: Processus visant à la constitution d’une force opérationnelle.
in scheme: Défense
in scheme: concept-SD-defense-operations
in scheme: concepts
notation: DEFE900

drone armé
type: ConceptConcept
type: Concept
creator: Commission d'enrichissement de la langue française, FranceTerme
date parution JO: 2019-06-29
deconseille ou frequent: drone tueur
equivalent EN: UCAV @en
equivalent EN: UCAV (en)
equivalent EN: attack drone @en
equivalent EN: attack drone (en)
equivalent EN: combat drone @en
equivalent EN: combat drone (en)
equivalent EN: unmanned combat aerial vehicle @en
equivalent EN: unmanned combat aerial vehicle (en)
equivalent EN: unmanned combat air vehicle @en
equivalent EN: unmanned combat air vehicle (en)
alternative label: drone de combat
definition: Drone qui est piloté et équipé d’un système d’armes pour neutraliser ou détruire un objectif.
in scheme: Défense
in scheme: concepts
notation: DEFE901
related: système d'armes
related: drone
related: système d'armes létal autonome

système d'armes létal autonome
type: ConceptConcept
type: Concept
creator: Commission d'enrichissement de la langue française, FranceTerme
abbreviation: SALA
date parution JO: 2019-06-29
deconseille ou frequent: drone tueur
deconseille ou frequent: killer robot
deconseille ou frequent: robot tueur
equivalent EN: LAWS @en
equivalent EN: LAWS (en)
equivalent EN: lethal autonomous weapons systems @en
equivalent EN: lethal autonomous weapons systems (en)
definition: Système d’armes robotique ayant la capacité de tuer, qui, une fois programmé par un opérateur humain, sélectionne et détruit un objectif sans autre intervention humaine.
in scheme: Défense
in scheme: concepts
notation: DEFE902
note: On trouve aussi, dans l’usage, le terme « robot tueur », qui est déconseillé.
related: système d'armes
related: drone armé

guerre dissymétrique
type: ConceptConcept
type: Concept
creator: Commission d'enrichissement de la langue française, FranceTerme
date parution JO: 2019-06-29
equivalent EN: dissymmetric warfare @en
equivalent EN: dissymmetric warfare (en)
equivalent EN: dissymmetrical warfare @en
equivalent EN: dissymmetrical warfare (en)
definition: Conflit armé qui oppose des forces régulières ne disposant pas de capacités opérationnelles équivalentes.
in scheme: Défense
in scheme: concept-SD-defense-operations
in scheme: concepts
notation: DEFE904
related: capacité opérationnelle
related: guerre asymétrique

posture permanente de sûreté aérienne
type: ConceptConcept
type: Concept
creator: Commission d'enrichissement de la langue française, FranceTerme
abbreviation: PPSA
definition: Dispositif de l’armée de l’Air regroupant un Ensemble de mesures permanentes de contrôle et d’interventions qui visent à faire respecter la souveraineté nationale dans l’espace aérien français et à assurer la défense du territoire contre toute menace aérienne.
in scheme: Aéronautique
in scheme: Défense
in scheme: concept-SD-aeronautique-operations
in scheme: concept-SD-defense-operations
in scheme: concepts
notation: DEFE906

régénération de force
type: ConceptConcept
type: Concept
creator: Commission d'enrichissement de la langue française, FranceTerme
date parution JO: 2019-06-29
deconseille ou frequent: génération de force
equivalent EN: force regeneration @en
equivalent EN: force regeneration (en)
definition: Processus consistant à restaurer la capacité opérationnelle d’une force.
in scheme: Défense
in scheme: concept-SD-defense-operations
in scheme: concepts
notation: DEFE907
related: force opérationnelle
related: capacité opérationnelle

malle renforcée
type: ConceptConcept
type: Concept
creator: Commission d'enrichissement de la langue française, FranceTerme
date parution JO: 2019-06-29
deconseille ou frequent: anti-choc
deconseille ou frequent: flightcase
deconseille ou frequent: malle de transport
equivalent EN: flight case @en
equivalent EN: flight case (en)
alternative label: malle antichoc
definition: Caisse conçue pour protéger du matériel lors d’un transport, notamment aérien.
in scheme: Tous domaines
in scheme: concepts
notation: DEFE908

guerre asymétrique
type: ConceptConcept
type: Concept
creator: Commission d'enrichissement de la langue française, FranceTerme
date parution JO: 2019-06-29
equivalent EN: asymmetric warfare @en
equivalent EN: asymmetric warfare (en)
equivalent EN: asymmetrical warfare @en
equivalent EN: asymmetrical warfare (en)
definition: Conflit armé qui oppose une armée régulière à des forces irrégulières.
in scheme: Défense
in scheme: concept-SD-defense-operations
in scheme: concepts
notation: DEFE909
note: Une guerre asymétrique peut, par exemple, opposer une force régulière à une guérilla ou à une force terroriste.
related: guerre dissymétrique

dissuasion
type: ConceptConcept
type: Concept
creator: Commission d'enrichissement de la langue française, FranceTerme
source: révision de l'arrêté du 12 août 1976
date parution JO: 2000-09-22
equivalent EN: deterrence @en
equivalent EN: deterrence (en)
part of speech: nom féminin
definition: Action visant à empêcher un adversaire ou un ennemi potentiel d'accomplir une action hostile, par crainte des conséquences, en particulier de représailles par arme nucléaire.
in scheme: Défense
in scheme: concepts
notation: DEFE91

guerre hybride
type: ConceptConcept
type: Concept
creator: Commission d'enrichissement de la langue française, FranceTerme
date parution JO: 2019-06-29
deconseille ou frequent: menace hybride
deconseille ou frequent: menaces hybrides
equivalent EN: hybrid warfare @en
equivalent EN: hybrid warfare (en)
definition: Conflit combinant des actions militaires et non militaires.
in scheme: Défense
in scheme: concept-SD-defense-operations
in scheme: concepts
notation: DEFE910
note: Les actions non militaires peuvent être d’ordre diplomatique, économique, cybernétique, ou encore relever de la manipulation de l’information.

cyberrenseignement
type: ConceptConcept
type: Concept
creator: Commission d'enrichissement de la langue française, FranceTerme
date parution JO: 2019-06-29
deconseille ou frequent: EI
deconseille ou frequent: exploitation informatique
equivalent EN: CNE @en
equivalent EN: CNE (en)
equivalent EN: computer network exploitation @en
equivalent EN: computer network exploitation (en)
part of speech: nom masculin
definition: Ensemble des opérations menées dans le cyberespace par un État, consistant à infiltrer les systèmes informatiques d’une organisation et à s’emparer de données pour exploiter, à des fins opérationnelles, les renseignements ainsi recueillis.
in scheme: Défense
in scheme: Informatique
in scheme: concepts
notation: DEFE911
note: On trouve aussi, dans le langage professionnel, le terme « exploitation informatique (EI) ».
related: cyberespace
related: opérations dans le cyberespace
related: renseignement intéressant la cyberdéfense militaire
related: concept-JURI62
scope note: Cette publication annule et remplace celle du Journal officiel du 19 septembre 2017.

coordination
type: ConceptConcept
type: Concept
creator: Commission d'enrichissement de la langue française, FranceTerme
date parution JO: 2020-12-11
deconseille ou frequent: déconfliction
equivalent EN: deconfliction @en
equivalent EN: deconfliction (en)
part of speech: nom féminin
definition: Ensemble des mesures prises, notamment dans le cadre d’opérations militaires, pour assurer la cohérence des actions menées conjointement par plusieurs intervenants dans un espace donné.
in scheme: Défense
in scheme: Transports et mobilité
in scheme: concept-SD-defense-operations
in scheme: concept-SD-transports-et-mobilite-operations
in scheme: concepts
notation: DEFE912
note: 1. L’espace dans lequel la coordination est mise en œuvre peut être terrestre, maritime ou aérien.
note: 2. On trouve aussi le terme « déconfliction », qui est à proscrire.

conseiller juridique en opération
type: ConceptConcept
type: Concept
creator: Commission d'enrichissement de la langue française, FranceTerme
date parution JO: 2020-12-11
equivalent EN: LEGAD @en
equivalent EN: LEGAD (en)
equivalent EN: legal adviser @en
equivalent EN: legal adviser (en)
equivalent EN: legal advisor @en
equivalent EN: legal advisor (en)
forme abregee: conseiller juridique
definition: Expert militaire chargé d’informer et de conseiller le commandement d’une force projetée sur les conditions juridiques de l’emploi de cette force et ainsi de garantir la légalité des actions sur le terrain.
in scheme: Défense
in scheme: concepts
notation: DEFE913
related: force projetable
related: conseiller pour les affaires politiques

ciblage
type: ConceptConcept
type: Concept
creator: Commission d'enrichissement de la langue française, FranceTerme
date parution JO: 2020-12-11
deconseille ou frequent: choix des objectifs et des moyens de traitement
equivalent EN: targeting @en
equivalent EN: targeting (en)
part of speech: nom masculin
definition: Processus qui comprend la recherche, l’identification et la hiérarchisation des objectifs à neutraliser ou à détruire, ainsi que le choix des moyens à mettre en œuvre.
in scheme: Défense
in scheme: concept-SD-defense-operations
in scheme: concepts
notation: DEFE914
note: On trouve aussi, dans le langage professionnel, le terme « choix des objectifs et des moyens de traitement ».

avion de transport et de ravitaillement
type: ConceptConcept
type: Concept
creator: Commission d'enrichissement de la langue française, FranceTerme
abbreviation: ATR
date parution JO: 2020-12-11
deconseille ou frequent: avion de transport et de ravitaillement
deconseille ou frequent: avion multi role de transport et de ravitaillement de vol
deconseille ou frequent: avion multirole de transport et de ravitaillement de vol
deconseille ou frequent: avion mutlrôle
equivalent EN: MRTT @en
equivalent EN: MRTT (en)
equivalent EN: multi-role tanker transport @en
equivalent EN: multi-role tanker transport (en)
equivalent EN: multirole tanker transport @en
equivalent EN: multirole tanker transport (en)
definition: Aéronef polyvalent à voilure fixe qui permet le transport de troupes et de matériels et le ravitaillement en vol.
in scheme: Aéronautique
in scheme: Défense
in scheme: concept-SD-aeronautique-operations
in scheme: concept-SD-defense-operations
in scheme: concepts
notation: DEFE916
related: aéronef polyvalent

force prépositionnée
type: ConceptConcept
type: Concept
creator: Commission d'enrichissement de la langue française, FranceTerme
date parution JO: 2020-12-11
equivalent EN: prepositioned force @en
equivalent EN: prepositioned force (en)
definition: Force qui, dans un but de prévention des crises, est déployée de manière permanente ou temporaire par un État dans les zones maritimes ou sur le territoire d’un autre État.
in scheme: Défense
in scheme: concept-SD-defense-operations
in scheme: concepts
notation: DEFE917
note: Une force de présence est un exemple de force prépositionnée.
related: force de présence

exploitation de site tactique
type: ConceptConcept
type: Concept
creator: Commission d'enrichissement de la langue française, FranceTerme
abbreviation: EST
date parution JO: 2020-12-11
deconseille ou frequent: E2S
deconseille ou frequent: ESS
deconseille ou frequent: exploitation de site sensible
deconseille ou frequent: exploitation de sites sensibles
deconseille ou frequent: exploitation de sites tactiques
equivalent EN: SSE @en
equivalent EN: SSE (en)
equivalent EN: sensitive site exploitation @en
equivalent EN: sensitive site exploitation (en)
definition: Recueil, dans une zone où se déroule un combat, de toutes les informations utiles à la connaissance de l’adversaire, complétées par leur analyse en vue d’une action ultérieure.
in scheme: Défense
in scheme: concepts
notation: DEFE919
note: On trouve aussi le terme « exploitation de site sensible (ESS) ».
related: recherche de renseignements

distance de sécurité (à)
type: ConceptConcept
type: Concept
creator: Commission d'enrichissement de la langue française, FranceTerme
source: révision de l'arrêté du 12 août 1976
date parution JO: 2000-09-22
deconseille ou frequent: distance de sécurité
deconseille ou frequent: à distance de sécurité
equivalent EN: safe distance @en
equivalent EN: safe distance (en)
equivalent EN: standoff distance @en
equivalent EN: standoff distance (en)
equivalent EN: standoff range @en
equivalent EN: standoff range (en)
definition: Se dit d'une arme dont le lancement peut être effectué par un moyen de combat qui se trouve hors de portée des moyens de défense adverse.
in scheme: Défense
in scheme: concepts
notation: DEFE92

descente en rappel inversé
type: ConceptConcept
type: Concept
creator: Commission d'enrichissement de la langue française, FranceTerme
date parution JO: 2020-12-11
deconseille ou frequent: Australian rappelling
deconseille ou frequent: décalade
equivalent EN: Australian abseiling @en
equivalent EN: Australian abseiling (en)
equivalent EN: deepelling @en
equivalent EN: deepelling (en)
equivalent EN: rap jumping @en
equivalent EN: rap jumping (en)
definition: Technique de descente contrôlée de parois verticales, qui consiste à marcher sur la paroi, face au sol, en s’aidant de cordes fixes et d’équipements spécialisés.
in scheme: Défense
in scheme: Sports
in scheme: concepts
notation: DEFE920
note: Dans un cadre militaire, la descente en rappel inversé est utilisée comme une technique d’assaut permettant à un soldat d’utiliser son arme pendant la descente.

robot fardier
type: ConceptConcept
type: Concept
creator: Commission d'enrichissement de la langue française, FranceTerme
date parution JO: 2020-12-11
deconseille ou frequent: mule robotique
deconseille ou frequent: pack mule
equivalent EN: robot pack mule @en
equivalent EN: robot pack mule (en)
alternative label: robot mule
definition: Robot conçu pour transporter des charges lourdes sur des terrains accidentés impraticables pour tout autre véhicule.
in scheme: Défense
in scheme: concepts
notation: DEFE921

francisation de matériel
type: ConceptConcept
type: Concept
creator: Commission d'enrichissement de la langue française, FranceTerme
date parution JO: 2020-12-11
deconseille ou frequent: francization
equivalent EN: frenchification @en
equivalent EN: frenchification (en)
forme abregee: francisation, n.f.
definition: Adaptation aux normes françaises de matériel conçu et fabriqué dans un autre pays.
in scheme: Défense
in scheme: Économie générale
in scheme: Industrie
in scheme: concept-SD-defense-armement
in scheme: concept-SD-industrie-armement
in scheme: concepts
notation: DEFE922

prime à la faille détectée
type: ConceptConcept
type: Concept
creator: Commission d'enrichissement de la langue française, FranceTerme
date parution JO: 2020-12-11
equivalent EN: bug bounty @en
equivalent EN: bug bounty (en)
forme abregee: prime à la faille
definition: Rémunération octroyée par une organisation à un expert informatique indépendant qui découvre une faille de sécurité au sein d’un système informatique utilisé par cette organisation.
in scheme: Informatique
in scheme: concepts
notation: DEFE923
related: cybersécurité
related: concept-INFO969

guerre par procuration
type: ConceptConcept
type: Concept
creator: Commission d'enrichissement de la langue française, FranceTerme
date parution JO: 2020-12-11
deconseille ou frequent: guerre par proxy
deconseille ou frequent: guerre proxy
equivalent EN: proxy war @en
equivalent EN: proxy war (en)
equivalent EN: war by proxy @en
equivalent EN: war by proxy (en)
definition: Guerre menée par un État qui, ne prenant pas directement part aux opérations militaires, agit par l’intermédiaire d’un autre acteur, étatique ou non étatique, engagé sur le terrain.
in scheme: Défense
in scheme: concept-SD-defense-operations
in scheme: concepts
notation: DEFE924
note: En contrepartie de son action, l’acteur engagé sur le terrain peut recevoir un financement, un entraînement militaire, de l’armement ou d’autres formes d’assistance.

cyberguerre
type: ConceptConcept
type: Concept
creator: Commission d'enrichissement de la langue française, FranceTerme
date parution JO: 2020-12-11
deconseille ou frequent: cyber guerre
deconseille ou frequent: cyber war
equivalent EN: cyberwar @en
equivalent EN: cyberwar (en)
part of speech: nom féminin
definition: Conflit se caractérisant par un ensemble d’actions offensives et défensives menées dans le cyberespace.
in scheme: Défense
in scheme: Informatique
in scheme: concepts
notation: DEFE925
related: cyberattaque
related: cyberespace
related: cyberdéfense
related: opérations dans le cyberespace
related: lutte informatique défensive
related: lutte informatique offensive

menace hybride
type: ConceptConcept
type: Concept
creator: Commission d'enrichissement de la langue française, FranceTerme
equivalent EN: hybrid threat @en
equivalent EN: hybrid threat (en)
definition: Menace qui consiste en une combinaison donnée de forces armées, non armées, irrégulières et régulières et de capacités et tactiques régulières et irrégulières utilisées ensemble pour atteindre un objectif commun.
in scheme: Défense
in scheme: concepts
notation: DEFE926

force de présence
type: ConceptConcept
type: Concept
creator: Commission d'enrichissement de la langue française, FranceTerme
date parution JO: 2020-12-11
equivalent EN: standing out-of-area force @en
equivalent EN: standing out-of-area force (en)
definition: Force prépositionnée qui est déployée de manière permanente.
in scheme: Défense
in scheme: concept-SD-defense-operations
in scheme: concepts
notation: DEFE927
note: Une force de présence assure des missions de veille et de renseignement ainsi que l’accueil et l’entraînement des forces d’intervention.
related: force prépositionnée
scope note: Cette publication annule et remplace celle du Journal officiel du 5 décembre 2013.

marsouinage
type: ConceptConcept
type: Concept
creator: Commission d'enrichissement de la langue française, FranceTerme
source: révision de l'arrêté du 12 août 1976
date parution JO: 2000-09-22
deconseille ou frequent: hydroplanage
equivalent EN: porpoising @en
equivalent EN: porpoising (en)
part of speech: nom masculin
definition: Tangage spontané d’un hydravion provoqué par son instabilité pendant l'hydroplanage.
in scheme: Aéronautique
in scheme: Défense
in scheme: concepts
notation: DEFE928
related: marsouinage

dose létale moyenne
type: ConceptConcept
type: Concept
creator: Commission d'enrichissement de la langue française, FranceTerme
source: révision de l'arrêté du 17 avril 1989
date parution JO: 2000-09-22
equivalent EN: mean lethal dose @en
equivalent EN: mean lethal dose (en)
definition: Dose d'un agent chimique toxique qui provoque la mort pour 50 % des personnes exposées.
in scheme: Chimie
in scheme: concepts
notation: DEFE929
related: dose létale moyenne

distance franchissable
type: ConceptConcept
type: Concept
creator: Commission d'enrichissement de la langue française, FranceTerme
source: révision de l'arrêté du 5 octobre 1984
date parution JO: 2000-09-22
equivalent EN: range @en
equivalent EN: range (en)
definition: Distance que peut parcourir un avion pour une configuration de décollage et dans des conditions atmosphériques données.
in scheme: Aéronautique
in scheme: Défense
in scheme: concepts
notation: DEFE93

dose létale
type: ConceptConcept
type: Concept
creator: Commission d'enrichissement de la langue française, FranceTerme
source: révision de l'arrêté du 5 octobre 1984
date parution JO: 2000-09-22
equivalent EN: lethal dose @en
equivalent EN: lethal dose (en)
definition: Dose nucléaire ou chimique mortelle.
in scheme: Chimie
in scheme: Nucléaire
in scheme: concepts
notation: DEFE94

dose létale moyenne
type: ConceptConcept
type: Concept
creator: Commission d'enrichissement de la langue française, FranceTerme
source: révision de l'arrêté du 17 avril 1989
date parution JO: 2000-09-22
equivalent EN: mean lethal dose @en
equivalent EN: mean lethal dose (en)
definition: Quantité d'irradiation nucléaire absorbée par l'ensemble du corps et qui, après un temps d'examen, provoque la mort pour 50 % des personnes exposées.
in scheme: Nucléaire
in scheme: concepts
notation: DEFE95
related: dose létale moyenne

dose limite
type: ConceptConcept
type: Concept
creator: Commission d'enrichissement de la langue française, FranceTerme
source: révision de l'arrêté du 5 octobre 1984
date parution JO: 2000-09-22
definition: Dose maximale fixée par le commandement pour une mission donnée.
in scheme: Défense
in scheme: concept-SD-defense-nucleaire
in scheme: concepts
notation: DEFE96

dose maximale admissible
type: ConceptConcept
type: Concept
creator: Commission d'enrichissement de la langue française, FranceTerme
source: révision de l'arrêté du 5 octobre 1984
abbreviation: MPD @en
date parution JO: 2000-09-22
equivalent EN: MPD @en
equivalent EN: MPD (en)
equivalent EN: maximum permissible dose @en
equivalent EN: maximum permissible dose (en)
definition: Dose extrême pouvant être absorbée pendant une durée déterminée.
in scheme: Chimie
in scheme: Nucléaire
in scheme: concepts
notation: DEFE97

élevon
type: ConceptConcept
type: Concept
creator: Commission d'enrichissement de la langue française, FranceTerme
source: révision de l'arrêté du 12 août 1976
date parution JO: 2000-09-22
deconseille ou frequent: débattement antisymétrique
deconseille ou frequent: débattement symétrique
deconseille ou frequent: elevator-aileron
equivalent EN: elevon @en
equivalent EN: elevon (en) [contraction d'elevator-aileron]
part of speech: nom masculin
definition: Gouverne d'avion utilisée soit comme gouverne de profondeur (débattement symétrique), soit comme gouverne de roulis (débattement antisymétrique).
in scheme: Aéronautique
in scheme: Défense
in scheme: concepts
notation: DEFE99

entreprise de taille intermédiaire
type: ConceptConcept
type: Concept
creator: INSEE
forme abregee: ETI
definition: Entreprise qui a entre 250 et 4 999 salariés, et soit un chiffre d'affaires n'excédant pas 1,5 milliard d'euros soit un total de bilan n'excédant pas 2 milliards d'euros.
in scheme: Économie et gestion d'entreprise
in scheme: concepts
note: 1. Une entreprise qui a moins de 250 salariés, mais plus de 50 millions d'euros de chiffre d'affaires et plus de 43 millions d'euros de total de bilan est aussi considérée comme une ETI.
note: 2. Les ETI constituent une catégorie d'entreprises intermédiaire entre les petites et moyennes entreprises (PME) et les grandes entreprises.
note: 3. Cette catégorie d'entreprises est définie par le décret d'application (n°2008-1354) de l'article 51 de la loi de modernisation de l'économie, relatif aux critères permettant de déterminer la catégorie d'appartenance d'une entreprise pour les besoins de l'analyse statistique et économique.

accord de règlement
type: ConceptConcept
type: Concept
creator: Commission d'enrichissement de la langue française, FranceTerme
date parution JO: 1998-08-14
deconseille ou frequent: clean-cut
equivalent EN: cut-off @en
equivalent EN: cut-off (en)
definition: Transaction globale portant sur des sinistres, négociée par une société d'assurances qui désire mettre un terme à la liquidation d'une activité qu'elle ne pratique plus.
in scheme: Assurance
in scheme: concepts
notation: ECON1
note: Lorsqu'un tel accord concerne l'intégralité d'une catégorie de sinistres et qu'il est conclu pour solde de tout compte, mettant définitivement un terme aux engagements de l'entreprise dans cette catégorie, on parlera d'« accord de règlement définitif » (en anglais : clean-cut).

défaisance
type: ConceptConcept
type: Concept
creator: Commission d'enrichissement de la langue française, FranceTerme
date parution JO: 1998-08-14
equivalent EN: defeasance @en
equivalent EN: defeasance (en)
part of speech: nom féminin
definition: Opération ayant pour but d'améliorer le bilan d'une entreprise en se défaisant, sur une entité distincte, d'actifs considérés comme compromis en tout ou partie.
in scheme: Finance
in scheme: concepts
notation: ECON10
related: structure de défaisance

récession à double creux
type: ConceptConcept
type: Concept
creator: Commission d'enrichissement de la langue française, FranceTerme
date parution JO: 2000-05-12
equivalent EN: double dip recession @en
equivalent EN: double dip recession (en)
definition: Récession caractérisée par une première chute du produit intérieur brut suivie, après une reprise avortée, d'une rechute plus profonde.
in scheme: Économie générale
in scheme: concepts
notation: ECON100

travail à domicile
type: ConceptConcept
type: Concept
creator: Commission d'enrichissement de la langue française, FranceTerme
date parution JO: 2006-10-26
deconseille ou frequent: TAD
equivalent EN: home-based business @en
equivalent EN: home-based business (en)
in scheme: Économie et gestion d'entreprise
in scheme: concepts
notation: ECON1000

approvisionnement local
type: ConceptConcept
type: Concept
creator: Commission d'enrichissement de la langue française, FranceTerme
date parution JO: 2006-12-28
equivalent EN: local sourcing @en
equivalent EN: local sourcing (en)
in scheme: Économie et gestion d'entreprise
in scheme: concepts
notation: ECON1003

audit préalable
type: ConceptConcept
type: Concept
creator: Commission d'enrichissement de la langue française, FranceTerme
date parution JO: 2006-12-28
equivalent EN: due diligence @en
equivalent EN: due diligence (en)
definition: Investigation qui implique le recours à des experts, notamment comptables, financiers, juridiques ou fiscaux, dont les conclusions serviront de base à la prise de décision d'un investisseur.
in scheme: Finance
in scheme: concepts
notation: ECON1004
related: obligation de vigilance

conseil d'entreprise
type: ConceptConcept
type: Concept
creator: Commission d'enrichissement de la langue française, FranceTerme
date parution JO: 2006-12-28
equivalent EN: advisory @en
equivalent EN: advisory (en)
equivalent EN: business consulting @en
equivalent EN: business consulting (en)
equivalent EN: consultancy @en
equivalent EN: consultancy (en)
equivalent EN: consulting @en
equivalent EN: consulting (en)
definition: Activité d'une société de conseil consacrée à la stratégie et la gestion d'entreprise.
in scheme: Économie et gestion d'entreprise
in scheme: concepts
notation: ECON1005

déontologue
type: ConceptConcept
type: Concept
creator: Commission d'enrichissement de la langue française, FranceTerme
date parution JO: 2006-12-28
equivalent EN: compliance officer @en
equivalent EN: compliance officer (en)
part of speech: nom
definition: Personne chargée, au sein d'une entreprise, de contrôler la conformité des actes et des procédures aux lois et aux règles de bonne conduite, et de sensibiliser le personnel à celles-ci.
in scheme: Économie et gestion d'entreprise
in scheme: Finance
in scheme: concepts
notation: ECON1007

discompte en cascade
type: ConceptConcept
type: Concept
creator: Commission d'enrichissement de la langue française, FranceTerme
abbreviation: roll back @en
abbreviation: roll-back @en
abbreviation: rollback @en
date parution JO: 2006-12-28
equivalent EN: price rollback @en
equivalent EN: price rollback (en)
equivalent EN: roll back @en
equivalent EN: roll back (en)
equivalent EN: roll-back @en
equivalent EN: roll-back (en)
equivalent EN: rollback @en
equivalent EN: rollback (en)
definition: Baisse des prix consistant à faire bénéficier systématiquement le client des réductions obtenues des fournisseurs.
in scheme: Économie et gestion d'entreprise
in scheme: concepts
notation: ECON1008

distributeur en ligne
type: ConceptConcept
type: Concept
creator: Commission d'enrichissement de la langue française, FranceTerme
date parution JO: 2006-12-28
deconseille ou frequent: pure player
definition: Acteur économique qui commercialise des produits ou des services exclusivement sur l'internet.
in scheme: Économie et gestion d'entreprise
in scheme: concepts
notation: ECON1009
note: Le terme pure player, emprunté de l’anglais, est à proscrire.
related: tout en ligne
related: vendeur, -euse en ligne

réponse optimale au consommateur
type: ConceptConcept
type: Concept
creator: Commission d'enrichissement de la langue française, FranceTerme
abbreviation: ECR @en
abbreviation: ROC
date parution JO: 2000-05-12
equivalent EN: ECR @en
equivalent EN: ECR (en)
equivalent EN: efficient consumer response @en
equivalent EN: efficient consumer response (en)
definition: Stratégie de réduction de ceux des coûts qui, dans la chaîne du producteur au client, ne contribuent pas à la satisfaction des besoins du consommateur.
in scheme: Économie et gestion d'entreprise
in scheme: concepts
notation: ECON101

filtrage
type: ConceptConcept
type: Concept
creator: Commission d'enrichissement de la langue française, FranceTerme
date parution JO: 2006-12-28
equivalent EN: screening @en
equivalent EN: screening (en)
part of speech: nom masculin
definition: Pratique consistant à sélectionner des titres de portefeuille d'investissement en fonction de divers critères, notamment d'ordre social ou environnemental.
in scheme: Finance
in scheme: concepts
notation: ECON1010

gestion centralisée de la trésorerie
type: ConceptConcept
type: Concept
creator: Commission d'enrichissement de la langue française, FranceTerme
date parution JO: 2006-12-28
equivalent EN: cash pooling @en
equivalent EN: cash pooling (en)
definition: Méthode de gestion, en un seul lieu, des comptes bancaires des sociétés appartenant à un groupe.
in scheme: Finance
in scheme: concepts
notation: ECON1011

gestion des commandes
type: ConceptConcept
type: Concept
creator: Commission d'enrichissement de la langue française, FranceTerme
date parution JO: 2006-12-28
equivalent EN: storeflow @en
equivalent EN: storeflow (en)
in scheme: Économie et gestion d'entreprise
in scheme: concepts
notation: ECON1012

gestionnaire de portefeuille
type: ConceptConcept
type: Concept
creator: Commission d'enrichissement de la langue française, FranceTerme
date parution JO: 2006-12-28
equivalent EN: money manager @en
equivalent EN: money manager (en)
equivalent EN: portfolio manager @en
equivalent EN: portfolio manager (en)
in scheme: Finance
in scheme: concepts
notation: ECON1013

lancement optimal d'un produit
type: ConceptConcept
type: Concept
creator: Commission d'enrichissement de la langue française, FranceTerme
abbreviation: EPI @en
date parution JO: 2006-12-28
equivalent EN: EPI @en
equivalent EN: EPI (en)
equivalent EN: efficient product introduction @en
equivalent EN: efficient product introduction (en)
in scheme: Économie et gestion d'entreprise
in scheme: concepts
notation: ECON1014

logistique des retours
type: ConceptConcept
type: Concept
creator: Commission d'enrichissement de la langue française, FranceTerme
date parution JO: 2006-12-28
equivalent EN: returns management @en
equivalent EN: returns management (en)
equivalent EN: reverse logistics @en
equivalent EN: reverse logistics (en)
in scheme: Économie et gestion d'entreprise
in scheme: concepts
notation: ECON1015
related: logistique des sorties
related: service des retours

logistique des sorties
type: ConceptConcept
type: Concept
creator: Commission d'enrichissement de la langue française, FranceTerme
date parution JO: 2006-12-28
equivalent EN: forward logistics @en
equivalent EN: forward logistics (en)
in scheme: Économie et gestion d'entreprise
in scheme: concepts
notation: ECON1016
related: logistique des retours

marchandisage
type: ConceptConcept
type: Concept
creator: Commission d'enrichissement de la langue française, FranceTerme
date parution JO: 2006-12-28
deconseille ou frequent: merchandizing
equivalent EN: merchandising @en
equivalent EN: merchandising (en)
part of speech: nom masculin
definition: Ensemble des méthodes et techniques ayant trait à la présentation et à la mise en valeur des produits sur les lieux de vente.
in scheme: Économie et gestion d'entreprise
in scheme: concepts
notation: ECON1017
note: Les spécialistes invoquent la règle dite des « 5B », qui consiste à présenter le bon produit, au bon prix, au bon moment, au bon endroit et en bonne quantité.

marchandisation
type: ConceptConcept
type: Concept
creator: Commission d'enrichissement de la langue française, FranceTerme
date parution JO: 2006-12-28
deconseille ou frequent: marketization
equivalent EN: marketisation @en
equivalent EN: marketisation (en)
part of speech: nom féminin
definition: Passage d'une forme non marchande à une forme marchande de l'offre de biens et services.
in scheme: Économie et gestion d'entreprise
in scheme: concepts
notation: ECON1018

marchandiseur, -euse
type: ConceptConcept
type: Concept
creator: Commission d'enrichissement de la langue française, FranceTerme
date parution JO: 2006-12-28
equivalent EN: merchandiser @en
equivalent EN: merchandiser (en)
part of speech: nom
definition: Spécialiste de la gestion des linéaires des magasins en libre-service.
in scheme: Économie et gestion d'entreprise
in scheme: concepts
notation: ECON1019

stratégie de groupe
type: ConceptConcept
type: Concept
creator: Commission d'enrichissement de la langue française, FranceTerme
date parution JO: 2000-05-12
equivalent EN: corporate strategy @en
equivalent EN: corporate strategy (en)
definition: Choix des orientations structurelles et concurrentielles communes à plusieurs entreprises.
in scheme: Économie et gestion d'entreprise
in scheme: concepts
notation: ECON102

mercatique de terrain
type: ConceptConcept
type: Concept
creator: Commission d'enrichissement de la langue française, FranceTerme
date parution JO: 2006-12-28
equivalent EN: field marketing @en
equivalent EN: field marketing (en)
definition: Assistance aux vendeurs qui vise à rendre plus efficace l'animation commerciale des points de vente.
in scheme: Économie et gestion d'entreprise
in scheme: concepts
notation: ECON1020

mercatique engagée
type: ConceptConcept
type: Concept
creator: Commission d'enrichissement de la langue française, FranceTerme
abbreviation: cause marketing @en
date parution JO: 2006-12-28
equivalent EN: cause marketing @en
equivalent EN: cause marketing (en)
equivalent EN: cause-related marketing @en
equivalent EN: cause-related marketing (en)
definition: Mercatique associant une entreprise à la défense d'une grande cause.
in scheme: Économie et gestion d'entreprise
in scheme: concepts
notation: ECON1021

mercatique interactive
type: ConceptConcept
type: Concept
creator: Commission d'enrichissement de la langue française, FranceTerme
date parution JO: 2006-12-28
equivalent EN: interactive marketing @en
equivalent EN: interactive marketing (en)
definition: Stratégie reposant sur l'ajustement permanent de l'offre aux besoins des consommateurs grâce à un échange régulier d'informations entre l'acheteur, le distributeur et le vendeur.
in scheme: Économie et gestion d'entreprise
in scheme: concepts
notation: ECON1022

modèle d'entreprise
type: ConceptConcept
type: Concept
creator: Commission d'enrichissement de la langue française, FranceTerme
date parution JO: 2006-12-28
equivalent EN: business model @en
equivalent EN: business model (en)
alternative label: modèle économique
definition: Schéma identifiant et combinant les paramètres qui caractérisent une entreprise du point de vue de l'organisation, du fonctionnement et de la stratégie, afin de mettre au jour les facteurs de sa rentabilité.
in scheme: Économie et gestion d'entreprise
in scheme: concepts
notation: ECON1023
related: extensibilité d'un modèle économique
related: plan d'affaires

obligation de vigilance
type: ConceptConcept
type: Concept
creator: Commission d'enrichissement de la langue française, FranceTerme
date parution JO: 2006-12-28
equivalent EN: due diligence @en
equivalent EN: due diligence (en)
definition: Ensemble de prescriptions légales imposant, aux établissements de crédit et à toute personne recueillant des fonds, des contrôles visant à identifier leur interlocuteur et l'origine de ses ressources.
in scheme: Droit
in scheme: Finance
in scheme: concepts
notation: ECON1024
related: audit préalable

offre combinée
type: ConceptConcept
type: Concept
creator: Commission d'enrichissement de la langue française, FranceTerme
date parution JO: 2006-12-28
deconseille ou frequent: mix produit
equivalent EN: product mix @en
equivalent EN: product mix (en)
definition: Offre commerciale portant simultanément sur plusieurs produits.
in scheme: Économie et gestion d'entreprise
in scheme: concepts
notation: ECON1025
note: L'expression « mix produit » est à proscrire.

opérateur, -trice de marché
type: ConceptConcept
type: Concept
creator: Commission d'enrichissement de la langue française, FranceTerme
date parution JO: 2006-12-28
equivalent EN: trader @en
equivalent EN: trader (en)
forme abregee: opérateur, -trice, n.
definition: Personne qui réalise, pour le compte de l'établissement qu'elle représente ou pour le compte d'un tiers, des opérations de couverture, de placement ou de spéculation sur les marchés financiers.
in scheme: Finance
in scheme: concepts
notation: ECON1026

performance sociale
type: ConceptConcept
type: Concept
creator: Commission d'enrichissement de la langue française, FranceTerme
date parution JO: 2006-12-28
equivalent EN: corporate social performance @en
equivalent EN: corporate social performance (en)
definition: Résultats d'une entreprise dans les domaines qui ne relèvent pas directement de l'activité économique.
in scheme: Économie et gestion d'entreprise
in scheme: concepts
notation: ECON1027

périodisation du chiffre d'affaires
type: ConceptConcept
type: Concept
creator: Commission d'enrichissement de la langue française, FranceTerme
date parution JO: 2006-12-28
deconseille ou frequent: phasing du chiffre d'affaires
definition: Découpage par périodes des objectifs de chiffre d'affaires.
in scheme: Économie et gestion d'entreprise
in scheme: concepts
notation: ECON1028
note: L'expression « phasing du chiffre d'affaires » est à proscrire.

personnaliser
type: ConceptConcept
type: Concept
creator: Commission d'enrichissement de la langue française, FranceTerme
date parution JO: 2006-12-28
deconseille ou frequent: customiser
deconseille ou frequent: to customize
equivalent EN: customize @en
equivalent EN: customize (en)
part of speech: verbe
definition: Adapter des produits à la demande exprimée par chaque client pour les rendre plus conformes aux goûts de celui-ci.
in scheme: Économie et gestion d'entreprise
in scheme: concepts
notation: ECON1029
note: L'emploi du verbe « customiser » est à proscrire.
related: personnalisation

scannage à domicile
type: ConceptConcept
type: Concept
creator: Commission d'enrichissement de la langue française, FranceTerme
date parution JO: 2000-05-12
equivalent EN: home scanning @en
equivalent EN: home scanning (en)
definition: Dans les enquêtes auprès des consommateurs, méthode consistant à recueillir les données à domicile au moyen d'un scanneur, puis à les transmettre par télématique.
in scheme: Économie et gestion d'entreprise
in scheme: concepts
notation: ECON103

préparation en magasin
type: ConceptConcept
type: Concept
creator: Commission d'enrichissement de la langue française, FranceTerme
abbreviation: store picking @en
date parution JO: 2006-12-28
equivalent EN: in-store picking @en
equivalent EN: in-store picking (en)
equivalent EN: store picking @en
equivalent EN: store picking (en)
definition: Pratique consistant à préparer les commandes en magasin et non en entrepôt.
in scheme: Économie et gestion d'entreprise
in scheme: concepts
notation: ECON1030

prise ferme
type: ConceptConcept
type: Concept
creator: Commission d'enrichissement de la langue française, FranceTerme
date parution JO: 2006-12-28
equivalent EN: bought deal @en
equivalent EN: bought deal (en)
definition: Engagement par lequel une banque ou un syndicat de banques garantit l'intégralité de la souscription d'une émission d'instruments financiers réalisée par une société.
in scheme: Finance
in scheme: concepts
notation: ECON1031

produit de grande consommation
type: ConceptConcept
type: Concept
creator: Commission d'enrichissement de la langue française, FranceTerme
abbreviation: FMCG @en
abbreviation: PGC
date parution JO: 2006-12-28
equivalent EN: FMCG @en
equivalent EN: FMCG (en)
equivalent EN: fast moving consumer good @en
equivalent EN: fast moving consumer good (en)
in scheme: Économie et gestion d'entreprise
in scheme: concepts
notation: ECON1032

promotion d'une marque
type: ConceptConcept
type: Concept
creator: Commission d'enrichissement de la langue française, FranceTerme
date parution JO: 2006-12-28
equivalent EN: brand development @en
equivalent EN: brand development (en)
in scheme: Économie et gestion d'entreprise
in scheme: concepts
notation: ECON1033

responsabilité sociale de l'entreprise
type: ConceptConcept
type: Concept
creator: Commission d'enrichissement de la langue française, FranceTerme
abbreviation: CSR @en
abbreviation: RSE
date parution JO: 2006-12-28
equivalent EN: CSR @en
equivalent EN: CSR (en)
equivalent EN: corporate social responsibility @en
equivalent EN: corporate social responsibility (en)
forme abregee: responsabilité sociale
definition: Responsabilité de l'entreprise à l'égard de la collectivité, qui s'étend au-delà de ses obligations légales et de ses impératifs purement économiques.
in scheme: Économie et gestion d'entreprise
in scheme: concepts
notation: ECON1034
related: triple performance

responsable du plan médias
type: ConceptConcept
type: Concept
creator: Commission d'enrichissement de la langue française, FranceTerme
date parution JO: 2006-12-28
equivalent EN: media planner @en
equivalent EN: media planner (en)
in scheme: Communication
in scheme: Économie et gestion d'entreprise
in scheme: concepts
notation: ECON1035
related: stratège de la diffusion publicitaire
related: plan médias

veille mercatique
type: ConceptConcept
type: Concept
creator: Commission d'enrichissement de la langue française, FranceTerme
date parution JO: 2006-12-28
deconseille ou frequent: marketing fluide
equivalent EN: fluid marketing @en
equivalent EN: fluid marketing (en)
definition: Démarche qui consiste à détecter, à l'échelle nationale et internationale, les tendances naissantes et à y répondre.
in scheme: Économie et gestion d'entreprise
in scheme: concepts
notation: ECON1037
note: L'expression « marketing fluide » est à proscrire.

vente poussée
type: ConceptConcept
type: Concept
creator: Commission d'enrichissement de la langue française, FranceTerme
date parution JO: 2006-12-28
equivalent EN: up-selling @en
equivalent EN: up-selling (en)
definition: Méthode de vente par laquelle le vendeur incite le client à dépasser le prix qu'il s'était fixé pour l'achat d'un produit.
in scheme: Économie et gestion d'entreprise
in scheme: concepts
notation: ECON1038
related: vente croisée

banalisation
type: ConceptConcept
type: Concept
creator: Commission d'enrichissement de la langue française, FranceTerme
date parution JO: 2007-06-12
deconseille ou frequent: commoditisation
equivalent EN: commoditization @en
equivalent EN: commoditization (en)
part of speech: nom féminin
definition: Démarche commerciale qui consiste à faire du prix d'un produit le seul critère distinctif pour l'acheteur.
in scheme: Économie et gestion d'entreprise
in scheme: concepts
notation: ECON1039

stratégie d'entreprise
type: ConceptConcept
type: Concept
creator: Commission d'enrichissement de la langue française, FranceTerme
date parution JO: 2000-05-12
equivalent EN: business strategy @en
equivalent EN: business strategy (en)
definition: Choices of structural orientations and competitive behaviour for a business. @en
definition: Choix des orientations structurelles et concurrentielles d'une entreprise.
in scheme: Économie et gestion d'entreprise
in scheme: concepts
notation: ECON104
preferred label: business strategy @en

bouche à oreille
type: ConceptConcept
type: Concept
creator: Commission d'enrichissement de la langue française, FranceTerme
abbreviation: WOMM @en
date parution JO: 2007-06-12
equivalent EN: WOMM @en
equivalent EN: WOMM (en)
equivalent EN: buzz marketing @en
equivalent EN: buzz marketing (en)
equivalent EN: word of mouth marketing @en
equivalent EN: word of mouth marketing (en)
definition: Technique mercatique fondée sur l'exploitation des messages circulant entre les consommateurs.
in scheme: Économie et gestion d'entreprise
in scheme: concepts
notation: ECON1040
related: bouche à oreille électronique

bouche à oreille électronique
type: ConceptConcept
type: Concept
creator: Commission d'enrichissement de la langue française, FranceTerme
date parution JO: 2007-06-12
deconseille ou frequent: marketing de propagation
deconseille ou frequent: marketing viral
equivalent EN: viral marketing @en
equivalent EN: viral marketing (en)
definition: Technique mercatique reposant sur la transmission de proche en proche, par voie électronique, de messages commerciaux.
in scheme: Économie et gestion d'entreprise
in scheme: concepts
notation: ECON1041
note: Les expressions « marketing viral » et « marketing de propagation » sont à proscrire.
related: bouche à oreille

commerce sans fil
type: ConceptConcept
type: Concept
creator: Commission d'enrichissement de la langue française, FranceTerme
abbreviation: m-commerce @en
date parution JO: 2007-06-12
deconseille ou frequent: commerce mobile
equivalent EN: m-commerce @en
equivalent EN: m-commerce (en)
equivalent EN: mobile commerce @en
equivalent EN: mobile commerce (en)
definition: Technique commerciale recourant à des moyens de communication portables.
in scheme: Économie et gestion d'entreprise
in scheme: concepts
notation: ECON1042
note: L'expression « commerce mobile » est à proscrire.

fonds multicédant
type: ConceptConcept
type: Concept
creator: Commission d'enrichissement de la langue française, FranceTerme
date parution JO: 2007-06-12
equivalent EN: conduit @en
equivalent EN: conduit (en)
definition: Structure de titrisation mise en place par certaines banques commerciales pour acquérir des actifs provenant de plusieurs cédants, ou par certaines sociétés d'assurance pour cantonner les risques.
in scheme: Finance
in scheme: concepts
notation: ECON1043
related: entité ad hoc

gestion consultative
type: ConceptConcept
type: Concept
creator: Commission d'enrichissement de la langue française, FranceTerme
date parution JO: 2007-06-12
equivalent EN: top-down and bottom-up approach @en
equivalent EN: top-down and bottom-up approach (en)
definition: Méthode de gestion impliquant de consulter le personnel avant de prendre les décisions.
in scheme: Économie et gestion d'entreprise
in scheme: concepts
notation: ECON1044

indemnité de rupture
type: ConceptConcept
type: Concept
creator: Commission d'enrichissement de la langue française, FranceTerme
date parution JO: 2007-06-12
deconseille ou frequent: indemnité de résiliation
equivalent EN: break-up fee @en
equivalent EN: break-up fee (en)
definition: Indemnité versée par une des parties aux autres dans le cas où l'exécution d'un engagement, par exemple l'ouverture ou la poursuite de négociations, est interrompue de son fait.
in scheme: Finance
in scheme: concepts
notation: ECON1045
note: Dans le cas particulier de la rupture d'un contrat, on parle d'« indemnité de résiliation ».

notation sociale
type: ConceptConcept
type: Concept
creator: Commission d'enrichissement de la langue française, FranceTerme
date parution JO: 2007-06-12
deconseille ou frequent: rating social
equivalent EN: social rating @en
equivalent EN: social rating (en)
alternative label: évaluation sociale
definition: Appréciation du comportement d'une entreprise à l'égard de son personnel et de ses partenaires.
in scheme: Économie et gestion d'entreprise
in scheme: concepts
notation: ECON1046
note: 1. Parmi les critères pris en compte, on peut citer la gestion des ressources humaines, le respect de l'environnement, les relations avec les fournisseurs, le gouvernement d'entreprise, les liens avec la société civile.
note: 2. L'expression « rating social » est à proscrire.
related: rapport social

optimisation de rendement
type: ConceptConcept
type: Concept
creator: Commission d'enrichissement de la langue française, FranceTerme
date parution JO: 2007-06-12
equivalent EN: optimized portfolio management @en
equivalent EN: optimized portfolio management (en)
equivalent EN: yield management @en
equivalent EN: yield management (en)
definition: Gestion de portefeuille qui recherche le meilleur rendement compte tenu du niveau de risque contractuellement convenu.
in scheme: Finance
in scheme: concepts
notation: ECON1047
scope note: Cette publication annule et remplace celle du terme « gestion de taux » au Journal officiel du 22 septembre 2000.

suiveur
type: ConceptConcept
type: Concept
creator: Commission d'enrichissement de la langue française, FranceTerme
date parution JO: 2000-05-12
equivalent EN: me-too @en
equivalent EN: me-too (en)
part of speech: nom masculin
definition: Personne ou entreprise qui imite un produit, une technique, un service considérés comme dominants sur le marché.
in scheme: Économie et gestion d'entreprise
in scheme: concepts
notation: ECON105

gestion spécifique du risque de change
type: ConceptConcept
type: Concept
creator: Commission d'enrichissement de la langue française, FranceTerme
date parution JO: 2015-07-22
deconseille ou frequent: gestion dynamique du risque de change
equivalent EN: currency overlay @en
equivalent EN: currency overlay (en)
definition: Couverture du risque de change attaché à une position en devises, traitée de manière à dissocier le risque de change des autres risques, et le plus souvent déléguée à une entité spécialisée.
in scheme: Finance
in scheme: concepts
notation: ECON1051
note: La gestion spécifique du risque de change repose le plus souvent sur l’utilisation de produits dérivés tels les contrats à terme ou les options.

actif incorporel
type: ConceptConcept
type: Concept
creator: Commission d'enrichissement de la langue française, FranceTerme
date parution JO: 2008-11-19
equivalent EN: intangible asset @en
equivalent EN: intangible asset (en)
equivalent EN: intangible fixed asset @en
equivalent EN: intangible fixed asset (en)
alternative label: immobilisation incorporelle
definition: Actif sans support matériel tel qu'un fonds de commerce, un brevet, des droits d'auteur, une marque.
in scheme: Finance
in scheme: concepts
notation: ECON1059
related: survaleur

vente personnalisée
type: ConceptConcept
type: Concept
creator: Commission d'enrichissement de la langue française, FranceTerme
date parution JO: 2000-05-12
equivalent EN: soft selling @en
equivalent EN: soft selling (en)
definition: Technique de vente faisant appel à des arguments adaptés à la personne de l'acheteur.
in scheme: Économie et gestion d'entreprise
in scheme: concepts
notation: ECON106

actif sous-jacent
type: ConceptConcept
type: Concept
creator: Commission d'enrichissement de la langue française, FranceTerme
date parution JO: 2008-11-19
equivalent EN: underlying asset @en
equivalent EN: underlying asset (en)
forme abregee: sous-jacent, n.m.
definition: Instrument financier, tel qu'une devise, une action, un taux d'intérêt ou un indice boursier, qui sert de support à un contrat à terme ou à un contrat d'option.
in scheme: Finance
in scheme: concepts
notation: ECON1060
related: contrat sur différence
related: option d'achat
related: option de vente

client privilégié
type: ConceptConcept
type: Concept
creator: Commission d'enrichissement de la langue française, FranceTerme
date parution JO: 2008-11-19
deconseille ou frequent: client VIP
equivalent EN: VIP client @en
equivalent EN: VIP client (en)
definition: Client bénéficiant, de la part d'une entreprise, d'un traitement de faveur et d'offres commerciales spécifiques.
in scheme: Économie et gestion d'entreprise
in scheme: concepts
notation: ECON1061
note: L'expression « client VIP » est à proscrire.

comptabilité flatteuse
type: ConceptConcept
type: Concept
creator: Commission d'enrichissement de la langue française, FranceTerme
date parution JO: 2008-11-19
equivalent EN: aggressive accounting @en
equivalent EN: aggressive accounting (en)
equivalent EN: creative accounting @en
equivalent EN: creative accounting (en)
definition: Pratique qui consiste à donner une représentation avantageuse des performances et de la situation financière d'une entreprise en exploitant jusqu'à la limite les possibilités offertes par les règles comptables.
in scheme: Économie générale
in scheme: concept-SD-economie-generale-comptabilite
in scheme: concepts
notation: ECON1062

contrat à terme de taux
type: ConceptConcept
type: Concept
creator: Commission d'enrichissement de la langue française, FranceTerme
abbreviation: CTT
abbreviation: FRA @en
date parution JO: 2008-11-19
equivalent EN: FRA @en
equivalent EN: FRA (en)
equivalent EN: forward rate agreement @en
equivalent EN: forward rate agreement (en)
equivalent EN: future rate agreement @en
equivalent EN: future rate agreement (en)
definition: Contrat ayant pour objet de fixer à l'avance le taux d'intérêt d'un emprunt ou d'un prêt futurs et se dénouant par le versement d'une différence entre ce taux et le taux du marché.
in scheme: Finance
in scheme: concepts
notation: ECON1063
note: Le paiement de la différence est effectué en bloc (dans ce cas, le contrat est désigné en anglais par le terme forward rate agreement) ou de façon fractionnée (on parle alors en anglais de future rate agreement).
related: taux d'intérêt à terme
related: marché à terme
scope note: Cette publication annule et remplace celle du terme « accord à taux futur » au Journal officiel du 22 septembre 2000.

cours au comptant
type: ConceptConcept
type: Concept
creator: Commission d'enrichissement de la langue française, FranceTerme
date parution JO: 2008-11-19
equivalent EN: spot price @en
equivalent EN: spot price (en)
equivalent EN: spot rate @en
equivalent EN: spot rate (en)
definition: Prix, sur un marché au comptant, d'une valeur mobilière ou d'une marchandise.
in scheme: Finance
in scheme: concepts
notation: ECON1064
related: report
related: déport
related: marché au comptant

dépenses d'exploitation
type: ConceptConcept
type: Concept
creator: Commission d'enrichissement de la langue française, FranceTerme
abbreviation: OPEX @en
date parution JO: 2008-11-19
equivalent EN: OPEX @en
equivalent EN: OPEX (en)
equivalent EN: operating expenditures @en
equivalent EN: operating expenditures (en)
equivalent EN: operating expenses @en
equivalent EN: operating expenses (en)
alternative label: dépenses de fonctionnement
alternative label: frais de fonctionnement
definition: Dépenses inhérentes à l'activité d'une entreprise, à l'exclusion des investissements.
in scheme: Économie et gestion d'entreprise
in scheme: Finance
in scheme: concepts
notation: ECON1065
note: L'expression « dépenses d'exploitation » est utilisée plutôt par les entreprises industrielles et commerciales, et l'expression « dépenses de fonctionnement » par les administrations et les associations.

dépenses d'investissement
type: ConceptConcept
type: Concept
creator: Commission d'enrichissement de la langue française, FranceTerme
abbreviation: CAPEX @en
date parution JO: 2008-11-19
equivalent EN: CAPEX @en
equivalent EN: CAPEX (en)
equivalent EN: capital expenditures @en
equivalent EN: capital expenditures (en)
equivalent EN: capital investments @en
equivalent EN: capital investments (en)
alternative label: dépenses en capital fixe
definition: Fonds utilisés par une entreprise pour acquérir des actifs, tels que les immeubles industriels ou tout autre équipement favorisant son développement, ou pour moderniser ceux qu'elle possède déjà.
in scheme: Finance
in scheme: concepts
notation: ECON1066

écart de cotation
type: ConceptConcept
type: Concept
creator: Commission d'enrichissement de la langue française, FranceTerme
date parution JO: 2008-11-19
equivalent EN: bid-ask spread @en
equivalent EN: bid-ask spread (en)
equivalent EN: bid-offer spread @en
equivalent EN: bid-offer spread (en)
equivalent EN: spread @en
equivalent EN: spread (en)
definition: Différence entre le cours auquel les acheteurs se déclarent prêts à acheter un actif financier et celui auquel les vendeurs sont disposés à céder ce même actif.
in scheme: Finance
in scheme: concepts
notation: ECON1067
related: écart

gel d'une procédure
type: ConceptConcept
type: Concept
creator: Commission d'enrichissement de la langue française, FranceTerme
abbreviation: standstill @en
date parution JO: 2008-11-19
equivalent EN: stand still @en
equivalent EN: stand still (en)
equivalent EN: standstill @en
equivalent EN: standstill (en)
forme abregee: gel, n.m.
definition: Suspension ou blocage d'une procédure en cours.
in scheme: Économie et gestion d'entreprise
in scheme: concepts
notation: ECON1068
note: Le gel d'une procédure peut affecter le paiement des dettes d'une entreprise (il est alors décidé en accord avec ses créanciers) ou intervenir dans le cadre d'une offre publique d'achat.

nommage
type: ConceptConcept
type: Concept
creator: Commission d'enrichissement de la langue française, FranceTerme
date parution JO: 2008-11-19
equivalent EN: naming @en
equivalent EN: naming (en)
part of speech: nom masculin
alternative label: dénomination
definition: Recherche et attribution d'un nom, généralement effectuées par des professionnels.
in scheme: Économie et gestion d'entreprise
in scheme: concepts
notation: ECON1069
note: Le nommage peut concerner, par exemple, un nouveau produit, une entreprise, un équipement public.

vente agressive
type: ConceptConcept
type: Concept
creator: Commission d'enrichissement de la langue française, FranceTerme
date parution JO: 2000-05-12
equivalent EN: hard selling @en
equivalent EN: hard selling (en)
definition: Technique de vente dont l'argument principal est l'importance supposée des avantages financiers consentis au client.
in scheme: Économie et gestion d'entreprise
in scheme: concepts
notation: ECON107
related: avantage choc

opérateur à la journée
type: ConceptConcept
type: Concept
creator: Commission d'enrichissement de la langue française, FranceTerme
date parution JO: 2008-11-19
equivalent EN: day trader @en
equivalent EN: day trader (en)
definition: Opérateur qui prend et dénoue ses positions dans la même journée.
in scheme: Finance
in scheme: concepts
notation: ECON1071
related: opérateur au jour le jour

opérateur au jour le jour
type: ConceptConcept
type: Concept
creator: Commission d'enrichissement de la langue française, FranceTerme
date parution JO: 2008-11-19
equivalent EN: overnight trader @en
equivalent EN: overnight trader (en)
definition: Opérateur qui intervient sur le marché monétaire et dénoue ses positions le lendemain du jour où il les a prises.
in scheme: Finance
in scheme: concepts
notation: ECON1072
related: opérateur à la journée
related: jour le jour (au)

panique bancaire
type: ConceptConcept
type: Concept
creator: Commission d'enrichissement de la langue française, FranceTerme
date parution JO: 2008-11-19
equivalent EN: bank run @en
equivalent EN: bank run (en)
equivalent EN: banking panic @en
equivalent EN: banking panic (en)
definition: Afflux soudain de clients déposants qui se pressent aux guichets des banques pour retirer leurs avoirs.
in scheme: Finance
in scheme: concepts
notation: ECON1075

profiteur, -euse
type: ConceptConcept
type: Concept
creator: Commission d'enrichissement de la langue française, FranceTerme
date parution JO: 2008-11-19
equivalent EN: free rider @en
equivalent EN: free rider (en)
part of speech: nom
alternative label: passager clandestin
definition: Agent économique profitant d'un bien ou d'un avantage collectifs sans en supporter les frais, laissés à la charge des autres usagers.
in scheme: Économie générale
in scheme: concepts
notation: ECON1076
scope note: Cette publication annule et remplace celle du terme « passager clandestin » au Journal officiel du 22 septembre 2000.

quasi-régie
type: ConceptConcept
type: Concept
creator: Commission d'enrichissement de la langue française, FranceTerme
date parution JO: 2008-11-19
equivalent EN: in house @en
equivalent EN: in house (en)
equivalent EN: in-house contract @en
equivalent EN: in-house contract (en)
part of speech: nom féminin
alternative label: prestations intégrées
definition: Marché public, délégation de service public ou concession d'aménagement conclus, sans mise en concurrence, par une autorité adjudicatrice avec un prestataire qui réalise pour elle l'essentiel de ses activités, et sur lequel elle assure un contrôle de même nature que sur ses propres services.
in scheme: Aménagement et urbanisme
in scheme: Économie et gestion d'entreprise
in scheme: concepts
notation: ECON1077

service des retours
type: ConceptConcept
type: Concept
creator: Commission d'enrichissement de la langue française, FranceTerme
date parution JO: 2008-11-19
equivalent EN: return center @en
equivalent EN: return center (en)
definition: Service mis en place par un distributeur pour réceptionner les articles renvoyés par les clients et assurer les opérations de gestion qui en découlent.
in scheme: Économie et gestion d'entreprise
in scheme: concepts
notation: ECON1078
related: logistique des retours

taux de rentabilité opérationnelle
type: ConceptConcept
type: Concept
creator: Commission d'enrichissement de la langue française, FranceTerme
abbreviation: ROS @en
abbreviation: TRO
date parution JO: 2008-11-19
equivalent EN: ROS @en
equivalent EN: ROS (en)
equivalent EN: return on sales @en
equivalent EN: return on sales (en)
alternative label: marge sur ventes
definition: Ratio qui mesure la rentabilité d'une entreprise, en rapportant son résultat d'exploitation à son chiffre d'affaires.
in scheme: Économie et gestion d'entreprise
in scheme: concepts
notation: ECON1079

appariement
type: ConceptConcept
type: Concept
creator: Commission d'enrichissement de la langue française, FranceTerme
date parution JO: 2000-05-12
equivalent EN: matching @en
equivalent EN: matching (en)
part of speech: nom masculin
definition: Compatibilité entre les offres et les demandes de travail selon le secteur professionnel, le lieu et la qualification.
in scheme: Économie générale
in scheme: Emploi et travail
in scheme: concepts
notation: ECON108
related: rattachement

taux plafond
type: ConceptConcept
type: Concept
creator: Commission d'enrichissement de la langue française, FranceTerme
date parution JO: 2008-11-19
equivalent EN: cap @en
equivalent EN: cap (en)
equivalent EN: cap interest rate @en
equivalent EN: cap interest rate (en)
definition: Taux d'intérêt maximal préalablement fixé auquel un acteur financier s'assure par contrat le droit d'emprunter un certain montant, pendant une période donnée, moyennant le paiement d'une prime ; par extension, le contrat qui garantit ce taux d'intérêt.
in scheme: Finance
in scheme: concepts
notation: ECON1080
related: taux plancher
related: tunnel de taux
scope note: Cette publication annule et remplace celle du Journal officiel du 22 septembre 2000.

taux plancher
type: ConceptConcept
type: Concept
creator: Commission d'enrichissement de la langue française, FranceTerme
date parution JO: 2008-11-19
equivalent EN: floor @en
equivalent EN: floor (en)
equivalent EN: floor interest rate @en
equivalent EN: floor interest rate (en)
definition: Taux d'intérêt minimal préalablement fixé auquel un acteur financier accepte par contrat de prêter un certain montant, pendant une période donnée, moyennant le paiement d'une prime ; par extension, le contrat qui garantit ce taux d'intérêt.
in scheme: Finance
in scheme: concepts
notation: ECON1081
related: taux plafond
related: tunnel de taux
scope note: Cette publication annule et remplace celle du Journal officiel du 22 septembre 2000.

tournée de présentation
type: ConceptConcept
type: Concept
creator: Commission d'enrichissement de la langue française, FranceTerme
date parution JO: 2008-11-19
equivalent EN: road show @en
equivalent EN: road show (en)
definition: Tournée promotionnelle organisée de place en place par une entreprise qui souhaite présenter ses projets aux investisseurs et à la presse.
in scheme: Économie et gestion d'entreprise
in scheme: Finance
in scheme: concepts
notation: ECON1083
scope note: Cette publication annule et remplace celle du Journal officiel du 22 septembre 2000.

directeur des services
type: ConceptConcept
type: Concept
creator: Commission d'enrichissement de la langue française, FranceTerme
date parution JO: 2008-11-19
equivalent EN: services manager @en
equivalent EN: services manager (en)
in scheme: Économie et gestion d'entreprise
in scheme: concepts
notation: ECON1084

directeur financier
type: ConceptConcept
type: Concept
creator: Commission d'enrichissement de la langue française, FranceTerme
abbreviation: CFO @en
date parution JO: 2008-11-19
equivalent EN: CFO @en
equivalent EN: CFO (en)
equivalent EN: chief financial officer @en
equivalent EN: chief financial officer (en)
in scheme: Économie et gestion d'entreprise
in scheme: concepts
notation: ECON1085

financement des entreprises
type: ConceptConcept
type: Concept
creator: Commission d'enrichissement de la langue française, FranceTerme
date parution JO: 2008-11-19
equivalent EN: corporate financing @en
equivalent EN: corporate financing (en)
in scheme: Finance
in scheme: concepts
notation: ECON1086

commerce équitable
type: ConceptConcept
type: Concept
creator: Commission d'enrichissement de la langue française, FranceTerme
date parution JO: 2010-01-19
equivalent EN: fair trade @en
equivalent EN: fair trade (en)
definition: Forme de commerce international assurant une juste rémunération des producteurs, notamment dans les pays en développement.
in scheme: Économie et gestion d'entreprise
in scheme: concepts
notation: ECON1088

centre d'évaluation
type: ConceptConcept
type: Concept
creator: Commission d'enrichissement de la langue française, FranceTerme
date parution JO: 2000-05-12
deconseille ou frequent: assessment center
deconseille ou frequent: assessment centre
equivalent EN: assessment center (US) @en
equivalent EN: assessment center (en-US)
equivalent EN: assessment centre (GB) @en
equivalent EN: assessment centre (en-GB)
definition: Organisme ou service chargé d'évaluer les compétences et les aptitudes du personnel, notamment par des mises en situation.
in scheme: Économie et gestion d'entreprise
in scheme: concepts
notation: ECON109

déqualification
type: ConceptConcept
type: Concept
creator: Commission d'enrichissement de la langue française, FranceTerme
date parution JO: 2010-01-19
equivalent EN: deskilling @en
equivalent EN: deskilling (en)
part of speech: nom féminin
definition: Déclassement de la qualification requise pour un poste de travail en raison de la segmentation du travail accrue qu'impose l'évolution des techniques.
in scheme: Économie et gestion d'entreprise
in scheme: concepts
notation: ECON1090
scope note: Cette publication annule et remplace celle du Journal officiel du 14 août 1998.

directeur des enchères
type: ConceptConcept
type: Concept
creator: Commission d'enrichissement de la langue française, FranceTerme
date parution JO: 2010-01-19
equivalent EN: auction manager @en
equivalent EN: auction manager (en)
definition: Responsable du service des achats par enchères.
in scheme: Économie et gestion d'entreprise
in scheme: concepts
notation: ECON1091

échange de rendement total
type: ConceptConcept
type: Concept
creator: Commission d'enrichissement de la langue française, FranceTerme
abbreviation: ERT
abbreviation: TROR swap @en
date parution JO: 2010-01-19
equivalent EN: TROR swap @en
equivalent EN: TROR swap (en)
equivalent EN: total rate of return swap @en
equivalent EN: total rate of return swap (en)
definition: Opération par laquelle un organisme financier transfère à un autre la totalité du rendement d'un actif de référence et le risque qui lui est lié, moyennant le versement d'une prime périodique par le second organisme.
in scheme: Finance
in scheme: concepts
notation: ECON1092

marché primaire
type: ConceptConcept
type: Concept
creator: Commission d'enrichissement de la langue française, FranceTerme
date parution JO: 2010-01-19
equivalent EN: primary market @en
equivalent EN: primary market (en)
definition: Marché sur lequel les valeurs mobilières sont émises et proposées à la souscription en espèces.
in scheme: Finance
in scheme: concepts
notation: ECON1096
related: marché secondaire

marché secondaire
type: ConceptConcept
type: Concept
creator: Commission d'enrichissement de la langue française, FranceTerme
date parution JO: 2010-01-19
equivalent EN: secondary market @en
equivalent EN: secondary market (en)
definition: Marché sur lequel les valeurs mobilières déjà émises et vendues sont négociées.
in scheme: Finance
in scheme: concepts
notation: ECON1097
related: marché primaire

droit de reprise
type: ConceptConcept
type: Concept
creator: Commission d'enrichissement de la langue française, FranceTerme
date parution JO: 1998-08-14
equivalent EN: claw back @en
equivalent EN: claw back (en)
definition: Lors d'une émission ou d'une offre publique de vente, disposition contractuelle qui permet à un émetteur ou à un vendeur de diminuer le nombre de titres alloués à une catégorie d'investisseurs.
in scheme: Finance
in scheme: concepts
notation: ECON11

prix de la rue
type: ConceptConcept
type: Concept
creator: Commission d'enrichissement de la langue française, FranceTerme
date parution JO: 2000-05-12
equivalent EN: street price @en
equivalent EN: street price (en)
definition: Prix résultant spontanément de l'offre et de la demande locales.
in scheme: Économie et gestion d'entreprise
in scheme: concepts
notation: ECON110

organisateur des achats
type: ConceptConcept
type: Concept
creator: Commission d'enrichissement de la langue française, FranceTerme
date parution JO: 2010-01-19
equivalent EN: supplier developer @en
equivalent EN: supplier developer (en)
in scheme: Économie et gestion d'entreprise
in scheme: concepts
notation: ECON1100

publipostage en ligne
type: ConceptConcept
type: Concept
creator: Commission d'enrichissement de la langue française, FranceTerme
date parution JO: 2010-01-19
equivalent EN: e-mailing @en
equivalent EN: e-mailing (en)
definition: Envoi de messages électroniques pour conquérir ou fidéliser des clients.
in scheme: Communication
in scheme: Économie et gestion d'entreprise
in scheme: concept-SD-communication-publicite
in scheme: concept-SD-economie-et-gestion-d-entreprise-publicite
in scheme: concepts
notation: ECON1102

réapprovisionnement continu
type: ConceptConcept
type: Concept
creator: Commission d'enrichissement de la langue française, FranceTerme
abbreviation: CRP @en
date parution JO: 2010-01-19
equivalent EN: CRP @en
equivalent EN: CRP (en)
equivalent EN: continuous replenishment program @en
equivalent EN: continuous replenishment program (en)
alternative label: réassort continu
definition: Programme d'échange automatique des informations concernant les commandes et les mouvements de stocks, à partir desquelles le fournisseur réapprovisionne le distributeur.
in scheme: Économie et gestion d'entreprise
in scheme: concepts
notation: ECON1103
note: Le réapprovisionnement continu est généralement mis en œuvre par un progiciel de gestion intégré.
related: progiciel de gestion intégré

négoce minute
type: ConceptConcept
type: Concept
creator: Commission d'enrichissement de la langue française, FranceTerme
date parution JO: 2010-01-19
deconseille ou frequent: scalpage
equivalent EN: scalping @en
equivalent EN: scalping (en)
alternative label: micro-négoce
definition: Technique qui, sur les marchés financiers, consiste à multiplier très rapidement les prises de position pour tirer profit des plus petites variations des cours.
in scheme: Finance
in scheme: concepts
notation: ECON1104

stratégie d'image de l'employeur
type: ConceptConcept
type: Concept
creator: Commission d'enrichissement de la langue française, FranceTerme
date parution JO: 2010-01-19
equivalent EN: employer branding @en
equivalent EN: employer branding (en)
definition: Démarche consistant à valoriser l'image de l'entreprise sur le marché de l'emploi et auprès de son personnel.
in scheme: Économie et gestion d'entreprise
in scheme: concepts
notation: ECON1105

politique opportuniste
type: ConceptConcept
type: Concept
creator: Commission d'enrichissement de la langue française, FranceTerme
date parution JO: 2010-01-19
equivalent EN: event driven strategy @en
equivalent EN: event driven strategy (en)
definition: Ligne de conduite d'un investisseur qui recherche des avantages liés à des écarts de valorisation résultant d'évènements survenus dans la vie d'une entreprise, tels qu'une prise de contrôle, une fusion ou une liquidation.
in scheme: Finance
in scheme: concepts
notation: ECON1106

surqualification
type: ConceptConcept
type: Concept
creator: Commission d'enrichissement de la langue française, FranceTerme
date parution JO: 2010-01-19
equivalent EN: overqualification @en
equivalent EN: overqualification (en)
part of speech: nom féminin
in scheme: Économie et gestion d'entreprise
in scheme: concepts
notation: ECON1107

taux de distribution des bénéfices
type: ConceptConcept
type: Concept
creator: Commission d'enrichissement de la langue française, FranceTerme
abbreviation: TDB
date parution JO: 2010-01-19
deconseille ou frequent: payout ratio
equivalent EN: pay-out ratio @en
equivalent EN: pay-out ratio (en)
definition: Proportion du bénéfice net d'une société versée sous forme de dividendes aux actionnaires.
in scheme: Finance
in scheme: concepts
notation: ECON1108

relancer
type: ConceptConcept
type: Concept
creator: Commission d'enrichissement de la langue française, FranceTerme
date parution JO: 2000-05-12
deconseille ou frequent: accélérer
deconseille ou frequent: booster
deconseille ou frequent: doper
deconseille ou frequent: stimuler
deconseille ou frequent: to boost
equivalent EN: boost @en
equivalent EN: boost (en)
part of speech: verbe
definition: Donner un nouvel élan.
in scheme: Économie et gestion d'entreprise
in scheme: concepts
notation: ECON111
note: Dans des acceptions voisines, on dit aussi « doper » (v., fam.), « accélérer » (v.), « stimuler » (v.).

titre de créance adossé
type: ConceptConcept
type: Concept
creator: Commission d'enrichissement de la langue française, FranceTerme
abbreviation: CDO @en
abbreviation: TCA
date parution JO: 2010-01-19
equivalent EN: CDO @en
equivalent EN: CDO (en)
equivalent EN: collateralized debt obligation @en
equivalent EN: collateralized debt obligation (en)
definition: Titre de créance émis par une structure de titrisation, généralement segmenté selon les risques et adossé à un portefeuille diversifié de créances bancaires.
in scheme: Finance
in scheme: concepts
notation: ECON1110
note: 1. Ce type d'instrument s'appuie sur des portefeuilles hétérogènes alors que la titrisation classique s'appuie sur des portefeuilles de créances homogènes telles les créances hypothécaires.
note: 3. L'acquéreur des titres n'est généralement pas en mesure d'apprécier les risques. L'adossement à un portefeuille ne doit donc pas être considéré comme une véritable garantie.
related: titre de créance adossé à des obligations
related: titre de créance adossé à des prêts
related: dérivé de crédit

titre de créance adossé à des obligations
type: ConceptConcept
type: Concept
creator: Commission d'enrichissement de la langue française, FranceTerme
abbreviation: CBO @en
abbreviation: TCAO
date parution JO: 2010-01-19
equivalent EN: CBO @en
equivalent EN: CBO (en)
equivalent EN: collateralized bond obligation @en
equivalent EN: collateralized bond obligation (en)
in scheme: Finance
in scheme: concepts
notation: ECON1111
related: titre de créance adossé
related: dérivé de crédit

titre de créance adossé à des prêts
type: ConceptConcept
type: Concept
creator: Commission d'enrichissement de la langue française, FranceTerme
abbreviation: CLO @en
abbreviation: TCAP
date parution JO: 2010-01-19
equivalent EN: CLO @en
equivalent EN: CLO (en)
equivalent EN: collateralized loan obligation @en
equivalent EN: collateralized loan obligation (en)
in scheme: Finance
in scheme: concepts
notation: ECON1112
related: titre de créance adossé
related: dérivé de crédit

levée de fonds
type: ConceptConcept
type: Concept
creator: Commission d'enrichissement de la langue française, FranceTerme
date parution JO: 2010-01-19
deconseille ou frequent: fundraising
equivalent EN: fund raising @en
equivalent EN: fund raising (en)
alternative label: collecte de fonds
in scheme: Finance
in scheme: concepts
notation: ECON1114

suiveur de tendance
type: ConceptConcept
type: Concept
creator: Commission d'enrichissement de la langue française, FranceTerme
date parution JO: 2010-01-19
equivalent EN: trend follower @en
equivalent EN: trend follower (en)
definition: Opérateur qui prend des positions en fonction des tendances récentes du marché et de l'analyse statistique des cours.
in scheme: Finance
in scheme: concepts
notation: ECON1115
related: suivi de tendance

acheteur pionnier
type: ConceptConcept
type: Concept
creator: Commission d'enrichissement de la langue française, FranceTerme
date parution JO: 2010-03-02
equivalent EN: early adopter @en
equivalent EN: early adopter (en)
definition: Client friand de toute nouveauté.
in scheme: Économie et gestion d'entreprise
in scheme: concepts
notation: ECON1117

assistant, -e d'achat
type: ConceptConcept
type: Concept
creator: Commission d'enrichissement de la langue française, FranceTerme
date parution JO: 2010-03-02
deconseille ou frequent: styliste personnel
deconseille ou frequent: styliste personnelle
deconseille ou frequent: styliste privé
deconseille ou frequent: styliste privée
equivalent EN: personal shopper @en
equivalent EN: personal shopper (en)
definition: Professionnel, employé par un magasin ou exerçant à son compte, qui dispense aux clients des conseils personnalisés ou se charge d'effectuer à leur place certains achats.
in scheme: Économie et gestion d'entreprise
in scheme: concepts
notation: ECON1118
note: On trouve aussi, dans le domaine de la mode, les termes « styliste personnel, -elle » et « styliste privé, -e ».

accord à taux différé
type: ConceptConcept
type: Concept
creator: Commission d'enrichissement de la langue française, FranceTerme
source: révision de l'arrêté du 7 juillet 1994
abbreviation: ATD
abbreviation: DRS @en
date parution JO: 2000-09-22
equivalent EN: DRS @en
equivalent EN: DRS (en)
equivalent EN: delayed rate settlement @en
equivalent EN: delayed rate settlement (en)
definition: Contrat par lequel les partenaires concluent qu'une opération sera réalisée sur la base du taux de marché constaté au moment du dénouement de celle-ci, à une date fixée dans le contrat.
in scheme: Finance
in scheme: concepts
notation: ECON112

dérivé de crédit
type: ConceptConcept
type: Concept
creator: Commission d'enrichissement de la langue française, FranceTerme
date parution JO: 2014-06-05
equivalent EN: credit derivative @en
equivalent EN: credit derivative (en)
definition: Instrument financier permettant de transférer d’une partie à une autre un risque de crédit attaché à un actif financier.
in scheme: Finance
in scheme: concepts
notation: ECON1120
related: couverture de défaillance
related: titre de créance adossé
related: titre de créance adossé à des obligations
related: titre de créance adossé à des prêts
related: contrat sur différence

faiseur, -euse d'argent
type: ConceptConcept
type: Concept
creator: Commission d'enrichissement de la langue française, FranceTerme
date parution JO: 2010-03-02
equivalent EN: money maker @en
equivalent EN: money maker (en)
definition: Personne qui réalise de gros gains ou entreprise qui dégage d'importants profits.
in scheme: Économie et gestion d'entreprise
in scheme: Finance
in scheme: concepts
notation: ECON1123

gestion du cycle de vie du produit
type: ConceptConcept
type: Concept
creator: Commission d'enrichissement de la langue française, FranceTerme
abbreviation: GCVP
abbreviation: PLM @en
date parution JO: 2010-03-02
deconseille ou frequent: product life cycle management
equivalent EN: PLM @en
equivalent EN: PLM (en)
equivalent EN: product lifecycle management @en
equivalent EN: product lifecycle management (en)
definition: Technique de gestion fondée sur l'analyse des grandes étapes de la vie du produit, de sa conception jusqu'à sa disparition.
in scheme: Économie et gestion d'entreprise
in scheme: concepts
notation: ECON1124

gestion partagée des stocks
type: ConceptConcept
type: Concept
creator: Commission d'enrichissement de la langue française, FranceTerme
date parution JO: 2010-03-02
deconseille ou frequent: JMI
equivalent EN: jointly managed inventory @en
equivalent EN: jointly managed inventory (en)
definition: Gestion des stocks d'un entrepôt qui repose sur la collaboration entre fournisseurs et distributeurs, et permet l'approvisionnement continu en fonction des données réelles de vente.
in scheme: Économie et gestion d'entreprise
in scheme: concepts
notation: ECON1125
related: planification partagée des approvisionnements

internalisation
type: ConceptConcept
type: Concept
creator: Commission d'enrichissement de la langue française, FranceTerme
date parution JO: 2010-03-02
deconseille ou frequent: insourcing
equivalent EN: in-sourcing @en
equivalent EN: in-sourcing (en)
part of speech: nom féminin
definition: Prise en charge, par une entreprise ou une organisation, de certaines activités qu'elle renonce à confier à un tiers, pour des raisons économiques ou stratégiques.
in scheme: Économie et gestion d'entreprise
in scheme: concepts
notation: ECON1126
related: externalisation

lecteur de poche
type: ConceptConcept
type: Concept
creator: Commission d'enrichissement de la langue française, FranceTerme
date parution JO: 2010-03-02
equivalent EN: pocket shopper @en
equivalent EN: pocket shopper (en)
definition: Appareil permettant au client de lire les codes à barres des produits choisis.
in scheme: Économie et gestion d'entreprise
in scheme: concepts
notation: ECON1127

gestion des évènements de la chaîne logistique
type: ConceptConcept
type: Concept
creator: Commission d'enrichissement de la langue française, FranceTerme
abbreviation: GCL
abbreviation: GECL
abbreviation: SCEM @en
date parution JO: 2010-03-02
equivalent EN: SCEM @en
equivalent EN: SCEM (en)
equivalent EN: supply chain event management @en
equivalent EN: supply chain event management (en)
forme abregee: gestion de la chaîne logistique
definition: Suivi en temps réel, sur une chaîne logistique, des évènements susceptibles d'interrompre, de ralentir ou de modifier l'approvisionnement.
in scheme: Économie et gestion d'entreprise
in scheme: concepts
notation: ECON1128
note: La gestion des évènements de la chaîne logistique s'effectue au moyen d'un progiciel de gestion intégré.
related: progiciel de gestion intégré
related: chaîne logistique

meilleures pratiques
type: ConceptConcept
type: Concept
creator: Commission d'enrichissement de la langue française, FranceTerme
abbreviation: best practices @en
date parution JO: 2010-03-02
equivalent EN: best practice @en
equivalent EN: best practice (en)
equivalent EN: best practices @en
equivalent EN: best practices (en)
in scheme: Tous domaines
in scheme: concepts
notation: ECON1129

parachute doré
type: ConceptConcept
type: Concept
creator: Commission d'enrichissement de la langue française, FranceTerme
date parution JO: 2010-03-02
deconseille ou frequent: parachute en or
equivalent EN: golden parachute @en
equivalent EN: golden parachute (en)
definition: Importante compensation financière qu'une entreprise s'engage, lors du recrutement d'un dirigeant ou d'un cadre, à verser à celui-ci en cas de licenciement ou de modification significative de son contrat de travail.
in scheme: Économie et gestion d'entreprise
in scheme: concepts
notation: ECON1132
related: pont d'or

planification partagée des approvisionnements
type: ConceptConcept
type: Concept
creator: Commission d'enrichissement de la langue française, FranceTerme
abbreviation: CPFR @en
abbreviation: PPA
date parution JO: 2010-03-02
equivalent EN: CPFR @en
equivalent EN: CPFR (en)
equivalent EN: collaborative planning, forecasting and replenishment @en
equivalent EN: collaborative planning, forecasting and replenishment (en)
definition: Partage, entre distributeurs et fournisseurs, d'informations liées à la prévision et à la planification d'une activité, en vue d'assurer un réassort continu et optimisé le long de la chaîne logistique.
in scheme: Économie et gestion d'entreprise
in scheme: concepts
notation: ECON1133
related: gestion partagée des stocks
related: chaîne logistique

pointe (de)
type: ConceptConcept
type: Concept
creator: Commission d'enrichissement de la langue française, FranceTerme
date parution JO: 2010-03-02
deconseille ou frequent: de pointe
deconseille ou frequent: à la pointe
deconseille ou frequent: à la pointe de la technique
equivalent EN: high tech @en
equivalent EN: high tech (en)
forme abregee: pointe (à la), loc.adj.
part of speech: locution adjectivale
alternative label: pointe de la technique (à la)
in scheme: Économie et gestion d'entreprise
in scheme: concepts
notation: ECON1134
related: technique de pointe

pont d'or
type: ConceptConcept
type: Concept
creator: Commission d'enrichissement de la langue française, FranceTerme
date parution JO: 2010-03-02
equivalent EN: golden hello @en
equivalent EN: golden hello (en)
definition: Avantage exceptionnel proposé à une personne pour l'inciter à rejoindre une entreprise.
in scheme: Économie et gestion d'entreprise
in scheme: concepts
notation: ECON1135
related: parachute doré

réassortiment délégué
type: ConceptConcept
type: Concept
creator: Commission d'enrichissement de la langue française, FranceTerme
date parution JO: 2010-03-02
equivalent EN: rack jobbing @en
equivalent EN: rack jobbing (en)
alternative label: réassort délégué
definition: Pratique commerciale consistant à déléguer au fournisseur d'un produit donné le réassortiment des présentoirs de marchandises ainsi que la gestion des stocks et des linéaires correspondants.
in scheme: Économie et gestion d'entreprise
in scheme: concepts
notation: ECON1136
related: réassortisseur, -euse

réassortisseur, -euse
type: ConceptConcept
type: Concept
creator: Commission d'enrichissement de la langue française, FranceTerme
date parution JO: 2010-03-02
equivalent EN: rack jobber @en
equivalent EN: rack jobber (en)
part of speech: nom
definition: Personne responsable de la gestion des stocks et des linéaires correspondants, ainsi que du réassortiment des présentoirs de marchandises.
in scheme: Économie et gestion d'entreprise
in scheme: concepts
notation: ECON1137
related: réassortiment délégué

rencontre express
type: ConceptConcept
type: Concept
creator: Commission d'enrichissement de la langue française, FranceTerme
date parution JO: 2010-03-02
equivalent EN: speed date @en
equivalent EN: speed date (en)
equivalent EN: speed dating @en
equivalent EN: speed dating (en)
definition: Organisation de rencontres croisées au sein d'un groupe dans un temps limité.
in scheme: Tous domaines
in scheme: concepts
notation: ECON1138
related: entretien d'embauche minute

entretien d'embauche minute
type: ConceptConcept
type: Concept
creator: Commission d'enrichissement de la langue française, FranceTerme
date parution JO: 2010-03-02
equivalent EN: job date @en
equivalent EN: job date (en)
equivalent EN: job dating @en
equivalent EN: job dating (en)
equivalent EN: speed networking @en
equivalent EN: speed networking (en)
forme abregee: entretien minute
definition: Forme organisée de rencontres en groupe et en temps limité, pour des personnes à la recherche d'un emploi.
in scheme: Économie et gestion d'entreprise
in scheme: concepts
notation: ECON1139
related: rencontre express

action éclair
type: ConceptConcept
type: Concept
creator: Commission d'enrichissement de la langue française, FranceTerme
source: révision de l'arrêté du 7 juillet 1994
date parution JO: 2000-09-22
deconseille ou frequent: hit & run
equivalent EN: hit-and-run @en
equivalent EN: hit-and-run (en)
definition: Opération financière ou bancaire menée rapidement et visant à saisir une bonne occasion.
in scheme: Finance
in scheme: concepts
notation: ECON114

traitement de bout en bout
type: ConceptConcept
type: Concept
creator: Commission d'enrichissement de la langue française, FranceTerme
abbreviation: STP @en
abbreviation: TBB
date parution JO: 2010-03-02
equivalent EN: STP @en
equivalent EN: STP (en)
equivalent EN: end-to-end processing @en
equivalent EN: end-to-end processing (en)
equivalent EN: straight-through processing @en
equivalent EN: straight-through processing (en)
definition: Traitement automatisé d'une série d'opérations, tout au long de la chaîne d'exécution et par une seule saisie de données.
in scheme: Finance
in scheme: concepts
notation: ECON1141

vache à lait
type: ConceptConcept
type: Concept
creator: Commission d'enrichissement de la langue française, FranceTerme
date parution JO: 2010-03-02
equivalent EN: cash cow @en
equivalent EN: cash cow (en)
equivalent EN: cash machine @en
equivalent EN: cash machine (en)
definition: Produit, activité ou entreprise dégageant des profits élevés, le plus souvent grâce à une rente de situation.
in scheme: Économie et gestion d'entreprise
in scheme: concepts
notation: ECON1142
scope note: Cette publication annule et remplace celle publiée au Journal officiel du 26 mars 2004.

vente in situ
type: ConceptConcept
type: Concept
creator: Commission d'enrichissement de la langue française, FranceTerme
date parution JO: 2010-03-02
equivalent EN: house sale @en
equivalent EN: house sale (en)
definition: Vente publique de biens mobiliers sur les lieux mêmes où résident les propriétaires.
in scheme: Économie et gestion d'entreprise
in scheme: concepts
notation: ECON1143

mercatique par stimulation sensorielle
type: ConceptConcept
type: Concept
creator: Commission d'enrichissement de la langue française, FranceTerme
date parution JO: 2010-03-02
deconseille ou frequent: marketing sensoriel
equivalent EN: sensory marketing @en
equivalent EN: sensory marketing (en)
forme abregee: mercatique sensorielle
definition: Mercatique consistant à solliciter un ou plusieurs sens du consommateur pour le séduire.
in scheme: Économie et gestion d'entreprise
in scheme: concepts
notation: ECON1144
note: L'expression « marketing sensoriel » est impropre.
related: neuromercatique

congrès d'affaires
type: ConceptConcept
type: Concept
creator: Commission d'enrichissement de la langue française, FranceTerme
date parution JO: 2010-03-02
equivalent EN: business convention @en
equivalent EN: business convention (en)
in scheme: Économie et gestion d'entreprise
in scheme: Tourisme
in scheme: concepts
notation: ECON1145

affacturage
type: ConceptConcept
type: Concept
creator: Commission d'enrichissement de la langue française, FranceTerme
source: révision de l'arrêté du 29 novembre 1973
date parution JO: 2000-09-22
deconseille ou frequent: affacturage à forfait
deconseille ou frequent: forfeiting
equivalent EN: factoring @en
equivalent EN: factoring (en)
part of speech: nom masculin
definition: Opération ou technique de gestion financière par laquelle, dans le cadre d'une convention, une entreprise gère les comptes clients d'entreprises en acquérant leurs créances, en assurant le recouvrement pour son propre compte et en supportant les pertes éventuelles sur des débiteurs insolvables.
in scheme: Finance
in scheme: concepts
notation: ECON115
note: Une variante en est l'affacturage à forfait (appelé en anglais : forfeiting).

produit de qualité vérifiable après l'achat
type: ConceptConcept
type: Concept
creator: Commission d'enrichissement de la langue française, FranceTerme
date parution JO: 2018-03-28
deconseille ou frequent: experience good
deconseille ou frequent: produit d'expérience
equivalent EN: experience goods @en
equivalent EN: experience goods (en)
definition: Bien ou service dont les caractéristiques ne peuvent être appréciées par le consommateur qu’à l’usage.
in scheme: Économie et gestion d'entreprise
in scheme: concepts
notation: ECON1154
preferred label: experience goods @en
related: produit de qualité non vérifiable
related: produit de qualité vérifiable avant l'achat

produit de qualité non vérifiable
type: ConceptConcept
type: Concept
creator: Commission d'enrichissement de la langue française, FranceTerme
date parution JO: 2018-03-28
deconseille ou frequent: credence good
deconseille ou frequent: produit de confiance
equivalent EN: credence goods @en
equivalent EN: credence goods (en)
definition: Bien ou service dont les caractéristiques ne peuvent être vérifiées par le consommateur et dont l’achat ne relève que de la confiance.
in scheme: Économie et gestion d'entreprise
in scheme: concepts
notation: ECON1155
note: La confiance du consommateur se fonde généralement sur la marque ou la réputation du produit.
preferred label: credence goods @en
related: produit de qualité vérifiable après l'achat
related: produit de qualité vérifiable avant l'achat

produit de qualité vérifiable avant l'achat
type: ConceptConcept
type: Concept
creator: Commission d'enrichissement de la langue française, FranceTerme
date parution JO: 2018-03-28
deconseille ou frequent: produit de prospection
deconseille ou frequent: search good
equivalent EN: search goods @en
equivalent EN: search goods (en)
definition: Bien ou service dont les caractéristiques sont connues du consommateur avant l’achat.
in scheme: Économie et gestion d'entreprise
in scheme: concepts
notation: ECON1156
preferred label: search goods @en
related: produit de qualité vérifiable après l'achat
related: produit de qualité non vérifiable

affacturer
type: ConceptConcept
type: Concept
creator: Commission d'enrichissement de la langue française, FranceTerme
source: révision de l'arrêté du 29 novembre 1973
date parution JO: 2000-09-22
deconseille ou frequent: to factor
equivalent EN: factor @en
equivalent EN: factor (en)
part of speech: verbe
definition: Pratiquer l'affacturage.
in scheme: Finance
in scheme: concepts
notation: ECON116

clientèle cible
type: ConceptConcept
type: Concept
creator: Commission d'enrichissement de la langue française, FranceTerme
date parution JO: 2011-03-18
equivalent EN: target market @en
equivalent EN: target market (en)
alternative label: marché cible
in scheme: Économie et gestion d'entreprise
in scheme: concepts
notation: ECON1163

faiseur, -euse de mode
type: ConceptConcept
type: Concept
creator: Commission d'enrichissement de la langue française, FranceTerme
date parution JO: 2011-03-18
equivalent EN: trend setter @en
equivalent EN: trend setter (en)
equivalent EN: trend-setter @en
equivalent EN: trend-setter (en)
equivalent EN: trendsetter @en
equivalent EN: trendsetter (en)
alternative label: lanceur, -euse de mode
definition: Personne jouissant d'une notoriété suffisante pour lancer, en liaison avec une entreprise, une mode vestimentaire ou un comportement de consommation.
in scheme: Économie et gestion d'entreprise
in scheme: Habillement et mode
in scheme: concepts
notation: ECON1169

affactureur
type: ConceptConcept
type: Concept
creator: Commission d'enrichissement de la langue française, FranceTerme
source: révision de l'arrêté du 29 novembre 1973
date parution JO: 2000-09-22
equivalent EN: factor @en
equivalent EN: factor (en)
part of speech: nom masculin
definition: Entreprise pratiquant l'affacturage.
in scheme: Finance
in scheme: concepts
notation: ECON117

chasseur, -euse de tendance
type: ConceptConcept
type: Concept
creator: Commission d'enrichissement de la langue française, FranceTerme
date parution JO: 2011-03-18
equivalent EN: trend scout @en
equivalent EN: trend scout (en)
definition: Spécialiste qui tente de prévoir l'évolution des demandes du public.
in scheme: Économie et gestion d'entreprise
in scheme: concepts
notation: ECON1170

gestion fondée sur la demande
type: ConceptConcept
type: Concept
creator: Commission d'enrichissement de la langue française, FranceTerme
abbreviation: DBM @en
abbreviation: GFD
date parution JO: 2011-03-18
equivalent EN: DBM @en
equivalent EN: DBM (en)
equivalent EN: demand-based management @en
equivalent EN: demand-based management (en)
definition: Technique de gestion visant à accroître la flexibilité d'une chaîne logistique en lançant la fabrication d'un produit à partir de la demande effective de la clientèle.
in scheme: Économie et gestion d'entreprise
in scheme: concepts
notation: ECON1172
related: chaîne logistique

spécialiste de niche
type: ConceptConcept
type: Concept
creator: Commission d'enrichissement de la langue française, FranceTerme
date parution JO: 2011-03-18
equivalent EN: niche player @en
equivalent EN: niche player (en)
alternative label: nicheur, -euse
definition: Personne ou entreprise spécialisée dans un segment de marché encore peu exploité.
in scheme: Économie et gestion d'entreprise
in scheme: concepts
notation: ECON1174

paiement à l'usage
type: ConceptConcept
type: Concept
creator: Commission d'enrichissement de la langue française, FranceTerme
date parution JO: 2011-03-18
equivalent EN: pay-per-use @en
equivalent EN: pay-per-use (en)
alternative label: paiement au coup par coup
definition: Paiement qui s'effectue chaque fois qu'on utilise un bien ou un service.
in scheme: Économie et gestion d'entreprise
in scheme: concepts
notation: ECON1175

profileur, -euse
type: ConceptConcept
type: Concept
creator: Commission d'enrichissement de la langue française, FranceTerme
date parution JO: 2011-03-18
equivalent EN: profiler @en
equivalent EN: profiler (en)
part of speech: nom
definition: Personne chargée d'élaborer des profils types de consommateurs.
in scheme: Économie et gestion d'entreprise
in scheme: concepts
notation: ECON1177
related: profilage du client

cibleur, -euse
type: ConceptConcept
type: Concept
creator: Commission d'enrichissement de la langue française, FranceTerme
date parution JO: 2011-03-18
equivalent EN: narrowcaster @en
equivalent EN: narrowcaster (en)
part of speech: nom
definition: Personne ou organisme spécialisés dans le repérage, le plus souvent sur la toile ou grâce à d'autres médias, de clients auxquels des produits sont ensuite proposés.
in scheme: Économie et gestion d'entreprise
in scheme: concepts
notation: ECON1179

allocation conditionnelle
type: ConceptConcept
type: Concept
creator: Commission d'enrichissement de la langue française, FranceTerme
source: révision de l'arrêté du 7 juillet 1994
date parution JO: 2000-09-22
equivalent EN: workfare @en
equivalent EN: workfare (en)
definition: Désigne, dans ce domaine, une aide publique fournie sous la condition, d'une part, que le bénéficiaire ait un comportement actif de recherche d'emploi ou, à défaut, suive une formation, et, d'autre part, qu'il ne refuse pas les propositions d'embauche qui lui sont faites.
in scheme: Emploi et travail
in scheme: concepts
notation: ECON118

sans usine
type: ConceptConcept
type: Concept
creator: Commission d'enrichissement de la langue française, FranceTerme
date parution JO: 2011-03-18
equivalent EN: fabless @en
equivalent EN: fabless (en)
part of speech: locution adjectivale
definition: Se dit d'une entreprise qui, sous-traitant l'intégralité de sa production, ne dispose d'aucun site de fabrication.
in scheme: Économie et gestion d'entreprise
in scheme: concepts
notation: ECON1181

site d'emplois
type: ConceptConcept
type: Concept
creator: Commission d'enrichissement de la langue française, FranceTerme
date parution JO: 2011-03-18
equivalent EN: job board @en
equivalent EN: job board (en)
definition: Site interactif de la toile qui met en ligne des offres et des demandes d'emplois et permet aux demandeurs d'emploi et aux recruteurs d'entrer en relation.
in scheme: Économie et gestion d'entreprise
in scheme: Emploi et travail
in scheme: concepts
notation: ECON1182
related: concept-emploi-et-travail

entreprise naissante
type: ConceptConcept
type: Concept
creator: Commission d'enrichissement de la langue française, FranceTerme
abbreviation: new company @en
date parution JO: 2011-03-18
equivalent EN: new company @en
equivalent EN: new company (en)
equivalent EN: newco @en
equivalent EN: newco (en)
definition: Entreprise en cours de création, dont le nom n'a pas encore été déposé.
in scheme: Économie et gestion d'entreprise
in scheme: concepts
notation: ECON1183
note: Il convient de distinguer l'« entreprise naissante » de la « jeune pousse ».
related: jeune pousse

système d'information mercatique
type: ConceptConcept
type: Concept
creator: Commission d'enrichissement de la langue française, FranceTerme
abbreviation: MIS @en
abbreviation: MkIS @en
abbreviation: SIM
date parution JO: 2011-03-18
deconseille ou frequent: système d’information marketing
equivalent EN: MIS @en
equivalent EN: MIS (en)
equivalent EN: MkIS @en
equivalent EN: MkIS (en)
equivalent EN: marketing information system @en
equivalent EN: marketing information system (en)
definition: Ensemble de techniques et de procédures visant à collecter, analyser et diffuser les informations disponibles sur une entreprise, son environnement, ses concurrents, ses marchés, pour un usage interne ou externe.
in scheme: Économie et gestion d'entreprise
in scheme: concepts
notation: ECON1184
note: L'expression « système d'information marketing » est à proscrire.

contrôle masqué
type: ConceptConcept
type: Concept
creator: Commission d'enrichissement de la langue française, FranceTerme
date parution JO: 2011-03-18
deconseille ou frequent: essai éliminatoire
deconseille ou frequent: trash test
definition: Opération par laquelle le superviseur d'un centre d'appels évalue la qualité du service en se faisant passer pour un client.
in scheme: Économie et gestion d'entreprise
in scheme: concepts
notation: ECON1185
note: L'expression trash test, empruntée de l'anglais, est à proscrire.

triple performance
type: ConceptConcept
type: Concept
creator: Commission d'enrichissement de la langue française, FranceTerme
date parution JO: 2011-03-18
equivalent EN: triple bottom line @en
equivalent EN: triple bottom line (en)
alternative label: triple résultat
definition: Efficacité d'une entreprise évaluée selon des critères prenant en compte la rentabilité, la responsabilité sociale et le respect de l'environnement.
in scheme: Économie et gestion d'entreprise
in scheme: concepts
notation: ECON1186
note: La triple performance est la transposition dans l'entreprise de la notion de développement durable.
related: responsabilité sociale de l'entreprise

action en or
type: ConceptConcept
type: Concept
creator: Commission d'enrichissement de la langue française, FranceTerme
date parution JO: 2011-03-18
equivalent EN: golden share @en
equivalent EN: golden share (en)
alternative label: action spécifique
definition: Action réservée à certains investisseurs, en particulier l'État, et assortie d'un droit de veto.
in scheme: Finance
in scheme: concepts
notation: ECON1187

aide financière au démarrage
type: ConceptConcept
type: Concept
creator: Commission d'enrichissement de la langue française, FranceTerme
date parution JO: 2011-03-18
equivalent EN: early stage financing @en
equivalent EN: early stage financing (en)
definition: Somme versée à une entreprise récemment créée afin de faciliter ses débuts.
in scheme: Économie et gestion d'entreprise
in scheme: concepts
notation: ECON1188
note: 1. L'aide financière au démarrage peut être versée par l'État, une collectivité locale, une banque ou un investisseur providentiel.
note: 2. Il convient de distinguer le « fonds d'amorçage », qui finance la création d'une entreprise, de l'« aide financière au démarrage », qui intervient peu après.
related: investisseur providentiel
related: fonds d'amorçage

allotissement
type: ConceptConcept
type: Concept
creator: Commission d'enrichissement de la langue française, FranceTerme
source: révision de l'arrêté du 29 novembre 1973
date parution JO: 2000-09-22
equivalent EN: allotment @en
equivalent EN: allotment (en)
part of speech: nom masculin
definition: Opération qui consiste à entreposer des marchandises, par exemple à leur arrivée sur un aéroport, dans un ordre qui facilite leur reconnaissance par leur propriétaire et leur enlèvement une fois faites les formalités douanières.
in scheme: Économie et gestion d'entreprise
in scheme: concepts
notation: ECON119

associé aux risques
type: ConceptConcept
type: Concept
creator: Commission d'enrichissement de la langue française, FranceTerme
date parution JO: 2011-03-18
equivalent EN: risk partner @en
equivalent EN: risk partner (en)
equivalent EN: risk sharing partner @en
equivalent EN: risk sharing partner (en)
definition: Fournisseur ou partenaire industriel qui participe aux risques, notamment financiers, d'un projet d'investissement, en souscrivant une fraction du capital ou en consentant un prêt à des conditions particulières.
in scheme: Finance
in scheme: concepts
notation: ECON1191
related: partie prenante

consultant financier
type: ConceptConcept
type: Concept
creator: Commission d'enrichissement de la langue française, FranceTerme
date parution JO: 2011-03-18
equivalent EN: financial consultant @en
equivalent EN: financial consultant (en)
in scheme: Finance
in scheme: concepts
notation: ECON1192

fonds sans droit d'entrée ni de sortie
type: ConceptConcept
type: Concept
creator: Commission d'enrichissement de la langue française, FranceTerme
date parution JO: 2015-07-22
deconseille ou frequent: fonds no load
equivalent EN: no-load fund @en
equivalent EN: no-load fund (en)
definition: Fonds de placement dont le gestionnaire n’exige des investisseurs ni droit d’entrée ni droit de sortie.
in scheme: Finance
in scheme: concepts
notation: ECON1193

gestion atypique
type: ConceptConcept
type: Concept
creator: Commission d'enrichissement de la langue française, FranceTerme
date parution JO: 2014-06-05
equivalent EN: alternative asset management @en
equivalent EN: alternative asset management (en)
equivalent EN: alternative investment management @en
equivalent EN: alternative investment management (en)
alternative label: gestion alternative
definition: Stratégie du détenteur d’un portefeuille ou de son gestionnaire consistant à associer divers types d’opérations plus risquées que celles qui relèvent d’une gestion classique.
in scheme: Finance
in scheme: concepts
notation: ECON1194
note: La gestion atypique consiste, par exemple, à acheter ou à vendre des parts de fonds spéculatifs.
related: fonds spéculatif

intéressement aux plus-values
type: ConceptConcept
type: Concept
creator: Commission d'enrichissement de la langue française, FranceTerme
date parution JO: 2011-03-18
equivalent EN: carried interest @en
equivalent EN: carried interest (en)
definition: Fraction des plus-values versée aux gestionnaires des sociétés de capital-risque.
in scheme: Finance
in scheme: concepts
notation: ECON1195
note: L'usage français est de n'accorder d'intéressement aux plus-values qu'aux gestionnaires de sociétés de capital-risque.

offre de crédit
type: ConceptConcept
type: Concept
creator: Commission d'enrichissement de la langue française, FranceTerme
date parution JO: 2011-03-18
equivalent EN: credit offer @en
equivalent EN: credit offer (en)
in scheme: Finance
in scheme: concepts
notation: ECON1196

placement hors marché dans une société cotée
type: ConceptConcept
type: Concept
creator: Commission d'enrichissement de la langue française, FranceTerme
abbreviation: PIPE @en
date parution JO: 2011-03-18
equivalent EN: PIPE @en
equivalent EN: PIPE (en)
equivalent EN: private investments in public equity @en
equivalent EN: private investments in public equity (en)
forme abregee: placement hors marché
definition: Souscription à une augmentation de capital d'une société cotée, réservée à des investisseurs qualifiés tels que des investisseurs institutionnels ou des fonds d'investissement.
in scheme: Finance
in scheme: concepts
notation: ECON1197

écrémage
type: ConceptConcept
type: Concept
creator: Commission d'enrichissement de la langue française, FranceTerme
date parution JO: 1998-08-14
equivalent EN: skimming @en
equivalent EN: skimming (en)
part of speech: nom masculin
definition: Politique commerciale visant à attirer la clientèle jugée la plus avantageuse.
in scheme: Économie et gestion d'entreprise
in scheme: concepts
notation: ECON12

arrangeur
type: ConceptConcept
type: Concept
creator: Commission d'enrichissement de la langue française, FranceTerme
source: révision de l'arrêté du 11 janvier 1990
date parution JO: 2000-09-22
equivalent EN: arranger @en
equivalent EN: arranger (en)
part of speech: nom masculin
definition: Chef de file d'une facilité d'émission garantie ou d'un échange financier mettant en jeu un syndicat de banques ou d'organismes financiers.
in scheme: Finance
in scheme: concepts
notation: ECON120
related: facilité d'émission garantie

salle d'information
type: ConceptConcept
type: Concept
creator: Commission d'enrichissement de la langue française, FranceTerme
date parution JO: 2011-03-18
equivalent EN: data room @en
equivalent EN: data room (en)
definition: Salle ouverte aux acquéreurs potentiels d'une entreprise, afin qu'ils puissent consulter sur place les documents d'ordre économique, juridique ou financier relatifs à cette dernière.
in scheme: Économie et gestion d'entreprise
in scheme: Finance
in scheme: concepts
notation: ECON1200

suivi de tendance
type: ConceptConcept
type: Concept
creator: Commission d'enrichissement de la langue française, FranceTerme
date parution JO: 2011-03-18
equivalent EN: trend following @en
equivalent EN: trend following (en)
definition: Stratégie d'investissement consistant, pour un opérateur, à prendre des positions en fonction des tendances récentes du marché et de l'analyse statistique des cours.
in scheme: Finance
in scheme: concepts
notation: ECON1201
related: suiveur de tendance

tunnel de taux
type: ConceptConcept
type: Concept
creator: Commission d'enrichissement de la langue française, FranceTerme
date parution JO: 2011-03-18
equivalent EN: collar @en
equivalent EN: collar (en)
definition: Disposition d'un contrat conclu de gré à gré, qui garantit les parties contre les variations du taux d'un emprunt au-delà d'un maximum, appelé taux plafond, et en-deçà d'un minimum, appelé taux plancher.
in scheme: Finance
in scheme: concepts
notation: ECON1202
related: taux plafond
related: taux plancher

arbitrage sur valeur liquidative
type: ConceptConcept
type: Concept
creator: Commission d'enrichissement de la langue française, FranceTerme
date parution JO: 2013-03-13
equivalent EN: market timing @en
equivalent EN: market timing (en)
definition: Opération consistant à tirer profit d'un écart entre la valeur liquidative des parts d'un fonds, habituellement calculée une fois par jour à une heure fixée d'avance, et leur valeur de marché, qui peut varier tout au long de la journée.
in scheme: Finance
in scheme: concepts
notation: ECON1203
note: 1. Lorsque l'arbitrage sur valeur liquidative a lieu après une heure limite, l'Autorité des marchés financiers le considère comme répréhensible car il porte atteinte à l'égalité entre les porteurs.
note: 2. L'expression anglaise market timing recouvre plus largement, dans les pays anglo-saxons, toute opération visant à tirer parti d'une différence de valeur dans une période de temps.

attestation d'équité
type: ConceptConcept
type: Concept
creator: Commission d'enrichissement de la langue française, FranceTerme
date parution JO: 2012-06-17
equivalent EN: fairness opinion @en
equivalent EN: fairness opinion (en)
definition: Document établi par un cabinet d'audit ou une banque-conseil, asssurant qu'une opération financière complexe ne lèse pas les intérêts des actionnaires.
in scheme: Finance
in scheme: concepts
notation: ECON1204

brise-négociation
type: ConceptConcept
type: Concept
creator: Commission d'enrichissement de la langue française, FranceTerme
date parution JO: 2012-06-17
deconseille ou frequent: deal breaker
equivalent EN: dealbreaker @en
equivalent EN: dealbreaker (en)
part of speech: nom masculin
definition: Évènement remettant en cause la conclusion d'un accord entre partenaires financiers ou économiques.
in scheme: Économie et gestion d'entreprise
in scheme: Finance
in scheme: concepts
notation: ECON1205

clôture
type: ConceptConcept
type: Concept
creator: Commission d'enrichissement de la langue française, FranceTerme
date parution JO: 2012-06-17
equivalent EN: closing @en
equivalent EN: closing (en)
part of speech: nom féminin
in scheme: Finance
in scheme: concepts
notation: ECON1206

échange d'actifs
type: ConceptConcept
type: Concept
creator: Commission d'enrichissement de la langue française, FranceTerme
date parution JO: 2012-06-17
equivalent EN: asset swap @en
equivalent EN: asset swap (en)
equivalent EN: asset-based swap @en
equivalent EN: asset-based swap (en)
definition: Opération consistant à échanger un actif contre un autre de même valeur mais présentant des caractéristiques différentes.
in scheme: Finance
in scheme: concepts
notation: ECON1207
note: L'échange d'actifs peut être, par exemple, l'échange d'un titre à revenu fixe contre un titre à revenu variable.

fonds de croissance
type: ConceptConcept
type: Concept
creator: Commission d'enrichissement de la langue française, FranceTerme
date parution JO: 2012-06-17
equivalent EN: growth fund @en
equivalent EN: growth fund (en)
definition: Fonds privilégiant l'achat de titres de sociétés en forte croissance.
in scheme: Finance
in scheme: concepts
notation: ECON1208
related: fonds de valeurs décotées
related: stratégie de croissance

fonds de valeurs décotées
type: ConceptConcept
type: Concept
creator: Commission d'enrichissement de la langue française, FranceTerme
date parution JO: 2012-06-17
equivalent EN: value fund @en
equivalent EN: value fund (en)
definition: Fonds investissant dans des valeurs considérées comme sous-évaluées.
in scheme: Finance
in scheme: concepts
notation: ECON1209
related: fonds de croissance

attaquant
type: ConceptConcept
type: Concept
creator: Commission d'enrichissement de la langue française, FranceTerme
source: révision de l'arrêté du 6 janvier 1989
date parution JO: 2000-09-22
equivalent EN: raider @en
equivalent EN: raider (en)
part of speech: nom masculin
definition: Personne physique ou morale qui prend l'initiative d'une offre publique sur les titres d'une société, conduite dans une logique exclusivement financière.
in scheme: Finance
in scheme: concepts
notation: ECON121

fonds grand public
type: ConceptConcept
type: Concept
creator: Commission d'enrichissement de la langue française, FranceTerme
date parution JO: 2012-06-17
equivalent EN: retail fund @en
equivalent EN: retail fund (en)
definition: Fonds de placement à destination exclusive des particuliers, faisant l'objet d'une régulation spécifique qui vise à limiter certaines pratiques à haut risque et à assurer une bonne information des porteurs de parts.
in scheme: Finance
in scheme: concepts
notation: ECON1210
note: Les SICAV sont un exemple de « fonds grand public ».

gestionnaire de grande fortune
type: ConceptConcept
type: Concept
creator: Commission d'enrichissement de la langue française, FranceTerme
date parution JO: 2012-06-17
equivalent EN: family office @en
equivalent EN: family office (en)
definition: Organisme spécialisé dans la gestion administrative et financière de patrimoines importants.
in scheme: Économie et gestion d'entreprise
in scheme: Finance
in scheme: concepts
notation: ECON1211

ligne de capital
type: ConceptConcept
type: Concept
creator: Commission d'enrichissement de la langue française, FranceTerme
date parution JO: 2012-06-17
equivalent EN: equity line @en
equivalent EN: equity line (en)
definition: Augmentation du capital d'une société en tranches échelonnées, fréquemment soumise à conditions.
in scheme: Finance
in scheme: concepts
notation: ECON1212

obligation à haut rendement
type: ConceptConcept
type: Concept
creator: Commission d'enrichissement de la langue française, FranceTerme
abbreviation: high yield bond @en
date parution JO: 2013-03-13
equivalent EN: high yield @en
equivalent EN: high yield (en)
equivalent EN: high yield bond @en
equivalent EN: high yield bond (en)
definition: Obligation non convertible qui offre un rendement élevé en raison du risque supposé qu'elle comporte.
in scheme: Finance
in scheme: concepts
notation: ECON1213
related: obligation à haut risque

obligation foncière
type: ConceptConcept
type: Concept
creator: Commission d'enrichissement de la langue française, FranceTerme
date parution JO: 2012-06-17
equivalent EN: covered bond @en
equivalent EN: covered bond (en)
definition: Obligation adossée à des crédits hypothécaires ou à des crédits accordés à des collectivités locales, et émise par un établissement de crédit.
in scheme: Finance
in scheme: concepts
notation: ECON1214
note: En France, les prêts aux collectivités locales sont assimilés, au regard de la loi, à des obligations foncières.
related: obligation sécurisée

répartition tactique des actifs
type: ConceptConcept
type: Concept
creator: Commission d'enrichissement de la langue française, FranceTerme
abbreviation: RTA
abbreviation: TAA @en
date parution JO: 2012-06-17
equivalent EN: TAA @en
equivalent EN: TAA (en)
equivalent EN: tactical asset allocation @en
equivalent EN: tactical asset allocation (en)
definition: Pratique consistant à modifier la composition d'un portefeuille pour tirer parti des mouvements du marché.
in scheme: Finance
in scheme: concepts
notation: ECON1218

banque à domicile
type: ConceptConcept
type: Concept
creator: Commission d'enrichissement de la langue française, FranceTerme
source: révision de l'arrêté du 30 septembre 1991
date parution JO: 2000-09-22
equivalent EN: home banking @en
equivalent EN: home banking (en)
definition: Ensemble des services bancaires accessibles immédiatement de chez soi sans qu'il soit besoin de se rendre dans une agence bancaire.
in scheme: Finance
in scheme: concepts
notation: ECON122

sortie du marché
type: ConceptConcept
type: Concept
creator: Commission d'enrichissement de la langue française, FranceTerme
abbreviation: P to P @en
abbreviation: P to P transaction @en
date parution JO: 2012-06-17
equivalent EN: P to P @en
equivalent EN: P to P (en)
equivalent EN: P to P transaction @en
equivalent EN: P to P transaction (en)
equivalent EN: public-to-private @en
equivalent EN: public-to-private (en)
equivalent EN: public-to-private transaction @en
equivalent EN: public-to-private transaction (en)
definition: Opération par laquelle une société décide de ne plus être cotée en Bourse.
in scheme: Finance
in scheme: concepts
notation: ECON1220

stratégie à long terme
type: ConceptConcept
type: Concept
creator: Commission d'enrichissement de la langue française, FranceTerme
date parution JO: 2012-06-17
equivalent EN: long only @en
equivalent EN: long only (en)
equivalent EN: long-only strategy @en
equivalent EN: long-only strategy (en)
definition: Stratégie selon laquelle un gérant achète des titres pour ne les revendre que lorsqu'ils auront pris suffisamment de valeur.
in scheme: Finance
in scheme: concepts
notation: ECON1222

valeur à quatre sous
type: ConceptConcept
type: Concept
creator: Commission d'enrichissement de la langue française, FranceTerme
date parution JO: 2012-06-17
equivalent EN: penny stock @en
equivalent EN: penny stock (en)
definition: Action hautement spéculative et dont le cours est très bas.
in scheme: Finance
in scheme: concepts
notation: ECON1223

valeur de croissance à bon marché
type: ConceptConcept
type: Concept
creator: Commission d'enrichissement de la langue française, FranceTerme
abbreviation: growth at a reasonable price stock @en
date parution JO: 2012-06-17
equivalent EN: GARP stock @en
equivalent EN: GARP stock (en)
equivalent EN: growth at a reasonable price stock @en
equivalent EN: growth at a reasonable price stock (en)
definition: Valeur d'un prix attrayant, recherchée par des fonds qui investissent dans des sociétés dont ils attendent une croissance de profit supérieure à la moyenne des entreprises du marché.
in scheme: Finance
in scheme: concepts
notation: ECON1224
related: stratégie de valorisation

vente à découvert
type: ConceptConcept
type: Concept
creator: Commission d'enrichissement de la langue française, FranceTerme
date parution JO: 2012-06-17
equivalent EN: short sale @en
equivalent EN: short sale (en)
equivalent EN: short sell @en
equivalent EN: short sell (en)
definition: Vente de titres ou de marchandises par un opérateur qui ne les possède pas encore et qui devra se les procurer en temps utile pour honorer son contrat.
in scheme: Finance
in scheme: concepts
notation: ECON1225

vente abusive
type: ConceptConcept
type: Concept
creator: Commission d'enrichissement de la langue française, FranceTerme
date parution JO: 2012-06-17
equivalent EN: mis-selling @en
equivalent EN: mis-selling (en)
equivalent EN: misselling @en
equivalent EN: misselling (en)
definition: Vente de produits financiers ou d'assurances, effectuée dans des conditions d'information insuffisantes pour l'acheteur.
in scheme: Assurance
in scheme: Finance
in scheme: concepts
notation: ECON1226

acheteur, -euse potentiel, -elle
type: ConceptConcept
type: Concept
creator: Commission d'enrichissement de la langue française, FranceTerme
date parution JO: 2012-06-17
equivalent EN: prospect @en
equivalent EN: prospect (en)
equivalent EN: suspect @en
equivalent EN: suspect (en)
definition: Consommateur susceptible d'acheter un produit donné.
in scheme: Économie et gestion d'entreprise
in scheme: concepts
notation: ECON1227
note: L'acheteur potentiel peut notamment être repéré lors d'une démarche prospective.
scope note: Cette publication annule et remplace celle des termes « personne prospectable », « personne prospectée », « prospectable » et « prospecté » au Journal officiel du 12 mai 2000.

assortiment du linéaire
type: ConceptConcept
type: Concept
creator: Commission d'enrichissement de la langue française, FranceTerme
date parution JO: 2012-06-17
deconseille ou frequent: mix linéaire
definition: Façon de disposer les articles sur les rayons destinée à appeler l'attention du client et à favoriser leur vente.
in scheme: Économie et gestion d'entreprise
in scheme: concepts
notation: ECON1229
note: L'expression « mix linéaire » est à proscrire.

banque de détail
type: ConceptConcept
type: Concept
creator: Commission d'enrichissement de la langue française, FranceTerme
source: révision de l'arrêté du 18 février 1987
date parution JO: 2000-09-22
equivalent EN: retail banking @en
equivalent EN: retail banking (en)
definition: Ensemble des opérations bancaires de faible montant unitaire faites essentiellement avec les particuliers, les professions libérales et les petites entreprises.
in scheme: Finance
in scheme: concepts
notation: ECON123

comportement d'entreprise
type: ConceptConcept
type: Concept
creator: Commission d'enrichissement de la langue française, FranceTerme
date parution JO: 2012-06-17
equivalent EN: corporate behavior (US) @en
equivalent EN: corporate behavior (en-US)
equivalent EN: corporate behaviour (GB) @en
equivalent EN: corporate behaviour (en-GB)
in scheme: Économie et gestion d'entreprise
in scheme: concepts
notation: ECON1231

dossier du client
type: ConceptConcept
type: Concept
creator: Commission d'enrichissement de la langue française, FranceTerme
date parution JO: 2012-06-17
deconseille ou frequent: dossier-client
equivalent EN: customer book @en
equivalent EN: customer book (en)
equivalent EN: customer file @en
equivalent EN: customer file (en)
definition: Dossier qui rassemble des informations sur un client, à l'usage du vendeur.
in scheme: Économie et gestion d'entreprise
in scheme: concepts
notation: ECON1233
note: On trouve aussi, dans le langage professionnel, la forme abrégée « dossier-client ».
related: dossier des produits
related: dossier du vendeur

dossier des produits
type: ConceptConcept
type: Concept
creator: Commission d'enrichissement de la langue française, FranceTerme
date parution JO: 2012-06-17
deconseille ou frequent: book client
deconseille ou frequent: dossier-produits
definition: Documentation relative aux biens ou services proposés par une entreprise et destinée aux clients.
in scheme: Économie et gestion d'entreprise
in scheme: concepts
notation: ECON1234
note: 1. On trouve aussi, dans le langage professionnel, la forme abrégée « dossier-produits ». 2. L'expression « book client » est à proscrire.
related: dossier du client
related: dossier du vendeur

dossier du vendeur
type: ConceptConcept
type: Concept
creator: Commission d'enrichissement de la langue française, FranceTerme
date parution JO: 2012-06-17
deconseille ou frequent: book vendeur
definition: Ensemble des éléments utiles à une négociation commerciale.
in scheme: Économie et gestion d'entreprise
in scheme: concepts
notation: ECON1235
note: L'expression « book vendeur » est à proscrire.
related: dossier du client
related: dossier des produits

banque universelle
type: ConceptConcept
type: Concept
creator: Commission d'enrichissement de la langue française, FranceTerme
source: révision de l'arrêté du 30 septembre 1991
date parution JO: 2000-09-22
equivalent EN: global banking @en
equivalent EN: global banking (en) [activité]
equivalent EN: universal bank @en
equivalent EN: universal bank (en) [établissement]
equivalent EN: universal banking @en
equivalent EN: universal banking (en) [activité]
definition: Établissement de crédit qui offre tous les services bancaires à l'ensemble de sa clientèle ; activité de l'établissement.
in scheme: Finance
in scheme: concepts
notation: ECON124

conseiller, -ère en image
type: ConceptConcept
type: Concept
creator: Commission d'enrichissement de la langue française, FranceTerme
date parution JO: 2012-06-17
deconseille ou frequent: agence de relooking
deconseille ou frequent: relooker
deconseille ou frequent: relookeur
deconseille ou frequent: relookeuse
definition: Spécialiste du façonnage de l'image d'une entreprise, d'une marque ou d'un produit.
in scheme: Économie et gestion d'entreprise
in scheme: concepts
notation: ECON1241
note: Les termes « agence de relooking », « relooker » et « relookeur » sont à proscrire.

minimanie
type: ConceptConcept
type: Concept
creator: Commission d'enrichissement de la langue française, FranceTerme
date parution JO: 2012-06-17
deconseille ou frequent: kawaii mania
deconseille ou frequent: kawaimania
part of speech: nom féminin
definition: Engouement pour tous les biens de consommation de taille réduite.
in scheme: Économie et gestion d'entreprise
in scheme: concepts
notation: ECON1243
note: L'expression « Kawaii mania » est à proscrire.

profilage du client
type: ConceptConcept
type: Concept
creator: Commission d'enrichissement de la langue française, FranceTerme
date parution JO: 2012-06-17
deconseille ou frequent: clienteling
equivalent EN: client profiling @en
equivalent EN: client profiling (en)
forme abregee: profilage-client, n.m.
definition: Exploitation, par une entreprise, des informations relatives aux clients et à leurs achats.
in scheme: Économie et gestion d'entreprise
in scheme: concepts
notation: ECON1247
note: Le mot clienteling, emprunté de l'anglais, est à proscrire.
related: profileur, -euse
related: magasin connecté
scope note: Cette publication annule et remplace celle du terme « profilage » au Journal officiel du 26 mars 2004.

bases de l'économie
type: ConceptConcept
type: Concept
creator: Commission d'enrichissement de la langue française, FranceTerme
source: révision de l'arrêté du 6 janvier 1989
date parution JO: 2000-09-22
deconseille ou frequent: fondamentals
deconseille ou frequent: fondamentaux
equivalent EN: fundamentals @en
equivalent EN: fundamentals (en)
forme abregee: bases, n.f.pl.
definition: Conditions générales de la santé d'une économie, définies notamment par référence à l'état de ses grands équilibres macroéconomiques et macrofinanciers.
in scheme: Économie générale
in scheme: concepts
notation: ECON125
note: Il convient d'éviter le terme « fondamentals » ou « fondamentaux ».
related: concept-economie-generale

temps partagé
type: ConceptConcept
type: Concept
creator: Commission d'enrichissement de la langue française, FranceTerme
date parution JO: 2012-06-17
equivalent EN: time sharing @en
equivalent EN: time sharing (en)
definition: Mode d'exploitation collectif d'un bien ou d'un service, dans lequel chaque personne se voit allouer un temps d'occupation ou d'utilisation.
in scheme: Économie et gestion d'entreprise
in scheme: concepts
notation: ECON1254
note: Le temps partagé peut s'appliquer à l'occupation d'un bureau, d'un appartement, ou encore à l'usage d'un véhicule, d'un outil de production ou d'un équipement.

valoriseur
type: ConceptConcept
type: Concept
creator: Commission d'enrichissement de la langue française, FranceTerme
abbreviation: VAR @en
date parution JO: 2012-06-17
equivalent EN: VAR @en
equivalent EN: VAR (en)
equivalent EN: value-added reseller @en
equivalent EN: value-added reseller (en)
part of speech: nom masculin
definition: Entreprise qui transforme ou reconditionne un produit et le commercialise sous sa propre marque, afin d'en augmenter la valeur.
in scheme: Économie et gestion d'entreprise
in scheme: concepts
notation: ECON1255

vendeur, -euse en ligne
type: ConceptConcept
type: Concept
creator: Commission d'enrichissement de la langue française, FranceTerme
date parution JO: 2012-06-17
deconseille ou frequent: commercial web
equivalent EN: e-seller @en
equivalent EN: e-seller (en)
definition: Vendeur sur la toile.
in scheme: Économie et gestion d'entreprise
in scheme: concepts
notation: ECON1256
note: L'expression « commercial web » est à proscrire.
related: distributeur en ligne

catégorie investissement
type: ConceptConcept
type: Concept
creator: Commission d'enrichissement de la langue française, FranceTerme
date parution JO: 2013-03-13
equivalent EN: investment grade @en
equivalent EN: investment grade (en)
definition: Catégorie dans laquelle les agences de notation classent les émetteurs ou les titres qui, selon elles, présentent un risque faible.
in scheme: Finance
in scheme: concepts
notation: ECON1258
related: notation

catégorie spéculative
type: ConceptConcept
type: Concept
creator: Commission d'enrichissement de la langue française, FranceTerme
date parution JO: 2013-03-13
deconseille ou frequent: noninvestment grade
equivalent EN: non-investment grade @en
equivalent EN: non-investment grade (en)
equivalent EN: speculative grade @en
equivalent EN: speculative grade (en)
definition: Catégorie dans laquelle les agences de notation classent les émetteurs ou les titres qui, selon elles, présentent un risque élevé.
in scheme: Finance
in scheme: concepts
notation: ECON1259
related: notation

billet à ordre
type: ConceptConcept
type: Concept
creator: Commission d'enrichissement de la langue française, FranceTerme
source: révision de l'arrêté du 18 février 1987
date parution JO: 2000-09-22
equivalent EN: promissory note @en
equivalent EN: promissory note (en)
definition: Écrit par lequel un débiteur s'engage à payer, à une date déterminée, une certaine somme au bénéficiaire ou à son ordre.
in scheme: Finance
in scheme: concepts
notation: ECON126
note: Le billet à ordre est négociable.

courtier principal
type: ConceptConcept
type: Concept
creator: Commission d'enrichissement de la langue française, FranceTerme
date parution JO: 2013-03-13
equivalent EN: prime broker @en
equivalent EN: prime broker (en)
definition: Intermédiaire fournissant aux gérants de fonds spéculatifs ou d'autres fonds professionnels des services tels que le prêt de titres et l'exécution d'ordres, ou encore un soutien technique et opérationnel.
in scheme: Finance
in scheme: concepts
notation: ECON1260
related: fonds spéculatif
related: courtier

introducteur agréé
type: ConceptConcept
type: Concept
creator: Commission d'enrichissement de la langue française, FranceTerme
date parution JO: 2013-03-13
equivalent EN: listing sponsor @en
equivalent EN: listing sponsor (en)
definition: Intermédiaire financier accompagnant un émetteur de titres dans la préparation de sa cotation sur un marché et l'assistant durant son parcours boursier.
in scheme: Finance
in scheme: concepts
notation: ECON1262

période de secret
type: ConceptConcept
type: Concept
creator: Commission d'enrichissement de la langue française, FranceTerme
date parution JO: 2013-03-13
deconseille ou frequent: blackout period
equivalent EN: black-out period @en
equivalent EN: black-out period (en)
definition: Période durant laquelle les membres du syndicat de placement travaillant à l'introduction en Bourse des titres d'une entreprise ou à l'augmentation de son capital s'engagent à ne diffuser aucune information.
in scheme: Finance
in scheme: concepts
notation: ECON1264
related: période de silence

période de silence
type: ConceptConcept
type: Concept
creator: Commission d'enrichissement de la langue française, FranceTerme
date parution JO: 2013-03-13
equivalent EN: quiet period @en
equivalent EN: quiet period (en)
equivalent EN: waiting period @en
equivalent EN: waiting period (en)
definition: Période durant laquelle un émetteur est tenu de ne pas fournir d'informations concernant un appel public à l'épargne.
in scheme: Finance
in scheme: concepts
notation: ECON1265
related: période de secret

stratégie de croissance
type: ConceptConcept
type: Concept
creator: Commission d'enrichissement de la langue française, FranceTerme
abbreviation: growth strategy @en
date parution JO: 2013-03-13
equivalent EN: growth approach @en
equivalent EN: growth approach (en)
equivalent EN: growth investing strategy @en
equivalent EN: growth investing strategy (en)
equivalent EN: growth investment strategy @en
equivalent EN: growth investment strategy (en)
equivalent EN: growth strategy @en
equivalent EN: growth strategy (en)
definition: Stratégie de placement consistant, dans la gestion d'un portefeuille, à privilégier les titres de sociétés qui offrent un potentiel de croissance important.
in scheme: Finance
in scheme: concepts
notation: ECON1267
related: fonds de croissance
related: stratégie de valorisation

stratégie de valorisation
type: ConceptConcept
type: Concept
creator: Commission d'enrichissement de la langue française, FranceTerme
abbreviation: value strategy @en
date parution JO: 2013-03-13
equivalent EN: value approach @en
equivalent EN: value approach (en)
equivalent EN: value investing strategy @en
equivalent EN: value investing strategy (en)
equivalent EN: value investment strategy @en
equivalent EN: value investment strategy (en)
equivalent EN: value strategy @en
equivalent EN: value strategy (en)
definition: Stratégie de placement consistant, dans la gestion d'un portefeuille, à privilégier les titres dont le cours de Bourse paraît sous-coté par rapport à la valeur réelle de la société.
in scheme: Finance
in scheme: concepts
notation: ECON1268
related: valeur de croissance à bon marché
related: stratégie de croissance

billet de trésorerie
type: ConceptConcept
type: Concept
creator: Commission d'enrichissement de la langue française, FranceTerme
source: révision de l'arrêté du 18 février 1987
date parution JO: 2000-09-22
deconseille ou frequent: CD
deconseille ou frequent: certificat de dépôt
deconseille ou frequent: certificate of deposit
deconseille ou frequent: papier commecial
equivalent EN: commercial paper @en
equivalent EN: commercial paper (en)
definition: Billet au porteur négociable, émis par une entreprise autre qu'un établissement de crédit pour se procurer des capitaux à court terme.
in scheme: Finance
in scheme: concepts
notation: ECON127
note: 1. Un établissement de crédit émet des certificats de dépôt (en anglais : certificates of deposit ou CD's) dont la définition est identique.
note: 2. Le terme « billet de trésorerie » ne doit pas être traduit en anglais par treasury bill (TB).
related: actif titrisé

picorage de titres
type: ConceptConcept
type: Concept
creator: Commission d'enrichissement de la langue française, FranceTerme
date parution JO: 2013-03-13
equivalent EN: stock picking @en
equivalent EN: stock picking (en)
definition: Méthode de gestion d'un portefeuille consistant à privilégier des titres pour leurs potentialités propres.
in scheme: Finance
in scheme: concepts
notation: ECON1271
note: Le picorage de titres s'oppose à la gestion de portefeuilles constitués d'un échantillon pondéré de valeurs, représentant tous les secteurs économiques ou la plupart d'entre eux.
related: picorage

coût complet d'un bien
type: ConceptConcept
type: Concept
creator: Commission d'enrichissement de la langue française, FranceTerme
abbreviation: TCO @en
date parution JO: 2013-03-13
equivalent EN: TCO @en
equivalent EN: TCO (en)
equivalent EN: total cost of ownership @en
equivalent EN: total cost of ownership (en)
definition: Somme des coûts d'un bien tout au long de son cycle de vie, incluant les coûts directs et les coûts indirects.
in scheme: Économie générale
in scheme: concept-SD-economie-generale-comptabilite
in scheme: concepts
notation: ECON1272
note: Le coût complet d'un bien peut concerner le propriétaire comme le locataire.

capacité d'autofinancement
type: ConceptConcept
type: Concept
creator: Commission d'enrichissement de la langue française, FranceTerme
abbreviation: CAF
abbreviation: SFC @en
date parution JO: 2013-03-13
equivalent EN: cash flow @en
equivalent EN: cash flow (en)
equivalent EN: self-financing capacity @en
equivalent EN: self-financing capacity (en)
lien: http://fr.wikipedia.org/wiki/Capacit%C3%A9_d%27autofinancement
definition: Financial results of a company over a reporting period when the income is earned and charges paid. @en
definition: Résultat dégagé par une entreprise au cours d'une période de référence une fois les produits encaissés et les charges décaissées.
in scheme: Économie générale
in scheme: concept-SD-economie-generale-comptabilite
in scheme: concepts
notation: ECON1273
note: Il convient de distinguer la « capacité d'autofinancement » du « flux de trésorerie », bien que le terme anglais cash flow recouvre les deux notions.
preferred label: self-financing capacity @en
related: flux de trésorerie
related: trésorerie disponible
related: concept-liquidites
related: concept-resultat
related: concept-tresorerie

flux de trésorerie
type: ConceptConcept
type: Concept
creator: Commission d'enrichissement de la langue française, FranceTerme
date parution JO: 2013-03-13
equivalent EN: cash flow @en
equivalent EN: cash flow (en)
definition: Ensemble des entrées et sorties de trésorerie et d'équivalents de trésorerie.
in scheme: Économie générale
in scheme: concept-SD-economie-generale-comptabilite
in scheme: concepts
notation: ECON1274
note: On peut distinguer plusieurs catégories de flux de trésorerie, selon que celui-ci provient de l'activité, des opérations de financement ou encore des opérations d'investissement.
related: capacité d'autofinancement
related: trésorerie disponible

administration allégée
type: ConceptConcept
type: Concept
creator: Commission d'enrichissement de la langue française, FranceTerme
date parution JO: 2013-03-13
equivalent EN: lean administration @en
equivalent EN: lean administration (en)
in scheme: Tous domaines
in scheme: concepts
notation: ECON1279

bon à moyen terme négociable
type: ConceptConcept
type: Concept
creator: Commission d'enrichissement de la langue française, FranceTerme
source: révision de l'arrêté du 11 février 1993
abbreviation: BMTN
abbreviation: MTN @en
date parution JO: 2000-09-22
equivalent EN: MTN @en
equivalent EN: MTN (en)
equivalent EN: medium term note @en
equivalent EN: medium term note (en)
definition: Catégorie de titre de créance négociable d'une durée initiale supérieure à un an pouvant être émis sur le marché, sous réserve de certaines conditions règlementaires, par les établissements de crédit, les entreprises, les institutions de la CEE et les organisations internationales.
in scheme: Finance
in scheme: concepts
notation: ECON128

analyste des données commerciales
type: ConceptConcept
type: Concept
creator: Commission d'enrichissement de la langue française, FranceTerme
date parution JO: 2013-03-13
deconseille ou frequent: analyste de données commerciales
deconseille ou frequent: sales & pricing analyst
equivalent EN: sales and pricing analyst @en
equivalent EN: sales and pricing analyst (en)
in scheme: Économie et gestion d'entreprise
in scheme: concepts
notation: ECON1280

analyste en logistique
type: ConceptConcept
type: Concept
creator: Commission d'enrichissement de la langue française, FranceTerme
date parution JO: 2013-03-13
equivalent EN: distribution analyst @en
equivalent EN: distribution analyst (en)
equivalent EN: logistics analyst @en
equivalent EN: logistics analyst (en)
in scheme: Économie et gestion d'entreprise
in scheme: concepts
notation: ECON1281

stockage groupé
type: ConceptConcept
type: Concept
creator: Commission d'enrichissement de la langue française, FranceTerme
date parution JO: 2013-03-13
deconseille ou frequent: crossstocking
equivalent EN: cross-stocking @en
equivalent EN: cross-stocking (en)
definition: Méthode consistant à concentrer dans un nombre réduit de dépôts des stocks de provenances diverses.
in scheme: Économie et gestion d'entreprise
in scheme: concepts
notation: ECON1282

assistance-client
type: ConceptConcept
type: Concept
creator: Commission d'enrichissement de la langue française, FranceTerme
date parution JO: 2013-03-13
equivalent EN: help desk @en
equivalent EN: help desk (en)
part of speech: nom féminin
definition: Service chargé, au sein d'une entreprise, de répondre aux difficultés des clients.
in scheme: Économie et gestion d'entreprise
in scheme: concepts
notation: ECON1283

état des lieux
type: ConceptConcept
type: Concept
creator: Commission d'enrichissement de la langue française, FranceTerme
date parution JO: 2013-03-13
equivalent EN: reality check @en
equivalent EN: reality check (en)
definition: Description d'une situation donnant lieu éventuellement à une comparaison avec un cahier des charges.
in scheme: Tous domaines
in scheme: concepts
notation: ECON1288

indice relationnel
type: ConceptConcept
type: Concept
creator: Commission d'enrichissement de la langue française, FranceTerme
abbreviation: RSC @en
date parution JO: 2013-03-13
equivalent EN: RSC @en
equivalent EN: RSC (en)
equivalent EN: relationship score @en
equivalent EN: relationship score (en)
definition: Indicateur chiffré de la qualité des relations qu'une entreprise entretient avec ses clients.
in scheme: Économie et gestion d'entreprise
in scheme: concepts
notation: ECON1289
note: L'indice relationnel est établi soit par l'entreprise elle-même, soit par un organisme extérieur.
related: gestion des relations avec la clientèle

bord (à)
type: ConceptConcept
type: Concept
creator: Commission d'enrichissement de la langue française, FranceTerme
source: révision de l'arrêté du 18 février 1987
date parution JO: 2000-09-22
deconseille ou frequent: à bord
equivalent EN: ex ship @en
equivalent EN: ex ship (en)
part of speech: locution
definition: Se dit d'une marchandise prise en charge à bord du navire au port de déchargement.
in scheme: Économie et gestion d'entreprise
in scheme: concepts
notation: ECON129
note: Le reste de la phrase précise le lieu de la prise en charge. Exemple : à bord Marseille.

neuromercatique
type: ConceptConcept
type: Concept
creator: Commission d'enrichissement de la langue française, FranceTerme
date parution JO: 2013-03-13
deconseille ou frequent: neuro marketing
equivalent EN: neuromarketing @en
equivalent EN: neuromarketing (en)
part of speech: nom féminin
definition: Étude des mécanismes cérébraux susceptibles d'intervenir dans le comportement des consommateurs.
in scheme: Économie et gestion d'entreprise
in scheme: concepts
notation: ECON1292
note: La neuromercatique recourt notamment aux techniques de l'imagerie médicale et observe la façon dont le cerveau répond à divers stimuli.
related: mercatique par stimulation sensorielle

personnalisation
type: ConceptConcept
type: Concept
creator: Commission d'enrichissement de la langue française, FranceTerme
date parution JO: 2013-03-13
deconseille ou frequent: customania
equivalent EN: customisation (GB) @en
equivalent EN: customisation (en-GB)
equivalent EN: customization (US) @en
equivalent EN: customization (en-US)
part of speech: nom féminin
definition: Adaptation d'un produit ou d'un service à la demande spécifique exprimée par un client, de façon à le rendre plus conforme à ses goûts.
in scheme: Économie et gestion d'entreprise
in scheme: concepts
notation: ECON1293
related: adaptation à l'usager
related: personnaliser

scénario du pire
type: ConceptConcept
type: Concept
creator: Commission d'enrichissement de la langue française, FranceTerme
date parution JO: 2013-03-13
deconseille ou frequent: worstcase scenario
equivalent EN: worst-case scenario @en
equivalent EN: worst-case scenario (en)
definition: Hypothèse d'évolution d'une entreprise qui prend en compte l'environnement le plus défavorable.
in scheme: Économie et gestion d'entreprise
in scheme: concepts
notation: ECON1298

éthique des affaires
type: ConceptConcept
type: Concept
creator: Commission d'enrichissement de la langue française, FranceTerme
date parution JO: 1998-08-14
equivalent EN: business ethics @en
equivalent EN: business ethics (en)
definition: Ensemble des valeurs et des règles morales qui s'imposent dans la vie des affaires.
in scheme: Économie et gestion d'entreprise
in scheme: concepts
notation: ECON13

bord à bord
type: ConceptConcept
type: Concept
creator: Commission d'enrichissement de la langue française, FranceTerme
source: révision de l'arrêté du 18 février 1987
abbreviation: BAB
abbreviation: FIO @en
date parution JO: 2000-09-22
deconseille ou frequent: free in & out
equivalent EN: FIO @en
equivalent EN: FIO (en)
equivalent EN: free in and out @en
equivalent EN: free in and out (en)
part of speech: locution
definition: Se dit du prix entendu pour une marchandise mise à bord du navire et également reprise à bord, aux frais et aux risques des chargeurs ou des réceptionnaires.
in scheme: Économie et gestion d'entreprise
in scheme: concepts
notation: ECON130
note: Une cotation donnée pour une ligne maritime sur la base BAB indique que toutes les manutentions sont à payer et à assurer en plus.

droit correcteur
type: ConceptConcept
type: Concept
creator: Commission d'enrichissement de la langue française, FranceTerme
date parution JO: 2014-06-05
equivalent EN: anti-dumping duty @en
equivalent EN: anti-dumping duty (en)
equivalent EN: antidumping duty @en
equivalent EN: antidumping duty (en)
definition: Droit de douane appliqué par un pays lorsqu’il constate que le prix d’un produit qu’il importe est inférieur à son prix de revient ou au prix courant de ce produit sur le marché du pays exportateur.
in scheme: Économie et gestion d'entreprise
in scheme: concepts
notation: ECON1302

brillant universel
type: ConceptConcept
type: Concept
creator: Commission d'enrichissement de la langue française, FranceTerme
source: révision de l'arrêté du 18 février 1987
abbreviation: BU
date parution JO: 2000-09-22
equivalent EN: brilliant uncirculated @en
equivalent EN: brilliant uncirculated (en)
definition: Monnaie de collection frappée dans les mêmes conditions que les pièces de monnaie courantes mais avec des matrices neuves.
in scheme: Finance
in scheme: concepts
notation: ECON131
note: N'ayant pas circulé, elle conserve le brillant d'une pièce neuve.

descriptif
type: ConceptConcept
type: Concept
creator: Commission d'enrichissement de la langue française, FranceTerme
date parution JO: 2013-03-13
deconseille ou frequent: fact sheet
deconseille ou frequent: factbook
equivalent EN: fact book @en
equivalent EN: fact book (en)
equivalent EN: factsheet @en
equivalent EN: factsheet (en)
equivalent EN: one pager @en
equivalent EN: one pager (en)
equivalent EN: onepager @en
equivalent EN: onepager (en)
part of speech: nom masculin
definition: Fiche d'information portant sur un sujet donné.
in scheme: Tous domaines
in scheme: concepts
notation: ECON1312
note: Dans le domaine de l'économie et des finances, un descriptif peut porter sur un produit, un service, une entreprise ou un émetteur de titres.

rapport d'étape
type: ConceptConcept
type: Concept
creator: Commission d'enrichissement de la langue française, FranceTerme
date parution JO: 2013-03-13
equivalent EN: milestone report @en
equivalent EN: milestone report (en)
equivalent EN: progress report @en
equivalent EN: progress report (en)
equivalent EN: term sheet @en
equivalent EN: term sheet (en)
definition: Document faisant état de l'avancement d'un projet à un moment considéré comme significatif.
in scheme: Tous domaines
in scheme: concepts
notation: ECON1313

fonds d'amorçage
type: ConceptConcept
type: Concept
creator: Commission d'enrichissement de la langue française, FranceTerme
date parution JO: 2011-03-18
equivalent EN: seed money @en
equivalent EN: seed money (en)
alternative label: capital d'amorçage
definition: Fonds alloués, le plus souvent par des investisseurs providentiels, au lancement d'un projet pour permettre la prospection de marchés et le développement de produits ou de services.
in scheme: Économie et gestion d'entreprise
in scheme: concepts
notation: ECON1315
related: investisseur providentiel
related: aide financière au démarrage
scope note: Cette publication annule et remplace celle du Journal officiel du 19 janvier 2010.

remise différée
type: ConceptConcept
type: Concept
creator: Commission d'enrichissement de la langue française, FranceTerme
date parution JO: 2011-03-18
equivalent EN: cash back @en
equivalent EN: cash back (en)
definition: Remise proposée à un client sur un achat ultérieur.
in scheme: Économie et gestion d'entreprise
in scheme: concepts
notation: ECON1316

publicité de rue
type: ConceptConcept
type: Concept
creator: Commission d'enrichissement de la langue française, FranceTerme
date parution JO: 2012-06-17
equivalent EN: street marketing @en
equivalent EN: street marketing (en)
definition: Technique mercatique consistant à distribuer des prospectus et des échantillons sur la voie publique ou à y mener toute autre opération de communication pour promouvoir un produit.
in scheme: Communication
in scheme: Économie et gestion d'entreprise
in scheme: concept-SD-communication-publicite
in scheme: concept-SD-economie-et-gestion-d-entreprise-publicite
in scheme: concepts
notation: ECON1318

cadeau publicitaire
type: ConceptConcept
type: Concept
creator: Commission d'enrichissement de la langue française, FranceTerme
source: révision de l'arrêté du 7 juillet 1994
date parution JO: 2000-09-22
equivalent EN: give-away @en
equivalent EN: give-away (en)
equivalent EN: giveaway @en
equivalent EN: giveaway (en)
definition: Objet de faible valeur distribué gratuitement pour promouvoir un produit ou une entreprise.
in scheme: Économie et gestion d'entreprise
in scheme: concepts
notation: ECON132

investissement en capital
type: ConceptConcept
type: Concept
creator: Commission d'enrichissement de la langue française, FranceTerme
date parution JO: 2013-03-13
equivalent EN: private equity @en
equivalent EN: private equity (en)
alternative label: capital-investissement
definition: Activité consistant à investir dans des entreprises non cotées en Bourse.
in scheme: Finance
in scheme: concepts
notation: ECON1320
note: L'investissement en capital permet, par exemple, d'accompagner la création d'une entreprise, de soutenir sa croissance ou de faciliter son rachat, total ou partiel.

pénurie de crédit
type: ConceptConcept
type: Concept
creator: Commission d'enrichissement de la langue française, FranceTerme
date parution JO: 2014-06-05
deconseille ou frequent: resserrement de crédit
equivalent EN: credit crunch @en
equivalent EN: credit crunch (en)
definition: Situation dans laquelle les banques, sans concertation, raréfient l’offre de crédit.
in scheme: Finance
in scheme: concepts
notation: ECON1326
note: La pénurie de crédit intervient notamment lorsque les banques constatent une insuffisance de leurs fonds propres ou une insuffisance de liquidités.
related: durcissement du crédit
scope note: Cette publication annule et remplace celle du terme « resserrement de crédit » au Journal officiel du 22 septembre 2000.

krach éclair
type: ConceptConcept
type: Concept
creator: Commission d'enrichissement de la langue française, FranceTerme
date parution JO: 2018-12-07
deconseille ou frequent: crash éclair
equivalent EN: flash crash @en
equivalent EN: flash crash (en)
definition: Chute forte et extrêmement rapide des cours boursiers.
in scheme: Finance
in scheme: concepts
notation: ECON1328
note: Un krach éclair résulte généralement de la diffusion d’une information non anticipée qui déclenche des ordres automatiques de vente de grande ampleur.
related: transactions à haute fréquence

capital-risque
type: ConceptConcept
type: Concept
creator: Commission d'enrichissement de la langue française, FranceTerme
source: révision de l'arrêté du 11 janvier 1990
date parution JO: 2000-09-22
deconseille ou frequent: société de capital-risque
equivalent EN: venture capital @en
equivalent EN: venture capital (en)
part of speech: nom masculin
definition: Investissement à risques assorti de gains potentiels élevés, consistant en prises de participations dans des entreprises œuvrant en principe dans les techniques de pointe, les idées nouvelles et sur les marchés risqués, et réalisé notamment par des sociétés spécialisées, dites « sociétés de capital-risque ».
in scheme: Finance
in scheme: concepts
notation: ECON133

obligation remboursable par anticipation
type: ConceptConcept
type: Concept
creator: Commission d'enrichissement de la langue française, FranceTerme
date parution JO: 2014-06-05
equivalent EN: callable bond @en
equivalent EN: callable bond (en)
definition: Obligation que l’émetteur peut rembourser avant l’échéance, au prix stipulé dans le contrat d’émission.
in scheme: Finance
in scheme: concepts
notation: ECON1330

obligation sécurisée
type: ConceptConcept
type: Concept
creator: Commission d'enrichissement de la langue française, FranceTerme
date parution JO: 2014-06-05
equivalent EN: covered bond @en
equivalent EN: covered bond (en)
definition: Titre obligataire assorti d’une garantie, qui est émis par une institution financière pour refinancer des créances, généralement des prêts immobiliers ou des prêts au secteur public, et qui figure comme tel dans la comptabilité de l’émetteur.
in scheme: Finance
in scheme: concepts
notation: ECON1331
related: obligation foncière

plateforme de négociation opaque
type: ConceptConcept
type: Concept
creator: Commission d'enrichissement de la langue française, FranceTerme
date parution JO: 2014-06-05
equivalent EN: dark pool @en
equivalent EN: dark pool (en)
alternative label: chambre opaque
definition: Système d’échange anonyme de blocs importants de titres hors du marché officiel.
in scheme: Finance
in scheme: concepts
notation: ECON1332
note: Une plateforme de négociation opaque est notamment destinée à limiter les éventuelles variations de prix que peut déclencher l’annonce d’une opération importante.

preneur ferme
type: ConceptConcept
type: Concept
creator: Commission d'enrichissement de la langue française, FranceTerme
date parution JO: 2014-06-05
equivalent EN: underwriter @en
equivalent EN: underwriter (en)
alternative label: souscripteur ferme
definition: Personne physique ou morale qui s'engage à acquérir les titres n'ayant pas trouvé preneur à la clôture d'une émission.
in scheme: Finance
in scheme: concepts
notation: ECON1333

rehausseur de notation
type: ConceptConcept
type: Concept
creator: Commission d'enrichissement de la langue française, FranceTerme
date parution JO: 2014-06-05
equivalent EN: monoline @en
equivalent EN: monoline (en)
equivalent EN: monoline insurance company @en
equivalent EN: monoline insurance company (en)
equivalent EN: monoline insurer @en
equivalent EN: monoline insurer (en)
equivalent EN: monoliner @en
equivalent EN: monoliner (en)
definition: Compagnie d’assurance qui apporte une garantie à des titres de dettes, afin que ces titres obtiennent une cotation meilleure que celle des émetteurs, ce qui permet à ceux-ci de bénéficier d’un coût réduit.
in scheme: Assurance
in scheme: Finance
in scheme: concepts
notation: ECON1334

système de règlement brut en temps réel
type: ConceptConcept
type: Concept
creator: Commission d'enrichissement de la langue française, FranceTerme
abbreviation: RBTR
abbreviation: RTGS @en
date parution JO: 2014-06-05
equivalent EN: RTGS @en
equivalent EN: RTGS (en)
equivalent EN: real time gross settlement system @en
equivalent EN: real time gross settlement system (en)
definition: Système de paiement dans lequel le règlement des opérations intervient de manière continue et en temps réel, transaction par transaction.
in scheme: Finance
in scheme: concepts
notation: ECON1335

transactions à haute fréquence
type: ConceptConcept
type: Concept
creator: Commission d'enrichissement de la langue française, FranceTerme
abbreviation: HFT @en
date parution JO: 2014-06-05
deconseille ou frequent: trading haute fréquence
deconseille ou frequent: trading à haute fréquence
equivalent EN: HFT @en
equivalent EN: HFT (en)
equivalent EN: high frequency trading @en
equivalent EN: high frequency trading (en)
forme abregee: transactions haute fréquence
definition: Production, acheminement et exécution d’ordres de bourse recourant à des programmes informatiques particulièrement rapides.
in scheme: Finance
in scheme: concepts
notation: ECON1336
related: krach éclair

caisse en libre service
type: ConceptConcept
type: Concept
creator: Commission d'enrichissement de la langue française, FranceTerme
date parution JO: 2014-06-05
deconseille ou frequent: caisse automatique
deconseille ou frequent: self checkout
equivalent EN: self check-out @en
equivalent EN: self check-out (en)
equivalent EN: self scanning @en
equivalent EN: self scanning (en)
definition: Caisse qui permet à un client d’enregistrer ses achats et d’en effectuer le paiement lui-même.
in scheme: Économie et gestion d'entreprise
in scheme: concepts
notation: ECON1337

gestion au plus juste
type: ConceptConcept
type: Concept
creator: Commission d'enrichissement de la langue française, FranceTerme
date parution JO: 2014-06-05
equivalent EN: lean management @en
equivalent EN: lean management (en)
definition: Méthode de management qui consiste à assurer la conduite d’une entreprise au coût le plus faible possible.
in scheme: Économie et gestion d'entreprise
in scheme: concepts
notation: ECON1338
related: production au plus juste

production au plus juste
type: ConceptConcept
type: Concept
creator: Commission d'enrichissement de la langue française, FranceTerme
date parution JO: 2014-06-05
equivalent EN: lean manufacturing @en
equivalent EN: lean manufacturing (en)
equivalent EN: lean production @en
equivalent EN: lean production (en)
definition: Mode de production fondé sur l’utilisation du minimum de ressources en vue de réduire le gaspillage.
in scheme: Économie et gestion d'entreprise
in scheme: concepts
notation: ECON1339
related: gestion au plus juste

capitaux flottants
type: ConceptConcept
type: Concept
creator: Commission d'enrichissement de la langue française, FranceTerme
source: révision de l'arrêté du 18 février 1987
date parution JO: 2000-09-22
deconseille ou frequent: capitaux fébriles
equivalent EN: hot money @en
equivalent EN: hot money (en)
definition: Capitaux en quête de placements permettant la meilleure rentabilité à court terme quels que soient la place financière, la monnaie et le placement.
in scheme: Finance
in scheme: concepts
notation: ECON134
note: On dit aussi, en période de crise, « capitaux fébriles ».

panneau d'accrochage
type: ConceptConcept
type: Concept
creator: Commission d'enrichissement de la langue française, FranceTerme
date parution JO: 2014-06-05
deconseille ou frequent: peg-boardable
deconseille ou frequent: pegboard
equivalent EN: peg-board @en
equivalent EN: peg-board (en)
definition: Présentoir de magasin garni de supports pour accrocher des articles.
in scheme: Économie et gestion d'entreprise
in scheme: concepts
notation: ECON1340
note: Les articles en question sont « accrochables » et non « peg-boardables ».

centre commercial
type: ConceptConcept
type: Concept
creator: Commission d'enrichissement de la langue française, FranceTerme
date parution JO: 2014-06-05
equivalent EN: retail park @en
equivalent EN: retail park (en)
equivalent EN: shopping center (US) @en
equivalent EN: shopping center (en-US)
equivalent EN: shopping centre (GB) @en
equivalent EN: shopping centre (en-GB)
equivalent EN: super center (US) @en
equivalent EN: super center (en-US)
equivalent EN: super centre (GB) @en
equivalent EN: super centre (en-GB)
alternative label: parc commercial
definition: Vaste ensemble commercial offrant une large gamme de magasins et de services, conçu et géré comme une même entité.
in scheme: Aménagement et urbanisme
in scheme: Économie et gestion d'entreprise
in scheme: concepts
notation: ECON1341
scope note: Cette publication annule et remplace celle du Journal officiel du 22 septembre 2000.

surface commerciale utile
type: ConceptConcept
type: Concept
creator: Commission d'enrichissement de la langue française, FranceTerme
abbreviation: SCU
date parution JO: 2016-08-05
equivalent EN: GLA @en
equivalent EN: GLA (en)
equivalent EN: gross leasable area @en
equivalent EN: gross leasable area (en)
equivalent EN: gross leasing area @en
equivalent EN: gross leasing area (en)
definition: Surface privative louée ou vendue à des commerçants, qui comprend l’unité de vente, les bureaux et les réserves.
in scheme: Économie et gestion d'entreprise
in scheme: concepts
notation: ECON1342

moins-disant social
type: ConceptConcept
type: Concept
creator: Commission d'enrichissement de la langue française, FranceTerme
date parution JO: 2016-08-05
deconseille ou frequent: dumping social
deconseille ou frequent: moins-disance sociale
equivalent EN: social dumping @en
equivalent EN: social dumping (en)
alternative label: moins-disance sociale
definition: Pratique consistant, pour un État, à adopter une législation sociale moins contraignante que celle d’États concurrents afin de maintenir les coûts de revient des producteurs à un bas niveau, et d’attirer les investissements étrangers.
in scheme: Économie et gestion d'entreprise
in scheme: Emploi et travail
in scheme: concepts
notation: ECON1344
note: On trouve aussi l’expression « dumping social ».
related: concept-JURI43

moins-disant fiscal
type: ConceptConcept
type: Concept
creator: Commission d'enrichissement de la langue française, FranceTerme
date parution JO: 2016-08-05
deconseille ou frequent: dumping fiscal
equivalent EN: moins-disance fiscale
alternative label: moins-disance fiscale
definition: Pratique consistant, pour un État, à adopter une législation fiscale moins contraignante que celle d’États concurrents afin d’attirer les entreprises étrangères et les capitaux étrangers.
in scheme: Économie et gestion d'entreprise
in scheme: Économie générale
in scheme: concept-SD-economie-et-gestion-d-entreprise-fiscalite
in scheme: concept-SD-economie-generale-fiscalite
in scheme: concepts
notation: ECON1345
note: On trouve aussi l’expression « dumping fiscal ».
related: concept-JURI43

rendu au terminal
type: ConceptConcept
type: Concept
creator: Commission d'enrichissement de la langue française, FranceTerme
abbreviation: DAT @en
abbreviation: RAT
date parution JO: 2014-06-05
equivalent EN: DAT @en
equivalent EN: DAT (en)
equivalent EN: delivered at terminal @en
equivalent EN: delivered at terminal (en)
in scheme: Économie et gestion d'entreprise
in scheme: concepts
notation: ECON1346
scope note: Cette publication annule et remplace celle du terme « rendu à quai » au Journal officiel des 14 août 1998 et 24 avril 2004.

rendu au lieu de destination
type: ConceptConcept
type: Concept
creator: Commission d'enrichissement de la langue française, FranceTerme
abbreviation: DAP @en
abbreviation: RLD
date parution JO: 2014-06-05
deconseille ou frequent: Incoterm
deconseille ou frequent: Incoterms
equivalent EN: DAP @en
equivalent EN: DAP (en)
equivalent EN: delivered at place @en
equivalent EN: delivered at place (en)
in scheme: Économie et gestion d'entreprise
in scheme: concepts
notation: ECON1347
scope note: Cette publication annule et remplace celle des termes « rendu à bord », « rendu à la frontière » et « rendu droits dus » au Journal officiel des 14 août 1998 et 24 avril 2004.

trésorerie disponible
type: ConceptConcept
type: Concept
creator: Commission d'enrichissement de la langue française, FranceTerme
date parution JO: 2013-03-13
equivalent EN: free cash flow @en
equivalent EN: free cash flow (en)
definition: Trésorerie restant à la disposition d'une entreprise après l'affectation des sommes nécessaires à l'achat de nouveaux éléments d'actifs, au règlement des échéances et au paiement des dividendes.
in scheme: Économie générale
in scheme: concept-SD-economie-generale-comptabilite
in scheme: concepts
notation: ECON1348
related: capacité d'autofinancement
related: flux de trésorerie

centre automobile
type: ConceptConcept
type: Concept
creator: Commission d'enrichissement de la langue française, FranceTerme
source: révision de l'arrêté du 29 novembre 1973
date parution JO: 2000-09-22
deconseille ou frequent: auto center
deconseille ou frequent: auto centre
deconseille ou frequent: car center
equivalent EN: autocenter (US) @en
equivalent EN: autocenter (en-US)
equivalent EN: autocentre (GB) @en
equivalent EN: autocentre (en-GB)
forme abregee: centre auto
definition: Magasin qui offre à la vente tout ce qui a rapport à l'automobile.
in scheme: Automobile
in scheme: Économie et gestion d'entreprise
in scheme: concepts
notation: ECON135
note: Pluriel : centres auto.

durcissement du crédit
type: ConceptConcept
type: Concept
creator: Commission d'enrichissement de la langue française, FranceTerme
date parution JO: 2014-06-05
equivalent EN: credit squeeze @en
equivalent EN: credit squeeze (en)
definition: Situation dans laquelle le système bancaire rend les conditions d’octroi des prêts plus strictes et renchérit les taux de crédit.
in scheme: Finance
in scheme: concepts
notation: ECON1350
related: pénurie de crédit

cloison étanche
type: ConceptConcept
type: Concept
creator: Commission d'enrichissement de la langue française, FranceTerme
date parution JO: 2014-06-05
deconseille ou frequent: muraille de Chine
equivalent EN: Chinese wall @en
equivalent EN: Chinese wall (en)
definition: Séparation rigoureuse des différentes fonctions exercées dans un établissement financier, telles que la gestion de portefeuilles, l’analyse financière, le conseil et la gestion pour compte propre.
in scheme: Finance
in scheme: concepts
notation: ECON1351
note: On trouve aussi le terme « muraille de Chine ».

appariement des ordres
type: ConceptConcept
type: Concept
creator: Commission d'enrichissement de la langue française, FranceTerme
date parution JO: 2014-06-05
definition: Rapprochement, par un établissement habilité, des ordres d’achat et de vente d’un même titre reçus de ses clients, en vue de leur exécution au sein même de cet établissement.
in scheme: Finance
in scheme: concepts
notation: ECON1352

banque sans fil
type: ConceptConcept
type: Concept
creator: Commission d'enrichissement de la langue française, FranceTerme
date parution JO: 2015-07-22
deconseille ou frequent: banque mobile
deconseille ou frequent: mbanking
equivalent EN: m-banking @en
equivalent EN: m-banking (en)
equivalent EN: mobile-banking @en
equivalent EN: mobile-banking (en)
definition: Service proposé par une banque, permettant à ses clients d’effectuer des opérations à partir d’un moyen de communication portable.
in scheme: Finance
in scheme: concepts
notation: ECON1353
note: L’expression « banque mobile » est à proscrire.

modèle d'octroi puis de cession de crédits
type: ConceptConcept
type: Concept
creator: Commission d'enrichissement de la langue française, FranceTerme
abbreviation: OCC
date parution JO: 2015-07-22
equivalent EN: OTD model @en
equivalent EN: OTD model (en)
equivalent EN: originate-and-distribute model @en
equivalent EN: originate-and-distribute model (en)
equivalent EN: originate-to-distribute model @en
equivalent EN: originate-to-distribute model (en)
forme abregee: octroi puis cession de crédits
definition: Modèle économique consistant à transférer au marché les risques associés aux crédits octroyés par un établissement financier.
in scheme: Finance
in scheme: concepts
notation: ECON1354
related: titrisation

contrat sur différence
type: ConceptConcept
type: Concept
creator: Commission d'enrichissement de la langue française, FranceTerme
abbreviation: CFD @en
date parution JO: 2015-07-22
equivalent EN: CFD @en
equivalent EN: CFD (en)
equivalent EN: contract for difference @en
equivalent EN: contract for difference (en)
definition: Contrat de gré à gré prévoyant l’encaissement ou le décaissement de la différence entre la valeur d’un actif sous-jacent au moment de sa vente et sa valeur au moment de l’établissement du contrat.
in scheme: Finance
in scheme: concepts
notation: ECON1355
related: actif sous-jacent
related: dérivé de crédit

partage de bureau
type: ConceptConcept
type: Concept
creator: Commission d'enrichissement de la langue française, FranceTerme
date parution JO: 2015-07-22
deconseille ou frequent: flex desk
deconseille ou frequent: flex-office
deconseille ou frequent: hot desk
equivalent EN: hot desking @en
equivalent EN: hot desking (en)
definition: Pratique permettant à plusieurs employés d’occuper à tour de rôle tout ou partie d’un même bureau, où chacun dispose d’un accès à son espace numérique de travail.
in scheme: Économie et gestion d'entreprise
in scheme: concepts
notation: ECON1356
related: cotravail

seuil de rachat
type: ConceptConcept
type: Concept
creator: Commission d'enrichissement de la langue française, FranceTerme
date parution JO: 2015-07-22
equivalent EN: gate @en
equivalent EN: gate (en)
definition: Niveau à partir duquel le gérant d’un organisme de placement collectif en valeurs mobilières peut échelonner le rachat de titres au lieu d’y procéder immédiatement.
in scheme: Finance
in scheme: concepts
notation: ECON1357
note: Le seuil de rachat est généralement exprimé en pourcentage de l’actif.

acteur planétaire
type: ConceptConcept
type: Concept
creator: Commission d'enrichissement de la langue française, FranceTerme
date parution JO: 2015-07-22
deconseille ou frequent: acteur global
equivalent EN: global player @en
equivalent EN: global player (en)
definition: Personne, entreprise ou organisation qui joue un rôle actif à l’échelle mondiale.
in scheme: Économie et gestion d'entreprise
in scheme: Relations internationales
in scheme: concepts
notation: ECON1358
note: On trouve aussi l’expression « acteur global », qui est déconseillée.

centre d'affaires international
type: ConceptConcept
type: Concept
creator: Commission d'enrichissement de la langue française, FranceTerme
source: révision de l'arrêté du 30 septembre 1991
abbreviation: WTC @en
date parution JO: 2000-09-22
deconseille ou frequent: world trade center
deconseille ou frequent: world trade centre
equivalent EN: WTC (GB) @en
equivalent EN: WTC (US) @en
equivalent EN: WTC (en-GB)
equivalent EN: WTC (en-US)
equivalent EN: world trade center (US) @en
equivalent EN: world trade center (en-US)
equivalent EN: world trade centre (GB) @en
equivalent EN: world trade centre (en-GB)
definition: Lieu qui regroupe des prestations de services destinées à faciliter les échanges internationaux.
in scheme: Économie et gestion d'entreprise
in scheme: concepts
notation: ECON136

mercatique par réseaux sociaux
type: ConceptConcept
type: Concept
creator: Commission d'enrichissement de la langue française, FranceTerme
date parution JO: 2015-07-22
deconseille ou frequent: marketing social
deconseille ou frequent: social marketing
equivalent EN: social media marketing @en
equivalent EN: social media marketing (en)
forme abregee: mercatique par réseaux
definition: Technique mercatique qui vise des groupes de consommateurs rassemblés dans des réseaux sociaux, en se fondant notamment sur l’action d’animateurs de communauté.
in scheme: Économie et gestion d'entreprise
in scheme: concepts
notation: ECON1362
note: L’expression « marketing social » est à proscrire.
related: animateur, -trice de communauté
related: responsable de la promotion en ligne
related: responsable des réseaux sociaux

mercatique automatisée
type: ConceptConcept
type: Concept
creator: Commission d'enrichissement de la langue française, FranceTerme
date parution JO: 2015-07-22
deconseille ou frequent: marketing automatisé
equivalent EN: trigger marketing @en
equivalent EN: trigger marketing (en)
definition: Technique mercatique consistant en l’envoi automatisé d’offres commerciales déclenché par le comportement ou l’action d’un client ou d’un consommateur potentiel.
in scheme: Économie et gestion d'entreprise
in scheme: concepts
notation: ECON1363
note: L’évènement déclencheur de la mercatique automatisée peut être un appel téléphonique, un achat ou une visite sur la toile.

parrainage
type: ConceptConcept
type: Concept
creator: Commission d'enrichissement de la langue française, FranceTerme
abbreviation: MGM @en
date parution JO: 2015-07-22
equivalent EN: MGM @en
equivalent EN: MGM (en)
equivalent EN: member-get-member @en
equivalent EN: member-get-member (en)
part of speech: nom masculin
definition: Fait, pour le client d’une entreprise, d’indiquer à celle-ci le nom d’une personne susceptible de répondre favorablement à une offre commerciale ; par extension, stratégie d’entreprise qui recourt à de telles pratiques.
in scheme: Économie et gestion d'entreprise
in scheme: concepts
notation: ECON1364
note: Souvent, l’auteur du parrainage ou le nouveau client reçoit un avantage.

délocalisation dans le pays
type: ConceptConcept
type: Concept
creator: Commission d'enrichissement de la langue française, FranceTerme
date parution JO: 2015-07-22
deconseille ou frequent: on-shoring
equivalent EN: onshoring @en
equivalent EN: onshoring (en)
alternative label: délocalisation régionale
definition: Transfert d’une unité de production ou d’un centre de services dans une autre région du pays.
in scheme: Économie et gestion d'entreprise
in scheme: concepts
notation: ECON1367
note: La délocalisation dans le pays peut être décidée en fonction de considérations de coût ou de qualité de la main-d’œuvre, ou encore en raison de la présence d’un pôle de compétences.
related: délocalisation dans un pays proche

délocalisation dans un pays proche
type: ConceptConcept
type: Concept
creator: Commission d'enrichissement de la langue française, FranceTerme
abbreviation: near-shoring @en
date parution JO: 2015-07-22
equivalent EN: near-shoring @en
equivalent EN: near-shoring (en)
equivalent EN: nearshoring @en
equivalent EN: nearshoring (en)
in scheme: Économie et gestion d'entreprise
in scheme: concepts
notation: ECON1369
related: délocalisation dans le pays

centre de magasins d'usine
type: ConceptConcept
type: Concept
creator: Commission d'enrichissement de la langue française, FranceTerme
source: révision de l'arrêté du 30 septembre 1991
abbreviation: CMU
date parution JO: 2000-09-22
deconseille ou frequent: factory outlet center
deconseille ou frequent: factory outlet centre
equivalent EN: factory outlet center (US) @en
equivalent EN: factory outlet center (en-US)
equivalent EN: factory outlet centre (GB) @en
equivalent EN: factory outlet centre (en-GB)
definition: Lieu où sont regroupés plusieurs magasins d'usine.
in scheme: Économie et gestion d'entreprise
in scheme: concepts
notation: ECON137
related: magasin d'usine

localisation optimale
type: ConceptConcept
type: Concept
creator: Commission d'enrichissement de la langue française, FranceTerme
date parution JO: 2015-07-22
equivalent EN: best shore @en
equivalent EN: best shore (en)
in scheme: Économie et gestion d'entreprise
in scheme: concepts
notation: ECON1371

réduction de l'effet de levier
type: ConceptConcept
type: Concept
creator: Commission d'enrichissement de la langue française, FranceTerme
date parution JO: 2016-08-05
equivalent EN: deleverage @en
equivalent EN: deleverage (en)
equivalent EN: deleveraging @en
equivalent EN: deleveraging (en)
definition: Action par laquelle une entreprise, financière ou non, réduit le rapport entre son endettement et ses fonds propres.
in scheme: Finance
in scheme: concepts
notation: ECON1374
note: En pratique, une entreprise procède à une réduction de l’effet de levier afin de diminuer son risque d’insolvabilité.

option d'achat
type: ConceptConcept
type: Concept
creator: Commission d'enrichissement de la langue française, FranceTerme
date parution JO: 2016-08-05
equivalent EN: call option @en
equivalent EN: call option (en)
equivalent EN: call warrant @en
equivalent EN: call warrant (en)
definition: Actif financier négociable donnant le droit d’acquérir, à une échéance et un prix fixés dès l’origine, une certaine quantité d’actifs sous-jacents.
in scheme: Finance
in scheme: concepts
notation: ECON1376
note: Le prix de l’option d’achat, payé par l’acheteur au vendeur, dépend principalement de la volatilité de l’actif sous-jacent, qui peut être une action, une obligation, une matière première ou encore une devise.
related: actif sous-jacent
related: option de vente
scope note: Cette publication annule et remplace celle du Journal officiel du 19 novembre 2008.

option de vente
type: ConceptConcept
type: Concept
creator: Commission d'enrichissement de la langue française, FranceTerme
date parution JO: 2016-08-05
equivalent EN: put option @en
equivalent EN: put option (en)
equivalent EN: put warrant @en
equivalent EN: put warrant (en)
definition: Actif financier négociable donnant le droit à son acheteur de vendre, à une échéance et à un prix fixés dès l’origine, une certaine quantité d’actifs sous-jacents.
in scheme: Finance
in scheme: concepts
notation: ECON1377
note: Le prix de l’option de vente, payé par l’acheteur au vendeur, dépend principalement de la volatilité de l’actif sous-jacent, qui peut être une action, une obligation, une matière première ou encore une devise.
related: actif sous-jacent
related: option d'achat
scope note: Cette publication annule et remplace celle du Journal officiel du 19 novembre 2008.

cession-bail
type: ConceptConcept
type: Concept
creator: Commission d'enrichissement de la langue française, FranceTerme
source: révision de l'arrêté du 11 janvier 1990
date parution JO: 2000-09-22
equivalent EN: lease back @en
equivalent EN: lease back (en)
part of speech: nom féminin
definition: Technique de financement par laquelle un établissement de crédit spécialisé achète à un utilisateur un bien et le lui remet aussitôt à disposition en vertu d'un contrat de crédit-bail à l'issue duquel l'utilisateur locataire peut, en levant l'option d'achat stipulée à son profit, redevenir propriétaire du bien.
in scheme: Finance
in scheme: concepts
notation: ECON138
note: 1. Dans certains domaines particuliers, notamment celui des transports, les contrats de cession-bail peuvent ne pas comporter d'option d'achat.
note: 2. Pluriel : cessions-bail.
related: crédit-bail
related: location avec option d'achat

notation
type: ConceptConcept
type: Concept
creator: Commission d'enrichissement de la langue française, FranceTerme
date parution JO: 2016-08-05
equivalent EN: credit rating @en
equivalent EN: credit rating (en)
equivalent EN: rating @en
equivalent EN: rating (en)
part of speech: nom féminin
definition: Évaluation, par une institution spécialisée, de la qualité de crédit d’une entreprise ou d’un État donnant une information codifiée sur la capacité de remboursement des titres de dette émis.
in scheme: Finance
in scheme: concepts
notation: ECON1380
note: Le résultat d’une notation n’est pas nécessairement rendu public.
related: catégorie investissement
related: catégorie spéculative
related: cotation de crédit
scope note: Cette publication annule et remplace celle du Journal officiel du 22 septembre 2000.

cotation de crédit
type: ConceptConcept
type: Concept
creator: Commission d'enrichissement de la langue française, FranceTerme
date parution JO: 2018-12-07
deconseille ou frequent: méthode des scores
deconseille ou frequent: scorage
deconseille ou frequent: écorage
deconseille ou frequent: évaluation par score
equivalent EN: scoring @en
equivalent EN: scoring (en)
definition: Évaluation, au moyen d’une méthode statistique reposant sur l’utilisation de données personnelles ou comptables et d’informations économiques, de la capacité d’un emprunteur à honorer ses engagements.
in scheme: Économie et gestion d'entreprise
in scheme: Finance
in scheme: concepts
notation: ECON1381
related: notation
scope note: Cette publication annule et remplace celle du terme « écorage » au Journal officiel du 22 septembre 2000.

contrat d'échange sur actions
type: ConceptConcept
type: Concept
creator: Commission d'enrichissement de la langue française, FranceTerme
date parution JO: 2017-09-21
equivalent EN: equity swap @en
equivalent EN: equity swap (en)
definition: Contrat d’échange par lequel les parties s’engagent à échanger un taux d’intérêt contre le rendement d’une action.
in scheme: Finance
in scheme: concepts
notation: ECON1382
note: 1. Le contrat d’échange sur actions permet à un investisseur d’obtenir le rendement d’un panier d’actions sans détenir ces actions elles-mêmes.
note: 2. Dans certains cas, les parties échangent les rendements de deux actions différentes.
related: contrat d'échange
related: échange de taux d'intérêt

branche d'un contrat d'échange
type: ConceptConcept
type: Concept
creator: Commission d'enrichissement de la langue française, FranceTerme
date parution JO: 2017-09-21
equivalent EN: swap leg @en
equivalent EN: swap leg (en)
forme abregee: branche, n.f.
forme abregee: jambe, n.f.
alternative label: jambe d'un contrat d'échange
definition: Chacune des deux séries de flux, l’une versée, l’autre reçue, dans un contrat d’échange.
in scheme: Finance
in scheme: concepts
notation: ECON1383
note: Les flux composant chaque branche peuvent correspondre au rendement d’une action, au prix d’une matière première, ou encore à un taux d’intérêt.
related: contrat d'échange

amélioration continue participative
type: ConceptConcept
type: Concept
creator: Commission d'enrichissement de la langue française, FranceTerme
date parution JO: 2016-08-05
deconseille ou frequent: Gemba Kaizen
forme abregee: amélioration continue
definition: Méthode de gestion qui recherche l’amélioration progressive et à un coût réduit, voire nul, de l’efficacité d’une organisation ou d’un processus en associant étroitement le personnel et les autres parties prenantes à cette démarche.
in scheme: Économie et gestion d'entreprise
in scheme: concepts
notation: ECON1385
note: « Kaizen », ou « Gemba Kaizen » (Jap.), qui est un nom de marque, ne doivent pas être employés en ce sens.
related: innovation continue
related: partie prenante

carte (à la)
type: ConceptConcept
type: Concept
creator: Commission d'enrichissement de la langue française, FranceTerme
date parution JO: 2016-08-05
deconseille ou frequent: pick & mix
deconseille ou frequent: à la carte
equivalent EN: pick and mix @en
equivalent EN: pick and mix (en)
part of speech: locution adjectivale
definition: Se dit d’une offre commerciale qui permet au consommateur de composer un assortiment de produits ou de services au sein d’une gamme prédéterminée.
in scheme: Économie et gestion d'entreprise
in scheme: concepts
notation: ECON1386

baisse en gamme
type: ConceptConcept
type: Concept
creator: Commission d'enrichissement de la langue française, FranceTerme
date parution JO: 2016-08-05
equivalent EN: trading down @en
equivalent EN: trading down (en)
definition: Stratégie d’entreprise consistant à réorienter l’offre commerciale vers le bas de gamme.
in scheme: Économie et gestion d'entreprise
in scheme: concepts
notation: ECON1387
related: montée en gamme

montée en gamme
type: ConceptConcept
type: Concept
creator: Commission d'enrichissement de la langue française, FranceTerme
date parution JO: 2016-08-05
equivalent EN: trading up @en
equivalent EN: trading up (en)
definition: Stratégie d’entreprise consistant à réorienter l'offre commerciale vers le haut de gamme.
in scheme: Économie et gestion d'entreprise
in scheme: concepts
notation: ECON1388
related: baisse en gamme
related: haut de gamme

boutique éphémère
type: ConceptConcept
type: Concept
creator: Commission d'enrichissement de la langue française, FranceTerme
date parution JO: 2016-08-05
equivalent EN: guerilla store @en
equivalent EN: guerilla store (en)
equivalent EN: pop-up retail @en
equivalent EN: pop-up retail (en)
equivalent EN: pop-up store @en
equivalent EN: pop-up store (en)
definition: Magasin conçu pour une durée de vie de quelques jours, semaines ou mois, en vue de faire connaître une marque ou un produit.
in scheme: Économie et gestion d'entreprise
in scheme: concepts
notation: ECON1389

chalandage de firmes d'audit
type: ConceptConcept
type: Concept
creator: Commission d'enrichissement de la langue française, FranceTerme
source: révision de l'arrêté du 30 septembre 1991
date parution JO: 2000-09-22
equivalent EN: opinion shopping @en
equivalent EN: opinion shopping (en)
definition: Recherche systématique de la firme d'audit susceptible d'être d'accord avec les options comptables souhaitées par la direction d'une société ; par extension, mise en concurrence des firmes sur des critères de ce type.
in scheme: Finance
in scheme: concepts
notation: ECON139

communication d'attente
type: ConceptConcept
type: Concept
creator: Commission d'enrichissement de la langue française, FranceTerme
date parution JO: 2016-08-05
equivalent EN: wait marketing @en
equivalent EN: wait marketing (en)
equivalent EN: waitertainment (US) @en
equivalent EN: waitertainment (en-US)
definition: Conception et diffusion de messages, le plus souvent publicitaires, destinés à un public en situation d’attente.
in scheme: Communication
in scheme: Économie et gestion d'entreprise
in scheme: concept-SD-communication-publicite
in scheme: concept-SD-economie-et-gestion-d-entreprise-publicite
in scheme: concepts
notation: ECON1391
note: La communication d’attente est généralement mise en œuvre dans des lieux publics tels que les salles d’attente médicales, les aéroports, les grandes surfaces, ou encore au téléphone.

communication masquée
type: ConceptConcept
type: Concept
creator: Commission d'enrichissement de la langue française, FranceTerme
deconseille ou frequent: marketing furtif
equivalent EN: murketing @en
equivalent EN: murketing (en)
equivalent EN: stealth marketing @en
equivalent EN: stealth marketing (en)
equivalent EN: undercover marketing (US) @en
equivalent EN: undercover marketing (en-US)
definition: Action de communication qui consiste à diffuser un message favorable à une marque sans mention explicite de celle-ci.
in scheme: Communication
in scheme: Économie et gestion d'entreprise
in scheme: concepts
notation: ECON1392
note: 1. L’utilisation d’une image ou d’une musique déjà associées à des publicités connues de la marque sont des exemples de communication masquée.
note: 2. L’expression « marketing furtif » est à proscrire.

savoir-être professionnel
type: ConceptConcept
type: Concept
creator: Commission d'enrichissement de la langue française, FranceTerme
date parution JO: 2016-08-05
deconseille ou frequent: compétences comportementales
deconseille ou frequent: soft skills
equivalent EN: soft skill @en
equivalent EN: soft skill (en)
alternative label: compétence comportementale
definition: Capacité d'un individu à adopter un comportement adapté à son milieu professionnel.
in scheme: Emploi et travail
in scheme: concepts
notation: ECON1393
note: La capacité de management, l’aptitude à la négociation, l’aptitude à l’animation d’équipe, la faculté d’adaptation ou la capacité d’écoute sont des exemples de savoir-être professionnel.
related: savoir-faire professionnel
related: badge numérique

savoir-faire professionnel
type: ConceptConcept
type: Concept
creator: Commission d'enrichissement de la langue française, FranceTerme
date parution JO: 2016-08-05
deconseille ou frequent: compétences techniques
deconseille ou frequent: hard skills
equivalent EN: hard skill @en
equivalent EN: hard skill (en)
alternative label: compétence technique
definition: Compétence acquise dans un ou plusieurs domaines de spécialité, précisément évaluable et transmissible, mise en œuvre dans un milieu professionnel.
in scheme: Emploi et travail
in scheme: concepts
notation: ECON1394
note: La maîtrise d’un logiciel ou la capacité d’utiliser une machine sont des exemples de savoir-faire professionnel.
related: savoir-être professionnel
related: badge numérique

données objectives
type: ConceptConcept
type: Concept
creator: Commission d'enrichissement de la langue française, FranceTerme
date parution JO: 2016-08-05
equivalent EN: hard data @en
equivalent EN: hard data (en)
definition: Données portant sur des faits établis, souvent quantifiés.
in scheme: Économie et gestion d'entreprise
in scheme: Statistique
in scheme: concepts
notation: ECON1396
note: Un exemple de données objectives est le pourcentage des logements français qui sont équipés d’une baignoire.
related: données subjectives

données subjectives
type: ConceptConcept
type: Concept
creator: Commission d'enrichissement de la langue française, FranceTerme
date parution JO: 2016-08-05
deconseille ou frequent: données qualitatives
equivalent EN: soft data @en
equivalent EN: soft data (en)
definition: Données portant sur des éléments qualitatifs tels que des opinions, des conjectures ou des interprétations.
in scheme: Économie et gestion d'entreprise
in scheme: Statistique
in scheme: concepts
notation: ECON1397
note: Un exemple de données subjectives est le pourcentage de Français qui pensent que leur logement est trop petit.
related: données objectives

jeu d'entreprise
type: ConceptConcept
type: Concept
creator: Commission d'enrichissement de la langue française, FranceTerme
date parution JO: 2016-08-05
equivalent EN: business game @en
equivalent EN: business game (en)
forme abregee: simulation de gestion
alternative label: simulation de gestion d’entreprise
definition: Jeu sérieux appliqué à la vie de l’entreprise et mettant en compétition des équipes d’élèves, d’étudiants ou de cadres ayant à prendre une succession de décisions.
in scheme: Économie et gestion d'entreprise
in scheme: concepts
notation: ECON1398
note: Le jeu d’entreprise est particulièrement utilisé comme outil de formation, et parfois d’orientation et de sélection professionnelle.
related: jeu sérieux

marché des transferts
type: ConceptConcept
type: Concept
creator: Commission d'enrichissement de la langue française, FranceTerme
abbreviation: MDT
date parution JO: 2016-08-05
equivalent EN: mercato @it
equivalent EN: mercato (it)
definition: Ensemble des transactions saisonnières qui, dans plusieurs secteurs économiques, permettent le passage de professionnels de haut niveau d’une entreprise à une autre.
in scheme: Économie et gestion d'entreprise
in scheme: Sports
in scheme: concepts
notation: ECON1399
note: On rencontre principalement le terme « marché des transferts » dans le domaine des sports, à l’occasion du passage de joueurs d’un club professionnel à un autre, et, par extension, dans d’autres domaines tels que l’audiovisuel et la mode.
scope note: Cette publication annule et remplace celle du Journal officiel du 25 mai 2008.

fonds spéculatif
type: ConceptConcept
type: Concept
creator: Commission d'enrichissement de la langue française, FranceTerme
date parution JO: 1998-08-14
equivalent EN: hedge fund @en
equivalent EN: hedge fund (en)
definition: Fonds d'investissement à haut risque portant principalement sur des produits à effet de levier particulièrement élevé, c'est-à-dire permettant, pour des mises limitées, d'opérer sur des montants beaucoup plus importants, mais avec des risques considérables.
in scheme: Finance
in scheme: concepts
notation: ECON14
related: établissement à fort effet de levier
related: gestion atypique
related: courtier principal

chalandage fiscal
type: ConceptConcept
type: Concept
creator: Commission d'enrichissement de la langue française, FranceTerme
source: révision de l'arrêté du 30 septembre 1991
date parution JO: 2000-09-22
equivalent EN: treaty shopping @en
equivalent EN: treaty shopping (en)
definition: Recherche systématique des conventions fiscales internationales offrant les meilleures possibilités de réduire la charge globale d'impôt.
in scheme: Économie générale
in scheme: concept-SD-economie-generale-fiscalite
in scheme: concepts
notation: ECON140
note: Cette pratique conduit les groupes à adopter des implantations et des structures juridiques en fonction de cet objectif.

marque de distributeur
type: ConceptConcept
type: Concept
creator: Commission d'enrichissement de la langue française, FranceTerme
abbreviation: MDD
date parution JO: 2016-08-05
equivalent EN: own brand @en
equivalent EN: own brand (en)
equivalent EN: own label @en
equivalent EN: own label (en)
equivalent EN: private label @en
equivalent EN: private label (en)
definition: Nom de marque qu’un distributeur appose sur le produit d’un fournisseur pour le commercialiser.
in scheme: Économie et gestion d'entreprise
in scheme: concepts
notation: ECON1400
scope note: Cette publication annule et remplace celle du Journal officiel du 12 mai 2000.

procédure accélérée
type: ConceptConcept
type: Concept
creator: Commission d'enrichissement de la langue française, FranceTerme
equivalent EN: fast-track @en
equivalent EN: fast-track (en)
definition: Méthode conçue pour sa rapidité de mise en œuvre et d'aboutissement, par opposition à la procédure ordinaire.
in scheme: Économie et gestion d'entreprise
in scheme: concepts
notation: ECON1401

pouvoir de marché
type: ConceptConcept
type: Concept
creator: Commission d'enrichissement de la langue française, FranceTerme
date parution JO: 2016-08-05
equivalent EN: market power @en
equivalent EN: market power (en)
alternative label: emprise sur le marché
definition: Capacité d’une entreprise ou d’une organisation à influencer le niveau des prix ou la définition des normes dans son domaine d’activité.
in scheme: Économie et gestion d'entreprise
in scheme: concepts
notation: ECON1402

ciblage publicitaire
type: ConceptConcept
type: Concept
creator: Commission d'enrichissement de la langue française, FranceTerme
date parution JO: 2016-08-05
deconseille ou frequent: reciblage publicitaire
equivalent EN: retargeting @en
equivalent EN: retargeting (en)
equivalent EN: search retargeting @en
equivalent EN: search retargeting (en)
definition: Pratique consistant à repérer un internaute qui a visité un site marchand afin de lui adresser des messages publicitaires liés à ses centres d’intérêt présumés.
in scheme: Communication
in scheme: Économie et gestion d'entreprise
in scheme: concept-SD-communication-publicite
in scheme: concept-SD-economie-et-gestion-d-entreprise-publicite
in scheme: concepts
notation: ECON1403
note: On trouve aussi, dans le langage professionnel, l’expression « reciblage publicitaire », qui n'est pas recommandée.
related: responsable de la promotion en ligne

renflouement externe
type: ConceptConcept
type: Concept
creator: Commission d'enrichissement de la langue française, FranceTerme
date parution JO: 2016-08-05
equivalent EN: bail-out @en
equivalent EN: bail-out (en)
definition: Décision des autorités publiques d’accorder à une entreprise ou à un État en difficulté un concours financier externe, provenant de fonds publics, principalement sous la forme d’un prêt ou d’un apport en capital, pour lui permettre de maintenir sa solvabilité à court terme.
in scheme: Finance
in scheme: concepts
notation: ECON1404
related: renflouement interne

renflouement interne
type: ConceptConcept
type: Concept
creator: Commission d'enrichissement de la langue française, FranceTerme
date parution JO: 2016-08-05
equivalent EN: bail-in @en
equivalent EN: bail-in (en)
definition: Décision des autorités publiques qui impose à certaines catégories de créanciers d’un établissement de crédit, selon un ordre préétabli, une diminution du montant des créances qu’ils possèdent sur celui-ci ou une conversion de ces créances en capital.
in scheme: Finance
in scheme: concepts
notation: ECON1405
related: renflouement externe

moins-disant commercial
type: ConceptConcept
type: Concept
creator: Commission d'enrichissement de la langue française, FranceTerme
date parution JO: 2016-08-05
deconseille ou frequent: dumping commercial
equivalent EN: moins-disance commerciale
alternative label: moins-disance commerciale
definition: Pratique consistant, pour un État, à adopter une législation commerciale moins contraignante que celle d’États concurrents afin de favoriser les exportations et de freiner les importations.
in scheme: Économie et gestion d'entreprise
in scheme: concepts
notation: ECON1406
note: On trouve aussi l'expression « dumping commercial ».
related: concept-JURI43

magasin physique
type: ConceptConcept
type: Concept
creator: Commission d'enrichissement de la langue française, FranceTerme
date parution JO: 2016-08-05
deconseille ou frequent: brick & mortar
equivalent EN: brick and mortar shop @en
equivalent EN: brick and mortar shop (en)
alternative label: magasin en dur
definition: Point de vente physique, par opposition à un site de commerce en ligne.
in scheme: Économie et gestion d'entreprise
in scheme: concepts
notation: ECON1407
related: repérage en magasin
related: repérage en ligne
related: retrait en magasin
related: commerce en ligne

repérage en magasin
type: ConceptConcept
type: Concept
creator: Commission d'enrichissement de la langue française, FranceTerme
date parution JO: 2016-08-05
deconseille ou frequent: mortar & click
equivalent EN: mortar and click @en
equivalent EN: mortar and click (en)
equivalent EN: showrooming @en
equivalent EN: showrooming (en)
definition: Pratique consistant, pour un consommateur, à préparer son achat dans un magasin physique avant de l’effectuer sur un site en ligne.
in scheme: Économie et gestion d'entreprise
in scheme: concepts
notation: ECON1408
related: magasin physique
related: repérage en ligne
related: commerce en ligne

repérage en ligne
type: ConceptConcept
type: Concept
creator: Commission d'enrichissement de la langue française, FranceTerme
date parution JO: 2016-08-05
equivalent EN: ROBO @en
equivalent EN: ROBO (en)
equivalent EN: ROPO @en
equivalent EN: ROPO (en)
equivalent EN: pre-shopping @en
equivalent EN: pre-shopping (en)
equivalent EN: research online, buy offline @en
equivalent EN: research online, buy offline (en)
equivalent EN: research online, purchase offline @en
equivalent EN: research online, purchase offline (en)
equivalent EN: web to store @en
equivalent EN: web to store (en)
definition: Pratique consistant, pour un consommateur, à préparer son achat sur un site en ligne avant de l’effectuer dans un magasin physique.
in scheme: Économie et gestion d'entreprise
in scheme: concepts
notation: ECON1409
note: Le terme « pré-shopping » est à proscrire.
related: magasin physique
related: repérage en magasin
scope note: Cette publication annule et remplace celle du terme « préchoix en ligne » au Journal officiel du 17 juin 2012.

chambre de compensation
type: ConceptConcept
type: Concept
creator: Commission d'enrichissement de la langue française, FranceTerme
source: révision de l'arrêté du 18 février 1987
date parution JO: 2000-09-22
equivalent EN: clearing house @en
equivalent EN: clearing house (en)
definition: Organisme chargé d'assurer la compensation des soldes créditeurs entre banques.
in scheme: Finance
in scheme: concepts
notation: ECON141
note: 1. Dans la plupart des pays, y compris la France, seuls y participent directement les principaux établissements, les autres établissements s'y faisant représenter par l'un d'eux.
note: 2. Pour les marchés à terme d'instruments financiers et de marchandises, les organismes de compensation sont chargés d'assurer la correspondance entre les positions débitrices et créditrices des différents intervenants, de compenser les soldes et de s'assurer du versement des appels de dépôts de garantie et de marges.
related: dépôt de garantie
related: marché à terme d'instruments financiers

retrait en magasin
type: ConceptConcept
type: Concept
creator: Commission d'enrichissement de la langue française, FranceTerme
date parution JO: 2016-08-05
deconseille ou frequent: click & collect
deconseille ou frequent: reserve & collect
equivalent EN: buy online, pick in store @en
equivalent EN: buy online, pick in store (en)
equivalent EN: click and collect @en
equivalent EN: click and collect (en)
equivalent EN: reserve and collect @en
equivalent EN: reserve and collect (en)
alternative label: cliqué-retiré
definition: Retrait dans un magasin physique d’une commande effectuée en ligne.
in scheme: Économie et gestion d'entreprise
in scheme: concepts
notation: ECON1410
related: retrait automobile
related: magasin physique
related: livraison de commande en ligne
related: cliqué-payé
related: commerce en ligne

livraison de commande en ligne
type: ConceptConcept
type: Concept
creator: Commission d'enrichissement de la langue française, FranceTerme
date parution JO: 2016-08-05
deconseille ou frequent: click & deliver
equivalent EN: click and deliver @en
equivalent EN: click and deliver (en)
alternative label: cliqué-livré
definition: Livraison à domicile ou dans un point-relais d’un achat effectué en ligne.
in scheme: Économie et gestion d'entreprise
in scheme: concepts
notation: ECON1411
related: retrait en magasin
related: cliqué-payé
related: commerce en ligne

antétransaction
type: ConceptConcept
type: Concept
creator: Commission d'enrichissement de la langue française, FranceTerme
date parution JO: 2017-09-21
equivalent EN: front running @en
equivalent EN: front running (en)
part of speech: nom féminin
definition: Transmission d’un ordre d’achat ou de vente d’un actif par un opérateur qui dispose d’une information privilégiée susceptible d’influencer le prix de marché de cet actif.
in scheme: Finance
in scheme: concepts
notation: ECON1412
note: L’antétransaction est jugée contraire à l’éthique professionnelle et est passible de sanction.

camion de restauration
type: ConceptConcept
type: Concept
creator: Commission d'enrichissement de la langue française, FranceTerme
date parution JO: 2016-08-05
deconseille ou frequent: foodtruck
equivalent EN: Imbisswagen @de
equivalent EN: Imbisswagen (de)
equivalent EN: catering van @en
equivalent EN: catering van (en)
equivalent EN: food truck @en
equivalent EN: food truck (en)
alternative label: camion restaurant
definition: Camion équipé pour confectionner rapidement des mets, le plus souvent élaborés, à emporter ou à consommer sur place.
in scheme: Économie et gestion d'entreprise
in scheme: Restauration
in scheme: concepts
notation: ECON1413

cotravail
type: ConceptConcept
type: Concept
creator: Commission d'enrichissement de la langue française, FranceTerme
date parution JO: 2016-08-05
deconseille ou frequent: co-travail
equivalent EN: co-working @en
equivalent EN: co-working (en)
equivalent EN: coworking @en
equivalent EN: coworking (en)
part of speech: nom masculin
definition: Mode de travail consistant, pour des professionnels indépendants, à partager espace, poste de travail, expérience ou compétences.
in scheme: Économie et gestion d'entreprise
in scheme: concepts
notation: ECON1414
related: partage de bureau
related: espace partagé de travail en ligne

boutique éphémère
type: ConceptConcept
type: Concept
creator: Commission d'enrichissement de la langue française, FranceTerme
date parution JO: 2016-08-05
definition: Magasin conçu pour une durée de vie de quelques jours, semaines ou mois, en vue de ventes ponctuelles ou saisonnières.
in scheme: Économie et gestion d'entreprise
in scheme: concepts
notation: ECON1415

contrat d'échange de taux d'intérêt variables
type: ConceptConcept
type: Concept
creator: Commission d'enrichissement de la langue française, FranceTerme
date parution JO: 2017-09-21
deconseille ou frequent: swap de base
equivalent EN: basis swap @en
equivalent EN: basis swap (en)
forme abregee: échange de taux d'intérêt variables
definition: Contrat d’échange par lequel les parties s’engagent à échanger des taux d’intérêt variables indexés sur deux références différentes.
in scheme: Finance
in scheme: concepts
notation: ECON1417
note: Les références peuvent se distinguer par la durée des taux d’intérêt ou encore par la devise et la nature de l’émetteur (entreprise, banque, Trésor, etc.).
related: contrat d'échange
related: échange de taux d'intérêt

coefficient de capitalisation des résultats
type: ConceptConcept
type: Concept
creator: Commission d'enrichissement de la langue française, FranceTerme
source: révision de l'arrêté du 18 février 1987
abbreviation: CCR
abbreviation: PER @en
date parution JO: 2000-09-22
equivalent EN: PER @en
equivalent EN: PER (en)
equivalent EN: price-earning ratio @en
equivalent EN: price-earning ratio (en)
definition: Coefficient par lequel il convient de multiplier le bénéfice net par action pour retrouver le cours coté.
in scheme: Finance
in scheme: concepts
notation: ECON142

garantie subséquente
type: ConceptConcept
type: Concept
creator: Commission d'enrichissement de la langue française, FranceTerme
date parution JO: 2017-09-21
equivalent EN: tail coverage @en
equivalent EN: tail coverage (en)
definition: Garantie portant sur des sinistres survenus après le terme d’un contrat d’assurance, mais couverts par celui-ci en raison de dispositions légales ou contractuelles particulières.
in scheme: Assurance
in scheme: concepts
notation: ECON1420

clause-relais
type: ConceptConcept
type: Concept
creator: Commission d'enrichissement de la langue française, FranceTerme
date parution JO: 2017-09-21
equivalent EN: drop down @en
equivalent EN: drop down (en)
equivalent EN: drop down clause @en
equivalent EN: drop down clause (en)
part of speech: nom féminin
definition: Modalité incluse dans un contrat, qui prévoit l’application d’un ou de plusieurs autres contrats d’assurance en complément de ce premier contrat dès lors que la couverture de celui-ci a été épuisée.
in scheme: Assurance
in scheme: concepts
notation: ECON1421

gestion des risques d'entreprise
type: ConceptConcept
type: Concept
creator: Commission d'enrichissement de la langue française, FranceTerme
abbreviation: BRM @en
abbreviation: ERM @en
abbreviation: GRE
date parution JO: 2018-03-28
deconseille ou frequent: gestion du risque d’entreprise
equivalent EN: BRM @en
equivalent EN: BRM (en)
equivalent EN: ERM @en
equivalent EN: ERM (en)
equivalent EN: business risk management @en
equivalent EN: business risk management (en)
equivalent EN: enterprise risk management @en
equivalent EN: enterprise risk management (en)
definition: Politique de l’entreprise consistant à identifier les risques qu’elle court et à établir les principes et modalités de leur gestion.
in scheme: Économie et gestion d'entreprise
in scheme: concepts
notation: ECON1422
note: Dans certains pays, la publication des modalités de la gestion des risques d’entreprise est obligatoire.
preferred label: business risk management @en
related: gestion des risques
related: gestion des risques bancaires
scope note: Cette publication annule et remplace celle du terme « gestion du risque d’entreprise » au Journal officiel du 28 juillet 2001.

prêt entre pairs
type: ConceptConcept
type: Concept
creator: Commission d'enrichissement de la langue française, FranceTerme
date parution JO: 2018-12-07
deconseille ou frequent: prêt entre entreprises
deconseille ou frequent: prêt entre particuliers
equivalent EN: P2P lending @en
equivalent EN: P2P lending (en)
equivalent EN: peer-to-peer lending @en
equivalent EN: peer-to-peer lending (en)
definition: Prêt consenti par une ou plusieurs personnes physiques ou morales non agréées à cet effet à une autre personne physique ou morale.
in scheme: Finance
in scheme: concepts
notation: ECON1423
note: Le prêt entre pairs peut être pratiqué entre particuliers, notamment dans le cadre du financement participatif, ou entre entreprises.
related: financement participatif

contrat d'assurance titrisé
type: ConceptConcept
type: Concept
creator: Commission d'enrichissement de la langue française, FranceTerme
abbreviation: CAT
date parution JO: 2017-09-21
deconseille ou frequent: insurance linked security
equivalent EN: ILS @en
equivalent EN: ILS (en)
equivalent EN: insurance linked securities @en
equivalent EN: insurance linked securities (en)
definition: Titre émis par une structure de titrisation et adossé à un portefeuille de contrats d’assurance.
in scheme: Assurance
in scheme: Finance
in scheme: concepts
notation: ECON1424
note: Lorsque le contrat d’assurance titrisé couvre des risques naturels extrêmes, on parle d’« obligation-catastrophe ».
related: obligation-catastrophe
related: technique d'atténuation des risques
related: entité ad hoc
related: actif titrisé
scope note: Cette publication annule et remplace celle du terme « titre-risque » au Journal officiel du 19 novembre 2008.

criblage
type: ConceptConcept
type: Concept
creator: Commission d'enrichissement de la langue française, FranceTerme
date parution JO: 2017-09-21
equivalent EN: screening @en
equivalent EN: screening (en)
part of speech: nom masculin
definition: Analyse d’un secteur d’activité effectuée selon des critères choisis, en vue de sélectionner certaines entreprises.
in scheme: Économie et gestion d'entreprise
in scheme: Économie générale
in scheme: concepts
notation: ECON1425

impatrié, -e
type: ConceptConcept
type: Concept
creator: Commission d'enrichissement de la langue française, FranceTerme
date parution JO: 2017-09-21
deconseille ou frequent: régime des impatriés
equivalent EN: inpatriate @en
equivalent EN: inpatriate (en)
part of speech: nom
definition: Personne venant dans un pays ou dans un territoire donné pour y mettre en œuvre des compétences recherchées par les acteurs économiques locaux.
in scheme: Économie générale
in scheme: concept-SD-economie-generale-fiscalite
in scheme: concepts
notation: ECON1426
note: 1. L’impatrié peut être, par exemple, un salarié détaché dans le cadre d’une mobilité au sein d’un groupe, qui conserve un lien avec l’entreprise dans laquelle il exerçait précédemment son activité.
note: 2. À la différence du travailleur immigré, l’impatrié peut avoir la nationalité du pays dans lequel il vient pour exercer son activité.
note: 3. Les impatriés peuvent bénéficier d’un régime fiscal favorable ; on parle alors de « régime des impatriés ».

indicateur présomptif d'imposition
type: ConceptConcept
type: Concept
creator: Commission d'enrichissement de la langue française, FranceTerme
date parution JO: 2017-09-21
equivalent EN: tax proxy @en
equivalent EN: tax proxy (en)
definition: Information factuelle permettant d’apprécier, dans une première approche, si une personne, un bien ou un service est susceptible d’être assujetti à un impôt lié à un territoire donné.
in scheme: Économie générale
in scheme: concept-SD-economie-generale-fiscalite
in scheme: concepts
notation: ECON1428

coentreprise
type: ConceptConcept
type: Concept
creator: Commission d'enrichissement de la langue française, FranceTerme
source: révision de l'arrêté du 11 janvier 1990
date parution JO: 2000-09-22
equivalent EN: joint venture @en
equivalent EN: joint venture (en)
part of speech: nom féminin
definition: Economic project developed by an association of companies formed according to various arrangements and generally making it possible to benefit from the synergies of the associated companies. @en
definition: Projet économique élaboré par une association d'entreprises constituée selon des modalités diverses et permettant en général de bénéficier des synergies des entreprises associées.
in scheme: Économie et gestion d'entreprise
in scheme: concepts
notation: ECON143

magasin connecté
type: ConceptConcept
type: Concept
creator: Commission d'enrichissement de la langue française, FranceTerme
date parution JO: 2018-03-28
deconseille ou frequent: magasin digital
deconseille ou frequent: magasin phygital
equivalent EN: digital store @en
equivalent EN: digital store (en)
definition: Magasin physique utilisant des outils et des services numériques et recourant au profilage des clients pour améliorer et personnaliser les services proposés.
in scheme: Économie et gestion d'entreprise
in scheme: concepts
notation: ECON1431
note: Le terme « magasin phygital » est à proscrire.
preferred label: digital store @en
related: profilage du client

consommacteur, -trice
type: ConceptConcept
type: Concept
creator: Commission d'enrichissement de la langue française, FranceTerme
deconseille ou frequent: consommateur-producteur
deconseille ou frequent: producteur-consommateur
deconseille ou frequent: productrice-consommatrice
equivalent EN: prosumer @en
equivalent EN: prosumer (en)
part of speech: nom
alternative label: consommateur, -trice-producteur, -trice
definition: Consommateur qui participe à la production de ce qu’il va consommer, par souci d’économie, d’autonomie, de qualité ou de responsabilité sociétale.
in scheme: Économie et gestion d'entreprise
in scheme: concepts
notation: ECON1433
note: De nombreux exemples illustrent cette tendance de fond de l’économie : autoproduction (énergie, imprimante 3D), laboratoire de fabrication, autoconstruction, autoréparation, automédication.

cogriffage valorisant
type: ConceptConcept
type: Concept
creator: Commission d'enrichissement de la langue française, FranceTerme
date parution JO: 2018-03-28
deconseille ou frequent: populuxe
equivalent EN: mass-luxury @en
equivalent EN: mass-luxury (en)
equivalent EN: mass-tige @en
equivalent EN: mass-tige (en)
equivalent EN: masstige @en
equivalent EN: masstige (en)
definition: Stratégie de cogriffage qui permet à une enseigne de grande distribution de rehausser son image en s’associant à une marque de prestige.
in scheme: Économie et gestion d'entreprise
in scheme: concepts
notation: ECON1434
note: L’association entre un réseau de grande distribution et un grand couturier est un exemple de cogriffage valorisant.
preferred label: mass-luxury @en
related: cogriffage

obligation convertible conditionnée
type: ConceptConcept
type: Concept
creator: Commission d'enrichissement de la langue française, FranceTerme
abbreviation: OCC
date parution JO: 2017-09-21
deconseille ou frequent: obligation coco
equivalent EN: coco bond @en
equivalent EN: coco bond (en)
equivalent EN: contingent convertible bond @en
equivalent EN: contingent convertible bond (en)
definition: Obligation qui peut être convertie en actions, ou pour laquelle le paiement des coupons ou le remboursement du capital peut être suspendu voire annulé si certains critères de solvabilité de l’émetteur ne sont plus respectés.
in scheme: Finance
in scheme: concepts
notation: ECON1438
note: 1. La conversion ou la suspension peut intervenir soit de manière automatique soit de manière discrétionnaire à la demande de l’emprunteur.
note: 2. Les obligations convertibles conditionnées étant des titres plus risqués que les obligations classiques, elles bénéficient d’un taux d’intérêt plus élevé.

comité de restructuration
type: ConceptConcept
type: Concept
creator: Commission d'enrichissement de la langue française, FranceTerme
source: révision de l'arrêté du 18 février 1987
date parution JO: 2000-09-22
equivalent EN: advisory committee @en
equivalent EN: advisory committee (en)
equivalent EN: steering committee @en
equivalent EN: steering committee (en)
definition: Dans le cadre particulier de la restructuration de la dette de certains pays, comité réunissant les banques chefs de file des crédits à ces pays pour organiser, administrer le financement additionnel et négocier la procédure de rééchelonnement de la dette.
in scheme: Finance
in scheme: concepts
notation: ECON144

cadrage prospectif
type: ConceptConcept
type: Concept
creator: Commission d'enrichissement de la langue française, FranceTerme
date parution JO: 2017-09-21
equivalent EN: forward guidance @en
equivalent EN: forward guidance (en)
definition: Stratégie de communication d’une banque centrale consistant à fournir aux agents économiques des indications sur les orientations futures de la politique monétaire afin de réduire la volatilité de leurs anticipations.
in scheme: Finance
in scheme: concepts
notation: ECON1440
note: Le cadrage prospectif précise notamment la trajectoire à moyen terme des taux d’intérêt directeurs, la réduction de l’incertitude sur ces variables étant considérée comme un facteur favorable à la consommation et à l’investissement.

cours de change à terme
type: ConceptConcept
type: Concept
creator: Commission d'enrichissement de la langue française, FranceTerme
date parution JO: 2017-09-21
equivalent EN: forward exchange rate @en
equivalent EN: forward exchange rate (en)
equivalent EN: forward rate @en
equivalent EN: forward rate (en)
definition: Cours auquel deux parties s’engagent à échanger, à une date future, deux monnaies entre elles.
in scheme: Finance
in scheme: concepts
notation: ECON1442
note: La fixation d’un cours de change à terme permet aux agents économiques de se protéger contre l’évolution défavorable du cours d’une monnaie étrangère, par exemple une hausse s’ils sont importateurs ou une baisse s’ils sont exportateurs.
related: taux d'intérêt à terme
related: échange à terme

opération de refinancement à long terme ciblée
type: ConceptConcept
type: Concept
creator: Commission d'enrichissement de la langue française, FranceTerme
abbreviation: ORLTC
date parution JO: 2018-12-07
equivalent EN: TLTRO @en
equivalent EN: TLTRO (en)
equivalent EN: targeted long-term refinancing operation @en
equivalent EN: targeted long-term refinancing operation (en)
equivalent EN: targeted longer-term refinancing operation @en
equivalent EN: targeted longer-term refinancing operation (en) [Banque centrale européenne]
definition: Opération de refinancement à long terme proposée à des banques à la condition que celles-ci utilisent une partie des liquidités obtenues pour octroyer des prêts à des agents non financiers tels que des ménages ou des entreprises.
in scheme: Finance
in scheme: concepts
notation: ECON1444
related: opération de refinancement à long terme
related: politique d'expansion monétaire

contrat d'échange
type: ConceptConcept
type: Concept
creator: Commission d'enrichissement de la langue française, FranceTerme
date parution JO: 2017-09-21
equivalent EN: swap @en
equivalent EN: swap (en)
definition: Contrat financier par lequel deux parties s’engagent, pour une période déterminée, à échanger régulièrement deux flux, tels que le rendement d’une action contre un taux d’intérêt, ou tels qu’un taux d’intérêt dans une devise donnée contre un taux d’intérêt dans une autre devise.
in scheme: Finance
in scheme: concepts
notation: ECON1448
related: contrat d'échange sur actions
related: branche d'un contrat d'échange
related: contrat d'échange de taux d'intérêt variables
related: échange financier

finance parallèle
type: ConceptConcept
type: Concept
creator: Commission d'enrichissement de la langue française, FranceTerme
date parution JO: 2017-09-21
deconseille ou frequent: banque de l'ombre
deconseille ou frequent: banque parallèle
deconseille ou frequent: finance de l'ombre
deconseille ou frequent: shadow bank
equivalent EN: shadow banking @en
equivalent EN: shadow banking (en)
definition: Ensemble des activités habituellement exercées par un établissement de crédit ou une société de financement, qui sont assurées par un établissement non soumis à la règlementation bancaire.
in scheme: Finance
in scheme: concepts
notation: ECON1449
note: La finance parallèle couvre principalement la titrisation, le financement participatif et les opérations de prêt-emprunt de titres.
related: financement participatif
related: titrisation

commission de garantie
type: ConceptConcept
type: Concept
creator: Commission d'enrichissement de la langue française, FranceTerme
source: révision de l'arrêté du 18 février 1987
date parution JO: 2000-09-22
equivalent EN: underwriting fee @en
equivalent EN: underwriting fee (en)
definition: Commission payée par un emprunteur à un syndicat d'établissements de crédit ou d'institutions financières en rémunération de la garantie de bonne fin de l'opération.
in scheme: Finance
in scheme: concepts
notation: ECON145

financement participatif par prêt
type: ConceptConcept
type: Concept
creator: Commission d'enrichissement de la langue française, FranceTerme
date parution JO: 2017-09-21
deconseille ou frequent: lending crowdfunding
equivalent EN: crowdlending @en
equivalent EN: crowdlending (en)
definition: Financement participatif d’un projet par lequel plusieurs particuliers octroient un prêt à un particulier ou à une entreprise.
in scheme: Finance
in scheme: concepts
notation: ECON1450
note: On trouve aussi l’expression « prêt participatif », qui est déconseillée dans ce sens.
related: financement participatif
related: prêt participatif

opération de refinancement à long terme
type: ConceptConcept
type: Concept
creator: Commission d'enrichissement de la langue française, FranceTerme
abbreviation: ORLT
date parution JO: 2018-12-07
equivalent EN: LTRO @en
equivalent EN: LTRO (en)
equivalent EN: long-term refinancing operation @en
equivalent EN: long-term refinancing operation (en)
equivalent EN: longer-term refinancing operation @en
equivalent EN: longer-term refinancing operation (en) [Banque centrale européenne]
definition: Opération d’octroi de liquidités aux banques par une banque centrale, dont le remboursement est fixé à une échéance plus éloignée que celle des opérations conventionnelles.
in scheme: Finance
in scheme: concepts
notation: ECON1452
note: La durée usuelle des prêts accordés lors d’une opération de refinancement à long terme est de trois mois à quelques années.
related: opération de refinancement à long terme ciblée
related: politique d'expansion monétaire

taux d'intérêt à terme
type: ConceptConcept
type: Concept
creator: Commission d'enrichissement de la langue française, FranceTerme
date parution JO: 2017-09-21
deconseille ou frequent: forward
deconseille ou frequent: taux forward
equivalent EN: forward rate @en
equivalent EN: forward rate (en)
definition: Taux d’intérêt appliqué à un prêt ou à un placement dont la prise d’effet est fixée à une date future.
in scheme: Finance
in scheme: concepts
notation: ECON1456
related: contrat à terme de taux
related: cours de change à terme

économie des seniors
type: ConceptConcept
type: Concept
creator: Commission d'enrichissement de la langue française, FranceTerme
date parution JO: 2018-03-28
deconseille ou frequent: silver economy
deconseille ou frequent: silver économie
deconseille ou frequent: économie des séniors
alternative label: économie des personnes âgées
definition: Ensemble des activités économiques qui offrent des biens et des services destinés aux personnes âgées.
in scheme: Économie et gestion d'entreprise
in scheme: Social
in scheme: concepts
notation: ECON1457
note: Les expressions « silver économie » et « silver economy » sont à proscrire.

observance fiscale
type: ConceptConcept
type: Concept
creator: Commission d'enrichissement de la langue française, FranceTerme
date parution JO: 2017-09-21
deconseille ou frequent: civisme fiscal
deconseille ou frequent: compliance
equivalent EN: tax compliance @en
equivalent EN: tax compliance (en)
alternative label: respect des obligations fiscales
definition: Fait de se conformer à la règle fiscale ; par extension, conformité à la règle fiscale.
in scheme: Économie générale
in scheme: concept-SD-economie-generale-fiscalite
in scheme: concepts
notation: ECON1458
note: On trouve aussi le terme « civisme fiscal ».

commission de gestion
type: ConceptConcept
type: Concept
creator: Commission d'enrichissement de la langue française, FranceTerme
source: révision de l'arrêté du 18 février 1987
date parution JO: 2000-09-22
equivalent EN: agency fee @en
equivalent EN: agency fee (en)
definition: Commission perçue en rémunération de la gestion de titres ou de capitaux confiée par un tiers.
in scheme: Finance
in scheme: concepts
notation: ECON146

coûts réduits (à)
type: ConceptConcept
type: Concept
creator: Commission d'enrichissement de la langue française, FranceTerme
date parution JO: 2018-03-28
deconseille ou frequent: à bas coûts
deconseille ou frequent: à coûts réduits
equivalent EN: low cost @en
equivalent EN: low cost (en)
part of speech: locution adjectivale
alternative label: bas coûts (à)
definition: Se dit d’une stratégie de réduction des coûts, caractérisée par une offre concentrée sur les seules fonctions essentielles, pour le client, d’un produit ou d’un service, ce qui permet de proposer celui-ci à la vente à un prix bas.
in scheme: Économie et gestion d'entreprise
in scheme: concepts
notation: ECON1460
note: Les entreprises qui proposent des prix bas en réduisant uniquement leur marge bénéficiaire ne pratiquent pas une stratégie à coûts réduits.
preferred label: low cost @en
related: compagnie à bas prix
related: mode express
related: Recommandation sur les équivalents français à donner à l'expression low cost
related: concept-JURI43

régime privilégié des brevets
type: ConceptConcept
type: Concept
creator: Commission d'enrichissement de la langue française, FranceTerme
date parution JO: 2017-09-21
deconseille ou frequent: havre à brevets
equivalent EN: licence box @en
equivalent EN: licence box (en)
equivalent EN: patent box @en
equivalent EN: patent box (en)
definition: Régime fiscal particulièrement favorable aux produits de la cession ou de la concession de brevets et d’autres droits de propriété intellectuelle.
in scheme: Économie générale
in scheme: concept-SD-economie-generale-fiscalite
in scheme: concepts
notation: ECON1461

bas de la pyramide
type: ConceptConcept
type: Concept
creator: Commission d'enrichissement de la langue française, FranceTerme
abbreviation: BDP
abbreviation: BOP @en
date parution JO: 2018-03-28
deconseille ou frequent: base de la pyramide
equivalent EN: BOP @en
equivalent EN: BOP (en)
equivalent EN: bottom of the pyramid @en
equivalent EN: bottom of the pyramid (en)
definition: Segment de la clientèle potentielle disposant des revenus les plus faibles.
in scheme: Économie et gestion d'entreprise
in scheme: concepts
notation: ECON1462
note: Intéressant jusqu’alors faiblement le marché, le bas de la pyramide fait désormais l’objet d’offres commerciales spécifiques.
preferred label: bottom of the pyramid @en

cliqué-payé
type: ConceptConcept
type: Concept
creator: Commission d'enrichissement de la langue française, FranceTerme
date parution JO: 2018-03-28
deconseille ou frequent: Click-and-buy
deconseille ou frequent: click & buy
equivalent EN: click and pay @en
equivalent EN: click and pay (en)
part of speech: nom masculin
definition: Système de paiement en ligne déclenché par la validation de la commande par le client.
in scheme: Économie et gestion d'entreprise
in scheme: concepts
notation: ECON1463
note: « Click-and-buy », qui est un nom de marque, ne doit pas être employé.
preferred label: click and pay @en
related: retrait en magasin
related: livraison de commande en ligne

dernier kilomètre
type: ConceptConcept
type: Concept
creator: Commission d'enrichissement de la langue française, FranceTerme
date parution JO: 2018-03-28
equivalent EN: last mile @en
equivalent EN: last mile (en)
definition: Dernière étape d’une chaîne de livraison, qui est la plus personnalisée et la moins automatisable, et dont l’organisation est par conséquent compliquée et coûteuse.
in scheme: Économie et gestion d'entreprise
in scheme: concepts
notation: ECON1464
preferred label: last mile @en
related: chaîne logistique

économie sociale et solidaire
type: ConceptConcept
type: Concept
creator: Commission d'enrichissement de la langue française, FranceTerme
abbreviation: ESS
date parution JO: 2017-09-21
equivalent EN: social and solidarity economy @en
equivalent EN: social and solidarity economy (en)
equivalent EN: solidarity economy @en
equivalent EN: solidarity economy (en)
definition: Ensemble d’activités de production, de distribution ou de consommation de biens et de services dont les règles de gestion entendent concilier intérêts individuels et intérêt collectif.
in scheme: Économie générale
in scheme: concepts
notation: ECON1465
note: 1. Les activités de l’économie sociale et solidaire s’exercent généralement dans le cadre d’une coopérative, d’une mutuelle, d’une association ou d’une fondation.
note: 2. La plupart du temps, l’économie sociale et solidaire est à visée sociale ou environnementale, sans recherche du profit comme une fin en soi.

externalité
type: ConceptConcept
type: Concept
creator: Commission d'enrichissement de la langue française, FranceTerme
date parution JO: 2017-09-21
deconseille ou frequent: effet externe
deconseille ou frequent: externalité négative
deconseille ou frequent: externalité positive
equivalent EN: externality @en
equivalent EN: externality (en)
part of speech: nom féminin
definition: Effet positif ou négatif de l’activité d’une organisation ou d’une personne sur l’environnement humain, naturel ou économique.
in scheme: Économie générale
in scheme: concepts
notation: ECON1466
note: 1. Une même activité peut produire à la fois des externalités positives et négatives. Par exemple, une activité industrielle peut favoriser l’emploi tout en polluant l’atmosphère.
note: 2. On peut décourager la production d’externalités négatives, notamment par la taxation des activités qui sont à l’origine de celles-ci ou par la création d’un marché de droits.
related: avantage connexe
related: internalisation environnementale
related: quota d'émission de gaz à effet de serre
related: écotaxe
scope note: Cette publication annule et remplace celle du terme « effet externe » au Journal officiel du 26 octobre 2006.

mercatique
type: ConceptConcept
type: Concept
creator: Commission d'enrichissement de la langue française, FranceTerme
date parution JO: 2018-03-28
equivalent EN: marketing @en
equivalent EN: marketing (en)
part of speech: nom féminin
definition: Ensemble des techniques et des actions grâce auxquelles une entreprise développe méthodiquement la vente de ses produits et de ses services en adaptant son offre aux besoins et au comportement du consommateur.
in scheme: Économie et gestion d'entreprise
in scheme: concepts
notation: ECON1467
preferred label: marketing @en
scope note: Cette publication annule et remplace celle du Journal officiel du 2 mars 2010.

prêt participatif
type: ConceptConcept
type: Concept
creator: Commission d'enrichissement de la langue française, FranceTerme
date parution JO: 2017-09-21
definition: Contrat de prêt dont la rémunération inclut une participation du prêteur aux bénéfices de l’emprunteur.
in scheme: Finance
in scheme: concepts
notation: ECON1468
note: Le prêt participatif est à distinguer du prêt obtenu dans le cadre d’un financement participatif.
related: financement participatif par prêt

prix de transfert
type: ConceptConcept
type: Concept
creator: Commission d'enrichissement de la langue française, FranceTerme
date parution JO: 2017-09-21
equivalent EN: transfer price @en
equivalent EN: transfer price (en)
definition: Prix auquel une entreprise liée à une autre mais soumise à un régime fiscal différent lui transfère un bien corporel ou incorporel ou lui fournit un service.
in scheme: Économie générale
in scheme: concept-SD-economie-generale-fiscalite
in scheme: concepts
notation: ECON1469
note: Le prix de transfert peut faire l’objet d’un régime fiscal favorable. Les autorités publiques disposent donc du pouvoir d’en apprécier la régularité.
related: cadre de sécurisation fiscale
related: transfert de bénéfices

commission d'engagement
type: ConceptConcept
type: Concept
creator: Commission d'enrichissement de la langue française, FranceTerme
source: révision de l'arrêté du 18 février 1987
date parution JO: 2000-09-22
equivalent EN: commitment fee @en
equivalent EN: commitment fee (en)
definition: Commission perçue par un syndicat bancaire rémunérant la partie non utilisée d'un crédit que le syndicat s'est engagé à mettre à la disposition d'un emprunteur.
in scheme: Finance
in scheme: concepts
notation: ECON147

cadre de sécurisation fiscale
type: ConceptConcept
type: Concept
creator: Commission d'enrichissement de la langue française, FranceTerme
date parution JO: 2021-01-21
deconseille ou frequent: régime de protection
deconseille ou frequent: régime fiscal de faveur
deconseille ou frequent: régime fiscal de protection
equivalent EN: safe harbor (US) @en
equivalent EN: safe harbor (en-US)
equivalent EN: safe harbour (GB) @en
equivalent EN: safe harbour (en-GB)
definition: Ensemble simplifié de critères dont le respect par le contribuable lui garantit le bénéfice d’un régime fiscal donné, lorsque la complexité de ses conditions générales d’application rend incertain l’accès à ce régime.
in scheme: Économie générale
in scheme: concept-SD-economie-generale-fiscalite
in scheme: concepts
notation: ECON1470
note: On trouve aussi, dans le langage professionnel, l’expression « régime de protection ».
related: prix de transfert
related: clause d'exception

gratuit-payant
type: ConceptConcept
type: Concept
creator: Commission d'enrichissement de la langue française, FranceTerme
date parution JO: 2018-03-28
equivalent EN: freemium @en
equivalent EN: freemium (en)
part of speech: nom masculin ou adjectif
definition: Modèle commercial qui propose le choix, pour un produit donné, entre une version de base gratuite et une ou plusieurs versions payantes offrant des fonctions supplémentaires ou dépourvues de publicité.
in scheme: Économie et gestion d'entreprise
in scheme: Informatique
in scheme: concepts
notation: ECON1471
note: Le gratuit-payant est d’usage courant dans des domaines tels que les logiciels, les jeux vidéo ou les services en ligne.
preferred label: freemium @en
related: jeu vidéo en accès gratuit
related: haut de gamme

obligation-catastrophe
type: ConceptConcept
type: Concept
creator: Commission d'enrichissement de la langue française, FranceTerme
date parution JO: 2017-09-21
equivalent EN: cat bond @en
equivalent EN: cat bond (en)
equivalent EN: catastrophe bond @en
equivalent EN: catastrophe bond (en)
part of speech: nom féminin
definition: Titre obligataire émis par une structure de titrisation pour transférer à ses détenteurs les risques d’entreprises d’assurances liés à des catastrophes naturelles.
in scheme: Assurance
in scheme: Finance
in scheme: concepts
notation: ECON1472
note: Les conditions de rémunération ou de remboursement des obligations-catastrophe varient selon qu’un sinistre survient ou non.
related: contrat d'assurance titrisé
related: entité ad hoc
scope note: Cette publication annule et remplace celle du Journal officiel du 19 novembre 2008.

portage spéculatif
type: ConceptConcept
type: Concept
creator: Commission d'enrichissement de la langue française, FranceTerme
date parution JO: 2018-12-07
equivalent EN: carry trade @en
equivalent EN: carry trade (en)
definition: Opération qui consiste à emprunter dans une monnaie à bas taux d’intérêt afin de financer un achat d’actifs dont le rendement attendu sur une période donnée laisse espérer un gain.
in scheme: Finance
in scheme: concepts
notation: ECON1473
note: L’exemple le plus courant de portage spéculatif est le portage de devises.
related: portage de devises

portage de devises
type: ConceptConcept
type: Concept
creator: Commission d'enrichissement de la langue française, FranceTerme
date parution JO: 2018-12-07
deconseille ou frequent: carry trade sur devises
deconseille ou frequent: currency carry trade
equivalent EN: carry trade @en
equivalent EN: carry trade (en)
definition: Portage spéculatif qui consiste à emprunter une devise à bas taux d’intérêt pour prêter dans une autre devise à taux d’intérêt plus élevé.
in scheme: Finance
in scheme: concepts
notation: ECON1474
related: portage spéculatif
scope note: Cette publication annule et remplace celle du Journal officiel du 17 juin 2012.

cours à terme
type: ConceptConcept
type: Concept
creator: Commission d'enrichissement de la langue française, FranceTerme
date parution JO: 2022-01-22
deconseille ou frequent: future price
equivalent EN: forward price @en
equivalent EN: forward price (en)
equivalent EN: futures price @en
equivalent EN: futures price (en)
definition: Cours préfixé d’achat ou de vente d’un actif dont le règlement et la livraison sont prévus à une échéance ultérieure.
in scheme: Finance
in scheme: concepts
notation: ECON1475
related: marché à terme

report
type: ConceptConcept
type: Concept
creator: Commission d'enrichissement de la langue française, FranceTerme
antonym: déport
date parution JO: 2018-12-07
equivalent EN: contango @en
equivalent EN: contango (en) [matières premières]
equivalent EN: premium @en
equivalent EN: premium (en)
part of speech: nom masculin
definition: Différence positive entre le cours à terme d’un actif et son cours au comptant.
in scheme: Finance
in scheme: concepts
notation: ECON1476
related: cours au comptant

déport
type: ConceptConcept
type: Concept
creator: Commission d'enrichissement de la langue française, FranceTerme
antonym: report
date parution JO: 2018-12-07
equivalent EN: backwardation @en
equivalent EN: backwardation (en) [matières premières]
equivalent EN: discount @en
equivalent EN: discount (en)
part of speech: nom masculin
definition: Différence négative entre le cours à terme d’un actif et son cours au comptant.
in scheme: Finance
in scheme: concepts
notation: ECON1477
related: cours au comptant

mécénat participatif
type: ConceptConcept
type: Concept
creator: Commission d'enrichissement de la langue française, FranceTerme
date parution JO: 2018-12-07
deconseille ou frequent: crowd sponsoring
equivalent EN: crowdsponsoring @en
equivalent EN: crowdsponsoring (en)
equivalent EN: donation-based crowdfunding @en
equivalent EN: donation-based crowdfunding (en)
alternative label: financement participatif par don
definition: Mécénat qui fait appel à de multiples donateurs, généralement des internautes, pour recueillir les fonds nécessaires à l’aboutissement d’un projet.
in scheme: Finance
in scheme: concepts
notation: ECON1478
related: financement participatif
related: mécénat

commission de placement
type: ConceptConcept
type: Concept
creator: Commission d'enrichissement de la langue française, FranceTerme
source: révision de l'arrêté du 18 février 1987
date parution JO: 2000-09-22
equivalent EN: underwriting fee @en
equivalent EN: underwriting fee (en)
definition: Commission payée par un émetteur à un syndicat d'établissements de crédit ou d'institutions financières en rémunération de la diffusion et du placement de ses titres.
in scheme: Finance
in scheme: concepts
notation: ECON148

désexpansion monétaire
type: ConceptConcept
type: Concept
creator: Commission d'enrichissement de la langue française, FranceTerme
date parution JO: 2018-12-07
equivalent EN: QE tapering @en
equivalent EN: QE tapering (en)
equivalent EN: quantitative easing tapering @en
equivalent EN: quantitative easing tapering (en)
equivalent EN: tapering @en
equivalent EN: tapering (en)
alternative label: sortie progressive de la politique d'expansion monétaire
definition: Réduction, par paliers successifs, du volume d’achat d’actifs par une banque centrale, annonçant la fin de la politique d’expansion monétaire qu’elle menait jusqu’alors.
in scheme: Finance
in scheme: concepts
notation: ECON1481
related: politique d'expansion monétaire

prêt à haut risque
type: ConceptConcept
type: Concept
creator: Commission d'enrichissement de la langue française, FranceTerme
date parution JO: 2018-12-07
deconseille ou frequent: crédit toxique
deconseille ou frequent: crédit à haut risque
deconseille ou frequent: prêt toxique
equivalent EN: subprime credit @en
equivalent EN: subprime credit (en)
equivalent EN: subprime loan @en
equivalent EN: subprime loan (en)
equivalent EN: subprime mortgage @en
equivalent EN: subprime mortgage (en)
definition: Prêt octroyé à un emprunteur dont la capacité à honorer ses engagements est fragile.
in scheme: Finance
in scheme: concepts
notation: ECON1482
note: 1. Les prêts à haut risque sont classés par les banques dans une catégorie spécifique.
note: 2. Les prêts à haut risque sont souvent assortis d’un taux d’intérêt initial faible qu’une clause de variabilité peut porter à un niveau élevé, ce qui accroît le risque d’impayé.
related: titrisation

fonds indiciel coté
type: ConceptConcept
type: Concept
creator: Commission d'enrichissement de la langue française, FranceTerme
abbreviation: FIC
date parution JO: 2018-12-07
deconseille ou frequent: ITF
deconseille ou frequent: index tracker fund
deconseille ou frequent: index tracking fund
equivalent EN: ETF @en
equivalent EN: ETF (en)
equivalent EN: exchange traded fund @en
equivalent EN: exchange traded fund (en)
equivalent EN: tracker @en
equivalent EN: tracker (en)
definition: Fonds coté sur un marché, dont l’objet est de reproduire l’évolution de la valeur d’un panier d’actifs, que celui-ci soit composé de matières premières, d’actions, d’obligations ou d’autres actifs.
in scheme: Finance
in scheme: concepts
notation: ECON1483
scope note: Cette publication annule et remplace celle du Journal officiel du 30 janvier 2005.

sortie de bilan
type: ConceptConcept
type: Concept
creator: Commission d'enrichissement de la langue française, FranceTerme
deconseille ou frequent: décomptabilisation
equivalent EN: derecognition @en
equivalent EN: derecognition (en)
definition: Opération comptable par laquelle est enregistrée la sortie d’un actif ou d’un passif du bilan, dès lors que la majorité des risques y afférents est transférée à un tiers.
in scheme: Finance
in scheme: concepts
notation: ECON1485
note: On trouve aussi, dans le langage professionnel, le terme « décomptabilisation », qui est déconseillé.

politique d'expansion monétaire
type: ConceptConcept
type: Concept
creator: Commission d'enrichissement de la langue française, FranceTerme
date parution JO: 2018-12-07
deconseille ou frequent: assouplissement quantitatif
equivalent EN: QE @en
equivalent EN: QE (en)
equivalent EN: quantitative easing @en
equivalent EN: quantitative easing (en)
definition: Politique qui consiste, pour une banque centrale, à acheter aux banques une partie des actifs qu’elles détiennent afin d’accroître leurs liquidités et, par voie de conséquence, le volume de crédits distribués par ces banques aux ménages et aux entreprises.
in scheme: Finance
in scheme: concepts
notation: ECON1488
note: 1. La politique d’expansion monétaire est qualifiée de non conventionnelle, par opposition à la politique conventionnelle de baisse des taux d’intérêt directeurs.
note: 2. On trouve aussi le terme « assouplissement quantitatif », qui n’est pas recommandé.
related: opération de refinancement à long terme ciblée
related: opération de refinancement à long terme
related: désexpansion monétaire
related: distribution monétaire sans contrepartie

prêt-emprunt de titres
type: ConceptConcept
type: Concept
creator: Commission d'enrichissement de la langue française, FranceTerme
date parution JO: 2022-01-22
deconseille ou frequent: opération de pension
deconseille ou frequent: security lending
equivalent EN: repo @en
equivalent EN: repo (en)
equivalent EN: securities lending @en
equivalent EN: securities lending (en)
definition: Opération par laquelle une entité cède temporairement des titres à une autre entité, contre le versement d’un intérêt et la remise d’un actif en nantissement afin de couvrir le risque de non-restitution à l’échéance des titres prêtés.
in scheme: Finance
in scheme: concepts
notation: ECON1489
note: À la différence de la mise en pension, le prêt-emprunt de titres ne donne droit qu’au versement d’un intérêt, sans que soient versées des liquidités en contrepartie des titres prêtés.
related: mise en pension
related: prise en pension

commission immédiate
type: ConceptConcept
type: Concept
creator: Commission d'enrichissement de la langue française, FranceTerme
source: révision de l'arrêté du 18 février 1987
date parution JO: 2000-09-22
equivalent EN: flat fee @en
equivalent EN: flat fee (en)
definition: Commission payée en totalité lors de la signature du contrat de crédit ou d'emprunt par l'emprunteur aux établissements de crédit participant au tour de table.
in scheme: Finance
in scheme: concepts
notation: ECON149

cotation commerciale
type: ConceptConcept
type: Concept
creator: Commission d'enrichissement de la langue française, FranceTerme
date parution JO: 2018-12-07
deconseille ou frequent: scorage
equivalent EN: scoring @en
equivalent EN: scoring (en)
definition: Estimation du potentiel commercial d’un client ou d’un fournisseur à partir d’une grille d’analyse préétablie.
in scheme: Économie et gestion d'entreprise
in scheme: concepts
notation: ECON1490
note: Le potentiel commercial d’un client est mesuré en fonction de critères tels que son intérêt pour le produit, son pouvoir d’achat ou sa capacité de remboursement. Le potentiel commercial d’un fournisseur est mesuré en fonction de critères tels que sa fiabilité de livraison, sa flexibilité ou la traçabilité de ses produits.

innovation de rupture
type: ConceptConcept
type: Concept
creator: Commission d'enrichissement de la langue française, FranceTerme
date parution JO: 2018-12-07
deconseille ou frequent: innovation disruptive
equivalent EN: disruptive innovation @en
equivalent EN: disruptive innovation (en)
definition: Innovation qui modifie fondamentalement un produit ou un service, un procédé de production, une technique de commercialisation ou le mode d’organisation d’une entreprise.
in scheme: Économie et gestion d'entreprise
in scheme: Recherche
in scheme: concepts
notation: ECON1491
note: 1. Une innovation de rupture transforme en profondeur un marché.
note: 2. On trouve aussi l’expression « innovation disruptive », qui est déconseillée.
related: innovation incrémentale
related: innovation continue
related: innovation inversée
related: innovation ouverte
related: innovation par la demande
related: innovation par l'offre

innovation incrémentale
type: ConceptConcept
type: Concept
creator: Commission d'enrichissement de la langue française, FranceTerme
date parution JO: 2018-12-07
deconseille ou frequent: innovation incrémentielle
equivalent EN: incremental innovation @en
equivalent EN: incremental innovation (en)
definition: Innovation qui améliore un produit ou un service, un procédé de production, une technique de commercialisation ou le mode d’organisation d’une entreprise sans en modifier fondamentalement les caractéristiques ou le fonctionnement.
in scheme: Économie et gestion d'entreprise
in scheme: Recherche
in scheme: concepts
notation: ECON1492
related: innovation de rupture
related: innovation continue
related: innovation inversée
related: innovation ouverte
related: innovation par la demande
related: innovation par l'offre

innovation continue
type: ConceptConcept
type: Concept
creator: Commission d'enrichissement de la langue française, FranceTerme
date parution JO: 2018-12-07
deconseille ou frequent: innovation de continuité
deconseille ou frequent: innovation permanente
equivalent EN: sustaining innovation @en
equivalent EN: sustaining innovation (en)
definition: Processus d’amélioration progressive et régulière apportée à un produit ou à un service, à un procédé de production, à une technique de commercialisation ou au mode d’organisation d’une entreprise.
in scheme: Économie et gestion d'entreprise
in scheme: Recherche
in scheme: concepts
notation: ECON1493
note: L’expression « innovation permanente » est également utilisée.
related: amélioration continue participative
related: innovation de rupture
related: innovation incrémentale
related: innovation inversée
related: innovation ouverte
related: innovation par la demande
related: innovation par l'offre

innovation inversée
type: ConceptConcept
type: Concept
creator: Commission d'enrichissement de la langue française, FranceTerme
date parution JO: 2018-12-07
deconseille ou frequent: innovation inverse
equivalent EN: reverse innovation @en
equivalent EN: reverse innovation (en)
definition: Innovation conçue dans un pays émergent ou en développement pour le marché local et qui est ensuite diffusée dans les pays développés.
in scheme: Économie et gestion d'entreprise
in scheme: Recherche
in scheme: concepts
notation: ECON1494
note: L’innovation inversée consiste généralement à proposer des produits analogues à des produits déjà disponibles dans les pays développés, mais par exemple plus robustes, plus simples d’emploi et souvent fabriqués à coût réduit.
related: innovation de rupture
related: innovation incrémentale
related: innovation continue
related: innovation ouverte
related: innovation par la demande
related: innovation par l'offre

innovation ouverte
type: ConceptConcept
type: Concept
creator: Commission d'enrichissement de la langue française, FranceTerme
date parution JO: 2018-12-07
equivalent EN: open innovation @en
equivalent EN: open innovation (en)
definition: Processus d’innovation mis en place par une organisation, qui fait appel à divers partenaires extérieurs, en recourant notamment à des pratiques participatives et à l’ouverture des données.
in scheme: Économie et gestion d'entreprise
in scheme: Recherche
in scheme: concepts
notation: ECON1495
note: Les partenaires extérieurs peuvent être des clients, des fournisseurs ou de simples particuliers ; ils peuvent, par exemple, former des groupes de testeurs de produits ou œuvrer dans des ateliers collaboratifs.
related: ouverture des données
related: innovation de rupture
related: innovation incrémentale
related: innovation continue
related: innovation inversée
related: innovation par la demande
related: innovation par l'offre
related: atelier collaboratif

innovation par la demande
type: ConceptConcept
type: Concept
creator: Commission d'enrichissement de la langue française, FranceTerme
abbreviation: ID
date parution JO: 2018-12-07
equivalent EN: innovation pull @en
equivalent EN: innovation pull (en)
equivalent EN: market pull @en
equivalent EN: market pull (en)
definition: Innovation proposée sur le marché, qui répond à l’expression d’une demande ou à un besoin identifié.
in scheme: Économie et gestion d'entreprise
in scheme: Recherche
in scheme: concepts
notation: ECON1496
related: innovation de rupture
related: innovation incrémentale
related: innovation continue
related: innovation inversée
related: innovation ouverte
related: innovation par l'offre

innovation par l'offre
type: ConceptConcept
type: Concept
creator: Commission d'enrichissement de la langue française, FranceTerme
abbreviation: IO
date parution JO: 2018-12-07
equivalent EN: innovation push @en
equivalent EN: innovation push (en)
equivalent EN: technology push @en
equivalent EN: technology push (en)
definition: Innovation proposée sur le marché, qui résulte d’une découverte scientifique ou d’un progrès technique.
in scheme: Économie et gestion d'entreprise
in scheme: Recherche
in scheme: concepts
notation: ECON1497
related: innovation de rupture
related: innovation incrémentale
related: innovation continue
related: innovation inversée
related: innovation ouverte
related: innovation par la demande

gestion des risques
type: ConceptConcept
type: Concept
creator: Commission d'enrichissement de la langue française, FranceTerme
date parution JO: 2018-03-28
deconseille ou frequent: gestion de risques
equivalent EN: risk management @en
equivalent EN: risk management (en)
definition: Ensemble d’actions visant à identifier, à évaluer et à diminuer les risques auxquels est exposée une organisation.
in scheme: Tous domaines
in scheme: concepts
notation: ECON1498
note: 2. La gestion des risques est souvent mise en œuvre dans un cadre de référence national ou international.
note: 1. Les risques que court une organisation sont notamment naturels, économiques, financiers, sociaux ou politiques.
preferred label: risk management @en
related: gestion des risques d'entreprise
related: gestion des risques bancaires
related: gestionnaire des risques
scope note: Cette publication annule et remplace celle du terme « gestion de risques » au Journal officiel du 22 septembre 2000.

gestion des risques bancaires
type: ConceptConcept
type: Concept
creator: Commission d'enrichissement de la langue française, FranceTerme
date parution JO: 2018-03-28
equivalent EN: banking risk management @en
equivalent EN: banking risk management (en)
in scheme: Finance
in scheme: concepts
notation: ECON1499
preferred label: banking risk management @en
related: gestion des risques d'entreprise
related: gestion des risques

magasin à prix unique
type: ConceptConcept
type: Concept
creator: Commission d'enrichissement de la langue française, FranceTerme
date parution JO: 1998-08-14
equivalent EN: one-price store @en
equivalent EN: one-price store (en)
definition: Magasin proposant un assortiment de produits de grande consommation vendus au même prix.
in scheme: Économie et gestion d'entreprise
in scheme: concepts
notation: ECON15

compensation monétaire de groupe
type: ConceptConcept
type: Concept
creator: Commission d'enrichissement de la langue française, FranceTerme
source: révision de l'arrêté du 18 février 1987
abbreviation: CMG
date parution JO: 2000-09-22
equivalent EN: netting @en
equivalent EN: netting (en)
definition: Technique d'optimisation de la trésorerie d'un groupe, principalement à l'égard du risque de change, et consistant à compenser les dettes et créances, par devises, à l'intérieur du groupe.
in scheme: Finance
in scheme: concepts
notation: ECON150

gestionnaire des risques
type: ConceptConcept
type: Concept
creator: Commission d'enrichissement de la langue française, FranceTerme
date parution JO: 2018-03-28
deconseille ou frequent: gestionnaire de risques
equivalent EN: risk manager @en
equivalent EN: risk manager (en)
in scheme: Tous domaines
in scheme: concepts
notation: ECON1500
preferred label: risk manager @en
related: gestion des risques
scope note: Cette publication annule et remplace celle du terme « gestionnaire de risques » au Journal officiel du 22 septembre 2000.

Recommandation sur les équivalents français à donner à l'expression low cost
type: ConceptConcept
type: Concept
creator: Commission d'enrichissement de la langue française, FranceTerme
date parution JO: 2018-03-25
deconseille ou frequent: bon marché
deconseille ou frequent: premier prix
deconseille ou frequent: vendu à prix d’appel
deconseille ou frequent: à bas coûts
deconseille ou frequent: à bas prix
deconseille ou frequent: à coûts réduits
deconseille ou frequent: à prix cassé
deconseille ou frequent: à prix réduit
deconseille ou frequent: économique
in scheme: Économie et gestion d'entreprise
in scheme: concepts
notation: ECON1501
related: compagnie à bas prix
related: coûts réduits (à)
scope note: Lire la recommandation "http://www.culture.fr/Ressources/FranceTerme/Recommandations-d-usage/LOW-COST" ; toutes les recommandations d'usage publiées par la Commission générale de terminologie et de néologie au Journal officiel à l'adresse suivante : "http://www.culture.fr/Ressources/FranceTerme/Recommandations-d-usage".

financement participatif par titres
type: ConceptConcept
type: Concept
creator: Commission d'enrichissement de la langue française, FranceTerme
date parution JO: 2018-12-07
deconseille ou frequent: crowd equity
deconseille ou frequent: crowd investing
equivalent EN: crowdequity @en
equivalent EN: crowdequity (en)
equivalent EN: crowdinvesting @en
equivalent EN: crowdinvesting (en)
equivalent EN: equity crowdfunding @en
equivalent EN: equity crowdfunding (en) [actions]
definition: Financement participatif qui repose sur la souscription de titres financiers.
in scheme: Finance
in scheme: concepts
notation: ECON1502
related: financement participatif

dispositif d'enregistrement électronique partagé
type: ConceptConcept
type: Concept
creator: Commission d'enrichissement de la langue française, FranceTerme
abbreviation: DEEP
date parution JO: 2021-01-15
deconseille ou frequent: registre partagé
equivalent EN: DLT @en
equivalent EN: DLT (en)
equivalent EN: distributed ledger technology @en
equivalent EN: distributed ledger technology (en)
definition: Dispositif d’enregistrement et de sécurisation de données qui recourt à un protocole d’authentification et à la duplication de ces données chez les participants à ce dispositif.
in scheme: Finance
in scheme: Informatique
in scheme: concept-SD-finance-internet
in scheme: concept-SD-informatique-internet
in scheme: concepts
notation: ECON1503
note: 1. Un dispositif d’enregistrement électronique partagé permet notamment d’enregistrer les identifiants des parties à une vente d’actifs numériques, tels des cyberjetons.
note: 2. Une chaîne de blocs est un exemple de dispositif d’enregistrement électronique partagé.
related: registre partagé
related: actif numérique
related: cyberjeton
related: automate exécuteur de clauses
related: cybermonnaie
related: titrisation en cyberjetons
related: chaîne de blocs

registre partagé
type: ConceptConcept
type: Concept
creator: Commission d'enrichissement de la langue française, FranceTerme
date parution JO: 2021-01-15
deconseille ou frequent: dispositif d'enregistrement électronique partagé
deconseille ou frequent: registre distribué
equivalent EN: distributed ledger @en
equivalent EN: distributed ledger (en)
alternative label: registre distribué
definition: Ensemble des données qui sont enregistrées par un dispositif d’enregistrement électronique partagé et conservées par les participants à l’enregistrement.
in scheme: Finance
in scheme: Informatique
in scheme: concept-SD-finance-internet
in scheme: concept-SD-informatique-internet
in scheme: concepts
notation: ECON1504
note: On trouve aussi, parfois employé improprement en ce sens, le terme « dispositif d’enregistrement électronique partagé ».
related: dispositif d'enregistrement électronique partagé
related: cyberjeton

actif numérique
type: ConceptConcept
type: Concept
creator: Commission d'enrichissement de la langue française, FranceTerme
date parution JO: 2021-01-15
equivalent EN: digital asset @en
equivalent EN: digital asset (en)
definition: Actif constitué par des données numériques, dont la propriété ou le droit d’usage est un élément du patrimoine d’une personne physique ou morale.
in scheme: Finance
in scheme: Informatique
in scheme: concept-SD-finance-internet
in scheme: concept-SD-informatique-internet
in scheme: concepts
notation: ECON1505
note: Un actif numérique peut être un contenu multimédia, un logiciel ou sa licence d’utilisation, ou encore un cyberjeton.
related: dispositif d'enregistrement électronique partagé
related: cyberjeton
related: gestion des actifs numériques
related: titrisation en cyberjetons

cyberjeton
type: ConceptConcept
type: Concept
creator: Commission d'enrichissement de la langue française, FranceTerme
date parution JO: 2021-01-15
equivalent EN: coin @en
equivalent EN: coin (en)
equivalent EN: crypto asset @en
equivalent EN: crypto asset (en)
equivalent EN: token @en
equivalent EN: token (en)
forme abregee: jeton, n.m.
part of speech: nom masculin
definition: Actif numérique émis et attribué ou transféré au moyen d’un dispositif d’enregistrement électronique partagé à un participant à ce dispositif.
in scheme: Finance
in scheme: Informatique
in scheme: concept-SD-finance-internet
in scheme: concept-SD-informatique-internet
in scheme: concepts
notation: ECON1506
note: Un cyberjeton peut notamment être l’unité de compte d’une cybermonnaie ou un ticket numérique échangeable contre un bien, un service ou un droit de vote.
related: dispositif d'enregistrement électronique partagé
related: registre partagé
related: actif numérique
related: offre au public de cyberjetons
related: preuve de détention
related: cybermonnaie
related: titrisation en cyberjetons
related: cyberjeton indexé
related: jeton d'authentification

gestion des actifs numériques
type: ConceptConcept
type: Concept
creator: Commission d'enrichissement de la langue française, FranceTerme
abbreviation: GAN
date parution JO: 2021-01-15
equivalent EN: DAM @en
equivalent EN: DAM (en)
equivalent EN: digital asset management @en
equivalent EN: digital asset management (en)
definition: Processus d’enregistrement, d’exploitation et de suivi des actifs numériques et des droits qui leur sont attachés.
in scheme: Finance
in scheme: Informatique
in scheme: concept-SD-finance-internet
in scheme: concept-SD-informatique-internet
in scheme: concepts
notation: ECON1507
note: 1. La gestion des actifs numériques est pratiquée dans le domaine des transactions financières ainsi, notamment, que dans celui de l’édition (musique, vidéo, jeux ou livres).
note: 2. La gestion des actifs numériques peut aussi intégrer des dispositifs de gestion des droits numériques acquis par les utilisateurs finals.
related: gestion des droits numériques
related: actif numérique

offre au public de cyberjetons
type: ConceptConcept
type: Concept
creator: Commission d'enrichissement de la langue française, FranceTerme
date parution JO: 2021-01-15
deconseille ou frequent: vente de cyberjetons
deconseille ou frequent: vente de jetons
equivalent EN: ICO @en
equivalent EN: ICO (en)
equivalent EN: initial coin offering @en
equivalent EN: initial coin offering (en)
forme abregee: offre de jetons
definition: Émission de cyberjetons qui a pour but de financer un projet ou une organisation.
in scheme: Finance
in scheme: Informatique
in scheme: concept-SD-finance-internet
in scheme: concept-SD-informatique-internet
in scheme: concepts
notation: ECON1508
related: cyberjeton
related: chaîne de blocs

automate exécuteur de clauses
type: ConceptConcept
type: Concept
creator: Commission d'enrichissement de la langue française, FranceTerme
date parution JO: 2021-01-15
deconseille ou frequent: contrat intelligent
equivalent EN: smart contract @en
equivalent EN: smart contract (en)
definition: Protocole informatique qui exécute des clauses préalablement définies, dont certaines peuvent être conditionnées par des évènements susceptibles de se produire.
in scheme: Assurance
in scheme: Informatique
in scheme: concept-SD-assurance-internet
in scheme: concept-SD-informatique-internet
in scheme: concepts
notation: ECON1509
note: 1. Un contrat formel n’est pas toujours établi pour mettre en place un automate exécuteur de clauses.
note: 2. Un automate exécuteur de clauses peut, par exemple, déclencher l’indemnisation automatique d’un assuré dont l’avion aurait pris du retard.
note: 3. Un automate exécuteur de clauses utilise généralement un dispositif d’enregistrement électronique partagé.
note: 4. On trouve aussi, dans le langage professionnel, le terme « contrat intelligent », qui est déconseillé.
related: dispositif d'enregistrement électronique partagé

comptant
type: ConceptConcept
type: Concept
creator: Commission d'enrichissement de la langue française, FranceTerme
source: révision de l'arrêté du 18 février 1987
date parution JO: 2000-09-22
equivalent EN: cash @en
equivalent EN: cash (en)
part of speech: adjectif
definition: Se dit d'un paiement immédiat quel que soit le moyen de paiement utilisé dès lors que ce moyen de paiement ne prévoit pas de délai.
in scheme: Finance
in scheme: concepts
notation: ECON151
note: 1. Ne s'emploie qu'au masculin, mais l'accord en nombre est possible.
note: 2. S'emploie aussi comme adverbe. Exemple : payer comptant [en anglais : pay in cash (to)].
related: espèces
related: payé-emporté

preuve de détention
type: ConceptConcept
type: Concept
creator: Commission d'enrichissement de la langue française, FranceTerme
equivalent EN: PoS (en)
equivalent EN: proof of stake @en
equivalent EN: proof of stake (en)
definition: Algorithme qui attribue la validation d’un bloc, ainsi que la récompense afférente, si elle existe, en tenant compte du nombre et de l’ancienneté des jetons détenus par les participants.
in scheme: Finance
in scheme: Télécommunications
in scheme: concept-SD-finance-internet
in scheme: concept-SD-telecommunications-internet
in scheme: concepts
notation: ECON1510
note: La preuve de détention consomme peu d’énergie, à la différence de la preuve de travail, toutefois elle repose sur un ou plusieurs tiers de confiance.
related: cyberjeton

bilan prudentiel
type: ConceptConcept
type: Concept
creator: Commission d'enrichissement de la langue française, FranceTerme
date parution JO: 2021-01-21
equivalent EN: prudential balance sheet @en
equivalent EN: prudential balance sheet (en)
definition: Bilan qu’élaborent des organismes d’assurance et de réassurance à partir de leur bilan comptable, et qui permet de vérifier qu’ils respectent les exigences quantitatives de solvabilité auxquelles ils sont soumis.
in scheme: Assurance
in scheme: Finance
in scheme: concepts
notation: ECON1511
note: Les exigences quantitatives de solvabilité, définies au niveau supranational, ont pour objectif de garantir le respect des engagements pris et de contribuer à la stabilité du système financier.
related: provision technique prudentielle

provision technique prudentielle
type: ConceptConcept
type: Concept
creator: Commission d'enrichissement de la langue française, FranceTerme
date parution JO: 2021-01-21
deconseille ou frequent: provisions prudentielles
deconseille ou frequent: provisions techniques
deconseille ou frequent: provisions techniques prudentielles
equivalent EN: TP @en
equivalent EN: TP (en)
equivalent EN: technical provision @en
equivalent EN: technical provision (en)
definition: Poste du bilan prudentiel d’un organisme d’assurance ou de réassurance où sont inscrits ses engagements envers ses assurés, souscripteurs et bénéficiaires, qui est établi en faisant la somme d’une meilleure estimation et d’un coût de portage, et correspond au montant d’actifs qu’un tiers exigerait pour reprendre lesdits engagements.
in scheme: Assurance
in scheme: Finance
in scheme: concepts
notation: ECON1512
note: En pratique, la provision technique prudentielle est la somme d’une meilleure estimation et d’une marge de risque.
related: bilan prudentiel
related: coût de portage
related: meilleure estimation

coût de portage
type: ConceptConcept
type: Concept
creator: Commission d'enrichissement de la langue française, FranceTerme
date parution JO: 2021-01-21
deconseille ou frequent: marge de risque
deconseille ou frequent: marge pour risque
equivalent EN: RM @en
equivalent EN: RM (en)
equivalent EN: risk margin @en
equivalent EN: risk margin (en)
alternative label: marge de risque
definition: Coût correspondant à la rémunération du supplément de fonds propres règlementaires qu’un organisme d’assurance ou de réassurance destinataire d’un hypothétique transfert des engagements associés aux provisions techniques prudentielles devrait lever pour être en mesure de porter ces engagements jusqu’à leur règlement intégral.
in scheme: Assurance
in scheme: Finance
in scheme: concepts
notation: ECON1513
note: 1. Le coût de portage est l’une des deux composantes de la provision technique prudentielle.
note: 2. On trouve aussi les termes « marge de risque » et « marge pour risque ».
related: provision technique prudentielle
related: meilleure estimation

meilleure estimation
type: ConceptConcept
type: Concept
creator: Commission d'enrichissement de la langue française, FranceTerme
date parution JO: 2021-01-21
equivalent EN: BE @en
equivalent EN: BE (en)
equivalent EN: best estimate @en
equivalent EN: best estimate (en)
definition: Moyenne des flux de trésorerie futurs, actualisés selon une courbe de taux règlementaire et pondérés par leur probabilité, qui est établie en prenant en compte toutes les entrées et sorties de trésorerie nécessaires à un organisme d’assurance ou de réassurance pour faire face à ses engagements, et ce jusqu’à leur règlement intégral.
in scheme: Assurance
in scheme: Finance
in scheme: concepts
notation: ECON1514
note: 1. La meilleure estimation est l’une des deux composantes de la provision technique prudentielle.
note: 2. La meilleure estimation est calculée sur la base de paramètres affectés de fortes incertitudes.
related: provision technique prudentielle
related: coût de portage
related: probabilité neutre vis-à-vis du risque
related: générateur de scénarios économiques neutre vis-à-vis du risque

probabilité neutre vis-à-vis du risque
type: ConceptConcept
type: Concept
creator: Commission d'enrichissement de la langue française, FranceTerme
equivalent EN: risk-neutral probability @en
equivalent EN: risk-neutral probability (en)
alternative label: probabilité risque-neutre
definition: Probabilité conventionnelle qui permet à l’espérance mathématique actualisée au taux sans risque des flux afférents à un actif ou à un engagement financier d’être égale au prix de marché de cet actif ou de cet engagement.
in scheme: Assurance
in scheme: Finance
in scheme: concepts
notation: ECON1515
note: Une probabilité neutre vis-à-vis du risque est l’un des paramètres principaux d’un générateur de scénarios économiques neutre vis-à-vis du risque.
related: meilleure estimation
related: générateur de scénarios économiques neutre vis-à-vis du risque

générateur de scénarios économiques neutre vis-à-vis du risque
type: ConceptConcept
type: Concept
creator: Commission d'enrichissement de la langue française, FranceTerme
equivalent EN: risk-neutral economic scenario generator @en
equivalent EN: risk-neutral economic scenario generator (en)
alternative label: générateur de scénarios économiques risque-neutre
definition: Outil de simulation des conditions économiques qui reproduit les mouvements possibles des différentes variables de marché selon une périodicité définie et en les pondérant par la probabilité risque-neutre.
in scheme: Assurance
in scheme: Finance
in scheme: concepts
notation: ECON1516
note: Les générateurs de scénarios économiques neutre vis-à-vis du risque fournissent la base nécessaire au calcul de la meilleure estimation.
related: meilleure estimation
related: probabilité neutre vis-à-vis du risque

technique d'atténuation des risques
type: ConceptConcept
type: Concept
creator: Commission d'enrichissement de la langue française, FranceTerme
date parution JO: 2021-01-21
equivalent EN: risk mitigation technique @en
equivalent EN: risk mitigation technique (en)
definition: Procédé qui permet à un organisme d’assurance de réduire ses risques en en transférant à un tiers tout ou partie par contrat.
in scheme: Assurance
in scheme: Finance
in scheme: concepts
notation: ECON1517
note: Les techniques d’atténuation des risques, qui font l’objet d’une règlementation spécifique, englobent notamment le recours aux instruments dérivés, aux traités de réassurance et à la titrisation des engagements.
related: contrat d'assurance titrisé
related: titrisation

seuil critique de perte
type: ConceptConcept
type: Concept
creator: Commission d'enrichissement de la langue française, FranceTerme
date parution JO: 2021-01-21
deconseille ou frequent: perte potentielle
equivalent EN: VAR @en
equivalent EN: VAR (en)
equivalent EN: value at risk @en
equivalent EN: value at risk (en)
definition: Perte maximale, pour un niveau de confiance donné, à laquelle un agent économique s’expose, dans l’hypothèse d’un scénario défavorable à un horizon fixé.
in scheme: Assurance
in scheme: Finance
in scheme: concepts
notation: ECON1518
note: Par exemple, pour un niveau de confiance de 95 % et un horizon de 10 jours, un seuil critique de perte d’un million d’euros signifie qu’il y a une probabilité de 5 % qu’un investisseur voie la valeur de son portefeuille se déprécier de plus d’un million d’euros dans 10 jours.
scope note: Cette publication annule et remplace celle du terme « perte potentielle » publié au Journal officiel du 19 janvier 2010.

test de résistance
type: ConceptConcept
type: Concept
creator: Commission d'enrichissement de la langue française, FranceTerme
date parution JO: 2021-01-21
equivalent EN: stress test @en
equivalent EN: stress test (en)
definition: Évaluation de la capacité d’une institution financière à résister à des conditions extrêmes, telle une crise financière, qui est mesurée selon des critères de liquidité et de solvabilité.
in scheme: Assurance
in scheme: Finance
in scheme: concepts
notation: ECON1519

conditions internationales de vente
type: ConceptConcept
type: Concept
creator: Commission d'enrichissement de la langue française, FranceTerme
source: révision de l'arrêté du 7 juillet 1994
abbreviation: CIV
abbreviation: Incoterms @en
date parution JO: 2000-09-22
equivalent EN: Incoterms @en
equivalent EN: Incoterms (en)
equivalent EN: International Commercial Terms @en
equivalent EN: International Commercial Terms (en)
definition: Règles internationales d'interprétation résumées en sigles, acronymes et abréviations, des expressions commerciales concernant les modalités de la répartition entre l'acheteur et le vendeur des responsabilités liées à un contrat international de vente.
in scheme: Économie et gestion d'entreprise
in scheme: concepts
notation: ECON152
note: 1. En 1990, la Chambre de commerce internationale a défini en anglais et en français treize conditions internationales de vente, mais avec leur seul sigle anglais.
note: 2. Les conditions internationales de vente doivent être assorties en français de leurs sigles, acronymes ou abréviations français. Exemple : « franco à bord (FAB) » et non « franco à bord (FOB) ».

impôt unitaire mondial sur les sociétés
type: ConceptConcept
type: Concept
creator: Commission d'enrichissement de la langue française, FranceTerme
date parution JO: 2021-01-21
equivalent EN: unitary tax @en
equivalent EN: unitary tax (en)
equivalent EN: unitary taxation @en
equivalent EN: unitary taxation (en)
equivalent EN: worldwide unitary taxation @en
equivalent EN: worldwide unitary taxation (en)
forme abregee: impôt unitaire mondial
definition: Impôt sur les sociétés assis sur l’activité globale d’une entreprise multinationale, dont le produit est réparti entre les juridictions fiscales dans le ressort desquelles celle-ci exerce une activité, en fonction de la valeur qu’elle y crée.
in scheme: Économie générale
in scheme: concept-SD-economie-generale-fiscalite
in scheme: concepts
notation: ECON1520
related: transfert de bénéfices

transfert de bénéfices
type: ConceptConcept
type: Concept
creator: Commission d'enrichissement de la langue française, FranceTerme
date parution JO: 2021-01-21
deconseille ou frequent: BEPS
deconseille ou frequent: base d'imposition et de transfert de bénéfices
deconseille ou frequent: base erosion and profit shifting
equivalent EN: profit shifting @en
equivalent EN: profit shifting (en)
definition: Pratique mise en œuvre par un groupe de sociétés, qui consiste à effectuer des échanges économiques fictifs entre des sociétés de ce groupe situées dans des juridictions fiscales différentes ou à appliquer entre elles des prix de transfert optimisés afin que le bénéfice global soit transféré vers une juridiction où il est moins imposé, que les entreprises concernées y exercent une activité réelle ou non.
in scheme: Économie générale
in scheme: concept-SD-economie-generale-fiscalite
in scheme: concepts
notation: ECON1521
related: prix de transfert
related: impôt unitaire mondial sur les sociétés
related: minoration de la base

clause d'exception
type: ConceptConcept
type: Concept
creator: Commission d'enrichissement de la langue française, FranceTerme
date parution JO: 2021-01-21
deconseille ou frequent: clause de sauvegarde
equivalent EN: safe harbor (US) @en
equivalent EN: safe harbor (en-US)
equivalent EN: safe harbour (GB) @en
equivalent EN: safe harbour (en-GB)
definition: Disposition permettant, sous de strictes conditions, de déroger à une mesure fiscale de portée générale.
in scheme: Économie générale
in scheme: concept-SD-economie-generale-fiscalite
in scheme: concepts
notation: ECON1522
note: 1.Une clause d’exception peut prendre la forme d’une dérogation à un dispositif destiné à éviter les abus d’optimisation fiscale, ou, à l’inverse, d’une mesure dérogatoire visant à préserver les intérêts des finances publiques.
note: 2. On trouve aussi, dans le langage professionnel, le terme « clause de sauvegarde ».
related: cadre de sécurisation fiscale

contrat de compensation à l'exportation
type: ConceptConcept
type: Concept
creator: Commission d'enrichissement de la langue française, FranceTerme
date parution JO: 2021-01-21
deconseille ou frequent: contrat d’offset
equivalent EN: offset @en
equivalent EN: offset (en)
equivalent EN: offset agreement @en
equivalent EN: offset agreement (en)
equivalent EN: offset contract @en
equivalent EN: offset contract (en)
forme abregee: compensation à l'export
definition: Contrat par lequel une entreprise exportatrice accorde une contrepartie financière, industrielle ou commerciale à un pays importateur ou à une entreprise de ce pays.
in scheme: Économie et gestion d'entreprise
in scheme: concepts
notation: ECON1523
note: Le contrat de compensation à l’exportation peut porter, par exemple, sur un octroi de crédit, un transfert de technologie ou de compétences, une sous-traitance ou une mutualisation des réseaux commerciaux.

plateforme de réservation en ligne
type: ConceptConcept
type: Concept
creator: Commission d'enrichissement de la langue française, FranceTerme
abbreviation: PRL
date parution JO: 2021-01-21
deconseille ou frequent: centrale de réservation
deconseille ou frequent: centrale de réservation en ligne
deconseille ou frequent: plate-forme de réservation
deconseille ou frequent: plate-forme de réservation en ligne
deconseille ou frequent: plateforme en ligne
equivalent EN: OBP @en
equivalent EN: OBP (en)
equivalent EN: OTA @en
equivalent EN: OTA (en)
equivalent EN: online booking platform @en
equivalent EN: online booking platform (en)
equivalent EN: online travel agency @en
equivalent EN: online travel agency (en)
forme abregee: plateforme de réservation
definition: Service en ligne qui permet de rechercher, de comparer et de réserver divers services, tels que des voyages et des prestations d’hôtellerie, de restauration ou de loisirs.
in scheme: Économie et gestion d'entreprise
in scheme: Tourisme
in scheme: concepts
notation: ECON1524
note: On trouve aussi, parfois employé dans ce sens, le terme « centrale de réservation en ligne ».

rémunération totale des dirigeants
type: ConceptConcept
type: Concept
creator: Commission d'enrichissement de la langue française, FranceTerme
abbreviation: RTD
date parution JO: 2021-01-21
deconseille ou frequent: executive compensation plan
deconseille ou frequent: management package
deconseille ou frequent: plan de rémunération des dirigeants
equivalent EN: executive compensation plan @en
equivalent EN: executive compensation plan (en)
forme abregee: rémunération totale
definition: Ensemble des rémunérations et des avantages dont bénéficient les dirigeants d’une entreprise.
in scheme: Économie et gestion d'entreprise
in scheme: Emploi et travail
in scheme: concepts
notation: ECON1525
note: 1. La rémunération totale des dirigeants inclut outre la rémunération, fixe ou variable, le versement d’actions gratuites ou de bons de souscription d’actions, les avantages en nature, les plans spécifiques de départ ou de retraite.
note: 2. L’expression management package, empruntée de l’anglais, est à proscrire.

va-et-vient public-privé
type: ConceptConcept
type: Concept
creator: Commission d'enrichissement de la langue française, FranceTerme
date parution JO: 2021-01-21
deconseille ou frequent: pantouflage
deconseille ou frequent: porte tournante
deconseille ou frequent: revolving doors
equivalent EN: revolving door @en
equivalent EN: revolving door (en)
alternative label: aller-retour public-privé
definition: Pratique qui consiste, pour un cadre supérieur, à passer du secteur public au secteur privé et inversement.
in scheme: Économie et gestion d'entreprise
in scheme: Emploi et travail
in scheme: concepts
notation: ECON1526
note: 1. Le va-et-vient public-privé est souvent soumis à des procédures déontologiques ou règlementaires, comme l’observation d’un temps de latence.
note: 2. Il convient de distinguer le terme « va-et-vient public-privé » du terme « pantouflage », qui désigne le départ d’un haut fonctionnaire vers le secteur privé.

évaluation au prix de marché
type: ConceptConcept
type: Concept
creator: Commission d'enrichissement de la langue française, FranceTerme
date parution JO: 2021-01-21
equivalent EN: mark-to-market @en
equivalent EN: mark-to-market (en)
equivalent EN: mark-to-market valuation @en
equivalent EN: mark-to-market valuation (en)
definition: Méthode comptable qui consiste à arrêter la valeur d’un actif ou d’un passif par référence à son prix de marché du moment.
in scheme: Économie générale
in scheme: Finance
in scheme: concept-SD-economie-generale-comptabilite
in scheme: concept-SD-finance-comptabilite
in scheme: concepts
notation: ECON1527
related: prix de marché
related: évalué au prix de marché
related: évaluation au prix de modèle
scope note: Cette publication annule et remplace celle du Journal officiel du 12 mai 2000.

retrait d'espèces à l'achat
type: ConceptConcept
type: Concept
creator: Commission d'enrichissement de la langue française, FranceTerme
date parution JO: 2021-01-21
deconseille ou frequent: cash back
deconseille ou frequent: cash-back
deconseille ou frequent: cashback
deconseille ou frequent: retrait à la caisse
definition: Pratique qui consiste à effectuer chez un commerçant, par un moyen électronique, un règlement qui dépasse le prix de l’achat afin de recevoir la différence en espèces.
in scheme: Économie et gestion d'entreprise
in scheme: concepts
notation: ECON1529
note: L’emploi de l’expression cash back, empruntée de l’anglais, est à proscrire.

conditions privilégiées
type: ConceptConcept
type: Concept
creator: Commission d'enrichissement de la langue française, FranceTerme
source: révision de l'arrêté du 6 janvier 1989
date parution JO: 2000-09-22
deconseille ou frequent: concessionnel
equivalent EN: concessional terms @en
equivalent EN: concessional terms (en)
definition: Conditions financières avantageuses par rapport à celles considérées comme normales.
in scheme: Finance
in scheme: concepts
notation: ECON153
note: Il convient d'éviter le terme « concessionnel ».

extensibilité d'un modèle économique
type: ConceptConcept
type: Concept
creator: Commission d'enrichissement de la langue française, FranceTerme
date parution JO: 2022-08-30
deconseille ou frequent: changement d'échelle
deconseille ou frequent: scalabilité
deconseille ou frequent: scalable
deconseille ou frequent: scaling
equivalent EN: businnes scalability @en
equivalent EN: businnes scalability (en)
equivalent EN: scalability @en
equivalent EN: scalability (en)
forme abregee: extensibilité, n.f.
part of speech: locution nominale féminine
definition: Capacité du modèle économique d’une entreprise à répondre sans modification structurelle aux changements d’échelle de son activité, notamment à une extension à d’autres aires géographiques, tout en conservant sa rentabilité.
in scheme: Économie et gestion d'entreprise
in scheme: concepts
notation: ECON1530
note: On trouve aussi l’expression « changement d’échelle ».
related: modèle d'entreprise
related: gazelle

licorne
type: ConceptConcept
type: Concept
creator: Commission d'enrichissement de la langue française, FranceTerme
date parution JO: 2022-08-30
equivalent EN: unicorn @en
equivalent EN: unicorn (en)
part of speech: nom féminin
definition: Gazelle dont la valeur est estimée à au moins un milliard d’euros.
in scheme: Économie et gestion d'entreprise
in scheme: concepts
notation: ECON1532
related: gazelle

conservation internationale
type: ConceptConcept
type: Concept
creator: Commission d'enrichissement de la langue française, FranceTerme
source: révision de l'arrêté du 11 février 1993
date parution JO: 2000-09-22
equivalent EN: global custody @en
equivalent EN: global custody (en)
definition: Activité de conservation, pour le compte de clients (banques, sociétés de bourse, maisons de titres, sociétés de gestion, etc.), de l'ensemble de leurs valeurs étrangères détenues sur les places étrangères.
in scheme: Finance
in scheme: concepts
notation: ECON154
note: Cette activité de conservation s'accompagne notamment du suivi et de l'exécution de toutes les opérations sur titres, dites « OST ».

coût, assurance et fret
type: ConceptConcept
type: Concept
creator: Commission d'enrichissement de la langue française, FranceTerme
abbreviation: CAF
date parution JO: 2004-04-24
equivalent EN: CIF @en
equivalent EN: CIF (en)
equivalent EN: cost, insurance and freight @en
equivalent EN: cost, insurance and freight (... named port of destination) @en
equivalent EN: cost, insurance and freight (... named port of destination) (en)
equivalent EN: cost, insurance and freight (en)
in scheme: Économie et gestion d'entreprise
in scheme: concepts
notation: ECON1544
scope note: Cette publication annule et remplace celle du Journal officiel du 14 août 1998.

coût et fret
type: ConceptConcept
type: Concept
creator: Commission d'enrichissement de la langue française, FranceTerme
abbreviation: CFR
date parution JO: 2004-04-24
equivalent EN: CFR @en
equivalent EN: CFR (en)
equivalent EN: cost and freight @en
equivalent EN: cost and freight (... named port of destination) @en
equivalent EN: cost and freight (... named port of destination) (en)
equivalent EN: cost and freight (en)
in scheme: Économie et gestion d'entreprise
in scheme: concepts
notation: ECON1545
scope note: Cette publication annule et remplace celle du Journal officiel du 14 août 1998.

usine (en)
type: ConceptConcept
type: Concept
creator: Commission d'enrichissement de la langue française, FranceTerme
abbreviation: ENU
date parution JO: 2004-04-24
equivalent EN: EXW @en
equivalent EN: EXW (en)
equivalent EN: ex works @en
equivalent EN: ex works (... named place) @en
equivalent EN: ex works (... named place) (en)
equivalent EN: ex works (en)
in scheme: Économie et gestion d'entreprise
in scheme: concepts
notation: ECON1546
scope note: Cette publication annule et remplace celle du Journal officiel du 14 août 1998.

franco le long du navire
type: ConceptConcept
type: Concept
creator: Commission d'enrichissement de la langue française, FranceTerme
abbreviation: FLN
date parution JO: 2004-04-24
equivalent EN: FAS @en
equivalent EN: FAS (en)
equivalent EN: free alongside ship @en
equivalent EN: free alongside ship (... named port of shipment) @en
equivalent EN: free alongside ship (... named port of shipment) (en)
equivalent EN: free alongside ship (en)
in scheme: Économie et gestion d'entreprise
in scheme: concepts
notation: ECON1547
scope note: Cette publication annule et remplace celle du terme « franco le long du bateau » au Journal officiel du 14 août 1998.

franco transporteur
type: ConceptConcept
type: Concept
creator: Commission d'enrichissement de la langue française, FranceTerme
abbreviation: FCT
date parution JO: 2004-04-24
equivalent EN: FCA @en
equivalent EN: FCA (en)
equivalent EN: free carrier @en
equivalent EN: free carrier (... named place) @en
equivalent EN: free carrier (... named place) (en)
equivalent EN: free carrier (en)
in scheme: Économie et gestion d'entreprise
in scheme: concepts
notation: ECON1548
scope note: Cette publication annule et remplace celle du Journal officiel du 14 août 1998.

port, assurance payés jusqu’à
type: ConceptConcept
type: Concept
creator: Commission d'enrichissement de la langue française, FranceTerme
abbreviation: PAP
date parution JO: 2004-04-24
equivalent EN: CIP @en
equivalent EN: CIP (en)
equivalent EN: carriage and insurance paid to @en
equivalent EN: carriage and insurance paid to (... named place of destination) @en
equivalent EN: carriage and insurance paid to (... named place of destination) (en)
equivalent EN: carriage and insurance paid to (en)
in scheme: Économie et gestion d'entreprise
in scheme: concepts
notation: ECON1549
scope note: Cette publication annule et remplace celle du terme « port et assurance payés » au Journal officiel du 14 août 1998.

conservation nationale
type: ConceptConcept
type: Concept
creator: Commission d'enrichissement de la langue française, FranceTerme
source: révision de l'arrêté du 11 février 1993
date parution JO: 2000-09-22
equivalent EN: local custody @en
equivalent EN: local custody (en)
equivalent EN: subcustody @en
equivalent EN: subcustody (en)
definition: Activité de conservation sur une place donnée, pour le compte de clients étrangers et nationaux (banques, maisons de titres, sociétés de gestion...), de l'ensemble des valeurs de la nationalité de cette place qu'ils détiennent.
in scheme: Finance
in scheme: concepts
notation: ECON155
note: Cette activité de conservation s'accompagne notamment du suivi et de l'exécution de toutes les opérations sur titres, dites « OST ».

port payé jusqu’à
type: ConceptConcept
type: Concept
creator: Commission d'enrichissement de la langue française, FranceTerme
abbreviation: POP
date parution JO: 2004-04-24
equivalent EN: CPT @en
equivalent EN: CPT (en)
equivalent EN: carriage paid to @en
equivalent EN: carriage paid to (... named place of destination) @en
equivalent EN: carriage paid to (... named place of destination) (en)
equivalent EN: carriage paid to (en)
in scheme: Économie et gestion d'entreprise
in scheme: concepts
notation: ECON1550
scope note: Cette publication annule et remplace celle du terme « port payé » au Journal officiel du 14 août 1998.

rendu droits acquittés
type: ConceptConcept
type: Concept
creator: Commission d'enrichissement de la langue française, FranceTerme
abbreviation: RDA
date parution JO: 2004-04-24
equivalent EN: DDP @en
equivalent EN: DDP (en)
equivalent EN: delivered duty paid @en
equivalent EN: delivered duty paid (... named place of destination) @en
equivalent EN: delivered duty paid (... named place of destination) (en)
equivalent EN: delivered duty paid (en)
in scheme: Économie et gestion d'entreprise
in scheme: concepts
notation: ECON1554
scope note: Cette publication annule et remplace celle du Journal officiel du 14 août 1998.

prix de marché
type: ConceptConcept
type: Concept
creator: Commission d'enrichissement de la langue française, FranceTerme
date parution JO: 2021-01-21
definition: Prix observé lors de transactions entre deux parties sur le marché financier et utilisé comme référence pour définir la valeur comptable des actifs et des passifs financiers.
in scheme: Économie générale
in scheme: Finance
in scheme: concept-SD-economie-generale-comptabilite
in scheme: concept-SD-finance-comptabilite
in scheme: concepts
notation: ECON1556
related: évaluation au prix de marché
related: évalué au prix de marché

évalué au prix de marché
type: ConceptConcept
type: Concept
creator: Commission d'enrichissement de la langue française, FranceTerme
date parution JO: 2021-01-21
deconseille ou frequent: évalué à prix de marché
equivalent EN: marked-to-market @en
equivalent EN: marked-to-market (en)
definition: Se dit de la valeur d’un actif ou d’un passif qui correspond à son prix de marché du moment.
in scheme: Économie générale
in scheme: Finance
in scheme: concept-SD-economie-generale-comptabilite
in scheme: concept-SD-finance-comptabilite
in scheme: concepts
notation: ECON1557
related: évaluation au prix de marché
related: prix de marché
scope note: Cette publication annule et remplace celle du terme « évalué à prix de marché » au Journal officiel du 12 mai 2000.

flottant, -e
type: ConceptConcept
type: Concept
creator: Commission d'enrichissement de la langue française, FranceTerme
source: révision de l'arrêté du 18 février 1987
date parution JO: 2000-09-22
equivalent EN: floating @en
equivalent EN: floating (en)
part of speech: adjectif
definition: Se dit du montant des chèques ou des effets déjà débités d'un compte et non encore crédités sur un autre compte.
in scheme: Finance
in scheme: concepts
notation: ECON1558

prisée
type: ConceptConcept
type: Concept
creator: Commission d'enrichissement de la langue française, FranceTerme
source: révision de l'arrêté du 11 février 1993
date parution JO: 2000-09-22
equivalent EN: pricing @en
equivalent EN: pricing (en)
part of speech: nom féminin
definition: Fixation de la valeur d'un bien ou d'un instrument financier à un moment donné, pour des raisons comptables, que ce soit sur un marché organisé ou un marché de gré à gré.
in scheme: Finance
in scheme: concepts
notation: ECON1559
related: prisée

contrat à terme d'instrument financier
type: ConceptConcept
type: Concept
creator: Commission d'enrichissement de la langue française, FranceTerme
source: révision de l'arrêté du 18 février 1987
abbreviation: CATIF
date parution JO: 2000-09-22
equivalent EN: financial futures @en
equivalent EN: financial futures (en)
definition: Engagement ferme, moyennant dépôt de garantie, d'acheter ou de vendre à une date fixée, à un prix convenu, une certaine quantité d'un instrument financier.
in scheme: Finance
in scheme: concepts
notation: ECON156
note: Le terme « contrat » désigne l'unité de transaction. Les contrats sont normalisés afin d'assurer la fongibilité, permettant ainsi l'établissement d'un véritable marché.

cybermonnaie
type: ConceptConcept
type: Concept
creator: Commission d'enrichissement de la langue française, FranceTerme
date parution JO: 2022-01-22
deconseille ou frequent: crypto-monnaie
deconseille ou frequent: cryptomonnaie
deconseille ou frequent: monnaie digitale
deconseille ou frequent: monnaie numérique
deconseille ou frequent: monnaie virtuelle
equivalent EN: crypto currency @en
equivalent EN: crypto currency (en)
equivalent EN: cryptocurrency @en
equivalent EN: cryptocurrency (en)
part of speech: nom féminin
definition: Ensemble de cyberjetons de même nature pouvant servir à des paiements, à l’instar d’une monnaie ayant cours légal.
in scheme: Finance
in scheme: Informatique
in scheme: concept-SD-finance-internet
in scheme: concept-SD-informatique-internet
in scheme: concepts
notation: ECON1561
note: 1. Des plateformes proposent d’échanger les cyberjetons de certaines cybermonnaies contre de la monnaie ayant cours légal.
note: 2. Les cybermonnaies ne doivent pas être confondues avec la monnaie électronique.
note: 3. On trouve aussi les termes « monnaie virtuelle » et « cryptomonnaie », qui sont déconseillés, et « monnaie digitale », qui est à proscrire.
related: dispositif d'enregistrement électronique partagé
related: cyberjeton
related: monnaie numérique de banque centrale
related: cyberjeton indexé
related: pair à pair
related: chaîne de blocs
related: minage
related: monnaie électronique
related: validation de bloc
related: concept-JURI58
related: concept-JURI67
scope note: Cette publication annule et remplace celle du Journal officiel du 23 mai 2017.

monnaie numérique de banque centrale
type: ConceptConcept
type: Concept
creator: Commission d'enrichissement de la langue française, FranceTerme
abbreviation: MNBC
date parution JO: 2022-01-22
deconseille ou frequent: monnaie centrale digitale
deconseille ou frequent: monnaie centrale numérique
deconseille ou frequent: monnaie digitale de bnque centrale
equivalent EN: CBDC @en
equivalent EN: CBDC (en)
equivalent EN: central bank digital currency @en
equivalent EN: central bank digital currency (en)
definition: Monnaie émise par une banque centrale sous une forme numérique.
in scheme: Finance
in scheme: concepts
notation: ECON1562
related: cybermonnaie
related: monnaie électronique

marché à terme
type: ConceptConcept
type: Concept
creator: Commission d'enrichissement de la langue française, FranceTerme
date parution JO: 2022-01-22
deconseille ou frequent: marché de gré à gré
deconseille ou frequent: marché organisé
equivalent EN: forward market @en
equivalent EN: forward market (en) [marché de gré à gré]
equivalent EN: futures market @en
equivalent EN: futures market (en) [marché organisé]
definition: Marché sur lequel sont établis les cours à terme.
in scheme: Finance
in scheme: concepts
notation: ECON1563
note: Lorsque les transactions sont réalisées directement entre les parties, le marché à terme est qualifié « de gré à gré ». Lorsque les transactions sont réalisées par l’intermédiaire d’une bourse, qu’elle soit physique ou électronique, le marché à terme est qualifié d’« organisé ».
related: contrat à terme de taux
related: cours à terme
related: couverture
related: marché à terme d'instruments financiers
scope note: Cette publication annule et remplace celle des termes « marché à terme » et « marché de contrats à terme » au Journal officiel du 22 septembre 2000.

évaluation au prix de modèle
type: ConceptConcept
type: Concept
creator: Commission d'enrichissement de la langue française, FranceTerme
date parution JO: 2022-01-22
equivalent EN: mark-to-model @en
equivalent EN: mark-to-model (en)
equivalent EN: mark-to-model valuation @en
equivalent EN: mark-to-model valuation (en)
definition: Méthode comptable qui consiste, lorsque le prix de marché n’est pas considéré comme représentatif, à arrêter la valeur à laquelle un actif ou un passif financiers pourraient être transférés à un tiers en se référant à un modèle d’évaluation établi par des experts.
in scheme: Économie générale
in scheme: Finance
in scheme: concept-SD-economie-generale-comptabilite
in scheme: concept-SD-finance-comptabilite
in scheme: concepts
notation: ECON1564
note: L’évaluation d’un portefeuille de créances repose par exemple sur un modèle prenant en compte l’estimation des probabilités de non-remboursement.
related: évaluation au prix de marché

mise en pension
type: ConceptConcept
type: Concept
creator: Commission d'enrichissement de la langue française, FranceTerme
date parution JO: 2022-01-22
equivalent EN: repo @en
equivalent EN: repo (en)
equivalent EN: repurchase agreement @en
equivalent EN: repurchase agreement (en)
definition: Emprunt en numéraire réalisé par une institution financière sur le marché monétaire, qui consiste à vendre des titres avec un horizon et un prix de rachat fixés d’avance, le prix de rachat étant en général supérieur au prix de vente.
in scheme: Finance
in scheme: concepts
notation: ECON1566
note: À la différence du prêt-emprunt de titres, la mise en pension permet à celui qui cède des titres d’obtenir des liquidités.
related: prêt-emprunt de titres
related: prise en pension

prise en pension
type: ConceptConcept
type: Concept
creator: Commission d'enrichissement de la langue française, FranceTerme
date parution JO: 2022-01-22
equivalent EN: reverse repo @en
equivalent EN: reverse repo (en)
definition: Prêt en numéraire consenti par une institution financière sur le marché monétaire, qui consiste à acheter des titres avec un horizon et un prix de revente fixés d’avance, le prix de revente étant en général supérieur au prix d’achat.
in scheme: Finance
in scheme: concepts
notation: ECON1567
note: En cas de non-remboursement à l’échéance, le prêteur conserve les titres qui lui ont été cédés et ne supporte donc qu’un risque de variation de leur cours.
related: prêt-emprunt de titres
related: mise en pension

titrisation en cyberjetons
type: ConceptConcept
type: Concept
creator: Commission d'enrichissement de la langue française, FranceTerme
date parution JO: 2022-01-22
equivalent EN: tokenisation (GB) @en
equivalent EN: tokenisation (en-GB)
equivalent EN: tokenization (US) @en
equivalent EN: tokenization (en-US)
alternative label: conversion en jetons
definition: Émission, au moyen d’un dispositif d’enregistrement électronique partagé, de cyberjetons qui sont adossés à un actif, en vue notamment de faciliter la vente en tout ou partie de cet actif.
in scheme: Finance
in scheme: Informatique
in scheme: concept-SD-finance-internet
in scheme: concept-SD-informatique-internet
in scheme: concepts
notation: ECON1569
note: Le cyberjeton sert d’unité de compte dans le cas d’un fractionnement de l’actif en parts.
related: dispositif d'enregistrement électronique partagé
related: actif numérique
related: cyberjeton
related: titrisation

contrat d'assurance vie universelle
type: ConceptConcept
type: Concept
creator: Commission d'enrichissement de la langue française, FranceTerme
source: révision de l'arrêté du 6 janvier 1989
date parution JO: 2000-09-22
equivalent EN: universal futures @en
equivalent EN: universal futures (en)
forme abregee: vie universelle
definition: Contrat d'assurance vie dans lequel le souscripteur peut, dans certaines limites, modifier à sa guise l'importance relative de l'épargne et des garanties en cas de décès.
in scheme: Assurance
in scheme: concepts
notation: ECON157
related: concept-assurance

entité ad hoc
type: ConceptConcept
type: Concept
creator: Commission d'enrichissement de la langue française, FranceTerme
date parution JO: 2022-01-22
deconseille ou frequent: structure de titrisation
equivalent EN: SPC @en
equivalent EN: SPC (en)
equivalent EN: SPE @en
equivalent EN: SPE (en)
equivalent EN: SPV @en
equivalent EN: SPV (en)
equivalent EN: special purpose company @en
equivalent EN: special purpose company (en)
equivalent EN: special purpose entity @en
equivalent EN: special purpose entity (en)
equivalent EN: special purpose vehicle @en
equivalent EN: special purpose vehicle (en)
definition: Structure juridique créée spécifiquement pour mener à bien une opération pour le compte d’une organisation publique ou privée.
in scheme: Finance
in scheme: concepts
notation: ECON1570
note: Une entité ad hoc peut être utilisée dans le cas d’opérations de titrisation. On parle alors de « structure de titrisation ».
related: fonds multicédant
related: contrat d'assurance titrisé
related: obligation-catastrophe
related: titrisation
related: titriser
related: actif titrisé
related: créance hypothécaire titrisée
related: structure de défaisance
scope note: Cette publication annule et remplace celle du terme « structure de titrisation » au Journal officiel du 28 décembre 2006. Les occurrences de « structure de titrisation » dans les définitions et notes de « contrat d’assurance titrisé », « fonds multicédant », « obligation-catastrophe » et « titre de créance adossé » sont remplacées par « entité ad hoc ».

titrisation
type: ConceptConcept
type: Concept
creator: Commission d'enrichissement de la langue française, FranceTerme
date parution JO: 2022-01-22
equivalent EN: securitisation (GB) @en
equivalent EN: securitisation (en-GB)
equivalent EN: securitization (US) @en
equivalent EN: securitization (en-US)
part of speech: nom féminin
definition: Opération par laquelle est cédé un ensemble d’actifs à une entité ad hoc, qui émet des titres négociables adossés à ces actifs pour financer cette acquisition.
in scheme: Finance
in scheme: concepts
notation: ECON1571
note: La titrisation permet à l’entité cédante de transférer un risque ou de se financer.
related: modèle d'octroi puis de cession de crédits
related: finance parallèle
related: prêt à haut risque
related: technique d'atténuation des risques
related: titrisation en cyberjetons
related: entité ad hoc
related: titriser
related: titrisable
related: actif titrisé
related: créance hypothécaire titrisée
scope note: Cette publication annule et remplace celle du Journal officiel du 22 septembre 2000.

titriser
type: ConceptConcept
type: Concept
creator: Commission d'enrichissement de la langue française, FranceTerme
date parution JO: 2022-01-22
equivalent EN: securitise (GB) @en
equivalent EN: securitise (en-GB)
equivalent EN: securitize (US) @en
equivalent EN: securitize (en-US)
part of speech: verbe
definition: Céder un ensemble d’actifs à une entité ad hoc, qui émet des titres négociables adossés à ces actifs pour financer cette acquisition.
in scheme: Finance
in scheme: concepts
notation: ECON1572
related: entité ad hoc
related: titrisation
scope note: Cette publication annule et remplace celle du Journal officiel du 22 septembre 2000.

titrisable
type: ConceptConcept
type: Concept
creator: Commission d'enrichissement de la langue française, FranceTerme
date parution JO: 2022-01-22
equivalent EN: securitisable (GB) @en
equivalent EN: securitisable (en-GB)
equivalent EN: securitizable (US) @en
equivalent EN: securitizable (en-US)
part of speech: adjectif
definition: Se dit d’un actif susceptible d’être titrisé.
in scheme: Finance
in scheme: concepts
notation: ECON1573
related: titrisation
related: actif titrisé
scope note: Cette publication annule et remplace celle du Journal officiel du 22 septembre 2000.

actif titrisé
type: ConceptConcept
type: Concept
creator: Commission d'enrichissement de la langue française, FranceTerme
date parution JO: 2022-01-22
equivalent EN: ABS @en
equivalent EN: ABS (en)
equivalent EN: asset-backed securities @en
equivalent EN: asset-backed securities (en)
definition: Titre négociable émis par une entité ad hoc pour financer l’acquisition d’actifs.
in scheme: Finance
in scheme: concepts
notation: ECON1574
note: Un actif titrisé prend généralement le nom de la catégorie d’actifs achetés par l’entité ad hoc. La créance hypothécaire titrisée et le contrat d’assurance titrisé sont des exemples d’actifs titrisés.
related: billet de trésorerie
related: contrat d'assurance titrisé
related: entité ad hoc
related: titrisation
related: titrisable
related: créance hypothécaire titrisée
scope note: Cette publication annule et remplace celle des termes « billet de trésorerie adossé à des créances titrisées » et « titre adossé à des créances titrisées » au Journal officiel du 19 janvier 2010.

créance hypothécaire titrisée
type: ConceptConcept
type: Concept
creator: Commission d'enrichissement de la langue française, FranceTerme
abbreviation: CHT
date parution JO: 2022-01-22
deconseille ou frequent: mortgage backed securities
deconseille ou frequent: mortgage backed security
deconseille ou frequent: mortgage-backed security
equivalent EN: MBS @en
equivalent EN: MBS (en)
equivalent EN: mortgage-backed securities @en
equivalent EN: mortgage-backed securities (en)
definition: Titre négociable émis par une entité ad hoc pour financer l’acquisition de créances hypothécaires.
in scheme: Finance
in scheme: concepts
notation: ECON1575
related: entité ad hoc
related: titrisation
related: actif titrisé
scope note: Cette publication annule et remplace celle du Journal officiel du 28 décembre 2006.

asymétrie fiscale
type: ConceptConcept
type: Concept
creator: Commission d'enrichissement de la langue française, FranceTerme
date parution JO: 2022-01-22
equivalent EN: hybrid mismatch @en
equivalent EN: hybrid mismatch (en)
definition: Ensemble de discordances entre des systèmes fiscaux nationaux ou entre ces systèmes et les règles internationales, qui peuvent notamment apparaître dans la qualification fiscale d’un contribuable au regard de ces différents systèmes et règles.
in scheme: Économie générale
in scheme: concept-SD-economie-generale-fiscalite
in scheme: concepts
notation: ECON1576
note: L’asymétrie fiscale peut être exploitée à des fins d’évasion fiscale.
related: minoration de la base

minoration de la base
type: ConceptConcept
type: Concept
creator: Commission d'enrichissement de la langue française, FranceTerme
date parution JO: 2022-01-22
equivalent EN: base erosion @en
equivalent EN: base erosion (en)
definition: Diminution de l’assiette de l’impôt, qui est obtenue au moyen d’opérations financières exploitant notamment les régimes de déduction ou l’asymétrie fiscale, dans un but d’optimisation.
in scheme: Économie générale
in scheme: concept-SD-economie-generale-fiscalite
in scheme: concepts
notation: ECON1577
note: 1. La conclusion de prêts entre sociétés d’une entreprise multinationale en vue de produire des intérêts déductibles de l’assiette de l’impôt sur les sociétés, ou le recours à une opération transnationale qui permet de bénéficier d’une déduction dans une juridiction sans entraîner d’imposition supplémentaire dans une autre, sont des exemples de minoration de la base.
note: 2. La minoration de la base peut être exploitée à des fins d’évasion fiscale.
related: transfert de bénéfices
related: asymétrie fiscale

redomiciliation fiscale
type: ConceptConcept
type: Concept
creator: Commission d'enrichissement de la langue française, FranceTerme
date parution JO: 2022-01-22
equivalent EN: tax inversion @en
equivalent EN: tax inversion (en)
definition: Réorganisation d’un groupe de sociétés destinée à transférer son domicile fiscal dans une juridiction dont la fiscalité permet une optimisation.
in scheme: Économie générale
in scheme: concept-SD-economie-generale-fiscalite
in scheme: concepts
notation: ECON1578

croissance partagée
type: ConceptConcept
type: Concept
creator: Commission d'enrichissement de la langue française, FranceTerme
date parution JO: 2022-01-22
deconseille ou frequent: croissance inclusive
equivalent EN: inclusive growth @en
equivalent EN: inclusive growth (en)
definition: Croissance économique qui bénéficie à toutes les catégories de la population.
in scheme: Économie générale
in scheme: Sciences humaines
in scheme: concepts
notation: ECON1579
note: On trouve aussi, dans le langage professionnel, le terme « croissance inclusive », qui n’est pas recommandé.

correspondant en valeurs du Trésor
type: ConceptConcept
type: Concept
creator: Commission d'enrichissement de la langue française, FranceTerme
source: révision de l'arrêté du 30 septembre 1991
abbreviation: CVT
date parution JO: 2000-09-22
equivalent EN: reporting dealer @en
equivalent EN: reporting dealer (en)
definition: Établissement ayant obtenu un statut particulier relatif à l'émission, au placement et au marché secondaire des valeurs du Trésor.
in scheme: Finance
in scheme: concepts
notation: ECON158
note: 1. Les correspondants en valeurs du Trésor sont sélectionnés par l'État pour l'importance de leurs souscriptions aux émissions de titres de la dette publique, pour leur capacité à les placer en France et à l'étranger.
note: 2. Ils s'engagent à soumissionner régulièrement aux adjudications, à contribuer en permanence à la liquidité du marché secondaire et à effectuer progressivement la tenue du marché des titres de la dette publique.
note: 3. Les correspondants en valeurs du Trésor ont naturellement vocation à obtenir le statut de spécialistes en valeurs du Trésor.

distribution monétaire sans contrepartie
type: ConceptConcept
type: Concept
creator: Commission d'enrichissement de la langue française, FranceTerme
date parution JO: 2022-01-22
deconseille ou frequent: hélicoptère monétaire
deconseille ou frequent: monnaie hélicoptère
equivalent EN: helicopter money @en
equivalent EN: helicopter money (en)
forme abregee: distribution sans contrepartie
definition: Distribution gracieuse de liquidités, notamment aux ménages, effectuée à l’initiative de l’État dans le but de relancer l’activité économique.
in scheme: Économie générale
in scheme: Finance
in scheme: concepts
notation: ECON1580
note: 1. La distribution monétaire sans contrepartie se traduit par une augmentation de la masse monétaire.
note: 2. On trouve aussi, dans le langage professionnel, les termes « hélicoptère monétaire » et « monnaie hélicoptère », qui sont déconseillés.
related: politique d'expansion monétaire

cyberjeton indexé
type: ConceptConcept
type: Concept
creator: Commission d'enrichissement de la langue française, FranceTerme
date parution JO: 2022-01-22
deconseille ou frequent: cryptomonnaie stable
deconseille ou frequent: jeton stable
deconseille ou frequent: stable coin
equivalent EN: asset-referenced token @en
equivalent EN: asset-referenced token (en)
equivalent EN: stablecoin @en
equivalent EN: stablecoin (en)
forme abregee: jeton indexé
definition: Cyberjeton dont la valeur est fixée en référence à une monnaie, à un panier de monnaies, ou, plus généralement, à un portefeuille d’actifs.
in scheme: Économie générale
in scheme: Finance
in scheme: concepts
notation: ECON1581
note: On trouve aussi, dans le langage professionnel, les termes « jeton stable » et « cryptomonnaie stable », qui sont déconseillés.
related: cyberjeton
related: cybermonnaie

référencement non payant sur la toile
type: ConceptConcept
type: Concept
creator: Commission d'enrichissement de la langue française, FranceTerme
abbreviation: RNPT
deconseille ou frequent: search engine optimisation
equivalent EN: SEM @en
equivalent EN: SEM (en)
equivalent EN: SEO @en
equivalent EN: SEO (en)
equivalent EN: search engine marketing @en
equivalent EN: search engine marketing (en)
equivalent EN: search engine optimization @en
equivalent EN: search engine optimization (en)
equivalent EN: search marketing @en
equivalent EN: search marketing (en)
forme abregee: référencement non payant
alternative label: référencement naturel
definition: Référencement sur la toile qui s’obtient en optimisant les contenus du site pour correspondre aux caractéristiques des algorithmes des moteurs de recherche.
in scheme: Économie et gestion d'entreprise
in scheme: Informatique
in scheme: concepts
notation: ECON1582
related: référencement payant
related: référencement par les réseaux sociaux

référencement payant
type: ConceptConcept
type: Concept
creator: Commission d'enrichissement de la langue française, FranceTerme
abbreviation: RP
date parution JO: 2022-08-30
deconseille ou frequent: PPC
deconseille ou frequent: Pay-Per-Click
deconseille ou frequent: paid referencing
equivalent EN: SEA @en
equivalent EN: SEA (en)
equivalent EN: paid search @en
equivalent EN: paid search (en)
equivalent EN: search engine advertising @en
equivalent EN: search engine advertising (en)
forme abregee: référencement payant
part of speech: locution nominale masculine
definition: Ensemble de techniques qui permettent d’assurer à un site de la toile, moyennant paiement, une meilleure position dans les résultats proposés par les moteurs de recherche.
in scheme: Économie et gestion d'entreprise
in scheme: Informatique
in scheme: concepts
notation: ECON1583
note: Le référencement payant fait appel notamment à l’achat de mots clés ou d’espace publicitaire sous forme de bannière textuelle, graphique ou vidéo.
related: référencement non payant sur la toile
related: référencement par les réseaux sociaux
related: référencement non payant

référencement par les réseaux sociaux
type: ConceptConcept
type: Concept
creator: Commission d'enrichissement de la langue française, FranceTerme
abbreviation: RRS
date parution JO: 2022-08-30
deconseille ou frequent: social media optimisation
equivalent EN: SMO @en
equivalent EN: SMO (en)
equivalent EN: social media optimization @en
equivalent EN: social media optimization (en)
part of speech: locution nominale masculine
definition: Pratique qui consiste à utiliser les réseaux sociaux, notamment leur fonction de partage, pour assurer à un site de la toile une meilleure position dans les résultats proposés par les moteurs de recherche.
in scheme: Communication
in scheme: Économie et gestion d'entreprise
in scheme: concepts
notation: ECON1584
note: Le référencement par les réseaux sociaux est notamment mis en œuvre par des animateurs de communauté.
related: animateur, -trice de communauté
related: référencement non payant sur la toile
related: référencement payant
related: référencement non payant

transformation numérique
type: ConceptConcept
type: Concept
creator: Commission d'enrichissement de la langue française, FranceTerme
deconseille ou frequent: digitalisation
equivalent EN: digitisation (GB) @en
equivalent EN: digitisation (en-GB)
equivalent EN: digitising (GB) @en
equivalent EN: digitising (en-GB)
equivalent EN: digitization (US) @en
equivalent EN: digitization (en-US)
equivalent EN: digitizing (US) @en
equivalent EN: digitizing (en-US)
alternative label: numérisation
definition: Transformation d’une activité économique, commerciale ou managériale ou d’un processus d’une organisation, qui met en œuvre de façon systématique la collecte, le traitement et l’exploitation de données numériques relatives à cette activité ou à ce processus.
in scheme: Économie et gestion d'entreprise
in scheme: Économie générale
in scheme: concepts
notation: ECON1585
note: On trouve aussi le terme « digitalisation », qui est à proscrire.

gazelle
type: ConceptConcept
type: Concept
creator: Commission d'enrichissement de la langue française, FranceTerme
date parution JO: 2022-08-30
equivalent EN: scalable start-up @en
equivalent EN: scalable start-up (en)
equivalent EN: scale up @en
equivalent EN: scale up (en)
equivalent EN: scale up company @en
equivalent EN: scale up company (en)
equivalent EN: scaleup @en
equivalent EN: scaleup (en)
part of speech: nom féminin
definition: Jeune pousse dont la croissance soutenue pendant plusieurs exercices atteste l’extensibilité du modèle économique.
in scheme: Économie et gestion d'entreprise
in scheme: concepts
notation: ECON1586
note: Les perspectives de croissance d’une entreprise gazelle permettent une évaluation favorable à la mobilisation de capitaux extérieurs.
related: extensibilité d'un modèle économique
related: licorne
related: jeune pousse

conception à objectif de coût
type: ConceptConcept
type: Concept
creator: Commission d'enrichissement de la langue française, FranceTerme
abbreviation: COC
date parution JO: 2022-08-30
deconseille ou frequent: conception par les coûts
deconseille ou frequent: conception à coût objectif
deconseille ou frequent: design-to-cost
equivalent EN: DTC @en
equivalent EN: DTC (en)
equivalent EN: design to cost @en
equivalent EN: design to cost (en)
part of speech: locution nominale féminine
alternative label: conception sous contrainte de coût
definition: Conception d’un produit fondée sur un objectif prioritaire de coût de revient prédéfini, selon la méthode des coûts cibles.
in scheme: Économie et gestion d'entreprise
in scheme: Économie générale
in scheme: Industrie
in scheme: concepts
notation: ECON1587
related: méthode des coûts cibles

observance commerciale
type: ConceptConcept
type: Concept
creator: Commission d'enrichissement de la langue française, FranceTerme
date parution JO: 2022-08-30
deconseille ou frequent: compliance marketing
equivalent EN: marketing compliance @en
equivalent EN: marketing compliance (en)
part of speech: locution nominale féminine
alternative label: respect des règles commerciales
definition: Respect par une entreprise, dans l’ensemble de ses pratiques, de la règlementation, des normes et des usages commerciaux qui régissent son secteur d’activité.
in scheme: Économie et gestion d'entreprise
in scheme: concepts
notation: ECON1588
note: L’emploi de l’expression compliance marketing, empruntée de l’anglais, est à proscrire.

communication opportuniste
type: ConceptConcept
type: Concept
creator: Commission d'enrichissement de la langue française, FranceTerme
date parution JO: 2022-08-30
equivalent EN: ambush marketing @en
equivalent EN: ambush marketing (en)
part of speech: locution nominale féminine
definition: Technique de communication consistant, pour une entreprise, à profiter du retentissement médiatique d’un évènement dont elle n’est ni l’organisatrice ni la partenaire pour gagner en visibilité et en notoriété.
in scheme: Communication
in scheme: Économie et gestion d'entreprise
in scheme: concept-SD-communication-publicite
in scheme: concept-SD-economie-et-gestion-d-entreprise-publicite
in scheme: concepts
notation: ECON1589

couponnage
type: ConceptConcept
type: Concept
creator: Commission d'enrichissement de la langue française, FranceTerme
source: révision de l'arrêté du 30 septembre 1991
date parution JO: 2000-09-22
equivalent EN: couponing @en
equivalent EN: couponing (en)
part of speech: nom masculin
definition: Distribution de coupons permettant d'obtenir un avantage sur l'achat d'un produit.
in scheme: Économie et gestion d'entreprise
in scheme: concepts
notation: ECON159

plan de marchéage
type: ConceptConcept
type: Concept
creator: Commission d'enrichissement de la langue française, FranceTerme
deconseille ou frequent: marchéage
equivalent EN: 4P @en
equivalent EN: 4P (en)
equivalent EN: marketing mix @en
equivalent EN: marketing mix (en)
equivalent EN: mix marketing @en
equivalent EN: mix marketing (en)
equivalent EN: product, price, promotion, place @en
equivalent EN: product, price, promotion, place (en)
definition: Plan d’action commerciale permettant à une entreprise ou à une marque de mettre en cohérence les décisions relatives aux politiques de produit, de prix, de distribution et de communication.
in scheme: Économie et gestion d'entreprise
in scheme: concepts
notation: ECON1590

jeton d'authentification
type: ConceptConcept
type: Concept
equivalent EN: NFT (en)
equivalent EN: non-fungible token (en)
definition: Cyberjeton qui permet d’identifier de manière unique un contenu numérique, voire un objet physique, et d’exposer les droits qui s’y attachent.
in scheme: Arts
in scheme: Finance
in scheme: concepts
note: 1. Les cyberjetons d’authentification sont notamment utilisés pour certifier les exemplaires d’une série de créations numériques.
note: 2. On trouve aussi jeton non fongible qui est déconseillé.
related: cyberjeton

structure de défaisance
type: ConceptConcept
type: Concept
creator: Commission d'enrichissement de la langue française, FranceTerme
date parution JO: 2022-01-22
deconseille ou frequent: banque de défaisance
equivalent EN: bad bank @en
equivalent EN: bad bank (en)
alternative label: structure de cantonnement
definition: Entité ad hoc créée pour recueillir et gérer des actifs de mauvaise qualité cédés par une institution qui cherche ainsi à améliorer son bilan.
in scheme: Finance
in scheme: concepts
notation: ECON1592
note: L’expression « banque de défaisance » est à déconseiller dans la mesure où une structure de défaisance n’a pas nécessairement d’agrément bancaire.
related: défaisance
related: entité ad hoc
scope note: Cette publication annule et remplace celle du Journal officiel du 7 décembre 2018.

référencement non payant
type: ConceptConcept
type: Concept
creator: Commission d'enrichissement de la langue française, FranceTerme
abbreviation: RNP
date parution JO: 2022-08-30
deconseille ou frequent: référencement naturel
deconseille ou frequent: search engine optimisation
equivalent EN: SEO @en
equivalent EN: SEO (en)
equivalent EN: search engine optimization @en
equivalent EN: search engine optimization (en)
part of speech: locution nominale masculine
definition: Ensemble de techniques qui permettent d’assurer à un site de la toile, sans recourir à des moyens payants, une meilleure position dans les résultats proposés par les moteurs de recherche en adaptant le contenu de ce site aux caractéristiques des algorithmes des moteurs.
in scheme: Économie et gestion d'entreprise
in scheme: Informatique
in scheme: concepts
notation: ECON1593
note: 1. Le référencement non payant peut être pratiqué par des animateurs de communauté dans les réseaux sociaux, par exemple quand ils utilisent des mots clés ou insèrent des liens hypertextuels.
note: 2. On trouve aussi, dans le langage professionnel, le terme « référencement naturel ».
related: animateur, -trice de communauté
related: référencement payant
related: référencement par les réseaux sociaux

coup sûr
type: ConceptConcept
type: Concept
creator: Commission d'enrichissement de la langue française, FranceTerme
source: révision de l'arrêté du 7 juillet 1994
date parution JO: 2000-09-22
equivalent EN: one-shot @en
equivalent EN: one-shot (en)
definition: Opération consistant à lancer une production en étant assuré de son succès.
in scheme: Économie et gestion d'entreprise
in scheme: concepts
notation: ECON160

coup unique
type: ConceptConcept
type: Concept
creator: Commission d'enrichissement de la langue française, FranceTerme
source: révision de l'arrêté du 7 juillet 1994
date parution JO: 2000-09-22
equivalent EN: one-shot @en
equivalent EN: one-shot (en)
definition: Opération à caractère exceptionnel éventuellement assortie d'un certain risque.
in scheme: Finance
in scheme: concepts
notation: ECON161

cours (dans le)
type: ConceptConcept
type: Concept
creator: Commission d'enrichissement de la langue française, FranceTerme
source: révision de l'arrêté du 6 janvier 1989
date parution JO: 2000-09-22
deconseille ou frequent: dans le cours
equivalent EN: in the money @en
equivalent EN: in the money (en)
part of speech: locution
definition: Dans le cadre des options négociables, qualifie une option dont la valeur intrinsèque est positive, son prix d'exercice étant inférieur au cours du titre support pour une option d'achat, et supérieur pour une option de vente.
in scheme: Finance
in scheme: concepts
notation: ECON162

coûts salariaux indirects
type: ConceptConcept
type: Concept
creator: Commission d'enrichissement de la langue française, FranceTerme
source: révision de l'arrêté du 6 janvier 1989
date parution JO: 2000-09-22
deconseille ou frequent: non-wage labor costs
equivalent EN: non-wage labour costs @en
equivalent EN: non-wage labour costs (en)
definition: Charges annexes au salaire brut, obligatoires ou non, constituées essentiellement des cotisations sociales versées par les employeurs.
in scheme: Économie générale
in scheme: concepts
notation: ECON163
note: Il convient d'éviter de parler dans ce cas des « coûts de main-d'œuvre non salariaux ».

couverture
type: ConceptConcept
type: Concept
creator: Commission d'enrichissement de la langue française, FranceTerme
source: révision de l'arrêté du 6 janvier 1989
date parution JO: 2000-09-22
equivalent EN: hedging @en
equivalent EN: hedging (en)
part of speech: nom féminin
definition: Opération ou suite d'opérations de marché ayant pour but de couvrir, ou de compenser, totalement ou partiellement, un risque de variation d'un élément d'actif ou de passif, ce risque provenant d'une fluctuation des cours des titres, des devises ou des taux d'intérêt (ou des prix des matières premières pour les marchandises).
in scheme: Finance
in scheme: concepts
notation: ECON164
note: Les opérations de couverture s'effectuent sur des marchés à terme organisés (marché à terme d'instruments financiers - MATIF, marché des options négociables de Paris - MONEP, marché à terme des marchandises), ou sur des marchés de gré à gré.
related: marché à terme
related: marché à terme d'instruments financiers

crédit additionnel
type: ConceptConcept
type: Concept
creator: Commission d'enrichissement de la langue française, FranceTerme
source: révision de l'arrêté du 11 janvier 1990
date parution JO: 2000-09-22
equivalent EN: fresh money @en
equivalent EN: fresh money (en)
definition: Crédit nouveau consenti par un syndicat de banques ou organismes financiers dans le cadre d'accords de restructuration de la dette de certains pays.
in scheme: Finance
in scheme: concepts
notation: ECON165
related: crédit de restructuration

crédit à taux révisable
type: ConceptConcept
type: Concept
creator: Commission d'enrichissement de la langue française, FranceTerme
source: révision de l'arrêté du 18 février 1987
date parution JO: 2000-09-22
equivalent EN: rollover credit @en
equivalent EN: rollover credit (en)
definition: Crédit généralement à moyen terme pour lequel les échéances d'intérêt sont effectuées à taux renouvelable à des intervalles déterminés (en général trois ou six mois).
in scheme: Finance
in scheme: concepts
notation: ECON166
related: crédit permanent

crédit-bail
type: ConceptConcept
type: Concept
creator: Commission d'enrichissement de la langue française, FranceTerme
source: révision de l'arrêté du 29 novembre 1973
date parution JO: 2000-09-22
equivalent EN: leasing @en
equivalent EN: leasing (en)
part of speech: nom masculin
definition: Technique de crédit dans laquelle le prêteur offre à l'emprunteur la location d'un bien, assortie d'une promesse unilatérale de vente, qui peut se dénouer par le transfert de la propriété à l'emprunteur.
in scheme: Finance
in scheme: concepts
notation: ECON167
note: 1. Cette technique fait, en France, l'objet d'une règlementation législative explicite.
note: 2. Pluriel : crédits-bail.
related: cession-bail
related: location avec option d'achat
related: bail financier

crédit croisé
type: ConceptConcept
type: Concept
creator: Commission d'enrichissement de la langue française, FranceTerme
source: révision de l'arrêté du 11 janvier 1990
date parution JO: 2000-09-22
equivalent EN: cross currency swap @en
equivalent EN: cross currency swap (en)
definition: Échange temporaire entre banques centrales d'un certain montant de leurs monnaies respectives afin de soutenir le cours de change de l'une d'elles.
in scheme: Finance
in scheme: concepts
notation: ECON168
note: Le crédit croisé correspond à une catégorie d'échange financier.
related: échange de devises dues

crédit de restructuration
type: ConceptConcept
type: Concept
creator: Commission d'enrichissement de la langue française, FranceTerme
source: révision de l'arrêté du 18 février 1987
date parution JO: 2000-09-22
equivalent EN: new money @en
equivalent EN: new money (en)
definition: Dans le cadre particulier de la restructuration de la dette de certains pays, financement additionnel à moyen terme réparti entre les banques au prorata de leurs encours sur le pays considéré et associé à un rééchelonnement.
in scheme: Finance
in scheme: concepts
notation: ECON169
note: Le crédit de restructuration se fait dans le cadre d'une procédure administrée par les banques elles-mêmes.
related: crédit additionnel

crédit de sécurité
type: ConceptConcept
type: Concept
creator: Commission d'enrichissement de la langue française, FranceTerme
source: révision de l'arrêté du 11 janvier 1990
date parution JO: 2000-09-22
equivalent EN: swing line @en
equivalent EN: swing line (en)
definition: Dans le cadre des facilités de crédit internationales, ligne de crédit relais adossée à une émission de billets à court terme, permettant à l'émetteur des tirages de très courte durée (rarement plus de dix jours) entre le remboursement d'une émission arrivée à échéance et son renouvellement, dans le cas de conditions du marché moins favorables à une nouvelle émission.
in scheme: Finance
in scheme: concepts
notation: ECON170

crédit permanent
type: ConceptConcept
type: Concept
creator: Commission d'enrichissement de la langue française, FranceTerme
source: révision de l'arrêté du 11 janvier 1990
date parution JO: 2000-09-22
equivalent EN: revolving credit @en
equivalent EN: revolving credit (en)
definition: Technique selon laquelle un établissement prêteur ouvre à un client un crédit dans la limite d'un montant maximal qui, pendant la durée du contrat, peut être utilisé en totalité ou en partie aux dates et au choix du client.
in scheme: Finance
in scheme: concepts
notation: ECON171
note: Les remboursements librement effectués dans le cadre du contrat reconstituent le crédit à concurrence du capital remboursé, permettant ainsi au client de nouvelles utilisations.
related: crédit à taux révisable

crédit ponctuel
type: ConceptConcept
type: Concept
creator: Commission d'enrichissement de la langue française, FranceTerme
source: révision de l'arrêté du 18 février 1987
date parution JO: 2000-09-22
equivalent EN: spot credit @en
equivalent EN: spot credit (en)
definition: Crédit à court terme dont le montant et les conditions sont négociés au coup par coup.
in scheme: Finance
in scheme: concepts
notation: ECON172
note: Le taux est déterminé en fonction du marché du moment.

crémaillère
type: ConceptConcept
type: Concept
creator: Commission d'enrichissement de la langue française, FranceTerme
source: révision de l'arrêté du 29 novembre 1973
date parution JO: 2000-09-22
equivalent EN: crawling peg @en
equivalent EN: crawling peg (en)
equivalent EN: crawling peg system @en
equivalent EN: crawling peg system (en)
part of speech: nom féminin
definition: Régime dans lequel les parités de change sont susceptibles d'être révisées par une succession de modifications de faible amplitude.
in scheme: Finance
in scheme: concepts
notation: ECON173
related: ancrage

date butoir
type: ConceptConcept
type: Concept
creator: Commission d'enrichissement de la langue française, FranceTerme
source: révision de l'arrêté du 11 janvier 1990
date parution JO: 2000-09-22
equivalent EN: cut-off date @en
equivalent EN: cut-off date (en)
definition: Date avant laquelle un crédit doit avoir été accordé pour que les échéances de remboursement correspondantes puissent être consolidées dans les accords de restructuration.
in scheme: Finance
in scheme: concepts
notation: ECON174

déchéance du terme de la créance
type: ConceptConcept
type: Concept
creator: Commission d'enrichissement de la langue française, FranceTerme
source: révision de l'arrêté du 18 février 1987
date parution JO: 2000-09-22
equivalent EN: event of default @en
equivalent EN: event of default (en)
forme abregee: déchéance du terme
definition: Exigence anticipée d'une créance, quand, par exemple, le débiteur n'a pas respecté ses obligations contractuelles.
in scheme: Finance
in scheme: concepts
notation: ECON175

déclaration des ordres
type: ConceptConcept
type: Concept
creator: Commission d'enrichissement de la langue française, FranceTerme
source: révision de l'arrêté du 11 février 1993
date parution JO: 2000-09-22
equivalent EN: reporting @en
equivalent EN: reporting (en)
definition: Déclaration, par un établissement, des transactions qu'il a réalisées sur les marchés règlementés ou non règlementés.
in scheme: Finance
in scheme: concepts
notation: ECON176
note: Cette déclaration est adressée, d'une part, aux autorités de contrôle et de tutelle de marché, d'autre part, aux instances de contrôle de l'établissement.

décollage
type: ConceptConcept
type: Concept
creator: Commission d'enrichissement de la langue française, FranceTerme
source: révision de l'arrêté du 6 janvier 1989
date parution JO: 2000-09-22
equivalent EN: take-off @en
equivalent EN: take-off (en)
part of speech: nom masculin
definition: Phase de développement d'une économie au cours de laquelle l'évolution des mentalités, des évènements politiques, des progrès techniques et des qualifications provoque l'apparition d'une croissance auto-entretenue.
in scheme: Économie générale
in scheme: concepts
notation: ECON177

défaut croisé
type: ConceptConcept
type: Concept
creator: Commission d'enrichissement de la langue française, FranceTerme
source: révision de l'arrêté du 18 février 1987
date parution JO: 2000-09-22
equivalent EN: cross default @en
equivalent EN: cross default (en)
definition: Clause établissant une relation entre un crédit et toute autre obligation de l'emprunteur concernant d'autres crédits ou emprunts, de telle manière qu'une défaillance de sa part, dans l'une quelconque de ses obligations, entraîne la déchéance du terme et donc l'exigibilité anticipée dudit crédit.
in scheme: Finance
in scheme: concepts
notation: ECON178

démarchage téléphonique
type: ConceptConcept
type: Concept
creator: Commission d'enrichissement de la langue française, FranceTerme
source: révision de l'arrêté du 11 février 1993
date parution JO: 2000-09-22
equivalent EN: phoning @en
equivalent EN: phoning (en)
definition: Technique de prospection, de vente et d'enquêtes commerciales fondée sur des appels téléphoniques en nombre et ciblés.
in scheme: Économie et gestion d'entreprise
in scheme: concepts
notation: ECON179

démembrement
type: ConceptConcept
type: Concept
creator: Commission d'enrichissement de la langue française, FranceTerme
source: révision de l'arrêté du 18 février 1987
date parution JO: 2000-09-22
equivalent EN: stripping @en
equivalent EN: stripping (en)
part of speech: nom masculin
definition: Technique consistant à scinder un titre en plusieurs titres.
in scheme: Finance
in scheme: concepts
notation: ECON180
note: 1. Exemple : démembrement d'une action ; démembrement d'une obligation.
note: 2. Chaque titre ainsi créé par démembrement peut être cédé et coté séparément. Actuellement dans la pratique, en ce qui concerne les actions, seuls sont cédés et cotés séparément les certificats d'investissement.

dépôt de garantie
type: ConceptConcept
type: Concept
creator: Commission d'enrichissement de la langue française, FranceTerme
source: révision de l'arrêté du 18 février 1987
date parution JO: 2000-09-22
deconseille ou frequent: deposit
deconseille ou frequent: initial margin
equivalent EN: deposit (GB) @en
equivalent EN: deposit (en-GB)
equivalent EN: initial margin (US) @en
equivalent EN: initial margin (en-US)
definition: Fraction du prix d'une marchandise, d'un service ou d'un actif financier achetés à terme, versée au moment de la conclusion du contrat.
in scheme: Finance
in scheme: concepts
notation: ECON182
note: L'achat à terme dans une bourse de commerce donne lieu au dépôt, à titre de garantie, auprès de la chambre de compensation, d'une somme comprise le plus souvent entre 5 et 25 % de la valeur de la marchandise.
related: chambre de compensation

dérive salariale
type: ConceptConcept
type: Concept
creator: Commission d'enrichissement de la langue française, FranceTerme
source: révision de l'arrêté du 7 juillet 1994
date parution JO: 2000-09-22
equivalent EN: wage drift @en
equivalent EN: wage drift (en)
definition: Évolution des salaires jugée excessive par rapport aux performances de l'économie ou de l'entreprise.
in scheme: Économie générale
in scheme: concepts
notation: ECON183
note: La dérive peut également s'observer par rapport aux accords salariaux de l'entreprise.

dernier entré, premier sorti
type: ConceptConcept
type: Concept
creator: Commission d'enrichissement de la langue française, FranceTerme
source: révision de l'arrêté du 18 février 1987
abbreviation: DEPS
abbreviation: LIFO @en
date parution JO: 2000-09-22
deconseille ou frequent: dernier entré premier sorti
deconseille ou frequent: last in first out
equivalent EN: LIFO @en
equivalent EN: LIFO (en)
equivalent EN: last in, first out @en
equivalent EN: last in, first out (en)
definition: Système dans lequel la comptabilisation d'un élément de stock se fait sur la base du prix du dernier élément entré en stock.
in scheme: Économie et gestion d'entreprise
in scheme: Économie générale
in scheme: concept-SD-economie-et-gestion-d-entreprise-comptabilite
in scheme: concept-SD-economie-generale-comptabilite
in scheme: concepts
notation: ECON184
related: premier entré, premier sorti

développement durable
type: ConceptConcept
type: Concept
creator: Commission d'enrichissement de la langue française, FranceTerme
source: révision de l'arrêté du 7 juillet 1994
antonym: développement non durable
date parution JO: 2000-09-22
equivalent EN: sustainable development @en
equivalent EN: sustainable development (en)
definition: Situation où les perspectives de développement n'appellent pas de mesures correctives à court terme.
in scheme: Économie générale
in scheme: concepts
notation: ECON185

développement non durable
type: ConceptConcept
type: Concept
creator: Commission d'enrichissement de la langue française, FranceTerme
source: révision de l'arrêté du 7 juillet 1994
antonym: développement durable
antonym: sustainable development @en
date parution JO: 2000-09-22
equivalent EN: unsustainable development @en
equivalent EN: unsustainable development (en)
broader: concept-developpement
definition: Situation in which development prospects are blocked following fundamental imbalances caused by the excessive indebtedness of the economic agents involved, the State, companies or local communities. @en
definition: Situation où les perspectives de développement sont bloquées par suite de déséquilibres fondamentaux provoqués par l'endettement excessif des agents économiques concernés, État, entreprises ou collectivités locales.
in scheme: Économie générale
in scheme: concepts
notation: ECON186
preferred label: unsustainable development @en

discompte
type: ConceptConcept
type: Concept
creator: Commission d'enrichissement de la langue française, FranceTerme
source: révision de l'arrêté du 11 février 1993
date parution JO: 2000-09-22
equivalent EN: discount @en
equivalent EN: discount (en)
part of speech: nom masculin
definition: Système de commercialisation permettant d'offrir au client des produits à prix réduit.
in scheme: Économie et gestion d'entreprise
in scheme: concepts
notation: ECON187
note: « Discompte » est un synonyme ancien d'« escompte ».
related: discompteur
related: magasin de discompte
related: prix discompté
related: ristourne

discompter
type: ConceptConcept
type: Concept
creator: Commission d'enrichissement de la langue française, FranceTerme
source: révision de l'arrêté du 11 février 1993
date parution JO: 2000-09-22
deconseille ou frequent: to discount
equivalent EN: discount @en
equivalent EN: discount (en)
part of speech: verbe
definition: Pratiquer le discompte.
in scheme: Économie et gestion d'entreprise
in scheme: concepts
notation: ECON188

discompteur
type: ConceptConcept
type: Concept
creator: Commission d'enrichissement de la langue française, FranceTerme
source: révision de l'arrêté du 11 février 1993
date parution JO: 2000-09-22
equivalent EN: discounter @en
equivalent EN: discounter (en)
part of speech: nom masculin
definition: Spécialiste du discompte.
in scheme: Économie et gestion d'entreprise
in scheme: concepts
notation: ECON189
related: discompte

distribution automatique
type: ConceptConcept
type: Concept
creator: Commission d'enrichissement de la langue française, FranceTerme
source: révision de l'arrêté du 11 février 1993
date parution JO: 2000-09-22
equivalent EN: vending @en
equivalent EN: vending (en)
definition: Vente utilisant des distributeurs automatiques.
in scheme: Économie et gestion d'entreprise
in scheme: concepts
notation: ECON190

division
type: ConceptConcept
type: Concept
creator: Commission d'enrichissement de la langue française, FranceTerme
source: révision de l'arrêté du 18 février 1987
date parution JO: 2000-09-22
equivalent EN: splitting @en
equivalent EN: splitting (en)
part of speech: nom féminin
definition: Fractionnement d'une action par division de son nominal.
in scheme: Finance
in scheme: concepts
notation: ECON191
note: Cette procédure a également pour conséquence le fractionnement de son cours de bourse dans les mêmes proportions. Elle permet ainsi une diffusion plus large du titre.

écart
type: ConceptConcept
type: Concept
creator: Commission d'enrichissement de la langue française, FranceTerme
source: révision de l'arrêté du 6 janvier 1989
date parution JO: 2000-09-22
deconseille ou frequent: différentiel
deconseille ou frequent: dollar gap
deconseille ou frequent: pénurie de dollars
equivalent EN: gap @en
equivalent EN: gap (en)
part of speech: nom masculin
definition: Se dit, dans divers contextes, d'une différence, d'un retard, d'un intervalle, etc.
in scheme: Économie générale
in scheme: concepts
notation: ECON192
note: 1. Le terme « différentiel » ne doit pas être utilisé.
note: 2. Le terme anglais gap ne peut pas toujours être traduit par « écart ». Exemples : déficit commercial (trade gap) ; pénurie de dollars (dollar gap).

écart
type: ConceptConcept
type: Concept
creator: Commission d'enrichissement de la langue française, FranceTerme
source: révision de l'arrêté du 7 juillet 1994
date parution JO: 2000-09-22
equivalent EN: spread @en
equivalent EN: spread (en)
part of speech: nom masculin
definition: Sur un marché d'instruments financiers, écart mesuré en taux d'intérêt entre les conditions qu'obtiendraient pour des opérations similaires des émetteurs différents.
in scheme: Finance
in scheme: concepts
notation: ECON193
related: écart de cotation

écart d'inflation
type: ConceptConcept
type: Concept
creator: Commission d'enrichissement de la langue française, FranceTerme
source: révision de l'arrêté du 18 février 1987
abbreviation: inflation differential @en
date parution JO: 2000-09-22
deconseille ou frequent: différentiel d'inflation
equivalent EN: inflation differential @en
equivalent EN: inflation differential (en)
equivalent EN: inflation rate differential @en
equivalent EN: inflation rate differential (en)
definition: Différence entre le taux de hausse des prix d'un pays et celui d'un de ses partenaires économiques, ou de l'ensemble, ou d'un sous-ensemble de ceux-ci.
in scheme: Économie générale
in scheme: concepts
notation: ECON194
note: Le terme « différentiel d'inflation », parfois employé, doit être écarté au bénéfice d'« écart d'inflation ».

échange à terme
type: ConceptConcept
type: Concept
creator: Commission d'enrichissement de la langue française, FranceTerme
source: révision de l'arrêté du 11 février 1993
date parution JO: 2000-09-22
equivalent EN: forward swap @en
equivalent EN: forward swap (en)
definition: Engagement pris entre deux parties de réaliser un échange d'intérêts, de monnaies ou d'instruments financiers à une date ultérieure et à des conditions fixées au moment de la conclusion de l'engagement.
in scheme: Finance
in scheme: concepts
notation: ECON195
related: cours de change à terme

échange cambiste
type: ConceptConcept
type: Concept
creator: Commission d'enrichissement de la langue française, FranceTerme
source: révision de l'arrêté du 11 janvier 1990
date parution JO: 2000-09-22
equivalent EN: treasury swap @en
equivalent EN: treasury swap (en)
definition: Échange, entre banques ou organismes financiers, de créances à court terme libellées en monnaies différentes.
in scheme: Finance
in scheme: concepts
notation: ECON196

échange de créances
type: ConceptConcept
type: Concept
creator: Commission d'enrichissement de la langue française, FranceTerme
source: révision de l'arrêté du 11 janvier 1990
date parution JO: 2000-09-22
equivalent EN: debt swap @en
equivalent EN: debt swap (en)
definition: Échange, entre deux banques ou organismes financiers, de créances privées ou publiques, essentiellement sur des pays différents, pour rééquilibrer géographiquement leurs portefeuilles de créances.
in scheme: Finance
in scheme: concepts
notation: ECON197

échange de créances contre des actifs
type: ConceptConcept
type: Concept
creator: Commission d'enrichissement de la langue française, FranceTerme
source: révision de l'arrêté du 11 janvier 1990
date parution JO: 2000-09-22
deconseille ou frequent: conversion de dettes en actifs
equivalent EN: debt equity swap @en
equivalent EN: debt equity swap (en)
definition: Cession de créances bancaires détenues sur des agents d'un pays, qui se fait en monnaie nationale et dont le produit sert obligatoirement à l'achat d'actifs dans ce même pays.
in scheme: Finance
in scheme: concepts
notation: ECON198
note: L'expression « échange de créances contre des actifs » est à employer de préférence à « conversion de dettes en actifs ».

échange de devises dues
type: ConceptConcept
type: Concept
creator: Commission d'enrichissement de la langue française, FranceTerme
source: révision de l'arrêté du 11 janvier 1990
date parution JO: 2000-09-22
equivalent EN: currency swap @en
equivalent EN: currency swap (en)
forme abregee: échange de devises
definition: Échange du service de dette en monnaies différentes entre deux entités selon un cours de change initialement défini.
in scheme: Finance
in scheme: concepts
notation: ECON199
note: L'échange de devises dues implique obligatoirement l'échange du taux d'intérêt spécifique à chacune des monnaies, mais pas forcément l'échange du principal.
related: crédit croisé

aimantin
type: ConceptConcept
type: Concept
creator: Commission d'enrichissement de la langue française, FranceTerme
date parution JO: 1998-08-14
equivalent EN: magnet @en
equivalent EN: magnet (en)
part of speech: nom masculin
definition: Objet décoratif aimanté.
in scheme: Économie et gestion d'entreprise
in scheme: concepts
notation: ECON2

échange de taux d'intérêt
type: ConceptConcept
type: Concept
creator: Commission d'enrichissement de la langue française, FranceTerme
source: révision de l'arrêté du 11 janvier 1990
abbreviation: interest swap @en
date parution JO: 2000-09-22
equivalent EN: interest rate swap @en
equivalent EN: interest rate swap (en)
equivalent EN: interest swap @en
equivalent EN: interest swap (en)
definition: Opération par laquelle deux entités ayant contracté des emprunts selon des modalités de taux d'intérêt différentes (par exemple taux fixe et taux variable) s'échangent les services de leur dette en compensant périodiquement le montant des intérêts dont elles deviennent ainsi mutuellement redevables.
in scheme: Finance
in scheme: concepts
notation: ECON200
note: Ces modalités s'appliquent en général à des durées et des montants identiques.
related: contrat d'échange sur actions
related: contrat d'échange de taux d'intérêt variables

échange financier
type: ConceptConcept
type: Concept
creator: Commission d'enrichissement de la langue française, FranceTerme
source: révision de l'arrêté du 11 janvier 1990
date parution JO: 2000-09-22
deconseille ou frequent: swaper
deconseille ou frequent: troc
equivalent EN: swap @en
equivalent EN: swap (en)
forme abregee: échange, n.m.
definition: Opération par laquelle deux ou plusieurs entités échangent des éléments de leurs créances ou de leurs dettes, celles-ci pouvant être libellées dans la même monnaie ou dans des monnaies différentes.
in scheme: Finance
in scheme: concepts
notation: ECON201
note: Au Québec, on emploie le terme « troc ».
related: contrat d'échange
related: troc

échange renouvelable
type: ConceptConcept
type: Concept
creator: Commission d'enrichissement de la langue française, FranceTerme
source: révision de l'arrêté du 11 février 1993
date parution JO: 2000-09-22
equivalent EN: roller swap @en
equivalent EN: roller swap (en)
definition: Échange, entre banques ou organismes financiers, d'intérêts, de monnaies, d'instruments financiers, renouvelable de période contractuelle en période contractuelle, en principe, selon les mêmes caractéristiques et les mêmes modalités.
in scheme: Finance
in scheme: concepts
notation: ECON202

échange syndiqué
type: ConceptConcept
type: Concept
creator: Commission d'enrichissement de la langue française, FranceTerme
source: révision de l'arrêté du 11 février 1993
date parution JO: 2000-09-22
equivalent EN: syndicated swap @en
equivalent EN: syndicated swap (en)
definition: Échange, entre banques ou organismes financiers, d'intérêts, de monnaies, ou d'instruments financiers, pris en charge, en terme d'engagement, par plusieurs établissements bancaires.
in scheme: Finance
in scheme: concepts
notation: ECON203

écorer
type: ConceptConcept
type: Concept
creator: Commission d'enrichissement de la langue française, FranceTerme
source: révision de l'arrêté du 18 février 1987
date parution JO: 2000-09-22
deconseille ou frequent: scorer
deconseille ou frequent: to score
equivalent EN: score @en
equivalent EN: score (en)
part of speech: verbe
definition: Évaluer par écorage.
in scheme: Finance
in scheme: concepts
notation: ECON205
note: Le terme « scorer », que l'on rencontre aussi, est moins bon.

épreuve
type: ConceptConcept
type: Concept
creator: Commission d'enrichissement de la langue française, FranceTerme
source: révision de l'arrêté du 18 février 1987
date parution JO: 2000-09-22
equivalent EN: proof @en
equivalent EN: proof (en)
part of speech: nom féminin
definition: Monnaie de collection frappée sur un flan qui a subi un polissage poussé au moyen de matrices dont les parties les plus hautes sont polies.
in scheme: Finance
in scheme: concepts
notation: ECON206
note: 1. Les reliefs de la pièce sont rendus mats par le sablage des creux de la matrice.
note: 2. Ces pièces sont soumises unité par unité à un contrôle visuel.

espèces
type: ConceptConcept
type: Concept
creator: Commission d'enrichissement de la langue française, FranceTerme
source: révision de l'arrêté du 18 février 1987
date parution JO: 2000-09-22
deconseille ou frequent: payer cash
equivalent EN: cash @en
equivalent EN: cash (en)
part of speech: nom féminin pluriel
definition: Se dit d'un moyen de paiement en monnaie fiduciaire ou divisionnaire (billet de banque et monnaie métallique).
in scheme: Finance
in scheme: concepts
notation: ECON207
note: 1. Exemple : payer en espèces [en anglais : pay in cash (to)].
note: 2. L'expression « payer cash » est déconseillée.
related: comptant

essaimage
type: ConceptConcept
type: Concept
creator: Commission d'enrichissement de la langue française, FranceTerme
source: révision de l'arrêté du 11 février 1993
date parution JO: 2000-09-22
deconseille ou frequent: spinoff
equivalent EN: spin-off @en
equivalent EN: spin-off (en)
part of speech: nom masculin
definition: Pratique par laquelle une entreprise incite ses salariés à créer leur propre entreprise.
in scheme: Économie et gestion d'entreprise
in scheme: concepts
notation: ECON208

excédent de pertes (en)
type: ConceptConcept
type: Concept
creator: Commission d'enrichissement de la langue française, FranceTerme
source: révision de l'arrêté du 6 janvier 1989
date parution JO: 2000-09-22
deconseille ou frequent: en excédent de pertes
equivalent EN: stop loss @en
equivalent EN: stop loss (en)
definition: Se dit d'un traité de réassurance aux termes duquel le réassureur prend en charge l'excédent éventuel, par rapport à une franchise, de la charge annuelle des sinistres d'un assureur.
in scheme: Assurance
in scheme: concepts
notation: ECON209

excédent de sinistre (en)
type: ConceptConcept
type: Concept
creator: Commission d'enrichissement de la langue française, FranceTerme
source: révision de l'arrêté du 6 janvier 1989
date parution JO: 2000-09-22
deconseille ou frequent: en excédent de sinistre
deconseille ou frequent: priorité
equivalent EN: excess of loss @en
equivalent EN: excess of loss (en)
definition: Se dit d'un traité de réassurance aux termes duquel le réassureur prend en charge la partie de chaque sinistre qui dépasse une franchise dont le montant est appelé « priorité ».
in scheme: Assurance
in scheme: concepts
notation: ECON210

expomarché
type: ConceptConcept
type: Concept
creator: Commission d'enrichissement de la langue française, FranceTerme
source: révision de l'arrêté du 18 février 1987
date parution JO: 2000-09-22
equivalent EN: trade mart @en
equivalent EN: trade mart (en)
part of speech: nom masculin
definition: Bâtiment d'exposition permanente destiné aux acheteurs professionnels où des fabricants, importateurs, grossistes et distributeurs de certains produits peuvent louer pour plusieurs années une aire de présentation.
in scheme: Économie et gestion d'entreprise
in scheme: concepts
notation: ECON211

extraterritorial
type: ConceptConcept
type: Concept
creator: Commission d'enrichissement de la langue française, FranceTerme
source: révision de l'arrêté du 18 février 1987
date parution JO: 2000-09-22
deconseille ou frequent: en mer
deconseille ou frequent: hauturier
equivalent EN: off-shore @en
equivalent EN: off-shore (en)
equivalent EN: offshore @en
equivalent EN: offshore (en)
part of speech: adjectif
definition: Qualifie les activités bancaires et financières domiciliées dans les places étrangères.
in scheme: Finance
in scheme: concepts
notation: ECON212
note: Dans le domaine du pétrole, les équivalents français utilisés sont « en mer » ou « hauturier ».

facilité d'émission garantie
type: ConceptConcept
type: Concept
creator: Commission d'enrichissement de la langue française, FranceTerme
source: révision de l'arrêté du 11 janvier 1990
date parution JO: 2000-09-22
equivalent EN: issuance facility @en
equivalent EN: issuance facility (en)
definition: Engagement bancaire qui garantit à un émetteur des ressources à long terme provenant d'émissions successives de titres à court terme.
in scheme: Finance
in scheme: concepts
notation: ECON213
note: 1. La garantie se matérialise par une ligne d'engagement, également à long terme, venant, le cas échéant, se substituer à l'émission des titres.
note: 2. Cette opération porte différents noms selon les banques chefs de file (arrangeurs).
related: arrangeur

fiduciaire
type: ConceptConcept
type: Concept
creator: Commission d'enrichissement de la langue française, FranceTerme
source: révision de l'arrêté du 30 septembre 1991
date parution JO: 2000-09-22
equivalent EN: trustee @en
equivalent EN: trustee (en)
part of speech: nom
definition: Personne physique ou morale à laquelle est temporairement transférée la propriété de biens ou droits, qui constituent une masse séparée dans son patrimoine, à charge pour elle d'agir dans l'intérêt du constituant ou d'autres bénéficiaires ou dans un but déterminé.
in scheme: Finance
in scheme: concepts
notation: ECON214
related: fiducie

fiducie
type: ConceptConcept
type: Concept
creator: Commission d'enrichissement de la langue française, FranceTerme
source: révision de l'arrêté du 30 septembre 1991
date parution JO: 2000-09-22
equivalent EN: trust @en
equivalent EN: trust (en)
part of speech: nom féminin
definition: Contrat par lequel un constituant transfère temporairement la propriété de biens ou de droits à un fiduciaire, à charge pour ce dernier d'agir dans l'intérêt du constituant ou d'autres bénéficiaires ou dans un but déterminé.
in scheme: Finance
in scheme: concepts
notation: ECON215
related: fiduciaire

fioul
type: ConceptConcept
type: Concept
creator: Commission d'enrichissement de la langue française, FranceTerme
source: révision de l'arrêté du 18 février 1987
date parution JO: 2000-09-22
deconseille ou frequent: fuel
equivalent EN: fuel oil @en
equivalent EN: fuel oil (en)
part of speech: nom masculin
definition: Distillat lourd, résidu ou mélange utilisé comme combustible pour la production de chaleur.
in scheme: Pétrole et gaz
in scheme: concept-SD-petrole-et-gaz-raffinage
in scheme: concepts
notation: ECON216
note: On trouve aussi, dans certains cas, la forme « fuel ».

fixage
type: ConceptConcept
type: Concept
creator: Commission d'enrichissement de la langue française, FranceTerme
source: révision de l'arrêté du 18 février 1987
date parution JO: 2000-09-22
deconseille ou frequent: cotation continue
deconseille ou frequent: cotation par prix demandé
deconseille ou frequent: cotation par prix offert
deconseille ou frequent: cours
equivalent EN: fixing @en
equivalent EN: fixing (en)
part of speech: nom masculin
definition: Procédure de cotation par laquelle est fixé le cours d'une valeur telle que valeur mobilière, or ou devise.
in scheme: Finance
in scheme: concepts
notation: ECON217
note: 1. Cette procédure consiste à fixer périodiquement le cours d'une valeur à partir de la confrontation, à un moment donné, des offres et des demandes de telle manière que le maximum d'offres et de demandes puisse être satisfait à ce cours. D'autres procédures de cotation sont : la cotation continue ; la cotation par prix offert, prix demandé.
note: 2. Par extension, ce terme recouvre parfois également le cours lui-même résultant de la procédure. Dans ce sens, il est préférable d'employer le terme « cours ».

fixeur de prix
type: ConceptConcept
type: Concept
creator: Commission d'enrichissement de la langue française, FranceTerme
source: révision de l'arrêté du 6 janvier 1989
date parution JO: 2000-09-22
equivalent EN: price maker @en
equivalent EN: price maker (en)
definition: Agent économique (entreprise ou groupe d'entreprises) qui détient une position suffisamment dominante pour être en mesure de fixer les prix dans son secteur.
in scheme: Économie générale
in scheme: concepts
notation: ECON218
related: preneur de prix

flottant, -e
type: ConceptConcept
type: Concept
creator: Commission d'enrichissement de la langue française, FranceTerme
source: révision de l'arrêté du 18 février 1987
date parution JO: 2000-09-22
equivalent EN: floating @en
equivalent EN: floating (en)
part of speech: adjectif
definition: Se dit d'une quantité de titres de sociétés cotées considérée comme susceptible d'être présentée à tout moment à la vente sur le marché.
in scheme: Finance
in scheme: concepts
notation: ECON219

fonds commercial
type: ConceptConcept
type: Concept
creator: Commission d'enrichissement de la langue française, FranceTerme
source: révision de l'arrêté du 11 janvier 1990
date parution JO: 2000-09-22
equivalent EN: goodwill @en
equivalent EN: goodwill (en)
definition: Éléments incorporels qui ne font pas l'objet d'une évaluation et d'une comptabilisation séparées au bilan, et qui concourent au maintien et au développement du potentiel d'activité de l'entreprise.
in scheme: Économie générale
in scheme: concept-SD-economie-generale-comptabilite
in scheme: concepts
notation: ECON221
note: Le fonds commercial ne doit pas être confondu avec le fonds de commerce.
related: survaleur

franchisage
type: ConceptConcept
type: Concept
creator: Commission d'enrichissement de la langue française, FranceTerme
source: révision de l'arrêté du 29 novembre 1973
date parution JO: 2000-09-22
equivalent EN: franchising @en
equivalent EN: franchising (en)
part of speech: nom masculin
definition: Le fait pour une entreprise de concéder à des entreprises indépendantes, en contrepartie d'une redevance, le droit de se présenter sous sa raison sociale et sa marque pour vendre des produits ou services.
in scheme: Économie et gestion d'entreprise
in scheme: concepts
notation: ECON222
note: Ce contrat s'accompagne généralement d'une assistance technique.

franco camion
type: ConceptConcept
type: Concept
creator: Commission d'enrichissement de la langue française, FranceTerme
source: révision de l'arrêté du 18 février 1987
abbreviation: FOT @en
date parution JO: 2000-09-22
equivalent EN: FOT @en
equivalent EN: FOT (en)
equivalent EN: free on truck @en
equivalent EN: free on truck (en)
part of speech: locution
definition: Condition internationale de vente signifiant que le prix est entendu pour une marchandise chargée sur camion, tous frais et risques étant, à partir de ce moment, supportés par l'acheteur.
in scheme: Économie et gestion d'entreprise
in scheme: concepts
notation: ECON223
note: Cette condition internationale de vente est suivie du nom du point de départ de la marchandise : si le point de prise en charge convenu est, par exemple Garonor, l'expression devient : « franco camion Garonor ».

franco wagon
type: ConceptConcept
type: Concept
creator: Commission d'enrichissement de la langue française, FranceTerme
source: révision de l'arrêté du 18 février 1987
abbreviation: FOR @en
date parution JO: 2000-09-22
equivalent EN: FOR @en
equivalent EN: FOR (en)
equivalent EN: free on rail @en
equivalent EN: free on rail (en)
part of speech: locution
definition: Condition internationale de vente signifiant que le prix est entendu pour une marchandise chargée sur wagon ou remise aux chemins de fer s'il s'agit d'un chargement inférieur à un wagon complet ou au poids nécessaire pour bénéficier des tarifs applicables aux charges par wagon, tous frais et risques étant, à partir de ce moment, supportés par l'acheteur.
in scheme: Économie et gestion d'entreprise
in scheme: concepts
notation: ECON224
note: Cette condition internationale de vente est suivie du nom du point de départ de la marchandise : si le point de prise en charge convenu est par exemple la gare du Nord, l'expression devient « franco wagon gare du Nord ».

frontal
type: ConceptConcept
type: Concept
creator: Commission d'enrichissement de la langue française, FranceTerme
source: révision de l'arrêté du 30 septembre 1991
date parution JO: 2000-09-22
deconseille ou frequent: frontale
equivalent EN: facing @en
equivalent EN: facing (en)
part of speech: nom masculin
definition: Surface visible, face au client, utilisée sur un rayonnage pour la présentation d'un produit.
in scheme: Économie et gestion d'entreprise
in scheme: concepts
notation: ECON225
note: La forme féminine « frontale » est également admise.

gestion de trésorerie
type: ConceptConcept
type: Concept
creator: Commission d'enrichissement de la langue française, FranceTerme
source: révision de l'arrêté du 18 février 1987
date parution JO: 2000-09-22
equivalent EN: cash management @en
equivalent EN: cash management (en)
definition: Ensemble de techniques permettant d'obtenir du trésorier d'un groupe d'entreprises la meilleure gestion possible des flux monétaires et financiers.
in scheme: Finance
in scheme: concepts
notation: ECON228

histoire de l'entreprise
type: ConceptConcept
type: Concept
creator: Commission d'enrichissement de la langue française, FranceTerme
date parution JO: 1998-08-14
equivalent EN: business history @en
equivalent EN: business history (en)
definition: Récit retraçant la vie d'une entreprise depuis son origine.
in scheme: Économie et gestion d'entreprise
in scheme: concepts
notation: ECON23

hors du cours
type: ConceptConcept
type: Concept
creator: Commission d'enrichissement de la langue française, FranceTerme
source: révision de l'arrêté du 6 janvier 1989
date parution JO: 2000-09-22
equivalent EN: out of the money @en
equivalent EN: out of the money (en)
part of speech: locution
definition: Dans le cadre des options négociables, qualifie une option dont la valeur intrinsèque est nulle car son prix d'exercice est supérieur au cours du titre support pour une option d'achat, et inférieur pour une option de vente.
in scheme: Finance
in scheme: concepts
notation: ECON230

hors faute
type: ConceptConcept
type: Concept
creator: Commission d'enrichissement de la langue française, FranceTerme
source: révision de l'arrêté du 11 janvier 1990
date parution JO: 2000-09-22
deconseille ou frequent: no fault liability
deconseille ou frequent: responsabilité sans faute
equivalent EN: no fault @en
equivalent EN: no fault (en)
part of speech: locution
definition: Qualifie un régime juridique de réparation de dommages où la responsabilité peut être mise en cause en l'absence de faute.
in scheme: Assurance
in scheme: concepts
notation: ECON231
note: On peut également parler de « responsabilité sans faute » (en anglais : no fault liability), expression à laquelle fait référence la directive européenne du 25 juillet 1985 relative au rapprochement des règlementations en matière de responsabilité du fait des produits défectueux.

jardinerie
type: ConceptConcept
type: Concept
creator: Commission d'enrichissement de la langue française, FranceTerme
source: révision de l'arrêté du 29 novembre 1973
date parution JO: 2000-09-22
deconseille ou frequent: garden center
deconseille ou frequent: garden centre
equivalent EN: garden center (US) @en
equivalent EN: garden center (en-US)
equivalent EN: garden centre (GB) @en
equivalent EN: garden centre (en-GB)
part of speech: nom féminin
definition: Établissement commercial, souvent de dimension importante, offrant tout ce qui concerne le jardin.
in scheme: Économie et gestion d'entreprise
in scheme: concepts
notation: ECON232

ligne de substitution
type: ConceptConcept
type: Concept
creator: Commission d'enrichissement de la langue française, FranceTerme
source: révision de l'arrêté du 18 février 1987
date parution JO: 2000-09-22
equivalent EN: back-up line @en
equivalent EN: back-up line (en)
definition: Engagement, ne constituant pas une caution, accordé par un ou plusieurs établissements de crédit à un émetteur de billets de trésorerie et garantissant à ce dernier qu'un concours lui sera consenti si la situation du marché ne permet pas de procéder au renouvellement de ces billets.
in scheme: Finance
in scheme: concepts
notation: ECON233

liquidation de sinistres
type: ConceptConcept
type: Concept
creator: Commission d'enrichissement de la langue française, FranceTerme
source: révision de l'arrêté du 11 janvier 1990
date parution JO: 2000-09-22
deconseille ou frequent: accord de liquidation de sinistres
deconseille ou frequent: cadence de liquidation
equivalent EN: run-off @en
equivalent EN: run-off (en)
definition: Déroulement des règlements, des recours et des provisionnements concernant un ensemble de sinistres déterminés.
in scheme: Assurance
in scheme: concepts
notation: ECON234
note: 1. On parlera d'un « accord de liquidation de sinistres » dans le cas où une entreprise d'assurance, qui désire interrompre certaines de ses activités, confie à une autre la gestion jusqu'à leur terme des dettes qu'elle a contractées envers des victimes d'accident.
note: 2. En assurance ou en réassurance, on parlera de « cadence de liquidation » pour analyser le rythme de consommation des provisions de sinistres.

location avec option d'achat
type: ConceptConcept
type: Concept
creator: Commission d'enrichissement de la langue française, FranceTerme
source: révision de l'arrêté du 11 janvier 1990
abbreviation: LOA
date parution JO: 2000-09-22
deconseille ou frequent: LPV
deconseille ou frequent: location avec promesse de vente
definition: Technique par laquelle un établissement de crédit donne en location à un preneur (pour un usage non professionnel) un bien acheté à cet effet, en vertu d'un contrat à l'issue duquel celui-ci, peut pour un prix convenu, devenir propriétaire de ce bien, en levant l'option d'achat initialement stipulée à son profit.
in scheme: Finance
in scheme: concepts
notation: ECON235
note: 1. Le preneur peut, dans certains cas, devenir propriétaire au cours du contrat en versant la totalité des loyers non échus, plus une pénalité éventuelle.
note: 2. L'expression « location avec option d'achat » (LOA) s'est progressivement substituée à l'expression « location avec promesse de vente » (LPV) qui figure encore dans les textes législatifs et règlementaires originels.
note: 3. Le terme anglais leasing recouvre de nombreuses autres techniques regroupées sous le terme générique de « crédit-bail ».
related: cession-bail
related: crédit-bail

magasin de discompte
type: ConceptConcept
type: Concept
creator: Commission d'enrichissement de la langue française, FranceTerme
source: révision de l'arrêté du 11 février 1993
date parution JO: 2000-09-22
deconseille ou frequent: discount center
deconseille ou frequent: discount centre
equivalent EN: discount center (US) @en
equivalent EN: discount center (en-US)
equivalent EN: discount centre (GB) @en
equivalent EN: discount centre (en-GB)
equivalent EN: discount house @en
equivalent EN: discount house (en)
equivalent EN: discount shop @en
equivalent EN: discount shop (en)
equivalent EN: discount store @en
equivalent EN: discount store (en)
definition: Magasin où l'on pratique le discompte.
in scheme: Économie et gestion d'entreprise
in scheme: concepts
notation: ECON236
related: discompte

magasin d'usine
type: ConceptConcept
type: Concept
creator: Commission d'enrichissement de la langue française, FranceTerme
source: révision de l'arrêté du 30 septembre 1991
date parution JO: 2000-09-22
deconseille ou frequent: usine center
equivalent EN: factory outlet @en
equivalent EN: factory outlet (en)
definition: Magasin de détail à prix réduit, situé en général dans les locaux d'un fabricant, dont l'assortiment est composé uniquement par les produits de ce dernier.
in scheme: Économie et gestion d'entreprise
in scheme: concepts
notation: ECON237
note: Le terme « usine center » ne doit pas être utilisé en français.
related: centre de magasins d'usine

manager
type: ConceptConcept
type: Concept
creator: Commission d'enrichissement de la langue française, FranceTerme
source: révision de l'arrêté du 29 novembre 1973
date parution JO: 2000-09-22
deconseille ou frequent: to manage
equivalent EN: manage @en
equivalent EN: manage (en)
part of speech: verbe transitif
definition: Assurer le management de.
in scheme: Économie et gestion d'entreprise
in scheme: concepts
notation: ECON239
note: Ce terme ne doit pas se prononcer à l'anglaise.

historien de l'entreprise
type: ConceptConcept
type: Concept
creator: Commission d'enrichissement de la langue française, FranceTerme
date parution JO: 1998-08-14
equivalent EN: business historian @en
equivalent EN: business historian (en)
definition: Personne qui, pour le compte d'une entreprise, retrace son histoire ; auteur retraçant l'histoire d'une entreprise.
in scheme: Économie et gestion d'entreprise
in scheme: concepts
notation: ECON24

marché à terme d'instruments financiers
type: ConceptConcept
type: Concept
creator: Commission d'enrichissement de la langue française, FranceTerme
source: révision de l'arrêté du 18 février 1987
abbreviation: MATIF
date parution JO: 2000-09-22
equivalent EN: financial futures market @en
equivalent EN: financial futures market (en)
definition: Marché à terme sur lequel se négocient uniquement les instruments financiers représentatifs d'actifs financiers ou monétaires par multiple de contrats normalisés.
in scheme: Finance
in scheme: concepts
notation: ECON241
related: chambre de compensation
related: marché à terme
related: couverture

marché au comptant
type: ConceptConcept
type: Concept
creator: Commission d'enrichissement de la langue française, FranceTerme
source: révision de l'arrêté du 18 février 1987
date parution JO: 2000-09-22
equivalent EN: spot market @en
equivalent EN: spot market (en)
definition: Marché sur lequel les transactions donnent lieu à paiement et livraison non différés d'actifs financiers ou de marchandises.
in scheme: Finance
in scheme: concepts
notation: ECON242
note: S'agissant de marchandises, ces marchés portant généralement sur des quantités marginales, les opérateurs n'y interviennent que de manière ponctuelle.
related: cours au comptant

marché baissier
type: ConceptConcept
type: Concept
creator: Commission d'enrichissement de la langue française, FranceTerme
source: révision de l'arrêté du 18 février 1987
abbreviation: bear market @en
date parution JO: 2000-09-22
equivalent EN: bear market @en
equivalent EN: bear market (en)
equivalent EN: bearish market @en
equivalent EN: bearish market (en)
definition: Marché dont la tendance est foncièrement orientée à la baisse.
in scheme: Finance
in scheme: concepts
notation: ECON243
related: marché haussier

marché gris
type: ConceptConcept
type: Concept
creator: Commission d'enrichissement de la langue française, FranceTerme
source: révision de l'arrêté du 6 janvier 1989
date parution JO: 2000-09-22
deconseille ou frequent: gray market
deconseille ou frequent: grey market
equivalent EN: gray market (US) @en
equivalent EN: gray market (en-US)
equivalent EN: grey market (GB) @en
equivalent EN: grey market (en-GB)
definition: Ensemble des transactions - aussi bien entre intermédiaires financiers qu'entre les intermédiaires et leurs clients - portant sur des valeurs mobilières en cours d'émission et intervenant avant leur cotation officielle.
in scheme: Finance
in scheme: concepts
notation: ECON245
note: Le marché gris peut ainsi s'analyser comme un marché secondaire limité à la période de souscription. Les souscriptions elles-mêmes constituent le marché primaire.

marché haussier
type: ConceptConcept
type: Concept
creator: Commission d'enrichissement de la langue française, FranceTerme
source: révision de l'arrêté du 18 février 1987
abbreviation: bull market @en
date parution JO: 2000-09-22
equivalent EN: bull market @en
equivalent EN: bull market (en)
equivalent EN: bullish market @en
equivalent EN: bullish market (en)
definition: Marché dont la tendance est foncièrement orientée à la hausse.
in scheme: Finance
in scheme: concepts
notation: ECON246
related: marché baissier

marge de sécurité
type: ConceptConcept
type: Concept
creator: Commission d'enrichissement de la langue française, FranceTerme
source: révision de l'arrêté du 7 juillet 1994
date parution JO: 2000-09-22
equivalent EN: haircut @en
equivalent EN: haircut (en)
definition: Différence entre la valeur de marché d'un titre et sa valeur en tant que gage.
in scheme: Finance
in scheme: concepts
notation: ECON247
note: La marge de sécurité vise à protéger un prêteur de fonds ou de titres en cas de pertes éventuelles dues à la baisse de la valeur du gage.

mécénat
type: ConceptConcept
type: Concept
creator: Commission d'enrichissement de la langue française, FranceTerme
source: révision de l'arrêté du 6 janvier 1989
date parution JO: 2000-09-22
equivalent EN: patronage @en
equivalent EN: patronage (en)
equivalent EN: sponsoring @en
equivalent EN: sponsoring (en)
equivalent EN: sponsorship @en
equivalent EN: sponsorship (en)
part of speech: nom masculin
definition: Soutien matériel apporté, sans contrepartie directe de la part du bénéficiaire, à une œuvre ou à une personne pour l'exercice d'activités présentant un intérêt général.
in scheme: Économie et gestion d'entreprise
in scheme: concepts
notation: ECON248
related: mécénat participatif
related: parrainage
related: patronage

mécène
type: ConceptConcept
type: Concept
creator: Commission d'enrichissement de la langue française, FranceTerme
source: révision de l'arrêté du 6 janvier 1989
date parution JO: 2000-09-22
equivalent EN: patron @en
equivalent EN: patron (en)
equivalent EN: sponsor @en
equivalent EN: sponsor (en)
part of speech: nom
definition: Personne physique ou morale qui apporte un soutien matériel, sans contrepartie directe de la part du bénéficiaire, à une œuvre ou à une personne pour l'exercice d'activités présentant un intérêt général.
in scheme: Économie et gestion d'entreprise
in scheme: concepts
notation: ECON249
related: parraineur

laboratoire d'idées
type: ConceptConcept
type: Concept
creator: Commission d'enrichissement de la langue française, FranceTerme
date parution JO: 1998-08-14
deconseille ou frequent: sink tank
deconseille ou frequent: think thank
equivalent EN: think tank @en
equivalent EN: think tank (en)
definition: Groupe plus ou moins formel dont les membres interviennent dans les débats publics sur les grands problèmes économiques et de société, parallèlement aux travaux effectués par les administrations publiques.
in scheme: Tous domaines
in scheme: concepts
notation: ECON25

mercaticien, -ienne
type: ConceptConcept
type: Concept
creator: Commission d'enrichissement de la langue française, FranceTerme
source: révision de l'arrêté du 18 février 1987
date parution JO: 2000-09-22
equivalent EN: marketer @en
equivalent EN: marketer (en)
part of speech: nom
definition: Spécialiste de la mercatique.
in scheme: Économie et gestion d'entreprise
in scheme: concepts
notation: ECON250

mercatique
type: ConceptConcept
type: Concept
creator: Commission d'enrichissement de la langue française, FranceTerme
source: révision de l'arrêté du 18 février 1987
equivalent EN: marketing @en
equivalent EN: marketing (en)
definition: Qui se rapporte à la mercatique.
in scheme: Économie et gestion d'entreprise
in scheme: concepts
notation: ECON252

mercatique après-vente
type: ConceptConcept
type: Concept
creator: Commission d'enrichissement de la langue française, FranceTerme
source: révision de l'arrêté du 11 février 1993
abbreviation: MAV
date parution JO: 2000-09-22
equivalent EN: reporting @en
equivalent EN: reporting (en)
definition: Force d'après-vente spécialisée dans la collecte d'informations sur les inadaptations du produit aux besoins.
in scheme: Économie et gestion d'entreprise
in scheme: concepts
notation: ECON253

mercatique associée
type: ConceptConcept
type: Concept
creator: Commission d'enrichissement de la langue française, FranceTerme
source: révision de l'arrêté du 7 juillet 1994
date parution JO: 2000-09-22
equivalent EN: trade marketing @en
equivalent EN: trade marketing (en)
definition: Association mercatique entre producteurs et distributeurs.
in scheme: Économie et gestion d'entreprise
in scheme: concepts
notation: ECON254

mercatique téléphonique
type: ConceptConcept
type: Concept
creator: Commission d'enrichissement de la langue française, FranceTerme
source: révision de l'arrêté du 11 février 1993
date parution JO: 2000-09-22
deconseille ou frequent: marketing téléphonique
equivalent EN: phone marketing @en
equivalent EN: phone marketing (en)
equivalent EN: phoning @en
equivalent EN: phoning (en)
definition: Utilisation du téléphone au service de la mercatique.
in scheme: Économie et gestion d'entreprise
in scheme: concepts
notation: ECON255
note: Le terme « marketing téléphonique » ne doit pas être utilisé.

multidevise
type: ConceptConcept
type: Concept
creator: Commission d'enrichissement de la langue française, FranceTerme
source: révision de l'arrêté du 18 février 1987
date parution JO: 2000-09-22
equivalent EN: multicurrency @en
equivalent EN: multicurrency (en)
part of speech: adjectif
definition: Se dit d'une opération ou d'un contrat dont les clauses financières peuvent mettre en jeu plusieurs devises.
in scheme: Finance
in scheme: concepts
notation: ECON256

noyau
type: ConceptConcept
type: Concept
creator: Commission d'enrichissement de la langue française, FranceTerme
source: révision de l'arrêté du 29 novembre 1973
date parution JO: 2000-09-22
equivalent EN: hardcore @en
equivalent EN: hardcore (en)
part of speech: nom masculin
definition: Dans le vocabulaire du commerce international, liste irréductible de produits contingentés.
in scheme: Économie et gestion d'entreprise
in scheme: concepts
notation: ECON259
note: Ce concept est apparu à l'occasion des négociations internationales en matière de libération des échanges.

limite à la baisse
type: ConceptConcept
type: Concept
creator: Commission d'enrichissement de la langue française, FranceTerme
date parution JO: 1998-08-14
equivalent EN: limit down @en
equivalent EN: limit down (en)
definition: Sur un marché organisé, cours en dessous duquel les transactions sur une valeur sont interrompues.
in scheme: Finance
in scheme: concepts
notation: ECON26

noyau
type: ConceptConcept
type: Concept
creator: Commission d'enrichissement de la langue française, FranceTerme
source: révision de l'arrêté du 29 novembre 1973
date parution JO: 2000-09-22
part of speech: nom masculin
definition: En théorie économique, espace limité d'un ensemble où s'appliquent intégralement et sûrement certaines propriétés.
in scheme: Économie générale
in scheme: concepts
notation: ECON260

obligation à haut risque
type: ConceptConcept
type: Concept
creator: Commission d'enrichissement de la langue française, FranceTerme
source: révision de l'arrêté du 7 juillet 1994
date parution JO: 2000-09-22
deconseille ou frequent: obligation pourrie
equivalent EN: junk bond @en
equivalent EN: junk bond (en)
definition: Obligation émise par une entreprise privée n'ayant pas demandé de notation ou n'ayant obtenu qu'une mauvaise notation de son émission.
in scheme: Finance
in scheme: concepts
notation: ECON261
note: 1. Le risque de mauvais service de sa dette par l'émetteur est tel que le taux d'intérêt de ses obligations est parfois très sensiblement plus élevé que celui offert par les grands émetteurs du marché.
note: 2. On dit, plus familièrement, « obligation pourrie ».
related: obligation à haut rendement

opérateur, -trice en couverture
type: ConceptConcept
type: Concept
creator: Commission d'enrichissement de la langue française, FranceTerme
source: révision de l'arrêté du 30 septembre 1991
date parution JO: 2000-09-22
equivalent EN: hedger @en
equivalent EN: hedger (en)
definition: Opérateur intervenant sur le marché dans le but de couvrir, ou de compenser, totalement ou partiellement, un risque de variation d'un élément financier, ce risque provenant d'une fluctuation des cours des titres, des devises, des taux d'intérêt, ou des prix des matières premières.
in scheme: Finance
in scheme: concepts
notation: ECON262

option d'échange
type: ConceptConcept
type: Concept
creator: Commission d'enrichissement de la langue française, FranceTerme
source: révision de l'arrêté du 11 février 1993
abbreviation: swaption @en
date parution JO: 2000-09-22
equivalent EN: swap option @en
equivalent EN: swap option (en)
equivalent EN: swaption @en
equivalent EN: swaption (en)
definition: Contrat permettant à son titulaire, contre paiement immédiat d'une prime au vendeur, d'effectuer, à une date d'échéance fixée, ou à tout moment jusqu'à celle-ci, un échange d'intérêts, de monnaies ou d'instruments financiers, selon des caractéristiques et des modalités convenues dès l'origine, ou d'y renoncer moyennant abandon de la prime.
in scheme: Finance
in scheme: concepts
notation: ECON263

option de monnaies
type: ConceptConcept
type: Concept
creator: Commission d'enrichissement de la langue française, FranceTerme
source: révision de l'arrêté du 11 janvier 1990
date parution JO: 2000-09-22
equivalent EN: currency option @en
equivalent EN: currency option (en)
definition: Dans le cadre d'une émission d'obligations, technique permettant aux porteurs d'obligations de choisir entre deux ou plusieurs monnaies (fixées dans le contrat d'émission), aussi bien à la souscription que pour le paiement des intérêts et le remboursement du capital.
in scheme: Finance
in scheme: concepts
notation: ECON264

option de sortie
type: ConceptConcept
type: Concept
creator: Commission d'enrichissement de la langue française, FranceTerme
source: révision de l'arrêté du 7 juillet 1994
date parution JO: 2000-09-22
equivalent EN: opting-out @en
equivalent EN: opting-out (en)
definition: Possibilité de se soustraire sous certaines conditions à une ou plusieurs clauses d'une convention.
in scheme: Économie et gestion d'entreprise
in scheme: concepts
notation: ECON265

option sur contrats à terme
type: ConceptConcept
type: Concept
creator: Commission d'enrichissement de la langue française, FranceTerme
source: révision de l'arrêté du 18 février 1987
date parution JO: 2000-09-22
equivalent EN: futures option @en
equivalent EN: futures option (en)
definition: Contrat qui confère, contre paiement immédiat d'une prime, la faculté d'acheter ou de vendre, pendant une période limitée, à un prix défini à l'avance, une certaine quantité d'instruments financiers ou de marchandises cotés sur un marché de contrats normalisés à terme.
in scheme: Finance
in scheme: concepts
notation: ECON266

ordre lié
type: ConceptConcept
type: Concept
creator: Commission d'enrichissement de la langue française, FranceTerme
source: révision de l'arrêté du 18 février 1987
date parution JO: 2000-09-22
equivalent EN: straddle @en
equivalent EN: straddle (en)
definition: Opération d'achat et de vente d'un même donneur d'ordre portant soit sur le même titre pour un montant donné sur deux échéances différentes, soit sur des titres différents pour un même montant sur la même échéance.
in scheme: Finance
in scheme: concepts
notation: ECON267

parité (à)
type: ConceptConcept
type: Concept
creator: Commission d'enrichissement de la langue française, FranceTerme
source: révision de l'arrêté du 6 janvier 1989
date parution JO: 2000-09-22
deconseille ou frequent: à parité
equivalent EN: at the money @en
equivalent EN: at the money (en)
part of speech: locution
definition: Dans le cadre des options négociables, qualifie une option dont la valeur intrinsèque est nulle ou proche de zéro car son prix d'exercice est proche du cours du titre support, ou lui est égal.
in scheme: Finance
in scheme: concepts
notation: ECON268

parrainage
type: ConceptConcept
type: Concept
creator: Commission d'enrichissement de la langue française, FranceTerme
source: révision de l'arrêté du 6 janvier 1989
date parution JO: 2000-09-22
equivalent EN: sponsoring @en
equivalent EN: sponsoring (en)
equivalent EN: sponsorship @en
equivalent EN: sponsorship (en)
part of speech: nom masculin
definition: Soutien matériel apporté à une manifestation, à une personne, à un produit ou à une organisation en vue d'en retirer un bénéfice direct.
in scheme: Économie et gestion d'entreprise
in scheme: concepts
notation: ECON269
note: Les opérations de parrainage sont destinées à promouvoir l'image du parraineur et comportent l'indication de son nom ou de sa marque.
related: mécénat
related: parrainer
related: parraineur
related: patronage
related: concept-TELE545

limite à la hausse
type: ConceptConcept
type: Concept
creator: Commission d'enrichissement de la langue française, FranceTerme
date parution JO: 1998-08-14
equivalent EN: limit up @en
equivalent EN: limit up (en)
definition: Sur un marché organisé, cours au-dessus duquel les transactions sur une valeur sont interrompues.
in scheme: Finance
in scheme: concepts
notation: ECON27

parrainer
type: ConceptConcept
type: Concept
creator: Commission d'enrichissement de la langue française, FranceTerme
source: révision de l'arrêté du 6 janvier 1989
date parution JO: 2000-09-22
deconseille ou frequent: to sponsor
equivalent EN: sponsor @en
equivalent EN: sponsor (en)
part of speech: verbe
definition: Apporter un soutien matériel à une manifestation, à une personne, à un produit ou à une organisation en vue d'en retirer un bénéfice direct.
in scheme: Économie et gestion d'entreprise
in scheme: concepts
notation: ECON270
related: parrainage

parraineur
type: ConceptConcept
type: Concept
creator: Commission d'enrichissement de la langue française, FranceTerme
source: révision de l'arrêté du 6 janvier 1989
date parution JO: 2000-09-22
deconseille ou frequent: parrain
equivalent EN: sponsor @en
equivalent EN: sponsor (en)
part of speech: nom masculin
definition: Personne physique ou morale qui apporte un soutien matériel à une manifestation, à une personne, à un produit ou à une organisation en vue d'en retirer un bénéfice direct.
in scheme: Économie et gestion d'entreprise
in scheme: concepts
notation: ECON271
note: On trouve aussi le terme « parrain », qui n'est pas recommandé dans ce sens.
related: mécène
related: parrainage

patronage
type: ConceptConcept
type: Concept
creator: Commission d'enrichissement de la langue française, FranceTerme
source: révision de l'arrêté du 6 janvier 1989
date parution JO: 2000-09-22
equivalent EN: sponsorship @en
equivalent EN: sponsorship (en)
part of speech: nom masculin
definition: Soutien moral explicite apporté à une personne, une manifestation ou une organisation.
in scheme: Économie et gestion d'entreprise
in scheme: concepts
notation: ECON273
related: mécénat
related: parrainage

payé-emporté
type: ConceptConcept
type: Concept
creator: Commission d'enrichissement de la langue française, FranceTerme
source: révision de l'arrêté du 18 février 1987
date parution JO: 2000-09-22
equivalent EN: cash-and-carry @en
equivalent EN: cash-and-carry (en)
part of speech: nom masculin
definition: Technique de vente en libre service appliquée à la vente en gros.
in scheme: Économie et gestion d'entreprise
in scheme: concepts
notation: ECON274
note: Cette technique de vente vise à une compression des frais généraux par une stricte limitation des services rendus : les acheteurs viennent eux-mêmes enlever la marchandise à l'entrepôt du vendeur, paient comptant et se chargent de l'emballage et de l'acheminement.
related: comptant

place extraterritoriale
type: ConceptConcept
type: Concept
creator: Commission d'enrichissement de la langue française, FranceTerme
source: révision de l'arrêté du 18 février 1987
date parution JO: 2000-09-22
equivalent EN: off-shore place @en
equivalent EN: off-shore place (en)
equivalent EN: offshore place @en
equivalent EN: offshore place (en)
definition: Place sur laquelle des agents économiques, notamment des banques, bénéficient de conditions d'exercice particulières, principalement sur le plan fiscal et du contrôle des changes, de sorte qu'ils domicilient certaines opérations internationales traitées ailleurs et avec des non-résidents.
in scheme: Économie générale
in scheme: Finance
in scheme: concept-SD-economie-generale-fiscalite
in scheme: concept-SD-finance-fiscalite
in scheme: concepts
notation: ECON275

plan d'options sur titres
type: ConceptConcept
type: Concept
creator: Commission d'enrichissement de la langue française, FranceTerme
source: révision de l'arrêté du 29 novembre 1973
date parution JO: 2000-09-22
equivalent EN: stock options plan @en
equivalent EN: stock options plan (en)
definition: Programme suivant lequel une entreprise offre à ses salariés des options d'achat sur ses propres actions.
in scheme: Finance
in scheme: concepts
notation: ECON276
related: option sur titres

premier entré, premier sorti
type: ConceptConcept
type: Concept
creator: Commission d'enrichissement de la langue française, FranceTerme
source: révision de l'arrêté du 18 février 1987
abbreviation: FIFO @en
abbreviation: PEPS
date parution JO: 2000-09-22
deconseille ou frequent: first in first out
deconseille ou frequent: premier entré premier sorti
equivalent EN: FIFO @en
equivalent EN: FIFO (en)
equivalent EN: first in, first out @en
equivalent EN: first in, first out (en)
definition: Système dans lequel la comptabilisation d'un élément de stock consommé se fait sur la base du prix du premier élément identique entré en stock.
in scheme: Économie et gestion d'entreprise
in scheme: Économie générale
in scheme: concept-SD-economie-et-gestion-d-entreprise-comptabilite
in scheme: concept-SD-economie-generale-comptabilite
in scheme: concepts
notation: ECON277
related: dernier entré, premier sorti

preneur de prix
type: ConceptConcept
type: Concept
creator: Commission d'enrichissement de la langue française, FranceTerme
source: révision de l'arrêté du 6 janvier 1989
date parution JO: 2000-09-22
equivalent EN: price taker @en
equivalent EN: price taker (en)
definition: Agent économique (entreprise ou groupe d'entreprises) qui accepte de pratiquer le prix imposé par le fixeur de prix ou le prix qui apparaît sur le marché concurrentiel.
in scheme: Économie générale
in scheme: concepts
notation: ECON278
related: fixeur de prix

prisée
type: ConceptConcept
type: Concept
creator: Commission d'enrichissement de la langue française, FranceTerme
source: révision de l'arrêté du 11 février 1993
date parution JO: 2000-09-22
equivalent EN: pricing @en
equivalent EN: pricing (en)
part of speech: nom féminin
definition: Fixation d'un prix en réponse à une demande sur un marché.
in scheme: Finance
in scheme: concepts
notation: ECON279
related: prisée

magasin permanent
type: ConceptConcept
type: Concept
creator: Commission d'enrichissement de la langue française, FranceTerme
date parution JO: 1998-08-14
equivalent EN: combination store @en
equivalent EN: combination store (en)
definition: Magasin ouvert 24 heures sur 24, proposant un large assortiment de produits à rotation rapide.
in scheme: Économie et gestion d'entreprise
in scheme: concepts
notation: ECON28
note: En Amérique du Nord, ces magasins de 400 à 600 m², vendent principalement des produits alimentaires, ainsi que des produits de loisirs, de la vidéo et de la pharmacie, en offrant un service de qualité.

priser
type: ConceptConcept
type: Concept
creator: Commission d'enrichissement de la langue française, FranceTerme
source: révision de l'arrêté du 11 février 1993
date parution JO: 2000-09-22
deconseille ou frequent: to price
equivalent EN: price @en
equivalent EN: price (en)
part of speech: verbe transitif
definition: Fixer un prix en réponse à une demande sur un marché ou la valeur d'un bien ou d'un instrument financier, pour des raisons comptables, que ce soit sur un marché organisé ou un marché de gré à gré.
in scheme: Finance
in scheme: concepts
notation: ECON280

priseur
type: ConceptConcept
type: Concept
creator: Commission d'enrichissement de la langue française, FranceTerme
source: révision de l'arrêté du 11 février 1993
date parution JO: 2000-09-22
equivalent EN: pricer @en
equivalent EN: pricer (en)
part of speech: nom masculin
definition: Personne qui fixe un prix en réponse à une demande sur un marché ou la valeur d'un bien ou d'un instrument financier pour des raisons comptables, que ce soit sur un marché organisé ou un marché de gré à gré.
in scheme: Finance
in scheme: concepts
notation: ECON281

prix demandé
type: ConceptConcept
type: Concept
creator: Commission d'enrichissement de la langue française, FranceTerme
source: révision de l'arrêté du 11 janvier 1990
date parution JO: 2000-09-22
equivalent EN: asking price @en
equivalent EN: asking price (en)
definition: Prix auquel un titre est demandé à l'achat.
in scheme: Finance
in scheme: concepts
notation: ECON282
related: prix offert

prix d'exercice
type: ConceptConcept
type: Concept
creator: Commission d'enrichissement de la langue française, FranceTerme
source: révision de l'arrêté du 6 janvier 1989
date parution JO: 2000-09-22
equivalent EN: striking price @en
equivalent EN: striking price (en)
definition: Prix auquel l'acheteur d'une option exerce le droit d'acquérir, dans le cas d'une option d'achat, ou de vendre, dans le cas d'une option de vente, le support du contrat d'option.
in scheme: Finance
in scheme: concepts
notation: ECON283

prix discompté
type: ConceptConcept
type: Concept
creator: Commission d'enrichissement de la langue française, FranceTerme
source: révision de l'arrêté du 11 février 1993
date parution JO: 2000-09-22
equivalent EN: discount price @en
equivalent EN: discount price (en)
alternative label: prix de discompte
definition: Prix auquel est pratiqué un discompte.
in scheme: Économie et gestion d'entreprise
in scheme: concepts
notation: ECON284
related: discompte

prix offert
type: ConceptConcept
type: Concept
creator: Commission d'enrichissement de la langue française, FranceTerme
source: révision de l'arrêté du 11 janvier 1990
date parution JO: 2000-09-22
equivalent EN: bid price @en
equivalent EN: bid price (en)
definition: Prix auquel un titre est offert à la vente.
in scheme: Finance
in scheme: concepts
notation: ECON285
related: prix demandé

prix virtuels
type: ConceptConcept
type: Concept
creator: Commission d'enrichissement de la langue française, FranceTerme
source: révision de l'arrêté du 11 janvier 1990
date parution JO: 2000-09-22
equivalent EN: shadow prices @en
equivalent EN: shadow prices (en)
definition: Prix de référence utilisés dans le calcul économique et s'écartant des prix effectivement pratiqués du fait qu'ils incorporent des coûts issus de contraintes inaperçues du marché et qu'ils excluent des charges de monopole.
in scheme: Économie générale
in scheme: concepts
notation: ECON286
note: 1. Les contraintes inaperçues du marché sont notamment macroéconomiques, par exemple les offres d'emploi ou la balance courante.
note: 2. Des prix virtuels peuvent être également calculés pour des biens et services non marchands.

procédures de séparation des exercices
type: ConceptConcept
type: Concept
creator: Commission d'enrichissement de la langue française, FranceTerme
source: révision de l'arrêté du 11 janvier 1990
date parution JO: 2000-09-22
equivalent EN: cut-off procedures @en
equivalent EN: cut-off procedures (en)
definition: Procédures utilisées lors de l'arrêté des comptes et permettant d'affecter de façon fiable et cohérente à chaque exercice les opérations dont l'exécution est proche de la date de clôture.
in scheme: Économie générale
in scheme: concept-SD-economie-generale-comptabilite
in scheme: concepts
notation: ECON287

publipostage
type: ConceptConcept
type: Concept
creator: Commission d'enrichissement de la langue française, FranceTerme
source: révision de l'arrêté du 29 novembre 1973
date parution JO: 2000-09-22
equivalent EN: mailing @en
equivalent EN: mailing (en)
part of speech: nom masculin
definition: Prospection, canvassing or selling by post. @en
definition: Prospection, démarchage ou vente par voie postale.
in scheme: Communication
in scheme: Économie et gestion d'entreprise
in scheme: concept-SD-communication-publicite
in scheme: concept-SD-economie-et-gestion-d-entreprise-publicite
in scheme: concepts
notation: ECON288
related: message publiposté
related: concept-TELE471

publipostage direct
type: ConceptConcept
type: Concept
creator: Commission d'enrichissement de la langue française, FranceTerme
source: révision de l'arrêté du 11 février 1993
date parution JO: 2000-09-22
equivalent EN: direct mailing @en
equivalent EN: direct mailing (en)
definition: Publipostage identifiant les destinataires par leur qualification ou leur nom.
in scheme: Communication
in scheme: Économie et gestion d'entreprise
in scheme: concept-SD-communication-publicite
in scheme: concept-SD-economie-et-gestion-d-entreprise-publicite
in scheme: concepts
notation: ECON289
related: message publiposté

organisation en réseau
type: ConceptConcept
type: Concept
creator: Commission d'enrichissement de la langue française, FranceTerme
date parution JO: 1998-08-14
deconseille ou frequent: network organisation
deconseille ou frequent: network organization
equivalent EN: network organisation (GB) @en
equivalent EN: network organisation (en-GB)
equivalent EN: network organization (US) @en
equivalent EN: network organization (en-US)
definition: Mode d'organisation non hiérarchisé d'un ensemble d'entreprises appartenant à la même zone géographique.
in scheme: Économie et gestion d'entreprise
in scheme: concepts
notation: ECON29
note: Ce terme peut s'appliquer également à l'intérieur de l'entreprise, quand les relations fonctionnelles sont plus fortes que les relations hiérarchiques.

rachat d'entreprise par ses salariés
type: ConceptConcept
type: Concept
creator: Commission d'enrichissement de la langue française, FranceTerme
source: révision de l'arrêté du 11 janvier 1990
abbreviation: LMBO @en
abbreviation: RES
date parution JO: 2000-09-22
equivalent EN: LMBO @en
equivalent EN: LMBO (en)
equivalent EN: leveraged management buy-out @en
equivalent EN: leveraged management buy-out (en)
definition: Opération permettant à des salariés de racheter leur entreprise, une division de leur entreprise ou une de ses filiales, à l'aide d'emprunts ou d'avantages fiscaux.
in scheme: Finance
in scheme: concepts
notation: ECON290

rattachement
type: ConceptConcept
type: Concept
creator: Commission d'enrichissement de la langue française, FranceTerme
source: révision de l'arrêté du 11 février 1993
date parution JO: 2000-09-22
deconseille ou frequent: rapprochement
equivalent EN: matching @en
equivalent EN: matching (en)
part of speech: nom masculin
definition: En comptabilité, principe stipulant que les charges sont prises dans le compte de résultats sur la base d'une liaison entre les coûts encourus et l'obtention de produits spécifiques.
in scheme: Économie générale
in scheme: concept-SD-economie-generale-comptabilite
in scheme: concepts
notation: ECON291
note: 1. Ce processus implique la prise en compte simultanée ou combinée de produits et de charges qui résultent des mêmes transactions ou évènements.
note: 2. Le terme « rapprochement » est également utilisé au Canada.
related: appariement

reconquête
type: ConceptConcept
type: Concept
creator: Commission d'enrichissement de la langue française, FranceTerme
source: révision de l'arrêté du 7 juillet 1994
date parution JO: 2000-09-22
equivalent EN: winback @en
equivalent EN: winback (en)
part of speech: nom féminin
definition: Reprise de position commerciale.
in scheme: Économie et gestion d'entreprise
in scheme: concepts
notation: ECON292

reddition de comptes
type: ConceptConcept
type: Concept
creator: Commission d'enrichissement de la langue française, FranceTerme
source: révision de l'arrêté du 11 février 1993
date parution JO: 2000-09-22
equivalent EN: reporting @en
equivalent EN: reporting (en)
definition: Élaboration et communication, par une entreprise, de ses états comptables.
in scheme: Économie générale
in scheme: concept-SD-economie-generale-comptabilite
in scheme: concepts
notation: ECON293

redevance
type: ConceptConcept
type: Concept
creator: Commission d'enrichissement de la langue française, FranceTerme
source: révision de l'arrêté du 29 novembre 1973
date parution JO: 2000-09-22
deconseille ou frequent: royalties
equivalent EN: royalty @en
equivalent EN: royalty (en)
part of speech: nom féminin
definition: Somme versée à échéances périodiques en contrepartie d'un avantage concédé contractuellement.
in scheme: Finance
in scheme: Pétrole et gaz
in scheme: concepts
notation: ECON294

rembours
type: ConceptConcept
type: Concept
creator: Commission d'enrichissement de la langue française, FranceTerme
source: révision de l'arrêté du 18 février 1987
date parution JO: 2000-09-22
equivalent EN: drawback @en
equivalent EN: drawback (en)
part of speech: nom masculin
alternative label: remboursement de droits et taxes
definition: Régime douanier qui permet, pour des marchandises étrangères réexportées soit en l'état, soit après transformation ou incorporation dans un autre produit, d'accorder le remboursement total ou partiel des droits de douane ou taxes qu'elles ont supportés lors de leur importation.
in scheme: Économie générale
in scheme: concept-SD-economie-generale-fiscalite
in scheme: concepts
notation: ECON295

remboursement in fine
type: ConceptConcept
type: Concept
creator: Commission d'enrichissement de la langue française, FranceTerme
source: révision de l'arrêté du 18 février 1987
date parution JO: 2000-09-22
equivalent EN: bullet @en
equivalent EN: bullet (en)
definition: Remboursement du principal d'un emprunt ou d'un crédit en un seul versement à son échéance.
in scheme: Finance
in scheme: concepts
notation: ECON297

répartition
type: ConceptConcept
type: Concept
creator: Commission d'enrichissement de la langue française, FranceTerme
source: révision de l'arrêté du 18 février 1987
date parution JO: 2000-09-22
deconseille ou frequent: ventilation
equivalent EN: dispatching @en
equivalent EN: dispatching (en)
part of speech: nom féminin
definition: Opération portant sur des marchandises ou sur du courrier et consistant à diriger chaque colis ou chaque pli vers son destinataire.
in scheme: Tous domaines
in scheme: concepts
notation: ECON298
note: On dit aussi, dans une acception voisine, « ventilation ».

replacement externe
type: ConceptConcept
type: Concept
creator: Commission d'enrichissement de la langue française, FranceTerme
source: révision de l'arrêté du 7 juillet 1994
date parution JO: 2000-09-22
equivalent EN: outplacement @en
equivalent EN: outplacement (en)
definition: Le fait de donner au salarié d'une entreprise un nouvel emploi dans une autre entreprise.
in scheme: Économie générale
in scheme: Emploi et travail
in scheme: concepts
notation: ECON299

carnet d'ordres
type: ConceptConcept
type: Concept
creator: Commission d'enrichissement de la langue française, FranceTerme
date parution JO: 1998-08-14
equivalent EN: book-building @en
equivalent EN: book-building (en)
definition: Recueil des intentions de souscription des investisseurs avant une émission de titres.
in scheme: Finance
in scheme: concepts
notation: ECON3

participation-pari
type: ConceptConcept
type: Concept
creator: Commission d'enrichissement de la langue française, FranceTerme
date parution JO: 1998-08-14
equivalent EN: corporate venturing @en
equivalent EN: corporate venturing (en)
part of speech: nom féminin
definition: Prise de participation financière notamment dans une perspective d'innovation pouvant conduire à un profit important.
in scheme: Économie et gestion d'entreprise
in scheme: concepts
notation: ECON30

replacement interne
type: ConceptConcept
type: Concept
creator: Commission d'enrichissement de la langue française, FranceTerme
source: révision de l'arrêté du 7 juillet 1994
date parution JO: 2000-09-22
equivalent EN: inplacement @en
equivalent EN: inplacement (en)
definition: Le fait de donner à un salarié un nouveau poste dans l'entreprise à laquelle il appartient.
in scheme: Économie générale
in scheme: Emploi et travail
in scheme: concepts
notation: ECON300

report en arrière de déficit
type: ConceptConcept
type: Concept
creator: Commission d'enrichissement de la langue française, FranceTerme
source: révision de l'arrêté du 18 février 1987
abbreviation: loss carry back @en
date parution JO: 2000-09-22
equivalent EN: carry back @en
equivalent EN: carry back (en)
equivalent EN: loss carry back @en
equivalent EN: loss carry back (en)
definition: Possibilité offerte, sous certaines conditions, aux entreprises soumises à l'impôt sur les sociétés, de reporter un déficit subi pendant un exercice sur les bénéfices non distribués d'exercices précédents, en faisant apparaître un excédent d'impôt sur les sociétés et donc une créance d'égal montant sur le Trésor.
in scheme: Finance
in scheme: concepts
notation: ECON301

salle des marchés
type: ConceptConcept
type: Concept
creator: Commission d'enrichissement de la langue française, FranceTerme
source: révision de l'arrêté du 11 janvier 1990
date parution JO: 2000-09-22
equivalent EN: front office @en
equivalent EN: front office (en)
equivalent EN: trading floor @en
equivalent EN: trading floor (en)
equivalent EN: trading room @en
equivalent EN: trading room (en)
definition: Lieu regroupant les opérateurs chargés de prendre des positions sur les marchés financiers, monétaires et des devises, nationaux et internationaux, pour le compte de l'établissement ou de la clientèle.
in scheme: Finance
in scheme: concepts
notation: ECON303
related: suivi de marché

schéma d'opérations
type: ConceptConcept
type: Concept
creator: Commission d'enrichissement de la langue française, FranceTerme
source: révision de l'arrêté du 7 juillet 1994
date parution JO: 2000-09-22
equivalent EN: flow chart @en
equivalent EN: flow chart (en)
definition: Représentation graphique du déroulement d'opérations à l'aide de symboles.
in scheme: Économie et gestion d'entreprise
in scheme: concepts
notation: ECON304

service bancaire pour entreprises
type: ConceptConcept
type: Concept
creator: Commission d'enrichissement de la langue française, FranceTerme
source: révision de l'arrêté du 30 septembre 1991
date parution JO: 2000-09-22
deconseille ou frequent: banque d'entreprise
equivalent EN: corporate bank @en
equivalent EN: corporate bank (en)
equivalent EN: corporate banking @en
equivalent EN: corporate banking (en)
definition: Ensemble des services rendus spécifiquement par une banque à sa clientèle d'entreprises.
in scheme: Finance
in scheme: concepts
notation: ECON305
note: On dit aussi « banque d'entreprise ».

sinistre maximum prévisible
type: ConceptConcept
type: Concept
creator: Commission d'enrichissement de la langue française, FranceTerme
source: révision de l'arrêté du 6 janvier 1989
abbreviation: MFL @en
abbreviation: SMP
date parution JO: 2000-09-22
equivalent EN: MFL @en
equivalent EN: MFL (en)
equivalent EN: maximum foreseeable loss @en
equivalent EN: maximum foreseeable loss (en)
definition: Se dit du montant maximum raisonnablement prévisible d'un sinistre.
in scheme: Assurance
in scheme: concepts
notation: ECON306
related: concept-assurance

sinistres inconnus
type: ConceptConcept
type: Concept
creator: Commission d'enrichissement de la langue française, FranceTerme
source: révision de l'arrêté du 6 janvier 1989
abbreviation: IBNR losses @en
date parution JO: 2000-09-22
equivalent EN: IBNR losses @en
equivalent EN: IBNR losses (en)
equivalent EN: incurred but not reported losses @en
equivalent EN: incurred but not reported losses (en)
definition: Sinistres survenus, mais dont l'assureur ou le réassureur n'a pas eu connaissance à une date d'évaluation déterminée.
in scheme: Assurance
in scheme: concepts
notation: ECON307

sourçage
type: ConceptConcept
type: Concept
creator: Commission d'enrichissement de la langue française, FranceTerme
source: révision de l'arrêté du 30 septembre 1991
abbreviation: sourcing @en
date parution JO: 2000-09-22
equivalent EN: global sourcing @en
equivalent EN: global sourcing (en)
equivalent EN: international sourcing @en
equivalent EN: international sourcing (en)
equivalent EN: sourcing @en
equivalent EN: sourcing (en)
part of speech: nom masculin
definition: Activité de mise en relation des centrales d'achat, des grossistes, des importateurs avec des fabricants étrangers afin de trouver dans tout pays du monde des produits au meilleur rapport qualité-prix.
in scheme: Économie et gestion d'entreprise
in scheme: concepts
notation: ECON308
related: cosourçage

sourceur, -euse
type: ConceptConcept
type: Concept
creator: Commission d'enrichissement de la langue française, FranceTerme
source: révision de l'arrêté du 30 septembre 1991
date parution JO: 2000-09-22
equivalent EN: sourcing expert @en
equivalent EN: sourcing expert (en)
part of speech: nom
definition: Spécialiste qui met en relation des centrales d'achat, des grossistes, des importateurs avec des fabricants étrangers afin de trouver dans tout pays du monde des produits au meilleur rapport qualité-prix.
in scheme: Économie et gestion d'entreprise
in scheme: concepts
notation: ECON309

picorage
type: ConceptConcept
type: Concept
creator: Commission d'enrichissement de la langue française, FranceTerme
date parution JO: 1998-08-14
equivalent EN: cherry picking @en
equivalent EN: cherry picking (en)
part of speech: nom masculin
definition: Sélection des seuls éléments qui semblent a priori intéressants dans une opération ou dans un marché global.
in scheme: Finance
in scheme: concepts
notation: ECON31
related: picorage de titres

spécialiste en valeurs du Trésor
type: ConceptConcept
type: Concept
creator: Commission d'enrichissement de la langue française, FranceTerme
source: révision de l'arrêté du 30 septembre 1991
abbreviation: SVT
date parution JO: 2000-09-22
equivalent EN: primary dealer @en
equivalent EN: primary dealer (en)
definition: Établissement ayant obtenu un statut particulier relatif à l'émission, au placement et au marché secondaire des valeurs du Trésor, et ayant l'obligation d'assurer en permanence la liquidité du marché secondaire.
in scheme: Finance
in scheme: concepts
notation: ECON310
note: 1. Les spécialistes en valeurs du Trésor sont sélectionnés par l'État pour l'importance de leurs souscriptions aux émissions des titres de la dette publique, pour leur capacité à les placer en France et à l'étranger et à effectuer la tenue du marché de ces titres.
note: 2. Les spécialistes en valeurs du Trésor sont consultés systématiquement par le Trésor sur les conditions d'émission des titres de la dette publique. Ils ont accès à toutes les adjudications et peuvent, en outre, acquérir des quantités supplémentaires au prix moyen de cette adjudication (offres dites « non compétitives »).

stratégie de marque
type: ConceptConcept
type: Concept
creator: Commission d'enrichissement de la langue française, FranceTerme
source: révision de l'arrêté du 11 février 1993
date parution JO: 2000-09-22
equivalent EN: brand strategy @en
equivalent EN: brand strategy (en)
definition: Stratégie commerciale axée principalement sur la marque.
in scheme: Économie et gestion d'entreprise
in scheme: concepts
notation: ECON311

suivi de marché
type: ConceptConcept
type: Concept
creator: Commission d'enrichissement de la langue française, FranceTerme
source: révision de l'arrêté du 11 février 1993
date parution JO: 2000-09-22
equivalent EN: middle office @en
equivalent EN: middle office (en)
definition: Service situé entre la salle des marchés et le post-marché, dont le rôle, variable selon les établissements, consiste notamment à normer les opérations réalisées pour les rendre gérables par le post-marché, et à vérifier qu'elles sont conformes à la règlementation.
in scheme: Finance
in scheme: concepts
notation: ECON312
related: salle des marchés

supérette
type: ConceptConcept
type: Concept
creator: Commission d'enrichissement de la langue française, FranceTerme
source: révision de l'arrêté du 18 février 1987
date parution JO: 2000-09-22
equivalent EN: small supermarket @en
equivalent EN: small supermarket (en)
part of speech: nom féminin
definition: Magasin en libre service de 120 m2 à 400 m2, consacré surtout à l'alimentation.
in scheme: Économie et gestion d'entreprise
in scheme: concepts
notation: ECON313
note: Son rayonnement est limité au quartier et sa clientèle le fréquente en général de manière quotidienne.

syndicat d'enchères
type: ConceptConcept
type: Concept
creator: Commission d'enrichissement de la langue française, FranceTerme
source: révision de l'arrêté du 11 janvier 1990
date parution JO: 2000-09-22
equivalent EN: tender panel @en
equivalent EN: tender panel (en)
definition: Réunion d'apporteurs de capitaux répondant à l'appel d'un émetteur de titres, principalement pour les facilités d'émission garantie et selon différentes modalités d'adjudication.
in scheme: Finance
in scheme: concepts
notation: ECON315

syndicat de prise ferme
type: ConceptConcept
type: Concept
creator: Commission d'enrichissement de la langue française, FranceTerme
source: révision de l'arrêté du 18 février 1987
date parution JO: 2000-09-22
deconseille ou frequent: syndicat de garantie
equivalent EN: pool @en
equivalent EN: pool (en)
equivalent EN: underwriting group @en
equivalent EN: underwriting group (en)
definition: Ensemble de banques ou de sociétés financières réunies pour participer à une émission obligataire (emprunt syndiqué), quels que soient l'émetteur, la monnaie et la place, en s'engageant à souscrire une part déterminée de l'emprunt, ce qui garantit l'émetteur de recevoir le produit de son émission, même en cas de placement difficile dans le public.
in scheme: Finance
in scheme: concepts
notation: ECON316
note: Un tel syndicat peut être aussi constitué à l'occasion d'une augmentation de capital, notamment préplacée. Le terme employé est plutôt « syndicat de garantie ».
related: tour de table

système d'information comptable
type: ConceptConcept
type: Concept
creator: Commission d'enrichissement de la langue française, FranceTerme
source: révision de l'arrêté du 11 février 1993
date parution JO: 2000-09-22
equivalent EN: reporting system @en
equivalent EN: reporting system (en)
definition: Ensemble finalisé d'états, délais et procédures auquel une entité doit se conformer pour rendre compte aux organes chargés du contrôle ou du suivi des réalisations.
in scheme: Économie générale
in scheme: concept-SD-economie-generale-comptabilite
in scheme: concepts
notation: ECON317

système inter-agent de marché
type: ConceptConcept
type: Concept
creator: Commission d'enrichissement de la langue française, FranceTerme
source: révision de l'arrêté du 30 septembre 1991
abbreviation: IDBS @en
abbreviation: SIAM
date parution JO: 2000-09-22
equivalent EN: IDBS @en
equivalent EN: IDBS (en)
equivalent EN: interdealer-broker system @en
equivalent EN: interdealer-broker system (en)
definition: Système de négociation mis en œuvre par un intermédiaire, permettant aux teneurs de marché ou courtiers d'afficher entre eux leurs prix à l'achat et à la vente sur certains titres sans les obliger à révéler leur identité, ce qui améliore la liquidité et la sécurité du marché.
in scheme: Finance
in scheme: concepts
notation: ECON318

plan d'affaires
type: ConceptConcept
type: Concept
creator: Commission d'enrichissement de la langue française, FranceTerme
date parution JO: 1998-08-14
equivalent EN: business plan @en
equivalent EN: business plan (en)
alternative label: plan de développement
definition: Dossier présentant un projet chiffré de création ou de développement d'entreprise.
in scheme: Économie et gestion d'entreprise
in scheme: concepts
notation: ECON32
related: modèle d'entreprise
related: création de valeur d'un exercice

taux de flambage
type: ConceptConcept
type: Concept
creator: Commission d'enrichissement de la langue française, FranceTerme
source: révision de l'arrêté du 30 septembre 1991
date parution JO: 2000-09-22
equivalent EN: burning cost @en
equivalent EN: burning cost (en)
definition: Dans un traité de réassurance en excédent de sinistres, rapport observé entre le coût des sinistres pris en charge par le réassureur et le montant total des primes encaissées par le cédant dans la catégorie d'affaires faisant l'objet du traité.
in scheme: Assurance
in scheme: Finance
in scheme: concepts
notation: ECON320
note: L'usage est d'exprimer cette grandeur sous forme d'un taux, à proportion des primes de l'assureur qui servent d'assiette à la rémunération du réassureur.

taux interbancaire offert
type: ConceptConcept
type: Concept
creator: Commission d'enrichissement de la langue française, FranceTerme
source: révision de l'arrêté du 18 février 1987
abbreviation: IBOR @en
abbreviation: TIO
date parution JO: 2000-09-22
equivalent EN: IBOR @en
equivalent EN: IBOR (en)
equivalent EN: interbank offered rate @en
equivalent EN: interbank offered rate (en)
definition: Taux d'intérêt que les banques offrent pour leurs prêts à des banques de premier rang, sur une place donnée, dans une monnaie et pour une échéance définies.
in scheme: Finance
in scheme: concepts
notation: ECON321
note: 1. Il peut y avoir autant de taux interbancaires offerts que de banques.
note: 2. En anglais, la lettre placée en préfixe de l'acronyme anglais permet de connaître la place d'origine, par exemple LIBOR pour Londres, PIBOR pour Paris.

téléachat
type: ConceptConcept
type: Concept
creator: Commission d'enrichissement de la langue française, FranceTerme
source: révision de l'arrêté du 11 février 1993
date parution JO: 2000-09-22
equivalent EN: armchair shopping @en
equivalent EN: armchair shopping (en)
equivalent EN: teleshopping @en
equivalent EN: teleshopping (en)
part of speech: nom masculin
definition: Achat à distance utilisant les techniques de télécommunication ou de radiodiffusion.
in scheme: Économie et gestion d'entreprise
in scheme: concepts
notation: ECON324
related: télévente

télédémarchage
type: ConceptConcept
type: Concept
creator: Commission d'enrichissement de la langue française, FranceTerme
source: révision de l'arrêté du 11 février 1993
date parution JO: 2000-09-22
equivalent EN: tele-canvassing @en
equivalent EN: tele-canvassing (en)
part of speech: nom masculin
definition: Utilisation de moyens de télécommunication au service de la prospection, de la vente et d'enquêtes commerciales.
in scheme: Économie et gestion d'entreprise
in scheme: concepts
notation: ECON325

télémarché
type: ConceptConcept
type: Concept
creator: Commission d'enrichissement de la langue française, FranceTerme
source: révision de l'arrêté du 11 février 1993
date parution JO: 2000-09-22
equivalent EN: telemarket @en
equivalent EN: telemarket (en)
part of speech: nom masculin
definition: Méthode de distribution permettant au client de choisir dans une liste de références et de commander à distance en utilisant les techniques de télécommunication.
in scheme: Économie et gestion d'entreprise
in scheme: concepts
notation: ECON326

télémercatique
type: ConceptConcept
type: Concept
creator: Commission d'enrichissement de la langue française, FranceTerme
source: révision de l'arrêté du 11 février 1993
date parution JO: 2000-09-22
equivalent EN: telemarketing @en
equivalent EN: telemarketing (en)
part of speech: nom féminin
definition: Utilisation des techniques et des moyens de télécommunication au service de la mercatique.
in scheme: Économie et gestion d'entreprise
in scheme: concepts
notation: ECON327

télévendeur, -euse
type: ConceptConcept
type: Concept
creator: Commission d'enrichissement de la langue française, FranceTerme
source: révision de l'arrêté du 11 février 1993
date parution JO: 2000-09-22
equivalent EN: telephone sales man @en
equivalent EN: telephone sales man (en)
equivalent EN: telephone sales woman @en
equivalent EN: telephone sales woman (en)
part of speech: nom
definition: Personne qui effectue la télévente.
in scheme: Économie et gestion d'entreprise
in scheme: concepts
notation: ECON328
related: télévente

télévente
type: ConceptConcept
type: Concept
creator: Commission d'enrichissement de la langue française, FranceTerme
source: révision de l'arrêté du 11 février 1993
date parution JO: 2000-09-22
equivalent EN: distance selling @en
equivalent EN: distance selling (en)
equivalent EN: telephone sales @en
equivalent EN: telephone sales (en)
equivalent EN: telephone selling @en
equivalent EN: telephone selling (en)
equivalent EN: telesales @en
equivalent EN: telesales (en)
part of speech: nom féminin
definition: Vente à distance utilisant les techniques de télécommunication ou de radiodiffusion.
in scheme: Économie et gestion d'entreprise
in scheme: concepts
notation: ECON329
related: téléachat
related: télévendeur, -euse

préplacement
type: ConceptConcept
type: Concept
creator: Commission d'enrichissement de la langue française, FranceTerme
date parution JO: 1998-08-14
deconseille ou frequent: pré-marketing
equivalent EN: pre-marketing @en
equivalent EN: pre-marketing (en)
part of speech: nom masculin
definition: Ensemble de démarches ayant pour but, avant une émission de titres, de sensibiliser les investisseurs et de recueillir leurs réactions.
in scheme: Finance
in scheme: concepts
notation: ECON33
note: L'expression « pré-marketing » est impropre.

teneur de marché
type: ConceptConcept
type: Concept
creator: Commission d'enrichissement de la langue française, FranceTerme
source: révision de l'arrêté du 30 septembre 1991
date parution JO: 2000-09-22
equivalent EN: market maker @en
equivalent EN: market maker (en)
definition: Opérateur ou établissement qui intervient sur les marchés financiers pour son propre compte de manière continue en indiquant en permanence les prix d'achat et de vente qu'il propose pour des quantités données, contribuant ainsi à la liquidité du marché.
in scheme: Finance
in scheme: concepts
notation: ECON330
note: 1. Cet affichage des cours résulte d'un engagement contracté par ces opérateurs pour effectuer la tenue de marché.
note: 2. Le teneur de marché ne se rémunère pas par un courtage mais par la différence entre ses prix d'achat et de vente.
related: tenue de marché

tenue de marché
type: ConceptConcept
type: Concept
creator: Commission d'enrichissement de la langue française, FranceTerme
source: révision de l'arrêté du 11 février 1993
date parution JO: 2000-09-22
equivalent EN: market making @en
equivalent EN: market making (en)
definition: Intervention d'un opérateur ou d'un établissement sur les marchés financiers pour son propre compte de manière continue en indiquant en permanence les prix d'achat et de vente qu'il propose pour des quantités données de valeurs, contribuant ainsi à la liquidité du marché.
in scheme: Finance
in scheme: concepts
notation: ECON331
related: teneur de marché

termaillage
type: ConceptConcept
type: Concept
creator: Commission d'enrichissement de la langue française, FranceTerme
source: révision de l'arrêté du 18 février 1987
date parution JO: 2000-09-22
equivalent EN: leads and lags @en
equivalent EN: leads and lags (en)
part of speech: nom masculin
definition: Changement dans le rythme des règlements internationaux, caractérisé par un jeu de va-et-vient entre les dates de paiement des créances et de recouvrement des dettes.
in scheme: Finance
in scheme: concepts
notation: ECON332

tour de table
type: ConceptConcept
type: Concept
creator: Commission d'enrichissement de la langue française, FranceTerme
source: révision de l'arrêté du 18 février 1987
date parution JO: 2000-09-22
equivalent EN: pool @en
equivalent EN: pool (en)
definition: Réunion de différents apporteurs de capitaux, sans appel public à l'épargne, ayant pour objet la répartition des capitaux apportés.
in scheme: Finance
in scheme: concepts
notation: ECON336
note: 1. En matière de crédit (en monnaie nationale ou en devises), le tour de table est constitué exclusivement par des banques ou des sociétés financières.
note: 2. Pour le capital social (constitution, augmentation) d'un organisme, quel qu'il soit, le tour de table peut comprendre des personnes physiques et morales. Lorsque le capital social d'un organisme est détenu intégralement par un même actionnaire, il n'y a pas lieu d'employer l'expression « tour de table ».
related: syndicat de prise ferme

traité facultatif obligatoire
type: ConceptConcept
type: Concept
creator: Commission d'enrichissement de la langue française, FranceTerme
source: révision de l'arrêté du 29 novembre 1973
date parution JO: 2000-09-22
deconseille ou frequent: facob
deconseille ou frequent: facultatif obligatoire
equivalent EN: open-cover @en
equivalent EN: open-cover (en)
definition: Traité de réassurance par lequel le réassureur s'engage à accepter les risques que l'assureur peut, à sa discrétion, lui céder dans le cadre dudit traité.
in scheme: Assurance
in scheme: concepts
notation: ECON337
note: 1. L'opération est donc facultative pour l'assureur et obligatoire pour le réassureur.
note: 2. On dit aussi, par abréviation et familièrement, « facultatif obligatoire », « facob ».

transfert
type: ConceptConcept
type: Concept
creator: Commission d'enrichissement de la langue française, FranceTerme
source: révision de l'arrêté du 11 février 1993
date parution JO: 2000-09-22
equivalent EN: assignment @en
equivalent EN: assignment (en)
part of speech: nom masculin
definition: Opération par laquelle une des parties sort d'un échange financier en transférant ses droits et obligations à une tierce partie.
in scheme: Finance
in scheme: concepts
notation: ECON338

transport maritime à la demande
type: ConceptConcept
type: Concept
creator: Commission d'enrichissement de la langue française, FranceTerme
source: révision de l'arrêté du 18 février 1987
date parution JO: 2000-09-22
equivalent EN: tramping @en
equivalent EN: tramping (en)
definition: Mode d'exploitation d'un navire consistant à l'utiliser sans itinéraire fixe ; par extension, activité d'un armateur qui place systématiquement son navire sur le marché de l'affrètement.
in scheme: Transports et mobilité
in scheme: concept-SD-transports-et-mobilite-transport-maritime
in scheme: concepts
notation: ECON339

promotion par l'argument charitable
type: ConceptConcept
type: Concept
creator: Commission d'enrichissement de la langue française, FranceTerme
date parution JO: 1998-08-14
equivalent EN: charity promotion @en
equivalent EN: charity promotion (en)
definition: Promotion des ventes par des actions ou des messages à vocation charitable.
in scheme: Économie et gestion d'entreprise
in scheme: concepts
notation: ECON34

travailleur en marge
type: ConceptConcept
type: Concept
creator: Commission d'enrichissement de la langue française, FranceTerme
source: révision de l'arrêté du 7 juillet 1994
antonym: travailleur en place
date parution JO: 2000-09-22
equivalent EN: outsider @en
equivalent EN: outsider (en)
definition: Travailleur ayant une faible probabilité de rejoindre un jour le groupe privilégié des travailleurs en place, même en proposant une embauche à un salaire inférieur à celui perçu par ces derniers.
in scheme: Emploi et travail
in scheme: concepts
notation: ECON340
related: concept-emploi-et-travail

travailleur en place
type: ConceptConcept
type: Concept
creator: Commission d'enrichissement de la langue française, FranceTerme
source: révision de l'arrêté du 7 juillet 1994
antonym: travailleur en marge
date parution JO: 2000-09-22
deconseille ou frequent: initié
equivalent EN: insider @en
equivalent EN: insider (en)
alternative label: travailleur installé
definition: Salarié appartenant à un groupe qui détient par lui-même un pouvoir de nature à lui assurer un niveau de salaire élevé, un risque de chômage restreint, de bonnes conditions de travail, et dont la présence est de nature à faire obstacle à l'embauche des travailleurs en marge.
in scheme: Emploi et travail
in scheme: concepts
notation: ECON341
note: En anglais, le terme insider signifie également « initié », en langage boursier.
related: concept-emploi-et-travail

troc
type: ConceptConcept
type: Concept
creator: Commission d'enrichissement de la langue française, FranceTerme
source: révision de l'arrêté du 7 juillet 1994
date parution JO: 2000-09-22
deconseille ou frequent: troc publicitaire
equivalent EN: barter @en
equivalent EN: barter (en)
equivalent EN: bartering @en
equivalent EN: bartering (en)
part of speech: nom masculin
definition: Échange direct de biens ou services non retranscrit par une opération monétaire.
in scheme: Communication
in scheme: Économie et gestion d'entreprise
in scheme: concept-SD-communication-publicite
in scheme: concept-SD-economie-et-gestion-d-entreprise-publicite
in scheme: concepts
notation: ECON342
note: Dans le domaine publicitaire, le procédé du troc consiste, pour l'annonceur, à proposer à une chaîne de télévision un programme auquel il appose sa signature en échange de la cession d'espaces publicitaires entourant ou coupant le programme proposé. Dans ce cas, on peut également utiliser le terme « troc publicitaire ».
related: échange financier

valeur de premier ordre
type: ConceptConcept
type: Concept
creator: Commission d'enrichissement de la langue française, FranceTerme
source: révision de l'arrêté du 11 janvier 1990
date parution JO: 2000-09-22
deconseille ou frequent: valeur de père de famille
equivalent EN: blue chip @en
equivalent EN: blue chip (en)
definition: Titre coté d'une société à forte capitalisation boursière, réputée pour sa sécurité et assurant généralement un dividende régulier à ses actions.
in scheme: Finance
in scheme: concepts
notation: ECON343
note: Dans cette acception, on dit aussi « valeur de père de famille ».

valeur vedette
type: ConceptConcept
type: Concept
creator: Commission d'enrichissement de la langue française, FranceTerme
source: révision de l'arrêté du 30 septembre 1991
date parution JO: 2000-09-22
equivalent EN: glamour stock @en
equivalent EN: glamour stock (en)
alternative label: valeur de croissance
definition: Titre coté d'une société censée disposer d'un important potentiel de plus-value et exerçant en conséquence un fort attrait sur les investisseurs.
in scheme: Finance
in scheme: concepts
notation: ECON344

vente en réseau par cooptation
type: ConceptConcept
type: Concept
creator: Commission d'enrichissement de la langue française, FranceTerme
source: révision de l'arrêté du 11 février 1993
abbreviation: MLM @en
abbreviation: VRC
date parution JO: 2000-09-22
equivalent EN: MLM @en
equivalent EN: MLM (en)
equivalent EN: multilevel marketing @en
equivalent EN: multilevel marketing (en)
definition: Formule de vente reposant sur la constitution d'un réseau par cooptations successives de ses membres.
in scheme: Économie et gestion d'entreprise
in scheme: concepts
notation: ECON345

vidéo-achat
type: ConceptConcept
type: Concept
creator: Commission d'enrichissement de la langue française, FranceTerme
source: révision de l'arrêté du 11 février 1993
date parution JO: 2000-09-22
equivalent EN: videoshopping @en
equivalent EN: videoshopping (en)
part of speech: nom masculin
definition: Achat effectué après visualisation sur un écran d'un assortiment de produits présentés en situation d'utilisation individualisée ou non.
in scheme: Économie et gestion d'entreprise
in scheme: concepts
notation: ECON346

vidéovente
type: ConceptConcept
type: Concept
creator: Commission d'enrichissement de la langue française, FranceTerme
source: révision de l'arrêté du 11 février 1993
date parution JO: 2000-09-22
equivalent EN: videosale @en
equivalent EN: videosale (en)
part of speech: nom féminin
definition: Vente après visualisation sur un écran de produits présentés en situation d'utilisation individualisée ou non.
in scheme: Économie et gestion d'entreprise
in scheme: concepts
notation: ECON347

achats en une fois
type: ConceptConcept
type: Concept
creator: Commission d'enrichissement de la langue française, FranceTerme
date parution JO: 2001-07-28
equivalent EN: one-stop shopping @en
equivalent EN: one-stop shopping (en)
definition: Action de faire ses achats en un seul lieu et en une seule fois.
in scheme: Économie et gestion d'entreprise
in scheme: concepts
notation: ECON348

achats en un seul appel
type: ConceptConcept
type: Concept
creator: Commission d'enrichissement de la langue française, FranceTerme
date parution JO: 2001-07-28
equivalent EN: one-call shopping @en
equivalent EN: one-call shopping (en)
definition: Action de faire ses achats par un seul appel téléphonique.
in scheme: Économie et gestion d'entreprise
in scheme: concepts
notation: ECON349

rallonge
type: ConceptConcept
type: Concept
creator: Commission d'enrichissement de la langue française, FranceTerme
date parution JO: 1998-08-14
equivalent EN: greenshoe @en
equivalent EN: greenshoe (en)
part of speech: nom féminin
definition: Lors d'une émission ou d'une offre publique de vente, disposition contractuelle qui permet à un émetteur ou à un vendeur d'allouer un supplément d'émission à une catégorie d'investisseurs dans un délai donné après l'opération.
in scheme: Finance
in scheme: concepts
notation: ECON35

acquéreur en série
type: ConceptConcept
type: Concept
creator: Commission d'enrichissement de la langue française, FranceTerme
date parution JO: 2001-07-28
equivalent EN: serial acquirer @en
equivalent EN: serial acquirer (en)
definition: Chef d'entreprise qui multiplie les acquisitions d'entreprises.
in scheme: Économie et gestion d'entreprise
in scheme: concepts
notation: ECON350

aide en ligne
type: ConceptConcept
type: Concept
creator: Commission d'enrichissement de la langue française, FranceTerme
date parution JO: 2001-07-28
equivalent EN: hot line @en
equivalent EN: hot line (en)
equivalent EN: hotline @en
equivalent EN: hotline (en)
definition: Assistance à distance immédiatement accessible.
in scheme: Économie et gestion d'entreprise
in scheme: concepts
notation: ECON351

ancrage
type: ConceptConcept
type: Concept
creator: Commission d'enrichissement de la langue française, FranceTerme
date parution JO: 2001-07-28
equivalent EN: peg @en
equivalent EN: peg (en)
part of speech: nom masculin
definition: Lien fixe entre deux monnaies, avec possibilité de fluctuations très limitée par rapport à un cours central.
in scheme: Finance
in scheme: concepts
notation: ECON352
related: crémaillère

atterrissage en douceur
type: ConceptConcept
type: Concept
creator: Commission d'enrichissement de la langue française, FranceTerme
date parution JO: 2001-07-28
equivalent EN: soft landing @en
equivalent EN: soft landing (en)
definition: Récession maîtrisée et progressive.
in scheme: Économie générale
in scheme: concepts
notation: ECON353

bureaux à la carte
type: ConceptConcept
type: Concept
creator: Commission d'enrichissement de la langue française, FranceTerme
date parution JO: 2001-07-28
equivalent EN: time-hotelling @en
equivalent EN: time-hotelling (en)
alternative label: hôtellerie de bureaux
definition: Bureaux mis à la disposition d'utilisateurs temporaires ; mise à disposition de tels bureaux.
in scheme: Économie et gestion d'entreprise
in scheme: concepts
notation: ECON354

carte d'achat
type: ConceptConcept
type: Concept
creator: Commission d'enrichissement de la langue française, FranceTerme
date parution JO: 2001-07-28
equivalent EN: corporate purchasing card @en
equivalent EN: corporate purchasing card (en)
definition: Carte de paiement permettant à une entreprise de régler les achats qui ne concernent pas directement la production, comme les fournitures ou le matériel de bureau.
in scheme: Économie et gestion d'entreprise
in scheme: concepts
notation: ECON355

carte d'entreprise
type: ConceptConcept
type: Concept
creator: Commission d'enrichissement de la langue française, FranceTerme
date parution JO: 2001-07-28
equivalent EN: corporate card @en
equivalent EN: corporate card (en)
definition: Carte de paiement personnelle remise par les entreprises à certains de leurs salariés pour régler leurs frais professionnels.
in scheme: Économie et gestion d'entreprise
in scheme: concepts
notation: ECON356
related: concept-economie-et-gestion-d-entreprise

catalogue commun
type: ConceptConcept
type: Concept
creator: Commission d'enrichissement de la langue française, FranceTerme
date parution JO: 2001-07-28
deconseille ou frequent: bus catalog
deconseille ou frequent: bus catalogue
equivalent EN: bus catalog (US) @en
equivalent EN: bus catalog (en-US)
equivalent EN: bus catalogue (GB) @en
equivalent EN: bus catalogue (en-GB)
definition: Catalogue regroupant les offres de produits de plusieurs entreprises.
in scheme: Économie et gestion d'entreprise
in scheme: concepts
notation: ECON357

chef du crédit
type: ConceptConcept
type: Concept
creator: Commission d'enrichissement de la langue française, FranceTerme
date parution JO: 2001-07-28
equivalent EN: credit manager @en
equivalent EN: credit manager (en)
definition: Personne qui, dans une entreprise, dirige le service du crédit à la clientèle.
in scheme: Économie et gestion d'entreprise
in scheme: concepts
notation: ECON358

commercialisable
type: ConceptConcept
type: Concept
creator: Commission d'enrichissement de la langue française, FranceTerme
date parution JO: 2001-07-28
equivalent EN: marketable @en
equivalent EN: marketable (en)
part of speech: adjectif
definition: Qui peut être mis sur le marché.
in scheme: Économie et gestion d'entreprise
in scheme: concepts
notation: ECON359

reconfiguration
type: ConceptConcept
type: Concept
creator: Commission d'enrichissement de la langue française, FranceTerme
abbreviation: re-engineering @en
date parution JO: 1998-08-14
equivalent EN: business re-engineering @en
equivalent EN: business re-engineering (en)
equivalent EN: re-engineering @en
equivalent EN: re-engineering (en)
part of speech: nom féminin
definition: Remise en cause radicale de l'entreprise pour rendre ses performances aussi bonnes que possible.
in scheme: Économie et gestion d'entreprise
in scheme: concepts
notation: ECON36

courtier
type: ConceptConcept
type: Concept
creator: Commission d'enrichissement de la langue française, FranceTerme
date parution JO: 2001-07-28
equivalent EN: broker @en
equivalent EN: broker (en)
part of speech: nom masculin
definition: Intermédiaire qui agit sur les marchés financiers pour le compte de tiers.
in scheme: Finance
in scheme: concepts
notation: ECON360
related: courtier principal

courtier négociant
type: ConceptConcept
type: Concept
creator: Commission d'enrichissement de la langue française, FranceTerme
date parution JO: 2001-07-28
equivalent EN: broker-dealer @en
equivalent EN: broker-dealer (en)
definition: Intermédiaire qui agit sur les marchés financiers pour le compte de tiers ou pour son propre compte en assumant des prises de position.
in scheme: Finance
in scheme: concepts
notation: ECON361

dégroupement
type: ConceptConcept
type: Concept
creator: Commission d'enrichissement de la langue française, FranceTerme
date parution JO: 2001-07-28
equivalent EN: unbundling @en
equivalent EN: unbundling (en)
part of speech: nom masculin
definition: Dissociation, en vue d'une meilleure efficacité, d'éléments d'un ensemble organisé.
in scheme: Économie et gestion d'entreprise
in scheme: concepts
notation: ECON362

écart de production
type: ConceptConcept
type: Concept
creator: Commission d'enrichissement de la langue française, FranceTerme
date parution JO: 2001-07-28
equivalent EN: output gap @en
equivalent EN: output gap (en)
definition: Différence de niveau entre la production effective et la production potentielle.
in scheme: Économie générale
in scheme: concepts
notation: ECON363
note: L'écart de production, qui peut aussi bien être négatif que positif, ne s'applique qu'à de grands agrégats, tels que le PIB ou la production industrielle ou manufacturière.

option (en)
type: ConceptConcept
type: Concept
creator: Commission d'enrichissement de la langue française, FranceTerme
date parution JO: 2001-07-28
deconseille ou frequent: en option
equivalent EN: optional @en
equivalent EN: optional (en)
part of speech: locution
definition: Se dit d'un choix facultatif entraînant un supplément de prix.
in scheme: Économie et gestion d'entreprise
in scheme: concepts
notation: ECON364

faux client
type: ConceptConcept
type: Concept
creator: Commission d'enrichissement de la langue française, FranceTerme
date parution JO: 2001-07-28
equivalent EN: mystery shopper @en
equivalent EN: mystery shopper (en)
definition: Agent chargé de tester le réseau ou l'offre d'une entreprise commerciale en se faisant passer pour un client.
in scheme: Économie et gestion d'entreprise
in scheme: concepts
notation: ECON365

fusionite
type: ConceptConcept
type: Concept
creator: Commission d'enrichissement de la langue française, FranceTerme
date parution JO: 2001-07-28
equivalent EN: mergermania @en
equivalent EN: mergermania (en)
part of speech: nom féminin
definition: Propension excessive à recourir aux fusions d'entreprises.
in scheme: Économie et gestion d'entreprise
in scheme: concepts
notation: ECON366

gestion du savoir
type: ConceptConcept
type: Concept
creator: Commission d'enrichissement de la langue française, FranceTerme
date parution JO: 2001-07-28
equivalent EN: knowledge management @en
equivalent EN: knowledge management (en)
definition: Gestion du capital intellectuel de l'entreprise, actif immatériel constitué par l'ensemble des connaissances et du savoir-faire des salariés.
in scheme: Économie et gestion d'entreprise
in scheme: concepts
notation: ECON368
related: banque de connaissances

gestionnaire du savoir
type: ConceptConcept
type: Concept
creator: Commission d'enrichissement de la langue française, FranceTerme
date parution JO: 2001-07-28
equivalent EN: knowledge manager @en
equivalent EN: knowledge manager (en)
definition: Personne responsable au sein de l'entreprise de la gestion du savoir.
in scheme: Économie et gestion d'entreprise
in scheme: concepts
notation: ECON369

gestion optimale des commandes
type: ConceptConcept
type: Concept
creator: Commission d'enrichissement de la langue française, FranceTerme
abbreviation: fulfillment @en
abbreviation: fulfilment @en
date parution JO: 2001-07-28
deconseille ou frequent: fulfillment
deconseille ou frequent: fulfilment
deconseille ou frequent: market fulfillment
deconseille ou frequent: market fulfilment
equivalent EN: fulfillment (US) @en
equivalent EN: fulfillment (en-US)
equivalent EN: fulfilment (GB) @en
equivalent EN: fulfilment (en-GB)
equivalent EN: market fulfillment (US) @en
equivalent EN: market fulfillment (en-US)
equivalent EN: market fulfilment (GB) @en
equivalent EN: market fulfilment (en-GB)
definition: Exécution des commandes, y compris par sous-traitance, visant à satisfaire au maximum toutes les parties.
in scheme: Économie et gestion d'entreprise
in scheme: concepts
notation: ECON370

harcèlement
type: ConceptConcept
type: Concept
creator: Commission d'enrichissement de la langue française, FranceTerme
date parution JO: 2001-07-28
equivalent EN: mobbing @en
equivalent EN: mobbing (en)
part of speech: nom masculin
definition: Pression exercée de manière constante à l'encontre d'une personne au sein d'une collectivité hiérarchisée.
in scheme: Emploi et travail
in scheme: Social
in scheme: concepts
notation: ECON371

intégration totale
type: ConceptConcept
type: Concept
creator: Commission d'enrichissement de la langue française, FranceTerme
date parution JO: 2001-07-28
equivalent EN: full integration @en
equivalent EN: full integration (en)
definition: Intégration à la fois verticale et horizontale en vue d'une maîtrise complète de la production et des débouchés d'une entreprise.
in scheme: Économie et gestion d'entreprise
in scheme: concepts
notation: ECON372

jeune pousse
type: ConceptConcept
type: Concept
creator: Commission d'enrichissement de la langue française, FranceTerme
date parution JO: 2001-07-28
equivalent EN: start-up @en
equivalent EN: start-up (en)
definition: Jeune entreprise innovante et dynamique, à croissance rapide.
in scheme: Économie et gestion d'entreprise
in scheme: concepts
notation: ECON373
note: Les jeunes pousses se rencontrent en particulier dans les secteurs de pointe tels que la biotechnique et les techniques d'information.
related: agriculture de pointe
related: filière agroalimentaire de pointe
related: entreprise naissante
related: gazelle

bonne heure (la)
type: ConceptConcept
type: Concept
creator: Commission d'enrichissement de la langue française, FranceTerme
date parution JO: 2001-07-28
deconseille ou frequent: la bonne heure
equivalent EN: happy hour @en
equivalent EN: happy hour (en)
definition: Période creuse pendant laquelle un tarif réduit est consenti à la clientèle.
in scheme: Économie et gestion d'entreprise
in scheme: concepts
notation: ECON374

magazine promotionnel
type: ConceptConcept
type: Concept
creator: Commission d'enrichissement de la langue française, FranceTerme
date parution JO: 2001-07-28
equivalent EN: customer magazine @en
equivalent EN: customer magazine (en)
definition: Publication gratuite destinée à la clientèle.
in scheme: Communication
in scheme: Économie et gestion d'entreprise
in scheme: concepts
notation: ECON375

mercatique de comportements
type: ConceptConcept
type: Concept
creator: Commission d'enrichissement de la langue française, FranceTerme
date parution JO: 2001-07-28
equivalent EN: situational marketing @en
equivalent EN: situational marketing (en)
definition: Technique mercatique privilégiant le comportement du consommateur à un moment donné.
in scheme: Économie et gestion d'entreprise
in scheme: concepts
notation: ECON376

mercatique de masse
type: ConceptConcept
type: Concept
creator: Commission d'enrichissement de la langue française, FranceTerme
date parution JO: 2001-07-28
equivalent EN: mass marketing @en
equivalent EN: mass marketing (en)
definition: Technique mercatique consistant à traiter les consommateurs globalement et non individuellement.
in scheme: Économie et gestion d'entreprise
in scheme: concepts
notation: ECON377

mercatique de relance
type: ConceptConcept
type: Concept
creator: Commission d'enrichissement de la langue française, FranceTerme
date parution JO: 2001-07-28
equivalent EN: remarketing @en
equivalent EN: remarketing (en)
definition: Révision de la mercatique d'un produit dont la demande est en régression.
in scheme: Économie et gestion d'entreprise
in scheme: concepts
notation: ECON378

mercatique électronique
type: ConceptConcept
type: Concept
creator: Commission d'enrichissement de la langue française, FranceTerme
date parution JO: 2001-07-28
deconseille ou frequent: digital marketing
deconseille ou frequent: e-marketing
deconseille ou frequent: emarketing
deconseille ou frequent: marketing digital
deconseille ou frequent: marketing numérique
deconseille ou frequent: mercatique digital
equivalent EN: cybermarketing @en
equivalent EN: cybermarketing (en)
equivalent EN: electronic marketing @en
equivalent EN: electronic marketing (en)
definition: Ensemble des techniques mercatiques utilisant des supports ou des réseaux électroniques.
in scheme: Économie et gestion d'entreprise
in scheme: concepts
notation: ECON379

retour de titres
type: ConceptConcept
type: Concept
creator: Commission d'enrichissement de la langue française, FranceTerme
date parution JO: 1998-08-14
equivalent EN: flow back @en
equivalent EN: flow back (en)
definition: Revente de titres par des souscripteurs d'une opération financière les jours suivant immédiatement celle-ci.
in scheme: Finance
in scheme: concepts
notation: ECON38

mercatique informatisée
type: ConceptConcept
type: Concept
creator: Commission d'enrichissement de la langue française, FranceTerme
date parution JO: 2001-07-28
equivalent EN: database marketing @en
equivalent EN: database marketing (en)
definition: Technique mercatique s'appuyant sur l'exploitation systématique de bases de données.
in scheme: Économie et gestion d'entreprise
in scheme: concepts
notation: ECON380

mercatique intégrée
type: ConceptConcept
type: Concept
creator: Commission d'enrichissement de la langue française, FranceTerme
date parution JO: 2001-07-28
equivalent EN: integrated marketing @en
equivalent EN: integrated marketing (en)
definition: Stratégie mercatique prenant en compte tous les éléments relatifs au client et au produit.
in scheme: Économie et gestion d'entreprise
in scheme: concepts
notation: ECON381

mercatique par affinité
type: ConceptConcept
type: Concept
creator: Commission d'enrichissement de la langue française, FranceTerme
date parution JO: 2001-07-28
equivalent EN: affinity marketing @en
equivalent EN: affinity marketing (en)
definition: Technique mercatique cherchant à renforcer un message par des associations d'images.
in scheme: Économie et gestion d'entreprise
in scheme: concepts
notation: ECON382

mercatique par grands comptes
type: ConceptConcept
type: Concept
creator: Commission d'enrichissement de la langue française, FranceTerme
date parution JO: 2001-07-28
equivalent EN: account-trade marketing @en
equivalent EN: account-trade marketing (en)
definition: Technique mercatique s'appuyant prioritairement sur l'étude des relations commerciales avec les principaux clients de l'entreprise.
in scheme: Économie et gestion d'entreprise
in scheme: concepts
notation: ECON383

mercatique prospective
type: ConceptConcept
type: Concept
creator: Commission d'enrichissement de la langue française, FranceTerme
date parution JO: 2001-07-28
equivalent EN: prospect marketing @en
equivalent EN: prospect marketing (en)
definition: Étude des tendances prédominantes pour déterminer une stratégie commerciale.
in scheme: Économie et gestion d'entreprise
in scheme: concepts
notation: ECON384

mercatique relationnelle
type: ConceptConcept
type: Concept
creator: Commission d'enrichissement de la langue française, FranceTerme
date parution JO: 2001-07-28
equivalent EN: relationship marketing @en
equivalent EN: relationship marketing (en)
definition: Technique mercatique visant à créer ou à renforcer des liens personnalisés de confiance entre fournisseur et client.
in scheme: Économie et gestion d'entreprise
in scheme: concepts
notation: ECON385

mercatique symbiotique
type: ConceptConcept
type: Concept
creator: Commission d'enrichissement de la langue française, FranceTerme
date parution JO: 2001-07-28
equivalent EN: symbiotic marketing @en
equivalent EN: symbiotic marketing (en)
definition: Stratégie mercatique fondée sur la mise en commun de dispositifs commerciaux par des entreprises concurrentes.
in scheme: Économie et gestion d'entreprise
in scheme: concepts
notation: ECON386

négociant
type: ConceptConcept
type: Concept
creator: Commission d'enrichissement de la langue française, FranceTerme
date parution JO: 2001-07-28
equivalent EN: dealer @en
equivalent EN: dealer (en)
part of speech: nom masculin
definition: Intervenant qui agit sur les marchés financiers (exclusivement ou non selon les statuts qui lui sont applicables et selon la stratégie qu'il a retenue) pour son compte propre en prenant généralement des positions de marché.
in scheme: Finance
in scheme: concepts
notation: ECON387
note: Le terme dealer correspond à des activités et des statuts très variés, selon les marchés et les droits applicables.

panel commun
type: ConceptConcept
type: Concept
creator: Commission d'enrichissement de la langue française, FranceTerme
date parution JO: 2001-07-28
equivalent EN: single panel @en
equivalent EN: single panel (en)
equivalent EN: single source @en
equivalent EN: single source (en)
definition: Échantillon représentatif stable faisant l'objet d'enquêtes périodiques et utilisé à la fois par les producteurs et les distributeurs.
in scheme: Économie et gestion d'entreprise
in scheme: concepts
notation: ECON388

panel élargi
type: ConceptConcept
type: Concept
creator: Commission d'enrichissement de la langue française, FranceTerme
date parution JO: 2001-07-28
equivalent EN: access panel @en
equivalent EN: access panel (en)
definition: Échantillon représentatif stable faisant l'objet d'enquêtes périodiques et composé d'un très grand nombre de consommateurs afin de réaliser des analyses plus fines.
in scheme: Économie et gestion d'entreprise
in scheme: concepts
notation: ECON389

rotation
type: ConceptConcept
type: Concept
creator: Commission d'enrichissement de la langue française, FranceTerme
date parution JO: 1998-08-14
deconseille ou frequent: turn over
equivalent EN: turnover @en
equivalent EN: turnover (en)
part of speech: nom féminin
definition: Rythme de renouvellement du personnel, du chiffre d'affaires, des stocks d'une entreprise.
in scheme: Économie et gestion d'entreprise
in scheme: concepts
notation: ECON39

surréaction
type: ConceptConcept
type: Concept
creator: Commission d'enrichissement de la langue française, FranceTerme
date parution JO: 2001-07-28
deconseille ou frequent: surajustement
equivalent EN: overshooting @en
equivalent EN: overshooting (en)
part of speech: nom féminin
definition: Changement brusque de parité, lié à une modification de données économiques exogènes (par exemple, modification de taux d'intérêt directeur à court terme), allant au-delà de ce que nécessite l'évolution des équilibres de long terme.
in scheme: Finance
in scheme: concepts
notation: ECON391
note: On dit aussi « surajustement ».

travailleurs pauvres (les)
type: ConceptConcept
type: Concept
creator: Commission d'enrichissement de la langue française, FranceTerme
date parution JO: 2001-07-28
deconseille ou frequent: les travailleurs pauvres
equivalent EN: working poor @en
equivalent EN: working poor (en)
definition: Catégorie de personnes actives salariées en général à temps partiel, dont le revenu familial est inférieur au seuil de pauvreté.
in scheme: Emploi et travail
in scheme: concepts
notation: ECON392

vendeur négociateur
type: ConceptConcept
type: Concept
creator: Commission d'enrichissement de la langue française, FranceTerme
date parution JO: 2001-07-28
equivalent EN: sales-trader @en
equivalent EN: sales-trader (en)
definition: Personne qui vend à des clients des instruments qu'elle, ou son entreprise, a élaborés ou négociés sur les marchés financiers.
in scheme: Finance
in scheme: concepts
notation: ECON393

catalogue du plein air
type: ConceptConcept
type: Concept
creator: Commission d'enrichissement de la langue française, FranceTerme
date parution JO: 1998-08-14
deconseille ou frequent: outdoor catalog
deconseille ou frequent: outdoor catalogue
equivalent EN: outdoor catalog (US) @en
equivalent EN: outdoor catalog (en-US)
equivalent EN: outdoor catalogue (GB) @en
equivalent EN: outdoor catalogue (en-GB)
definition: Catalogue proposant des articles de détente et de loisir pour l'extérieur.
in scheme: Économie et gestion d'entreprise
in scheme: concepts
notation: ECON4
note: 1. On trouve aussi la formulation familière « catalogue plein air ».
note: 2. Il est déconseillé d'utiliser le terme « catalogue outdoor ».

veille économique
type: ConceptConcept
type: Concept
creator: Commission d'enrichissement de la langue française, FranceTerme
date parution JO: 1998-08-14
deconseille ou frequent: intelligence économique
equivalent EN: business intelligence @en
equivalent EN: business intelligence (en)
definition: Recherche, traitement et diffusion (en vue de leur exploitation) de renseignements utiles à l'entreprise.
in scheme: Économie et gestion d'entreprise
in scheme: concepts
notation: ECON40
note: 1. La veille économique comprend notamment la veille à la concurrence et la veille au marché.
note: 2. L'expression « intelligence économique » est impropre dans le domaine de l'économie d'entreprise.
related: veille à la concurrence
related: veille au marché

veille à la concurrence
type: ConceptConcept
type: Concept
creator: Commission d'enrichissement de la langue française, FranceTerme
date parution JO: 1998-08-14
equivalent EN: competitive intelligence @en
equivalent EN: competitive intelligence (en)
definition: Recherche, traitement et diffusion (en vue de leur exploitation) de renseignements relatifs à la concurrence.
in scheme: Économie et gestion d'entreprise
in scheme: concepts
notation: ECON41
related: veille économique
related: veille au marché

veille au marché
type: ConceptConcept
type: Concept
creator: Commission d'enrichissement de la langue française, FranceTerme
date parution JO: 1998-08-14
equivalent EN: marketing intelligence @en
equivalent EN: marketing intelligence (en)
definition: Recherche, traitement et diffusion (en vue de leur exploitation) de renseignements relatifs à l'environnement commercial de l'entreprise.
in scheme: Économie et gestion d'entreprise
in scheme: concepts
notation: ECON42
related: veille économique
related: veille à la concurrence

vente directe
type: ConceptConcept
type: Concept
creator: Commission d'enrichissement de la langue française, FranceTerme
abbreviation: VD
date parution JO: 1998-08-14
deconseille ou frequent: marketing direct
equivalent EN: direct marketing @en
equivalent EN: direct marketing (en)
definition: Technique de vente fondée sur la mercatique directe et caractérisée par une relation personnalisée avec les clients.
in scheme: Économie et gestion d'entreprise
in scheme: concepts
notation: ECON43
note: L'expression « marketing direct » est impropre.

zone euro
type: ConceptConcept
type: Concept
creator: Commission d'enrichissement de la langue française, FranceTerme
date parution JO: 1999-09-14
deconseille ou frequent: euroland
deconseille ou frequent: eurolande
equivalent EN: euro area @en
equivalent EN: euro area (en)
equivalent EN: euro zone @en
equivalent EN: euro zone (en)
equivalent EN: single currency area @en
equivalent EN: single currency area (en)
in scheme: Finance
in scheme: concepts
notation: ECON49

chômage temporaire
type: ConceptConcept
type: Concept
creator: Commission d'enrichissement de la langue française, FranceTerme
date parution JO: 1998-08-14
equivalent EN: lay-off @en
equivalent EN: lay-off (en)
definition: Situation créée par un licenciement, en général collectif, effectué par une entreprise en difficulté conjoncturelle, avec promesse de réembauche quand sa situation sera améliorée.
in scheme: Économie générale
in scheme: Emploi et travail
in scheme: concepts
notation: ECON5

achat sur simulation électronique
type: ConceptConcept
type: Concept
creator: Commission d'enrichissement de la langue française, FranceTerme
date parution JO: 2000-05-12
equivalent EN: virtual shopping @en
equivalent EN: virtual shopping (en)
forme abregee: achat sur simulation
definition: Achat fondé sur une présentation simulée des produits.
in scheme: Économie et gestion d'entreprise
in scheme: concepts
notation: ECON50

aide de caisse
type: ConceptConcept
type: Concept
creator: Commission d'enrichissement de la langue française, FranceTerme
date parution JO: 2000-05-12
deconseille ou frequent: caddie-boy
equivalent EN: bag-boy @en
equivalent EN: bag-boy (en)
equivalent EN: bag-girl @en
equivalent EN: bag-girl (en)
equivalent EN: bagger @en
equivalent EN: bagger (en)
equivalent EN: bagman @en
equivalent EN: bagman (en)
definition: Employé d'un magasin en libre-service chargé d'assister la clientèle aux caisses de sortie.
in scheme: Économie et gestion d'entreprise
in scheme: concepts
notation: ECON51
note: Le terme « caddie-boy » est impropre.

argument clé de vente
type: ConceptConcept
type: Concept
creator: Commission d'enrichissement de la langue française, FranceTerme
abbreviation: ACV
abbreviation: USP @en
date parution JO: 2000-05-12
equivalent EN: USP @en
equivalent EN: USP (en)
equivalent EN: unique selling point @en
equivalent EN: unique selling point (en)
forme abregee: argument clé
definition: Principal argument mis en avant pour la vente d'un produit.
in scheme: Économie et gestion d'entreprise
in scheme: concepts
notation: ECON53

argument émotionnel de vente
type: ConceptConcept
type: Concept
creator: Commission d'enrichissement de la langue française, FranceTerme
abbreviation: ESP @en
date parution JO: 2000-05-12
equivalent EN: ESP @en
equivalent EN: ESP (en)
equivalent EN: emotional selling point @en
equivalent EN: emotional selling point (en)
forme abregee: argument émotionnel
definition: Argument de vente qui s'adresse à la sensibilité du client pour susciter de sa part une réaction affective favorable.
in scheme: Économie et gestion d'entreprise
in scheme: concepts
notation: ECON54

argument publicitaire unique
type: ConceptConcept
type: Concept
creator: Commission d'enrichissement de la langue française, FranceTerme
abbreviation: USP @en
date parution JO: 2000-05-12
equivalent EN: USP @en
equivalent EN: USP (en)
equivalent EN: unique selling proposition @en
equivalent EN: unique selling proposition (en)
definition: Argument publicitaire qui met en avant une seule des caractéristiques d'un produit.
in scheme: Économie et gestion d'entreprise
in scheme: concepts
notation: ECON55

avantage choc
type: ConceptConcept
type: Concept
creator: Commission d'enrichissement de la langue française, FranceTerme
date parution JO: 2000-05-12
deconseille ou frequent: avantage hard
definition: Avantage accordé lors d'une vente agressive.
in scheme: Économie et gestion d'entreprise
in scheme: concepts
notation: ECON56
related: vente agressive

avantage personnalisé
type: ConceptConcept
type: Concept
creator: Commission d'enrichissement de la langue française, FranceTerme
date parution JO: 2000-05-12
deconseille ou frequent: avantage soft
definition: Avantage accordé à certains clients.
in scheme: Économie et gestion d'entreprise
in scheme: concepts
notation: ECON57

centre d'affaires
type: ConceptConcept
type: Concept
creator: Commission d'enrichissement de la langue française, FranceTerme
date parution JO: 2000-05-12
deconseille ou frequent: business center
deconseille ou frequent: business centre
equivalent EN: business center (US) @en
equivalent EN: business center (en-US)
equivalent EN: business centre (GB) @en
equivalent EN: business centre (en-GB)
definition: Lieu spécifique regroupant des entreprises, des services divers.
in scheme: Économie et gestion d'entreprise
in scheme: concepts
notation: ECON58

chariot
type: ConceptConcept
type: Concept
creator: Commission d'enrichissement de la langue française, FranceTerme
date parution JO: 2000-05-12
deconseille ou frequent: caddy cart
equivalent EN: caddie cart @en
equivalent EN: caddie cart (en)
equivalent EN: shopping trolley @en
equivalent EN: shopping trolley (en)
part of speech: nom masculin
definition: Poussette permettant à la clientèle des magasins en libre-service de transporter les articles achetés.
in scheme: Économie et gestion d'entreprise
in scheme: concepts
notation: ECON59

cogriffage
type: ConceptConcept
type: Concept
creator: Commission d'enrichissement de la langue française, FranceTerme
date parution JO: 1998-08-14
equivalent EN: cobranding @en
equivalent EN: cobranding (en)
part of speech: nom masculin
alternative label: alliance de marques
definition: Alliance entre marques commerciales.
in scheme: Économie et gestion d'entreprise
in scheme: concepts
notation: ECON6
related: cogriffage valorisant

chef de file
type: ConceptConcept
type: Concept
creator: Commission d'enrichissement de la langue française, FranceTerme
date parution JO: 2000-05-12
equivalent EN: leader @en
equivalent EN: leader (en)
definition: Établissement bancaire dirigeant une opération financière, assurant les relations entre une entreprise cliente et les autres banquiers de celle-ci, et agissant vis-à-vis des tiers.
in scheme: Finance
in scheme: concepts
notation: ECON60

chef de produit
type: ConceptConcept
type: Concept
creator: Commission d'enrichissement de la langue française, FranceTerme
date parution JO: 2000-05-12
equivalent EN: product executive @en
equivalent EN: product executive (en) [Source : Avis du 14 mai 2005.]
equivalent EN: product manager @en
equivalent EN: product manager (en)
definition: Personne responsable de la gestion d'un produit ou d'un groupe de produits.
in scheme: Économie et gestion d'entreprise
in scheme: concepts
notation: ECON61
related: manageur de produits

clause de forfait
type: ConceptConcept
type: Concept
creator: Commission d'enrichissement de la langue française, FranceTerme
date parution JO: 2000-05-12
equivalent EN: walk-away clause @en
equivalent EN: walk-away clause (en)
definition: Dans une convention de compensation avec déchéance du terme, clause contractuelle précisant que la partie non défaillante est libérée de ses obligations, totalement ou partiellement, vis-à-vis de la partie défaillante.
in scheme: Finance
in scheme: concepts
notation: ECON62
related: compensation avec déchéance du terme

commerce en ligne
type: ConceptConcept
type: Concept
creator: Commission d'enrichissement de la langue française, FranceTerme
date parution JO: 2000-05-12
deconseille ou frequent: commerce on-line
equivalent EN: e-commerce @en
equivalent EN: e-commerce (en)
equivalent EN: electronic commerce @en
equivalent EN: electronic commerce (en)
definition: Technique d'achat et de vente à distance utilisant des procédés électroniques qui permettent la liaison directe et instantanée entre le vendeur et le client.
in scheme: Économie et gestion d'entreprise
in scheme: concepts
notation: ECON63
related: retrait automobile
related: magasin physique
related: repérage en magasin
related: retrait en magasin
related: livraison de commande en ligne
related: commerce hors ligne

commerce hors ligne
type: ConceptConcept
type: Concept
creator: Commission d'enrichissement de la langue française, FranceTerme
date parution JO: 2000-05-12
deconseille ou frequent: commerce off-line
definition: Technique d'achat et de vente à distance utilisant des procédés électroniques qui établissent une liaison différée entre le vendeur et le client.
in scheme: Économie et gestion d'entreprise
in scheme: concepts
notation: ECON64
related: commerce en ligne

compensation avec déchéance du terme
type: ConceptConcept
type: Concept
creator: Commission d'enrichissement de la langue française, FranceTerme
date parution JO: 2000-05-12
equivalent EN: close-out netting @en
equivalent EN: close-out netting (en)
definition: Clause d'une convention prévoyant la déchéance du terme de l'ensemble des obligations réciproques régies par le contrat en cas de défaillance de l'une des parties et le paiement du solde net de ces obligations.
in scheme: Finance
in scheme: concepts
notation: ECON65
related: clause de forfait

compensation sans déchéance du terme
type: ConceptConcept
type: Concept
creator: Commission d'enrichissement de la langue française, FranceTerme
date parution JO: 2000-05-12
equivalent EN: on-going netting @en
equivalent EN: on-going netting (en)
definition: Clause d'une convention prévoyant des obligations réciproques par solde net au fur et à mesure de leur exigibilité.
in scheme: Finance
in scheme: concepts
notation: ECON66

débauche-embauche
type: ConceptConcept
type: Concept
creator: Commission d'enrichissement de la langue française, FranceTerme
date parution JO: 2000-05-12
equivalent EN: hiring and firing @en
equivalent EN: hiring and firing (en)
part of speech: nom féminin
definition: Pratique des entreprises qui consiste à ajuster les effectifs en licenciant et en recrutant en fonction de la conjoncture.
in scheme: Économie générale
in scheme: Emploi et travail
in scheme: concepts
notation: ECON67

détente fiscale
type: ConceptConcept
type: Concept
creator: Commission d'enrichissement de la langue française, FranceTerme
date parution JO: 2000-05-12
equivalent EN: tax cut @en
equivalent EN: tax cut (en)
definition: Réduction structurelle ou conjoncturelle des impôts, notamment de l'impôt sur le revenu ou de l'impôt sur les sociétés.
in scheme: Économie générale
in scheme: concept-SD-economie-generale-fiscalite
in scheme: concepts
notation: ECON68

directeur de la mercatique
type: ConceptConcept
type: Concept
creator: Commission d'enrichissement de la langue française, FranceTerme
date parution JO: 2000-05-12
equivalent EN: marketing manager @en
equivalent EN: marketing manager (en)
definition: Responsable de la mercatique dans une entreprise.
in scheme: Économie et gestion d'entreprise
in scheme: concepts
notation: ECON69

communication d'entreprise
type: ConceptConcept
type: Concept
creator: Commission d'enrichissement de la langue française, FranceTerme
date parution JO: 1998-08-14
equivalent EN: business communication @en
equivalent EN: business communication (en)
definition: Ensemble des messages et des actions destinés à permettre à une entreprise de communiquer.
in scheme: Économie et gestion d'entreprise
in scheme: concepts
notation: ECON7
related: concept-economie-et-gestion-d-entreprise

direction de la mercatique
type: ConceptConcept
type: Concept
creator: Commission d'enrichissement de la langue française, FranceTerme
date parution JO: 2000-05-12
equivalent EN: marketing management @en
equivalent EN: marketing management (en)
definition: Service responsable de la mercatique dans une entreprise.
in scheme: Économie et gestion d'entreprise
in scheme: concepts
notation: ECON70

discompteur spécialisé
type: ConceptConcept
type: Concept
creator: Commission d'enrichissement de la langue française, FranceTerme
date parution JO: 2000-05-12
equivalent EN: category buster @en
equivalent EN: category buster (en)
equivalent EN: category killer @en
equivalent EN: category killer (en)
definition: Se dit d'un magasin spécialisé dans une catégorie de produits, dont l'objectif est d'éliminer la concurrence en pratiquant des marges très faibles.
in scheme: Économie et gestion d'entreprise
in scheme: concepts
notation: ECON71

dosage macroéconomique
type: ConceptConcept
type: Concept
creator: Commission d'enrichissement de la langue française, FranceTerme
date parution JO: 2000-05-12
equivalent EN: policy mix @en
equivalent EN: policy mix (en)
definition: Arbitrage effectué par les pouvoirs publics entre les instruments budgétaire et monétaire, en vue d'assurer le meilleur équilibre entre croissance et inflation.
in scheme: Économie générale
in scheme: Finance
in scheme: concepts
notation: ECON72

emplacement promotionnel
type: ConceptConcept
type: Concept
creator: Commission d'enrichissement de la langue française, FranceTerme
date parution JO: 2000-05-12
equivalent EN: corner @en
equivalent EN: corner (en)
definition: Espace réservé dans un magasin à la promotion d'un type de produits.
in scheme: Économie et gestion d'entreprise
in scheme: concepts
notation: ECON73

discrimination positive
type: ConceptConcept
type: Concept
creator: Commission d'enrichissement de la langue française, FranceTerme
date parution JO: 2001-07-28
equivalent EN: affirmative action @en
equivalent EN: affirmative action (en)
in scheme: Emploi et travail
in scheme: Social
in scheme: concepts
notation: ECON755

grandes affaires (les)
type: ConceptConcept
type: Concept
creator: Commission d'enrichissement de la langue française, FranceTerme
date parution JO: 2001-07-28
deconseille ou frequent: le grand commerce
deconseille ou frequent: les grandes affaires
deconseille ou frequent: les grandes entreprises
equivalent EN: big business @en
equivalent EN: big business (en)
alternative label: grand commerce (le)
alternative label: grandes entreprises (les)
in scheme: Économie et gestion d'entreprise
in scheme: concepts
notation: ECON756

géomercatique
type: ConceptConcept
type: Concept
creator: Commission d'enrichissement de la langue française, FranceTerme
date parution JO: 2000-05-12
equivalent EN: geomarketing @en
equivalent EN: geomarketing (en)
part of speech: nom féminin
definition: Application de la mercatique fondée sur des critères géographiques.
in scheme: Économie et gestion d'entreprise
in scheme: concepts
notation: ECON76

directeur d'affaires
type: ConceptConcept
type: Concept
creator: Commission d'enrichissement de la langue française, FranceTerme
date parution JO: 2001-07-28
equivalent EN: business manager @en
equivalent EN: business manager (en)
in scheme: Économie et gestion d'entreprise
in scheme: concepts
notation: ECON760

accord
type: ConceptConcept
type: Concept
creator: Commission d'enrichissement de la langue française, FranceTerme
date parution JO: 2001-07-28
equivalent EN: deal @en
equivalent EN: deal (en)
part of speech: nom masculin
in scheme: Économie et gestion d'entreprise
in scheme: concepts
notation: ECON761
related: négociation
related: transaction

négociation
type: ConceptConcept
type: Concept
creator: Commission d'enrichissement de la langue française, FranceTerme
date parution JO: 2001-07-28
equivalent EN: deal @en
equivalent EN: deal (en)
part of speech: nom féminin
in scheme: Économie et gestion d'entreprise
in scheme: concepts
notation: ECON762
related: accord
related: transaction

transaction
type: ConceptConcept
type: Concept
creator: Commission d'enrichissement de la langue française, FranceTerme
date parution JO: 2001-07-28
equivalent EN: deal @en
equivalent EN: deal (en)
part of speech: nom féminin
in scheme: Économie et gestion d'entreprise
in scheme: concepts
notation: ECON763
preferred label: deal @en
related: accord
related: négociation

autorisation d'exploitation
type: ConceptConcept
type: Concept
creator: Commission d'enrichissement de la langue française, FranceTerme
date parution JO: 2001-07-28
equivalent EN: licensing @en
equivalent EN: licensing (en)
in scheme: Économie et gestion d'entreprise
in scheme: concepts
notation: ECON764

profit imputable à une mercatique stratégique
type: ConceptConcept
type: Concept
creator: Commission d'enrichissement de la langue française, FranceTerme
abbreviation: PIMS
date parution JO: 2001-07-28
equivalent EN: PIMS @en
equivalent EN: PIMS (en)
equivalent EN: profit impact of marketing strategy @en
equivalent EN: profit impact of marketing strategy (en)
in scheme: Économie et gestion d'entreprise
in scheme: concepts
notation: ECON765

direction générale
type: ConceptConcept
type: Concept
creator: Commission d'enrichissement de la langue française, FranceTerme
date parution JO: 2001-07-28
equivalent EN: top management @en
equivalent EN: top management (en)
in scheme: Économie et gestion d'entreprise
in scheme: concepts
notation: ECON766
related: équipe dirigeante

équipe dirigeante
type: ConceptConcept
type: Concept
creator: Commission d'enrichissement de la langue française, FranceTerme
date parution JO: 2001-07-28
equivalent EN: top management team @en
equivalent EN: top management team (en)
in scheme: Économie et gestion d'entreprise
in scheme: concepts
notation: ECON767
related: direction générale

dirigeant
type: ConceptConcept
type: Concept
creator: Commission d'enrichissement de la langue française, FranceTerme
date parution JO: 2001-07-28
equivalent EN: top manager @en
equivalent EN: top manager (en)
part of speech: nom masculin
in scheme: Économie et gestion d'entreprise
in scheme: concepts
notation: ECON768
related: concept-SPOR28

tendance structurelle
type: ConceptConcept
type: Concept
creator: Commission d'enrichissement de la langue française, FranceTerme
date parution JO: 2001-07-28
equivalent EN: trend @en
equivalent EN: trend (en)
in scheme: Économie générale
in scheme: concepts
notation: ECON769

gouvernement de l'entreprise
type: ConceptConcept
type: Concept
creator: Commission d'enrichissement de la langue française, FranceTerme
date parution JO: 2000-05-12
equivalent EN: corporate governance @en
equivalent EN: corporate governance (en)
forme abregee: gouvernement d'entreprise
definition: Organisation du pouvoir au sein d'une société ou d'une entreprise visant à un meilleur équilibre entre les instances de direction, les instances de contrôle et les actionnaires ou sociétaires.
in scheme: Économie et gestion d'entreprise
in scheme: concepts
notation: ECON77
related: gouvernance
related: concept-JURI34

orientations
type: ConceptConcept
type: Concept
creator: Commission d'enrichissement de la langue française, FranceTerme
date parution JO: 2000-05-12
equivalent EN: guidelines @en
equivalent EN: guidelines (en)
part of speech: nom féminin pluriel
in scheme: Finance
in scheme: concepts
notation: ECON770

achat à domicile
type: ConceptConcept
type: Concept
creator: Commission d'enrichissement de la langue française, FranceTerme
date parution JO: 2000-05-12
equivalent EN: home shopping @en
equivalent EN: home shopping (en)
in scheme: Économie et gestion d'entreprise
in scheme: concepts
notation: ECON771

homme d'affaires
type: ConceptConcept
type: Concept
creator: Commission d'enrichissement de la langue française, FranceTerme
date parution JO: 1998-08-14
equivalent EN: businessman @en
equivalent EN: businessman (en)
in scheme: Économie et gestion d'entreprise
in scheme: concepts
notation: ECON772
related: femme d'affaires

femme d'affaires
type: ConceptConcept
type: Concept
creator: Commission d'enrichissement de la langue française, FranceTerme
date parution JO: 1998-08-14
equivalent EN: businesswoman @en
equivalent EN: businesswoman (en)
in scheme: Économie et gestion d'entreprise
in scheme: concepts
notation: ECON773
related: homme d'affaires

renforcement d'équipe
type: ConceptConcept
type: Concept
creator: Commission d'enrichissement de la langue française, FranceTerme
date parution JO: 1998-08-14
deconseille ou frequent: teambuilding
equivalent EN: empowerment @en
equivalent EN: empowerment (en)
equivalent EN: team building @en
equivalent EN: team building (en)
in scheme: Économie et gestion d'entreprise
in scheme: concepts
notation: ECON774

épinglette
type: ConceptConcept
type: Concept
creator: Commission d'enrichissement de la langue française, FranceTerme
date parution JO: 1998-08-14
equivalent EN: pin @en
equivalent EN: pin (en)
part of speech: nom féminin
in scheme: Économie et gestion d'entreprise
in scheme: concepts
notation: ECON775

assurance multirisque
type: ConceptConcept
type: Concept
creator: Commission d'enrichissement de la langue française, FranceTerme
source: révision de l'arrêté du 29 novembre 1973
date parution JO: 2000-09-22
deconseille ou frequent: assurances multirisques
equivalent EN: comprehensive insurance @en
equivalent EN: comprehensive insurance (en)
broader: concept-assurance
in scheme: Assurance
in scheme: concepts
notation: ECON776

chèque de voyage
type: ConceptConcept
type: Concept
creator: Commission d'enrichissement de la langue française, FranceTerme
source: révision de l'arrêté du 6 janvier 1989
date parution JO: 2000-09-22
deconseille ou frequent: traveler's check
deconseille ou frequent: traveller's cheque
equivalent EN: traveler's check (US) @en
equivalent EN: traveler's check (en-US)
equivalent EN: traveller's cheque (GB) @en
equivalent EN: traveller's cheque (en-GB)
in scheme: Finance
in scheme: concepts
notation: ECON778

haut de gamme
type: ConceptConcept
type: Concept
creator: Commission d'enrichissement de la langue française, FranceTerme
date parution JO: 2000-05-12
equivalent EN: high standing @en
equivalent EN: high standing (en) [Source : Avis du 22 septembre 2000.]
equivalent EN: premium @en
equivalent EN: premium (en)
part of speech: locution adjectivale
definition: Qualifie un produit de qualité supérieure et de prix élevé.
in scheme: Tous domaines
in scheme: concepts
notation: ECON78
related: montée en gamme
related: gratuit-payant

comité de réflexion
type: ConceptConcept
type: Concept
creator: Commission d'enrichissement de la langue française, FranceTerme
source: révision de l'arrêté du 6 janvier 1989
date parution JO: 2000-09-22
equivalent EN: task force @en
equivalent EN: task force (en)
alternative label: groupe d'étude
alternative label: équipe spéciale
in scheme: Finance
in scheme: concepts
notation: ECON780

conquête de position
type: ConceptConcept
type: Concept
creator: Commission d'enrichissement de la langue française, FranceTerme
source: révision de l'arrêté du 7 juillet 1994
date parution JO: 2000-09-22
equivalent EN: winover @en
equivalent EN: winover (en)
in scheme: Économie et gestion d'entreprise
in scheme: concepts
notation: ECON783

déficit commercial
type: ConceptConcept
type: Concept
creator: Commission d'enrichissement de la langue française, FranceTerme
source: révision de l'arrêté du 6 janvier 1989
date parution JO: 2000-09-22
equivalent EN: trade gap @en
equivalent EN: trade gap (en)
definition: Le déficit commercial correspond à un solde négatif faisant apparaître une insuffisance du montant des exportations par rapport à celui des importations au cours d'une période donnée. Le déficit commercial représente sur le plan des flux monétaires une sortie de la monnaie nationale en faveur des devises attachées aux différents marchés étrangers.
definition: Trade deficit corresponds to a negative balance showing that the amount of exports with respect to that of imports is unsufficient in a given period. The trade balance represents on a cash flow basis an output of the national currency in favour of currencies related to the different foreign markets. @en
in scheme: Économie générale
in scheme: concepts
notation: ECON784
preferred label: trade gap @en

échanger
type: ConceptConcept
type: Concept
creator: Commission d'enrichissement de la langue française, FranceTerme
source: révision de l'arrêté du 11 janvier 1990
date parution JO: 2000-09-22
deconseille ou frequent: swaper
deconseille ou frequent: to swap
equivalent EN: swap @en
equivalent EN: swap (en)
part of speech: verbe
in scheme: Finance
in scheme: concepts
notation: ECON785
note: L'emploi du verbe swaper, emprunté de l'anglais, est à proscrire.

équipe d'étude et d'action
type: ConceptConcept
type: Concept
creator: Commission d'enrichissement de la langue française, FranceTerme
source: révision de l'arrêté du 6 janvier 1989
date parution JO: 2000-09-22
equivalent EN: task force @en
equivalent EN: task force (en)
alternative label: groupe de travail
in scheme: Économie et gestion d'entreprise
in scheme: concepts
notation: ECON786
related: groupe d'intervention

groupe d'intervention
type: ConceptConcept
type: Concept
creator: Commission d'enrichissement de la langue française, FranceTerme
source: révision de l'arrêté du 6 janvier 1989
date parution JO: 2000-09-22
equivalent EN: task force @en
equivalent EN: task force (en)
alternative label: unité d'intervention
in scheme: Économie et gestion d'entreprise
in scheme: concepts
notation: ECON787
related: équipe d'étude et d'action

habillage de bilan
type: ConceptConcept
type: Concept
creator: Commission d'enrichissement de la langue française, FranceTerme
source: révision de l'arrêté du 18 février 1987
date parution JO: 2000-09-22
equivalent EN: window-dressing @en
equivalent EN: window-dressing (en)
in scheme: Finance
in scheme: concepts
notation: ECON789

jour le jour (au)
type: ConceptConcept
type: Concept
creator: Commission d'enrichissement de la langue française, FranceTerme
date parution JO: 2000-05-12
deconseille ou frequent: JJ
deconseille ou frequent: au jour le jour
equivalent EN: overnight @en
equivalent EN: overnight (en)
part of speech: locution adjectivale
definition: Dans le domaine des pensions, du marché des changes et du marché interbancaire, s'emploie pour désigner une opération dont le début est fixé le jour même et l'échéance au lendemain.
in scheme: Finance
in scheme: concepts
notation: ECON79
note: Les professionnels de la Bourse utilisent également l'abréviation « JJ ».
related: opérateur au jour le jour

négociations
type: ConceptConcept
type: Concept
creator: Commission d'enrichissement de la langue française, FranceTerme
source: révision de l'arrêté du 18 février 1987
date parution JO: 2000-09-22
equivalent EN: round @en
equivalent EN: round (en)
part of speech: nom féminin pluriel
in scheme: Finance
in scheme: concepts
notation: ECON791
related: concept-relations-internationales

stimulation
type: ConceptConcept
type: Concept
creator: Commission d'enrichissement de la langue française, FranceTerme
source: révision de l'arrêté du 30 décembre 1988
date parution JO: 2000-09-22
equivalent EN: incentive @en
equivalent EN: incentive (en)
part of speech: nom féminin
in scheme: Économie et gestion d'entreprise
in scheme: concepts
notation: ECON792

jour lendemain (à)
type: ConceptConcept
type: Concept
creator: Commission d'enrichissement de la langue française, FranceTerme
date parution JO: 2000-05-12
deconseille ou frequent: J+1
deconseille ou frequent: J+2
deconseille ou frequent: à jour lendemain
equivalent EN: tomorrow next @en
equivalent EN: tomorrow next (en)
part of speech: locution adjectivale
definition: Dans le domaine des pensions, du marché des changes et du marché interbancaire, s'emploie pour désigner une opération dont les parties fixent le début au lendemain et l'échéance au surlendemain.
in scheme: Finance
in scheme: concepts
notation: ECON799
note: Les professionnels de la Bourse utilisent également l'abréviation « J+1, J+2 ».

management de produits
type: ConceptConcept
type: Concept
creator: Commission d'enrichissement de la langue française, FranceTerme
date parution JO: 2000-05-12
equivalent EN: category management @en
equivalent EN: category management (en)
equivalent EN: product marketing management @en
equivalent EN: product marketing management (en)
definition: Technique de gestion de produits qui applique la mercatique à l'ensemble de la chaîne allant de la détection d'une catégorie de besoins à leur satisfaction.
in scheme: Économie et gestion d'entreprise
in scheme: concepts
notation: ECON80

arbitrage
type: ConceptConcept
type: Concept
creator: Commission d'enrichissement de la langue française, FranceTerme
date parution JO: 2000-05-12
equivalent EN: trade-off @en
equivalent EN: trade-off (en)
part of speech: nom masculin
definition: Procédure, décision par laquelle on cherche à obtenir le meilleur compromis entre des objectifs contradictoires.
in scheme: Économie générale
in scheme: concepts
notation: ECON800
note: L'arbitrage peut relever soit de la politique économique (par exemple, arbitrage entre inflation et chômage, entre préoccupations de court ou de long terme), soit de décisions individuelles (par exemple, recherche d'un équilibre entre travail et loisir).

argent du cœur
type: ConceptConcept
type: Concept
creator: Commission d'enrichissement de la langue française, FranceTerme
date parution JO: 2004-03-26
deconseille ou frequent: argent du coeur
equivalent EN: love money @en
equivalent EN: love money (en)
definition: Soutien financier apporté pour des raisons affectives ou familiales.
in scheme: Économie et gestion d'entreprise
in scheme: concepts
notation: ECON801

argent futé
type: ConceptConcept
type: Concept
creator: Commission d'enrichissement de la langue française, FranceTerme
date parution JO: 2004-03-26
equivalent EN: smart money @en
equivalent EN: smart money (en)
definition: Réserve d'argent pour investissement propice.
in scheme: Économie et gestion d'entreprise
in scheme: concepts
notation: ECON802

barattage commercial
type: ConceptConcept
type: Concept
creator: Commission d'enrichissement de la langue française, FranceTerme
date parution JO: 2004-03-26
equivalent EN: churning @en
equivalent EN: churning (en)
definition: Technique de vente qui consiste à persuader les clients fidèles de renouveler rapidement leur équipement (par analogie avec une pratique du monde de la finance).
in scheme: Économie et gestion d'entreprise
in scheme: concepts
notation: ECON803

barattage financier
type: ConceptConcept
type: Concept
creator: Commission d'enrichissement de la langue française, FranceTerme
date parution JO: 2004-03-26
equivalent EN: churning @en
equivalent EN: churning (en)
alternative label: moulinette
definition: Dans le cadre d'une gestion de portefeuille, technique qui consiste à multiplier les commissions de mouvement, au profit du gestionnaire et au détriment du client.
in scheme: Finance
in scheme: concepts
notation: ECON805

bâtir, œuvrer, transférer
type: ConceptConcept
type: Concept
creator: Commission d'enrichissement de la langue française, FranceTerme
abbreviation: BOT
date parution JO: 2004-03-26
deconseille ou frequent: build operate transfer
deconseille ou frequent: bâtir
deconseille ou frequent: bâtir oeuvrer transférer
deconseille ou frequent: oeuvrer
deconseille ou frequent: to build
deconseille ou frequent: to build to operate to transfer
deconseille ou frequent: to operate
deconseille ou frequent: to transfer
deconseille ou frequent: transférer
equivalent EN: BOT @en
equivalent EN: BOT (en)
equivalent EN: build, operate, transfer @en
equivalent EN: build, operate, transfer (en)
definition: Politique d'investissement consistant à transférer la propriété d'une infrastructure après en avoir assuré la réalisation et l'exploitation pour une période donnée.
in scheme: Économie et gestion d'entreprise
in scheme: concepts
notation: ECON808

chasse aux coûts
type: ConceptConcept
type: Concept
creator: Commission d'enrichissement de la langue française, FranceTerme
date parution JO: 2004-03-26
equivalent EN: cost cutting @en
equivalent EN: cost cutting (en)
equivalent EN: cost killing @en
equivalent EN: cost killing (en)
definition: Activité consistant à traquer toutes les dépenses superflues.
in scheme: Économie et gestion d'entreprise
in scheme: concepts
notation: ECON809

manageur de produits
type: ConceptConcept
type: Concept
creator: Commission d'enrichissement de la langue française, FranceTerme
date parution JO: 2000-05-12
equivalent EN: category manager @en
equivalent EN: category manager (en)
equivalent EN: product marketing manager @en
equivalent EN: product marketing manager (en)
definition: Chef de produit qui applique la mercatique à l'ensemble de la chaîne allant de la détection d'une catégorie de besoins à leur satisfaction.
in scheme: Économie et gestion d'entreprise
in scheme: concepts
notation: ECON81
related: chef de produit

chasseur de coûts
type: ConceptConcept
type: Concept
creator: Commission d'enrichissement de la langue française, FranceTerme
date parution JO: 2004-03-26
equivalent EN: cost killer @en
equivalent EN: cost killer (en)
definition: Personne chargée de traquer toutes les dépenses superflues.
in scheme: Économie et gestion d'entreprise
in scheme: concepts
notation: ECON810

clause d'intéressement
type: ConceptConcept
type: Concept
creator: Commission d'enrichissement de la langue française, FranceTerme
date parution JO: 2004-03-26
equivalent EN: earn out @en
equivalent EN: earn out (en)
definition: Disposition contractuelle prévoyant des avantages de nature diverse, en fonction de l'augmentation des bénéfices de l'entreprise.
in scheme: Économie et gestion d'entreprise
in scheme: concepts
notation: ECON811

cœur de marque
type: ConceptConcept
type: Concept
creator: Commission d'enrichissement de la langue française, FranceTerme
date parution JO: 2004-03-26
deconseille ou frequent: coeur de marque
equivalent EN: core brand @en
equivalent EN: core brand (en)
definition: Marque commerciale essentielle pour l'activité et l'image d'une entreprise.
in scheme: Économie et gestion d'entreprise
in scheme: concepts
notation: ECON812

cœur de métier
type: ConceptConcept
type: Concept
creator: Commission d'enrichissement de la langue française, FranceTerme
date parution JO: 2004-03-26
deconseille ou frequent: coeur de métier
equivalent EN: core @en
equivalent EN: core (en)
equivalent EN: core activity @en
equivalent EN: core activity (en)
equivalent EN: core business @en
equivalent EN: core business (en)
alternative label: métier de base
definition: Activité première d'une entreprise.
in scheme: Économie et gestion d'entreprise
in scheme: concepts
notation: ECON813

commission de direction
type: ConceptConcept
type: Concept
creator: Commission d'enrichissement de la langue française, FranceTerme
date parution JO: 2004-03-26
equivalent EN: management fee @en
equivalent EN: management fee (en)
definition: Coût des services centralisés d'un groupe facturés aux entreprises qui en ont bénéficié.
in scheme: Économie et gestion d'entreprise
in scheme: concepts
notation: ECON814

courtier interprofessionnel
type: ConceptConcept
type: Concept
creator: Commission d'enrichissement de la langue française, FranceTerme
date parution JO: 2004-03-26
equivalent EN: interdealer-broker @en
equivalent EN: interdealer-broker (en)
definition: Intermédiaire qui agit, sur les marchés financiers, pour son propre compte ou pour le compte d'autres professionnels de marchés.
in scheme: Finance
in scheme: concepts
notation: ECON815
note: Dans certains pays, notamment au Royaume-Uni, les courtiers interprofessionnels ne s'entremettent qu'entre les spécialistes en valeurs du Trésor.

coût cible
type: ConceptConcept
type: Concept
creator: Commission d'enrichissement de la langue française, FranceTerme
date parution JO: 2004-03-26
equivalent EN: target cost @en
equivalent EN: target cost (en)
definition: Coût constituant un objectif déterminé, calculé généralement à partir du prix de vente visé, dont on déduit la marge souhaitée.
in scheme: Économie et gestion d'entreprise
in scheme: concepts
notation: ECON816
related: méthode des coûts cibles

dénicheur
type: ConceptConcept
type: Concept
creator: Commission d'enrichissement de la langue française, FranceTerme
abbreviation: shopbot @en
date parution JO: 2004-03-26
equivalent EN: shopbot @en
equivalent EN: shopbot (en)
equivalent EN: shopping robot @en
equivalent EN: shopping robot (en)
part of speech: nom masculin
definition: Moteur de recherche spécifique aux sites de commerce électronique, capable d'interroger simultanément plusieurs boutiques en ligne afin de trouver l'article recherché aux meilleures conditions.
in scheme: Économie et gestion d'entreprise
in scheme: concepts
notation: ECON817

écart social
type: ConceptConcept
type: Concept
creator: Commission d'enrichissement de la langue française, FranceTerme
date parution JO: 2004-03-26
deconseille ou frequent: écart fiscal
equivalent EN: tax wedge @en
equivalent EN: tax wedge (en)
equivalent EN: wage wedge @en
equivalent EN: wage wedge (en)
definition: Écart entre le coût total du travail supporté par l'entreprise et le salaire net après cotisations sociales.
in scheme: Économie générale
in scheme: Emploi et travail
in scheme: concepts
notation: ECON818
note: La présente définition correspond au régime français dans lequel les impôts ne sont pas prélevés à la source. En effet, dans les pays où les impôts sont prélevés à la source, la notion de tax wedge correspond plus précisément à l'écart entre le coût total du travail supporté par l'entreprise et le salaire net après impôt et cotisations sociales ; dans ce cas, il s'agit d'un « écart fiscal ».

entreprise en ligne
type: ConceptConcept
type: Concept
creator: Commission d'enrichissement de la langue française, FranceTerme
date parution JO: 2004-03-26
equivalent EN: virtual corporation @en
equivalent EN: virtual corporation (en)
definition: Entreprise dont l'organisation est entièrement fondée sur l'utilisation des nouvelles techniques de l'information et de la communication.
in scheme: Économie et gestion d'entreprise
in scheme: concepts
notation: ECON819

espace-boutique
type: ConceptConcept
type: Concept
creator: Commission d'enrichissement de la langue française, FranceTerme
date parution JO: 2004-03-26
deconseille ou frequent: shop-in-shop
equivalent EN: shop-in-the-shop @en
equivalent EN: shop-in-the-shop (en)
part of speech: nom masculin
definition: Boutique aménagée à l'intérieur d'un magasin.
in scheme: Économie et gestion d'entreprise
in scheme: concepts
notation: ECON820

faire-part de clôture
type: ConceptConcept
type: Concept
creator: Commission d'enrichissement de la langue française, FranceTerme
date parution JO: 2004-03-26
equivalent EN: tombstone @en
equivalent EN: tombstone (en)
alternative label: avis de clôture
definition: Annonce dans la presse indiquant que la souscription d'une opération financière, ouverte ou non au public, est terminée.
in scheme: Finance
in scheme: concepts
notation: ECON821

finalité d'entreprise
type: ConceptConcept
type: Concept
creator: Commission d'enrichissement de la langue française, FranceTerme
date parution JO: 2004-03-26
equivalent EN: corporate purpose @en
equivalent EN: corporate purpose (en)
definition: But assigné aux activités d'une entreprise ou d'un groupe d'entreprises.
in scheme: Économie et gestion d'entreprise
in scheme: concepts
notation: ECON822

grappe d'entreprises
type: ConceptConcept
type: Concept
creator: Commission d'enrichissement de la langue française, FranceTerme
date parution JO: 2004-03-26
equivalent EN: business cluster @en
equivalent EN: business cluster (en)
equivalent EN: cluster @en
equivalent EN: cluster (en)
equivalent EN: cluster of firms @en
equivalent EN: cluster of firms (en)
forme abregee: grappe, n.f.
definition: Regroupement de petites entreprises à l'échelon local.
in scheme: Économie et gestion d'entreprise
in scheme: concepts
notation: ECON823
related: pôle de compétitivité

hors contrat
type: ConceptConcept
type: Concept
creator: Commission d'enrichissement de la langue française, FranceTerme
date parution JO: 2004-03-26
equivalent EN: outside @en
equivalent EN: outside (en)
definition: Se dit d'une opération parallèle à un contrat, convenue afin de contribuer à sa réalisation.
in scheme: Économie et gestion d'entreprise
in scheme: concepts
notation: ECON824

liste restreinte
type: ConceptConcept
type: Concept
creator: Commission d'enrichissement de la langue française, FranceTerme
date parution JO: 2004-03-26
deconseille ou frequent: short liste
equivalent EN: short list @en
equivalent EN: short list (en)
definition: Liste des candidats retenus après une présélection.
in scheme: Tous domaines
in scheme: concepts
notation: ECON825

management par activité
type: ConceptConcept
type: Concept
creator: Commission d'enrichissement de la langue française, FranceTerme
abbreviation: ABM @en
abbreviation: MPA
date parution JO: 2004-03-26
equivalent EN: ABM @en
equivalent EN: ABM (en)
equivalent EN: activity-based management @en
equivalent EN: activity-based management (en)
definition: Principe et pratique de management qui privilégient la méthode des coûts par activité pour la prise de décision.
in scheme: Économie et gestion d'entreprise
in scheme: concepts
notation: ECON826
related: méthode des coûts par activité

maternage
type: ConceptConcept
type: Concept
creator: Commission d'enrichissement de la langue française, FranceTerme
date parution JO: 2004-03-26
equivalent EN: nursing @en
equivalent EN: nursing (en)
part of speech: nom masculin
definition: Technique de fidélisation du client consistant à l'entourer d'attentions et de prévenances.
in scheme: Économie et gestion d'entreprise
in scheme: concepts
notation: ECON827

mentor
type: ConceptConcept
type: Concept
creator: Commission d'enrichissement de la langue française, FranceTerme
date parution JO: 2004-03-26
equivalent EN: coach @en
equivalent EN: coach (en)
part of speech: nom
definition: Cadre chargé d'améliorer les compétences et la réussite professionnelle d'un individu ou d'une équipe.
in scheme: Économie et gestion d'entreprise
in scheme: concepts
notation: ECON828
related: mentorat
related: poulain

mentorat
type: ConceptConcept
type: Concept
creator: Commission d'enrichissement de la langue française, FranceTerme
date parution JO: 2004-03-26
equivalent EN: coaching @en
equivalent EN: coaching (en)
part of speech: nom masculin
definition: Activité du mentor.
in scheme: Économie et gestion d'entreprise
in scheme: concepts
notation: ECON829
related: mentor

méthode des coûts cibles
type: ConceptConcept
type: Concept
creator: Commission d'enrichissement de la langue française, FranceTerme
abbreviation: MCC
date parution JO: 2004-03-26
equivalent EN: target costing @en
equivalent EN: target costing (en)
definition: Ensemble de méthodes et d'outils de gestion permettant de déterminer un objectif de coûts à partir du prix de vente visé, dont on déduit la marge souhaitée.
in scheme: Économie et gestion d'entreprise
in scheme: concepts
notation: ECON830
related: conception à objectif de coût
related: coût cible

méthode des coûts par activité
type: ConceptConcept
type: Concept
creator: Commission d'enrichissement de la langue française, FranceTerme
abbreviation: MCA
date parution JO: 2004-03-26
equivalent EN: ABC method @en
equivalent EN: ABC method (en)
equivalent EN: activity-based costing @en
equivalent EN: activity-based costing (en)
definition: Méthode de calcul du coût de revient d'un produit ou d'un service qui consiste à identifier les activités ou les processus requis pour leur création et à prendre en compte leurs coûts respectifs.
in scheme: Économie et gestion d'entreprise
in scheme: concepts
notation: ECON831
related: management par activité

méthode des coûts stables
type: ConceptConcept
type: Concept
creator: Commission d'enrichissement de la langue française, FranceTerme
abbreviation: MCS
date parution JO: 2004-03-26
deconseille ou frequent: M3C
deconseille ou frequent: MCCC
deconseille ou frequent: méthode du calcul des coûts caractéristiques
equivalent EN: feature costing @en
equivalent EN: feature costing (en)
definition: Méthode de détermination du coût de revient d'un produit ou d'un service qui consiste à en déterminer les caractéristiques stables pour prendre en compte le coût des activités successives nécessaires à leur production.
in scheme: Économie et gestion d'entreprise
in scheme: concepts
notation: ECON832
note: On trouve aussi le terme « méthode du calcul des coûts caractéristiques » (« MCCC » ou « M3C »).

opération de recentrage
type: ConceptConcept
type: Concept
creator: Commission d'enrichissement de la langue française, FranceTerme
date parution JO: 2004-03-26
deconseille ou frequent: spinoff
equivalent EN: spin-off @en
equivalent EN: spin-off (en)
definition: Opération consistant à recentrer l'activité d'une entreprise sur son objet principal par apports partiels d'actifs, par fusions ou, plus souvent, par scissions.
in scheme: Économie et gestion d'entreprise
in scheme: concepts
notation: ECON833

prime à la réponse
type: ConceptConcept
type: Concept
creator: Commission d'enrichissement de la langue française, FranceTerme
date parution JO: 2004-03-26
equivalent EN: early bird @en
equivalent EN: early bird (en)
definition: Technique de promotion des ventes consistant à offrir un avantage au consommateur s'il achète dans un court délai.
in scheme: Économie et gestion d'entreprise
in scheme: concepts
notation: ECON834

rescrit
type: ConceptConcept
type: Concept
creator: Commission d'enrichissement de la langue française, FranceTerme
date parution JO: 2004-03-26
equivalent EN: ruling @en
equivalent EN: ruling (en)
part of speech: nom masculin
definition: Interprétation officielle d'un texte donnée par l'Administration sur la demande d'un administré.
in scheme: Tous domaines
in scheme: concepts
notation: ECON836

responsable des services généraux
type: ConceptConcept
type: Concept
creator: Commission d'enrichissement de la langue française, FranceTerme
date parution JO: 2004-03-26
deconseille ou frequent: facility manager
equivalent EN: facilities manager @en
equivalent EN: facilities manager (en)
definition: Personne chargée de la gestion de tout ce qui n'a pas directement trait à la production de l'entreprise.
in scheme: Économie et gestion d'entreprise
in scheme: concepts
notation: ECON837

tableau de bord
type: ConceptConcept
type: Concept
creator: Commission d'enrichissement de la langue française, FranceTerme
date parution JO: 2004-03-26
equivalent EN: balanced scorecard @en
equivalent EN: balanced scorecard (en)
definition: Document de gestion présentant un ensemble d'indicateurs directement reliés à la stratégie développée par l'entreprise.
in scheme: Économie et gestion d'entreprise
in scheme: concepts
notation: ECON838

taxe au preneur
type: ConceptConcept
type: Concept
creator: Commission d'enrichissement de la langue française, FranceTerme
date parution JO: 2004-03-26
equivalent EN: reverse charge @en
equivalent EN: reverse charge (en)
definition: TVA mise à la charge du bénéficiaire d'une prestation de services, ou de l'acquéreur d'un bien (régime intracommunautaire), par dérogation au principe selon lequel le redevable au Trésor de la TVA est le prestataire ou le vendeur.
in scheme: Économie générale
in scheme: concept-SD-economie-generale-fiscalite
in scheme: concepts
notation: ECON839

mercatique d'amont
type: ConceptConcept
type: Concept
creator: Commission d'enrichissement de la langue française, FranceTerme
date parution JO: 2000-05-12
equivalent EN: upstream direct marketing @en
equivalent EN: upstream direct marketing (en)
definition: Mercatique appliquée aux approvisionnements.
in scheme: Économie et gestion d'entreprise
in scheme: concepts
notation: ECON84

veille automatique
type: ConceptConcept
type: Concept
creator: Commission d'enrichissement de la langue française, FranceTerme
abbreviation: sigint @en
date parution JO: 2004-03-26
equivalent EN: sigint @en
equivalent EN: sigint (en)
equivalent EN: signal intelligence @en
equivalent EN: signal intelligence (en)
definition: Collecte et traitement de l'information par des moyens exclusivement électroniques.
in scheme: Tous domaines
in scheme: concepts
notation: ECON841

veille humaine
type: ConceptConcept
type: Concept
creator: Commission d'enrichissement de la langue française, FranceTerme
abbreviation: humint @en
date parution JO: 2004-03-26
equivalent EN: human intelligence @en
equivalent EN: human intelligence (en)
equivalent EN: humint @en
equivalent EN: humint (en)
definition: Collecte et traitement de l'information effectués directement par l'homme.
in scheme: Tous domaines
in scheme: concepts
notation: ECON842

vente à l'évènement
type: ConceptConcept
type: Concept
creator: Commission d'enrichissement de la langue française, FranceTerme
date parution JO: 2004-03-26
equivalent EN: chrono merchandising @en
equivalent EN: chrono merchandising (en)
equivalent EN: event marketing @en
equivalent EN: event marketing (en)
definition: Technique de promotion des ventes reposant sur l'exploitation d'évènements de la vie du client et par extension de tout évènement intéressant la vie de la société.
in scheme: Économie et gestion d'entreprise
in scheme: concepts
notation: ECON843

chef comptable
type: ConceptConcept
type: Concept
creator: Commission d'enrichissement de la langue française, FranceTerme
date parution JO: 2004-03-26
equivalent EN: accounting manager @en
equivalent EN: accounting manager (en)
in scheme: Économie et gestion d'entreprise
in scheme: concepts
notation: ECON844

responsable de zone à l'exportation
type: ConceptConcept
type: Concept
creator: Commission d'enrichissement de la langue française, FranceTerme
date parution JO: 2004-03-26
equivalent EN: area export manager @en
equivalent EN: area export manager (en)
forme abregee: responsable de zone
in scheme: Économie et gestion d'entreprise
in scheme: concepts
notation: ECON845

responsable de zone de vente
type: ConceptConcept
type: Concept
creator: Commission d'enrichissement de la langue française, FranceTerme
date parution JO: 2004-03-26
equivalent EN: area sales manager @en
equivalent EN: area sales manager (en)
in scheme: Économie et gestion d'entreprise
in scheme: concepts
notation: ECON846

adaptation
type: ConceptConcept
type: Concept
creator: Commission d'enrichissement de la langue française, FranceTerme
date parution JO: 2004-03-26
equivalent EN: fit @en
equivalent EN: fit (en)
part of speech: nom féminin
in scheme: Tous domaines
in scheme: concepts
notation: ECON847

affactureur à forfait
type: ConceptConcept
type: Concept
creator: Commission d'enrichissement de la langue française, FranceTerme
date parution JO: 2004-03-26
equivalent EN: forfaitor @en
equivalent EN: forfaitor (en)
equivalent EN: forfeiter @en
equivalent EN: forfeiter (en)
in scheme: Finance
in scheme: concepts
notation: ECON848

chargé de pays
type: ConceptConcept
type: Concept
creator: Commission d'enrichissement de la langue française, FranceTerme
date parution JO: 2004-03-26
equivalent EN: country manager @en
equivalent EN: country manager (en)
in scheme: Économie et gestion d'entreprise
in scheme: concepts
notation: ECON849

mercatique d'aval
type: ConceptConcept
type: Concept
creator: Commission d'enrichissement de la langue française, FranceTerme
date parution JO: 2000-05-12
equivalent EN: customer marketing @en
equivalent EN: customer marketing (en)
definition: Mercatique appliquée aux débouchés.
in scheme: Économie et gestion d'entreprise
in scheme: concepts
notation: ECON85

chef d'équipe
type: ConceptConcept
type: Concept
creator: Commission d'enrichissement de la langue française, FranceTerme
date parution JO: 2004-03-26
equivalent EN: team leader @en
equivalent EN: team leader (en)
in scheme: Économie et gestion d'entreprise
in scheme: concepts
notation: ECON850

chef de rayon
type: ConceptConcept
type: Concept
creator: Commission d'enrichissement de la langue française, FranceTerme
date parution JO: 2004-03-26
equivalent EN: floor manager @en
equivalent EN: floor manager (en)
in scheme: Économie et gestion d'entreprise
in scheme: concepts
notation: ECON851

chef de réseau
type: ConceptConcept
type: Concept
creator: Commission d'enrichissement de la langue française, FranceTerme
date parution JO: 2004-03-26
equivalent EN: network manager @en
equivalent EN: network manager (en)
in scheme: Économie et gestion d'entreprise
in scheme: concepts
notation: ECON852

conseil-partenaire
type: ConceptConcept
type: Concept
creator: Commission d'enrichissement de la langue française, FranceTerme
date parution JO: 2004-03-26
equivalent EN: sparring-partner @en
equivalent EN: sparring-partner (en)
part of speech: nom masculin
in scheme: Économie et gestion d'entreprise
in scheme: concepts
notation: ECON853

contrôleur de gestion
type: ConceptConcept
type: Concept
creator: Commission d'enrichissement de la langue française, FranceTerme
date parution JO: 2004-03-26
equivalent EN: financial controller @en
equivalent EN: financial controller (en)
in scheme: Économie et gestion d'entreprise
in scheme: concepts
notation: ECON854

directeur commercial
type: ConceptConcept
type: Concept
creator: Commission d'enrichissement de la langue française, FranceTerme
date parution JO: 2004-03-26
equivalent EN: sales director @en
equivalent EN: sales director (en)
in scheme: Économie et gestion d'entreprise
in scheme: concepts
notation: ECON855

directeur de centre commercial
type: ConceptConcept
type: Concept
creator: Commission d'enrichissement de la langue française, FranceTerme
date parution JO: 2004-03-26
equivalent EN: retail management director @en
equivalent EN: retail management director (en)
in scheme: Économie et gestion d'entreprise
in scheme: concepts
notation: ECON856

directeur de magasin
type: ConceptConcept
type: Concept
creator: Commission d'enrichissement de la langue française, FranceTerme
date parution JO: 2004-03-26
equivalent EN: shop manager @en
equivalent EN: shop manager (en)
in scheme: Économie et gestion d'entreprise
in scheme: concepts
notation: ECON857

étalagiste
type: ConceptConcept
type: Concept
creator: Commission d'enrichissement de la langue française, FranceTerme
date parution JO: 2004-03-26
equivalent EN: visual merchandiser @en
equivalent EN: visual merchandiser (en)
part of speech: nom
in scheme: Économie et gestion d'entreprise
in scheme: concepts
notation: ECON858

gestion des relations avec la clientèle
type: ConceptConcept
type: Concept
creator: Commission d'enrichissement de la langue française, FranceTerme
abbreviation: CRM @en
date parution JO: 2004-03-26
equivalent EN: CRM @en
equivalent EN: CRM (en)
equivalent EN: customer relationship management @en
equivalent EN: customer relationship management (en)
in scheme: Économie et gestion d'entreprise
in scheme: concepts
notation: ECON859
related: indice relationnel

mercatique écologique
type: ConceptConcept
type: Concept
creator: Commission d'enrichissement de la langue française, FranceTerme
date parution JO: 2000-05-12
equivalent EN: ecomarketing @en
equivalent EN: ecomarketing (en)
definition: Technique mercatique utilisant des arguments écologiques.
in scheme: Économie et gestion d'entreprise
in scheme: concepts
notation: ECON86

gestionnaire immobilier
type: ConceptConcept
type: Concept
creator: Commission d'enrichissement de la langue française, FranceTerme
date parution JO: 2004-03-26
equivalent EN: property manager @en
equivalent EN: property manager (en)
in scheme: Économie et gestion d'entreprise
in scheme: concepts
notation: ECON860

grignotage
type: ConceptConcept
type: Concept
creator: Commission d'enrichissement de la langue française, FranceTerme
date parution JO: 2004-03-26
equivalent EN: snacking @en
equivalent EN: snacking (en)
part of speech: nom masculin
in scheme: Économie et gestion d'entreprise
in scheme: Restauration
in scheme: concepts
notation: ECON861

histoire d'une réussite
type: ConceptConcept
type: Concept
creator: Commission d'enrichissement de la langue française, FranceTerme
date parution JO: 2004-03-26
equivalent EN: success story @en
equivalent EN: success story (en)
in scheme: Tous domaines
in scheme: concepts
notation: ECON862

magazine en ligne
type: ConceptConcept
type: Concept
creator: Commission d'enrichissement de la langue française, FranceTerme
abbreviation: e-zine @en
date parution JO: 2004-03-26
equivalent EN: e-magazine @en
equivalent EN: e-magazine (en)
equivalent EN: e-zine @en
equivalent EN: e-zine (en)
in scheme: Communication
in scheme: Informatique
in scheme: concept-SD-communication-internet
in scheme: concept-SD-informatique-internet
in scheme: concepts
notation: ECON863
related: concept-economie-numerique

organisation à but non lucratif
type: ConceptConcept
type: Concept
creator: Commission d'enrichissement de la langue française, FranceTerme
abbreviation: NPO @en
date parution JO: 2004-03-26
deconseille ou frequent: non-profit organisation
deconseille ou frequent: non-profit organization
equivalent EN: NPO (GB) @en
equivalent EN: NPO (US) @en
equivalent EN: NPO (en-GB)
equivalent EN: NPO (en-US)
equivalent EN: non-profit organisation (GB) @en
equivalent EN: non-profit organisation (en-GB)
equivalent EN: non-profit organization (US) @en
equivalent EN: non-profit organization (en-US)
in scheme: Économie et gestion d'entreprise
in scheme: concepts
notation: ECON864

pouvoir d'achat
type: ConceptConcept
type: Concept
creator: Commission d'enrichissement de la langue française, FranceTerme
date parution JO: 2004-03-26
equivalent EN: buying power @en
equivalent EN: buying power (en)
equivalent EN: purchasing power @en
equivalent EN: purchasing power (en)
in scheme: Économie et gestion d'entreprise
in scheme: concepts
notation: ECON865

présentation en vitrine
type: ConceptConcept
type: Concept
creator: Commission d'enrichissement de la langue française, FranceTerme
date parution JO: 2004-03-26
equivalent EN: window display @en
equivalent EN: window display (en)
in scheme: Économie et gestion d'entreprise
in scheme: concepts
notation: ECON866

répartiteur, -trice
type: ConceptConcept
type: Concept
creator: Commission d'enrichissement de la langue française, FranceTerme
date parution JO: 2004-03-26
equivalent EN: dispatcher @en
equivalent EN: dispatcher (en)
part of speech: nom
in scheme: Tous domaines
in scheme: concepts
notation: ECON867

responsable de clientèle
type: ConceptConcept
type: Concept
creator: Commission d'enrichissement de la langue française, FranceTerme
date parution JO: 2004-03-26
equivalent EN: client manager @en
equivalent EN: client manager (en)
equivalent EN: customer relationship manager @en
equivalent EN: customer relationship manager (en)
in scheme: Économie et gestion d'entreprise
in scheme: concepts
notation: ECON868

responsable de la facturation
type: ConceptConcept
type: Concept
creator: Commission d'enrichissement de la langue française, FranceTerme
date parution JO: 2004-03-26
equivalent EN: billing manager @en
equivalent EN: billing manager (en)
in scheme: Économie et gestion d'entreprise
in scheme: concepts
notation: ECON869

mercatique personnalisée
type: ConceptConcept
type: Concept
creator: Commission d'enrichissement de la langue française, FranceTerme
date parution JO: 2000-05-12
equivalent EN: micromarketing @en
equivalent EN: micromarketing (en)
equivalent EN: one-to-one marketing @en
equivalent EN: one-to-one marketing (en)
definition: Technique mercatique développant la relation individuelle avec la clientèle.
in scheme: Économie et gestion d'entreprise
in scheme: concepts
notation: ECON87
related: commerce personnalisé

responsable de la mercatique et de la communication
type: ConceptConcept
type: Concept
creator: Commission d'enrichissement de la langue française, FranceTerme
date parution JO: 2004-03-26
equivalent EN: marketing and communication manager @en
equivalent EN: marketing and communication manager (en)
in scheme: Économie et gestion d'entreprise
in scheme: concepts
notation: ECON870

responsable des prix et des devis
type: ConceptConcept
type: Concept
creator: Commission d'enrichissement de la langue française, FranceTerme
date parution JO: 2004-03-26
equivalent EN: cost estimator @en
equivalent EN: cost estimator (en)
in scheme: Économie et gestion d'entreprise
in scheme: concepts
notation: ECON871

secteur non marchand
type: ConceptConcept
type: Concept
creator: Commission d'enrichissement de la langue française, FranceTerme
date parution JO: 2004-03-26
equivalent EN: non-profit sector @en
equivalent EN: non-profit sector (en)
in scheme: Économie et gestion d'entreprise
in scheme: concepts
notation: ECON872

service au volant
type: ConceptConcept
type: Concept
creator: Commission d'enrichissement de la langue française, FranceTerme
date parution JO: 2004-03-26
equivalent EN: drive-in @en
equivalent EN: drive-in (en)
equivalent EN: drive-through @en
equivalent EN: drive-through (en)
equivalent EN: drive-thru @en
equivalent EN: drive-thru (en)
in scheme: Économie et gestion d'entreprise
in scheme: concepts
notation: ECON873
related: retrait automobile
related: point de retrait automobile

ventilation des coûts
type: ConceptConcept
type: Concept
creator: Commission d'enrichissement de la langue française, FranceTerme
date parution JO: 2004-03-26
equivalent EN: cost allocation @en
equivalent EN: cost allocation (en)
equivalent EN: cost breakdown @en
equivalent EN: cost breakdown (en)
in scheme: Économie et gestion d'entreprise
in scheme: concepts
notation: ECON874

volant (au)
type: ConceptConcept
type: Concept
creator: Commission d'enrichissement de la langue française, FranceTerme
date parution JO: 2004-03-26
deconseille ou frequent: au volant
equivalent EN: drive-in @en
equivalent EN: drive-in (en)
part of speech: locution adjectivale
in scheme: Économie et gestion d'entreprise
in scheme: concepts
notation: ECON875

franco à bord
type: ConceptConcept
type: Concept
creator: Commission d'enrichissement de la langue française, FranceTerme
abbreviation: FAB
abbreviation: free on board (... named port of shipment) @en
date parution JO: 2004-04-24
deconseille ou frequent: Incoterm
deconseille ou frequent: Incoterms
equivalent EN: FOB @en
equivalent EN: FOB (en)
equivalent EN: free on board @en
equivalent EN: free on board (... named port of shipment) @en
equivalent EN: free on board (... named port of shipment) (en)
equivalent EN: free on board (en)
in scheme: Économie et gestion d'entreprise
in scheme: concepts
notation: ECON876

niche fiscale
type: ConceptConcept
type: Concept
creator: Commission d'enrichissement de la langue française, FranceTerme
abbreviation: loophole @en
date parution JO: 2000-05-12
equivalent EN: loophole @en
equivalent EN: loophole (en)
equivalent EN: tax loophole @en
equivalent EN: tax loophole (en)
definition: Lacune ou vide législatif permettant d'échapper à l'impôt sans être en infraction.
in scheme: Économie générale
in scheme: concept-SD-economie-generale-fiscalite
in scheme: concepts
notation: ECON88

conditionnement
type: ConceptConcept
type: Concept
creator: Commission d'enrichissement de la langue française, FranceTerme
source: révision de l'arrêté du 10 octobre 1985
date parution JO: 2000-09-22
equivalent EN: package @en
equivalent EN: package (en)
equivalent EN: packaging @en
equivalent EN: packaging (en)
part of speech: nom masculin
definition: Emballage destiné à assurer la protection, la conservation et le transport d'un produit, ou encore servant à le mettre en valeur.
in scheme: Économie et gestion d'entreprise
in scheme: concepts
notation: ECON880

achalandeur
type: ConceptConcept
type: Concept
creator: Commission d'enrichissement de la langue française, FranceTerme
date parution JO: 2005-01-30
equivalent EN: customer contact employee @en
equivalent EN: customer contact employee (en)
part of speech: nom masculin
definition: Personne travaillant en relation directe avec la clientèle.
in scheme: Économie et gestion d'entreprise
in scheme: concepts
notation: ECON881

action reflet
type: ConceptConcept
type: Concept
creator: Commission d'enrichissement de la langue française, FranceTerme
date parution JO: 2005-01-30
equivalent EN: tracking stock @en
equivalent EN: tracking stock (en)
definition: Action émise par une société et dont les dividendes sont indexés sur les résultats d'une de ses branches d'activité, sans que celle-ci constitue une entité juridique.
in scheme: Finance
in scheme: concepts
notation: ECON882

analyse par segmentation
type: ConceptConcept
type: Concept
creator: Commission d'enrichissement de la langue française, FranceTerme
date parution JO: 2005-01-30
equivalent EN: clustering analysis @en
equivalent EN: clustering analysis (en)
definition: Méthode statistique de la mercatique consistant à définir des sous-ensembles au sein d'une population générale donnée.
in scheme: Économie et gestion d'entreprise
in scheme: concepts
notation: ECON883

avertissement sur les résultats
type: ConceptConcept
type: Concept
creator: Commission d'enrichissement de la langue française, FranceTerme
date parution JO: 2005-01-30
equivalent EN: profit warning @en
equivalent EN: profit warning (en)
forme abregee: avertissement, n.m.
definition: Communication publiée par une société cotée, en l'absence d'évènement marquant, afin d'informer le marché que les perspectives de résultats doivent être modifiées.
in scheme: Finance
in scheme: concepts
notation: ECON884
note: La modification des perspectives de résultats peut avoir une incidence importante sur le marché et les positions des opérateurs, qu'elle soit positive ou négative.

centre de services partagés
type: ConceptConcept
type: Concept
creator: Commission d'enrichissement de la langue française, FranceTerme
date parution JO: 2005-01-30
deconseille ou frequent: shared service center
deconseille ou frequent: shared service centre
equivalent EN: shared service center (US) @en
equivalent EN: shared service center (en-US)
equivalent EN: shared service centre (GB) @en
equivalent EN: shared service centre (en-GB)
definition: Entité chargée de la gestion en commun des services nécessaires à plusieurs sociétés ou divisions d'un même groupe.
in scheme: Économie et gestion d'entreprise
in scheme: concepts
notation: ECON885
related: services partagés

commerce personnalisé
type: ConceptConcept
type: Concept
creator: Commission d'enrichissement de la langue française, FranceTerme
date parution JO: 2005-01-30
equivalent EN: dynamic trade @en
equivalent EN: dynamic trade (en)
definition: Activité commerciale fondée sur la mercatique personnalisée.
in scheme: Économie et gestion d'entreprise
in scheme: concepts
notation: ECON886
related: mercatique personnalisée

consommateur cible
type: ConceptConcept
type: Concept
creator: Commission d'enrichissement de la langue française, FranceTerme
date parution JO: 2005-01-30
equivalent EN: target consumer @en
equivalent EN: target consumer (en)
definition: Client potentiel visé par un message commercial.
in scheme: Économie et gestion d'entreprise
in scheme: concepts
notation: ECON887

contrôle a posteriori
type: ConceptConcept
type: Concept
creator: Commission d'enrichissement de la langue française, FranceTerme
date parution JO: 2005-01-30
equivalent EN: back testing @en
equivalent EN: back testing (en)
alternative label: contrôle ex post
definition: Vérification de la validité d'une méthode de calcul des risques à partir de données antérieures.
in scheme: Finance
in scheme: concepts
notation: ECON888

double déduction
type: ConceptConcept
type: Concept
creator: Commission d'enrichissement de la langue française, FranceTerme
date parution JO: 2005-01-30
equivalent EN: double dip @en
equivalent EN: double dip (en)
definition: Combinaison de règles internationales aboutissant à pratiquer des déductions fiscales dans deux pays à la fois.
in scheme: Économie générale
in scheme: concept-SD-economie-generale-fiscalite
in scheme: concepts
notation: ECON889
note: Ces règles s'appliquent deux par deux, éventuellement à plus de deux pays.

option sur titres
type: ConceptConcept
type: Concept
creator: Commission d'enrichissement de la langue française, FranceTerme
date parution JO: 2000-05-12
equivalent EN: stock option @en
equivalent EN: stock option (en)
definition: Option d'acquisition ou de souscription d'actions ou de toute autre valeur mobilière.
in scheme: Finance
in scheme: concepts
notation: ECON89
note: Dans une acception courante, l'expression « option sur titres » désigne une option d'acquisition ou de souscription d'actions lorsqu'elle est offerte par une entreprise à ses salariés ou ses dirigeants, à des conditions préférentielles et à des fins d'intéressement.
related: plan d'options sur titres

économie en ligne
type: ConceptConcept
type: Concept
creator: Commission d'enrichissement de la langue française, FranceTerme
abbreviation: net economy @en
date parution JO: 2005-01-30
deconseille ou frequent: nouvelle économie
deconseille ou frequent: économie numérique
equivalent EN: net economy @en
equivalent EN: net economy (en)
equivalent EN: network economy @en
equivalent EN: network economy (en)
equivalent EN: new economy @en
equivalent EN: new economy (en)
alternative label: économie en réseau
definition: Économie dans laquelle les échanges de biens et de services s'effectuent en ligne grâce aux techniques de l'information et de la communication (TIC).
in scheme: Économie et gestion d'entreprise
in scheme: concepts
notation: ECON890
note: 1. L'expression « nouvelle économie » est impropre.
note: 2. On trouve aussi « économie numérique ».

encadrement intermédiaire
type: ConceptConcept
type: Concept
creator: Commission d'enrichissement de la langue française, FranceTerme
date parution JO: 2005-01-30
equivalent EN: middle management @en
equivalent EN: middle management (en)
definition: Fonctions exercées par des cadres agissant entre la direction générale et d'autres cadres ; par extension, ensemble de ces cadres.
in scheme: Économie et gestion d'entreprise
in scheme: concepts
notation: ECON891

entreprise à administration en ligne
type: ConceptConcept
type: Concept
creator: Commission d'enrichissement de la langue française, FranceTerme
abbreviation: B-to-A @en
abbreviation: B2A @en
abbreviation: EAL
date parution JO: 2005-01-30
equivalent EN: B-to-A @en
equivalent EN: B-to-A (en)
equivalent EN: B2A @en
equivalent EN: B2A (en)
equivalent EN: business-to-administration @en
equivalent EN: business-to-administration (en)
definition: Se dit des échanges électroniques entre une entreprise et une administration.
in scheme: Économie et gestion d'entreprise
in scheme: concepts
notation: ECON892

entreprise à consommateur en ligne
type: ConceptConcept
type: Concept
creator: Commission d'enrichissement de la langue française, FranceTerme
abbreviation: B-to-C @en
abbreviation: B2C @en
abbreviation: B2C commerce @en
abbreviation: ECL
abbreviation: business-to-consumer @en
date parution JO: 2005-01-30
equivalent EN: B-to-C @en
equivalent EN: B-to-C (en)
equivalent EN: B2C @en
equivalent EN: B2C (en)
equivalent EN: B2C commerce @en
equivalent EN: B2C commerce (en)
equivalent EN: business-to-consumer @en
equivalent EN: business-to-consumer (en)
equivalent EN: business-to-consumer commerce @en
equivalent EN: business-to-consumer commerce (en)
equivalent EN: business-to-customer @en
equivalent EN: business-to-customer (en)
definition: Se dit des transactions électroniques entre une entreprise et un particulier.
in scheme: Économie et gestion d'entreprise
in scheme: concepts
notation: ECON893

entreprise à entreprise en ligne
type: ConceptConcept
type: Concept
creator: Commission d'enrichissement de la langue française, FranceTerme
abbreviation: B-to-B @en
abbreviation: B2B @en
abbreviation: B2B commerce @en
abbreviation: EEL
date parution JO: 2005-01-30
equivalent EN: B-to-B @en
equivalent EN: B-to-B (en)
equivalent EN: B2B @en
equivalent EN: B2B (en)
equivalent EN: B2B commerce @en
equivalent EN: B2B commerce (en)
equivalent EN: business-to-business @en
equivalent EN: business-to-business (en)
equivalent EN: business-to-business commerce @en
equivalent EN: business-to-business commerce (en)
equivalent EN: business-to-business transactions @en
equivalent EN: business-to-business transactions (en)
definition: Se dit des transactions électroniques entre entreprises.
in scheme: Économie et gestion d'entreprise
in scheme: concepts
notation: ECON894

extension de marque
type: ConceptConcept
type: Concept
creator: Commission d'enrichissement de la langue française, FranceTerme
date parution JO: 2005-01-30
equivalent EN: brand extension @en
equivalent EN: brand extension (en)
equivalent EN: brand stretching @en
equivalent EN: brand stretching (en)
definition: Technique commerciale consistant à appliquer à un nouveau produit un nom de marque connu.
in scheme: Économie et gestion d'entreprise
in scheme: concepts
notation: ECON895

gagnant-gagnant
type: ConceptConcept
type: Concept
creator: Commission d'enrichissement de la langue française, FranceTerme
date parution JO: 2005-01-30
equivalent EN: win-win @en
equivalent EN: win-win (en)
part of speech: adjectif invariable
definition: Se dit du résultat d'une négociation favorable à chacune des parties.
in scheme: Économie et gestion d'entreprise
in scheme: concepts
notation: ECON897

galerie marchande en ligne
type: ConceptConcept
type: Concept
creator: Commission d'enrichissement de la langue française, FranceTerme
date parution JO: 2005-01-30
deconseille ou frequent: chaîne shopping
equivalent EN: shopping channel @en
equivalent EN: shopping channel (en)
definition: Réseau de commerçants abonnés auprès d'un fournisseur d'accès pour proposer leurs produits sur la toile.
in scheme: Économie et gestion d'entreprise
in scheme: concepts
notation: ECON898
note: L'expression « chaîne shopping » est impropre.

indicateur de déviation
type: ConceptConcept
type: Concept
creator: Commission d'enrichissement de la langue française, FranceTerme
date parution JO: 2005-01-30
equivalent EN: tracking error @en
equivalent EN: tracking error (en)
alternative label: indice de déviation
definition: Indicateur de risque qui mesure la déviation d'un fonds par rapport à sa valeur de référence.
in scheme: Finance
in scheme: concepts
notation: ECON899

marque en ligne
type: ConceptConcept
type: Concept
creator: Commission d'enrichissement de la langue française, FranceTerme
date parution JO: 2005-01-30
deconseille ou frequent: e-marque
equivalent EN: e-brand @en
equivalent EN: e-brand (en)
definition: Marque commerciale présentée sur l'internet.
in scheme: Économie et gestion d'entreprise
in scheme: concepts
notation: ECON900
note: Le terme « e-marque » est impropre.

mesure de couverture brute
type: ConceptConcept
type: Concept
creator: Commission d'enrichissement de la langue française, FranceTerme
abbreviation: GRP @en
abbreviation: MCB
date parution JO: 2005-01-30
equivalent EN: GRP @en
equivalent EN: GRP (en)
equivalent EN: gross-rating point @en
equivalent EN: gross-rating point (en)
definition: Évaluation de l'efficacité de campagnes de publicité, se fondant sur le produit du nombre moyen d'occasions de recevoir un message publicitaire par le pourcentage de personnes susceptibles de le recevoir.
in scheme: Économie et gestion d'entreprise
in scheme: concepts
notation: ECON901

metteur en toile
type: ConceptConcept
type: Concept
creator: Commission d'enrichissement de la langue française, FranceTerme
date parution JO: 2005-01-30
deconseille ou frequent: web agent
deconseille ou frequent: web designer
deconseille ou frequent: webagency
deconseille ou frequent: webagent
deconseille ou frequent: webdesigner
equivalent EN: web agency @en
equivalent EN: web agency (en)
definition: Agence ou personne spécialisée dans la conception et la création de sites sur la toile.
in scheme: Informatique
in scheme: concept-SD-informatique-internet
in scheme: concepts
notation: ECON902

partie prenante
type: ConceptConcept
type: Concept
creator: Commission d'enrichissement de la langue française, FranceTerme
date parution JO: 2005-01-30
deconseille ou frequent: stake holder
equivalent EN: stakeholder @en
equivalent EN: stakeholder (en)
definition: Tout acteur concerné par la bonne marche de l'entreprise, tels le créancier, le fournisseur, le client, le dirigeant, le salarié, l'actionnaire.
in scheme: Finance
in scheme: concepts
notation: ECON903
related: associé aux risques
related: amélioration continue participative
related: valeur partenariale

petite capitalisation
type: ConceptConcept
type: Concept
creator: Commission d'enrichissement de la langue française, FranceTerme
date parution JO: 2005-01-30
deconseille ou frequent: small capitalisation
deconseille ou frequent: small capitalization
equivalent EN: small cap @en
equivalent EN: small cap (en)
definition: Titre émis par une société à faible capitalisation boursière.
in scheme: Finance
in scheme: concepts
notation: ECON904

picoreur
type: ConceptConcept
type: Concept
creator: Commission d'enrichissement de la langue française, FranceTerme
date parution JO: 2005-01-30
equivalent EN: cherry picker @en
equivalent EN: cherry picker (en)
part of speech: nom masculin
definition: Consommateur dont les achats sont conditionnés par les différentes remises dont il peut bénéficier et non par sa préférence pour telle ou telle marque ou enseigne.
in scheme: Économie et gestion d'entreprise
in scheme: concepts
notation: ECON905

planificateur mercatique
type: ConceptConcept
type: Concept
creator: Commission d'enrichissement de la langue française, FranceTerme
date parution JO: 2005-01-30
equivalent EN: market planning manager @en
equivalent EN: market planning manager (en)
definition: Responsable de l'ordonnancement des opérations commerciales.
in scheme: Économie et gestion d'entreprise
in scheme: concepts
notation: ECON906

poulain
type: ConceptConcept
type: Concept
creator: Commission d'enrichissement de la langue française, FranceTerme
date parution JO: 2005-01-30
equivalent EN: mentee @en
equivalent EN: mentee (en)
part of speech: nom masculin
definition: Membre du personnel d'une entreprise, bénéficiant de l'aide d'un mentor.
in scheme: Économie et gestion d'entreprise
in scheme: concepts
notation: ECON907
related: mentor

progiciel de gestion intégré
type: ConceptConcept
type: Concept
creator: Commission d'enrichissement de la langue française, FranceTerme
abbreviation: ERP application @en
abbreviation: PGI
date parution JO: 2005-01-30
equivalent EN: ERP application @en
equivalent EN: ERP application (en)
equivalent EN: enterprise resource planning application @en
equivalent EN: enterprise resource planning application (en)
definition: Système informatique de planification des ressources de l'entreprise.
in scheme: Économie et gestion d'entreprise
in scheme: concepts
notation: ECON908
related: réapprovisionnement continu
related: gestion des évènements de la chaîne logistique
related: gestion des données de la production

résidence protégée
type: ConceptConcept
type: Concept
creator: Commission d'enrichissement de la langue française, FranceTerme
date parution JO: 2005-01-30
equivalent EN: gated community @en
equivalent EN: gated community (en)
definition: Zone d'habitation fermée répondant à certaines exigences de sécurité et de services.
in scheme: Aménagement et urbanisme
in scheme: concepts
notation: ECON909

responsable de la confidentialité
type: ConceptConcept
type: Concept
creator: Commission d'enrichissement de la langue française, FranceTerme
abbreviation: CPO @en
date parution JO: 2005-01-30
equivalent EN: CPO @en
equivalent EN: CPO (en)
equivalent EN: chief privacy officer @en
equivalent EN: chief privacy officer (en)
definition: Personne chargée dans une entreprise de la protection des données informatiques, particulièrement celles relatives aux personnes.
in scheme: Économie et gestion d'entreprise
in scheme: concepts
notation: ECON910

responsable de la fiscalité
type: ConceptConcept
type: Concept
creator: Commission d'enrichissement de la langue française, FranceTerme
date parution JO: 2005-01-30
equivalent EN: tax manager @en
equivalent EN: tax manager (en)
definition: Personne chargée de traiter la fiscalité dans une entreprise.
in scheme: Économie et gestion d'entreprise
in scheme: Économie générale
in scheme: concept-SD-economie-et-gestion-d-entreprise-fiscalite
in scheme: concept-SD-economie-generale-fiscalite
in scheme: concepts
notation: ECON911

responsable des grands comptes
type: ConceptConcept
type: Concept
creator: Commission d'enrichissement de la langue française, FranceTerme
date parution JO: 2005-01-30
equivalent EN: key account manager @en
equivalent EN: key account manager (en)
alternative label: responsable des comptes-clés
definition: Personne chargée de la gestion des opérations avec les clients principaux.
in scheme: Économie et gestion d'entreprise
in scheme: concepts
notation: ECON912

restructuration
type: ConceptConcept
type: Concept
creator: Commission d'enrichissement de la langue française, FranceTerme
date parution JO: 2005-01-30
deconseille ou frequent: restructuration avec embauche
deconseille ou frequent: restructuration avec licenciement
equivalent EN: downsizing @en
equivalent EN: downsizing (en)
equivalent EN: rightsizing @en
equivalent EN: rightsizing (en)
equivalent EN: up sizing @en
equivalent EN: up sizing (en)
equivalent EN: upsizing @en
equivalent EN: upsizing (en)
part of speech: nom féminin
definition: Réorganisation d'une entreprise avec maintien d'effectif, embauche ou licenciement.
in scheme: Économie et gestion d'entreprise
in scheme: concepts
notation: ECON913
scope note: Cette publication annule et remplace celle du terme « restructuration avec embauche » au Journal officiel du 28 juillet 2001.

retrait obligatoire
type: ConceptConcept
type: Concept
creator: Commission d'enrichissement de la langue française, FranceTerme
date parution JO: 2005-01-30
equivalent EN: squeeze out @en
equivalent EN: squeeze out (en)
definition: Cession forcée de titres, autorisée par les autorités de place, à la suite d'une offre publique de retrait, qui permet à un groupe majoritaire d'obtenir le transfert des titres détenus par les minoritaires moyennant une indemnisation.
in scheme: Finance
in scheme: concepts
notation: ECON914
scope note: Cette publication annule et remplace celle du terme « cession forcée » au Journal officiel du 14 août 1998.

site de marché
type: ConceptConcept
type: Concept
creator: Commission d'enrichissement de la langue française, FranceTerme
date parution JO: 2005-01-30
deconseille ou frequent: online market place
deconseille ou frequent: online marketplace
deconseille ou frequent: place de marché
equivalent EN: e-market place @en
equivalent EN: e-market place (en)
definition: Site informatique d'échange de données relatives à un domaine d'activité économique déterminé.
in scheme: Économie et gestion d'entreprise
in scheme: concepts
notation: ECON915

soutien logistique intégré
type: ConceptConcept
type: Concept
creator: Commission d'enrichissement de la langue française, FranceTerme
date parution JO: 2005-01-30
equivalent EN: computer aided acquisition and logistic support @en
equivalent EN: computer aided acquisition and logistic support (en)
equivalent EN: continuous acquisition and life cycle support @en
equivalent EN: continuous acquisition and life cycle support (en)
definition: Méthode de traitement électronique homogène des informations concernant la conception, la fabrication, la commercialisation, la livraison et la maintenance d'éléments industriels.
in scheme: Économie et gestion d'entreprise
in scheme: concepts
notation: ECON916

valeur partenariale
type: ConceptConcept
type: Concept
creator: Commission d'enrichissement de la langue française, FranceTerme
date parution JO: 2005-01-30
equivalent EN: stakeholder value @en
equivalent EN: stakeholder value (en)
definition: Ensemble des caractères qui font apprécier une entreprise, indépendamment de sa valeur actionnariale, par chacune des parties intéressées à sa bonne marche, et qui fonde la confiance qu'elle inspire.
in scheme: Finance
in scheme: concepts
notation: ECON917
related: partie prenante

vente croisée
type: ConceptConcept
type: Concept
creator: Commission d'enrichissement de la langue française, FranceTerme
date parution JO: 2005-01-30
equivalent EN: cross-selling @en
equivalent EN: cross-selling (en)
definition: Technique commerciale qui consiste, pour une entreprise, à vendre les produits d'une autre entreprise et réciproquement.
in scheme: Économie et gestion d'entreprise
in scheme: concepts
notation: ECON918
related: vente poussée

assistant, -e de clientèle
type: ConceptConcept
type: Concept
creator: Commission d'enrichissement de la langue française, FranceTerme
date parution JO: 2005-01-30
equivalent EN: customer assistant @en
equivalent EN: customer assistant (en)
equivalent EN: customer support employee @en
equivalent EN: customer support employee (en)
in scheme: Économie et gestion d'entreprise
in scheme: concepts
notation: ECON919

pistage
type: ConceptConcept
type: Concept
creator: Commission d'enrichissement de la langue française, FranceTerme
date parution JO: 2000-05-12
equivalent EN: tracking @en
equivalent EN: tracking (en)
part of speech: nom masculin
definition: Suivi des effets d'une opération commerciale au cours de son déroulement.
in scheme: Économie et gestion d'entreprise
in scheme: concepts
notation: ECON92

chef des ventes
type: ConceptConcept
type: Concept
creator: Commission d'enrichissement de la langue française, FranceTerme
date parution JO: 2005-01-30
equivalent EN: sales executive @en
equivalent EN: sales executive (en)
in scheme: Économie et gestion d'entreprise
in scheme: concepts
notation: ECON920

indice de pouvoir d'achat
type: ConceptConcept
type: Concept
creator: Commission d'enrichissement de la langue française, FranceTerme
date parution JO: 2005-01-30
equivalent EN: buying power index @en
equivalent EN: buying power index (en)
equivalent EN: purchasing power index @en
equivalent EN: purchasing power index (en)
in scheme: Économie et gestion d'entreprise
in scheme: concepts
notation: ECON921

couple actif sans enfants
type: ConceptConcept
type: Concept
creator: Commission d'enrichissement de la langue française, FranceTerme
abbreviation: CASE
abbreviation: DINK @en
date parution JO: 2005-01-30
deconseille ou frequent: double income no kids
equivalent EN: DINK @en
equivalent EN: DINK (en)
equivalent EN: double income, no kids @en
equivalent EN: double income, no kids (en)
in scheme: Économie et gestion d'entreprise
in scheme: concepts
notation: ECON922

ménage actif suburbain
type: ConceptConcept
type: Concept
creator: Commission d'enrichissement de la langue française, FranceTerme
abbreviation: BSF @en
abbreviation: MAS
date parution JO: 2005-01-30
equivalent EN: BSF @en
equivalent EN: BSF (en)
equivalent EN: busy suburban family @en
equivalent EN: busy suburban family (en)
in scheme: Économie et gestion d'entreprise
in scheme: concepts
notation: ECON923

notoriété
type: ConceptConcept
type: Concept
creator: Commission d'enrichissement de la langue française, FranceTerme
date parution JO: 2005-01-30
equivalent EN: share of mind @en
equivalent EN: share of mind (en)
part of speech: nom féminin
in scheme: Économie et gestion d'entreprise
in scheme: concepts
notation: ECON924

partage du savoir
type: ConceptConcept
type: Concept
creator: Commission d'enrichissement de la langue française, FranceTerme
date parution JO: 2005-01-30
equivalent EN: knowledge sharing @en
equivalent EN: knowledge sharing (en)
in scheme: Économie et gestion d'entreprise
in scheme: concepts
notation: ECON925

personnalisation
type: ConceptConcept
type: Concept
creator: Commission d'enrichissement de la langue française, FranceTerme
date parution JO: 2005-01-30
equivalent EN: personal recognition @en
equivalent EN: personal recognition (en)
part of speech: nom féminin
in scheme: Économie et gestion d'entreprise
in scheme: concepts
notation: ECON926

technique de pointe
type: ConceptConcept
type: Concept
creator: Commission d'enrichissement de la langue française, FranceTerme
date parution JO: 2005-01-30
equivalent EN: high technology @en
equivalent EN: high technology (en)
in scheme: Économie et gestion d'entreprise
in scheme: concepts
notation: ECON927
related: pointe (de)

approvisionnement en ligne
type: ConceptConcept
type: Concept
creator: Commission d'enrichissement de la langue française, FranceTerme
date parution JO: 2005-05-14
deconseille ou frequent: electronic procurement
equivalent EN: e-procurement @en
equivalent EN: e-procurement (en)
definition: Gestion centralisée des acquisitions et des approvisionnements d'une entreprise sur une plateforme électronique.
in scheme: Économie et gestion d'entreprise
in scheme: concepts
notation: ECON929

politique d'entreprise
type: ConceptConcept
type: Concept
creator: Commission d'enrichissement de la langue française, FranceTerme
date parution JO: 2000-05-12
equivalent EN: business politics @en
equivalent EN: business politics (en)
definition: Ensemble des orientations choisies par une entreprise pour conduire ses affaires.
in scheme: Économie et gestion d'entreprise
in scheme: concepts
notation: ECON93

chaîne logistique
type: ConceptConcept
type: Concept
creator: Commission d'enrichissement de la langue française, FranceTerme
date parution JO: 2005-05-14
equivalent EN: supply chain @en
equivalent EN: supply chain (en)
definition: Ensemble des processus nécessaires pour fournir des produits ou des services.
in scheme: Économie et gestion d'entreprise
in scheme: concepts
notation: ECON930
related: gestion des évènements de la chaîne logistique
related: planification partagée des approvisionnements
related: gestion fondée sur la demande
related: dernier kilomètre

consommateur à consommateur en ligne
type: ConceptConcept
type: Concept
creator: Commission d'enrichissement de la langue française, FranceTerme
abbreviation: C-to-C @en
abbreviation: C2C @en
abbreviation: CCL
date parution JO: 2005-05-14
equivalent EN: C-to-C @en
equivalent EN: C-to-C (en)
equivalent EN: C2C @en
equivalent EN: C2C (en)
equivalent EN: consumer-to-consumer @en
equivalent EN: consumer-to-consumer (en)
definition: Se dit des transactions commerciales réalisées entre consommateurs au moyen de l'internet.
in scheme: Économie et gestion d'entreprise
in scheme: concepts
notation: ECON931

coût moyen pondéré du capital
type: ConceptConcept
type: Concept
creator: Commission d'enrichissement de la langue française, FranceTerme
abbreviation: CMPC
abbreviation: WACC @en
date parution JO: 2005-05-14
equivalent EN: WACC @en
equivalent EN: WACC (en)
equivalent EN: weighted average cost of capital @en
equivalent EN: weighted average cost of capital (en)
definition: Moyenne pondérée du coût, net de l'impôt, de l'ensemble des sources de financement d'une entreprise.
in scheme: Économie et gestion d'entreprise
in scheme: concepts
notation: ECON932

création de valeur d'un exercice
type: ConceptConcept
type: Concept
creator: Commission d'enrichissement de la langue française, FranceTerme
abbreviation: CVE
abbreviation: EVA @en
date parution JO: 2005-05-14
equivalent EN: EVA @en
equivalent EN: EVA (en)
equivalent EN: economic value added @en
equivalent EN: economic value added (en)
definition: Résultat courant après impôt, déduction faite de la rémunération des capitaux engagés.
in scheme: Économie et gestion d'entreprise
in scheme: concepts
notation: ECON933
note: Il est possible de calculer cet indicateur tant pour le passé que pour l'avenir dans le cas où l'entreprise dispose d'un plan d'affaires.
related: plan d'affaires

formation en ligne
type: ConceptConcept
type: Concept
creator: Commission d'enrichissement de la langue française, FranceTerme
date parution JO: 2005-05-14
deconseille ou frequent: e-formation
deconseille ou frequent: eformation
deconseille ou frequent: elearning
deconseille ou frequent: electronic learning
equivalent EN: e-learning @en
equivalent EN: e-learning (en)
equivalent EN: e-training @en
equivalent EN: e-training (en)
equivalent EN: on-line training @en
equivalent EN: on-line training (en)
equivalent EN: virtual learning @en
equivalent EN: virtual learning (en)
definition: Formation faisant appel à des moyens de communication électroniques.
in scheme: Tous domaines
in scheme: concepts
notation: ECON934
note: Le terme « e-formation » est à éviter.
related: formation
related: cours en ligne ouvert à tous
related: cours en ligne d'entreprise
related: cours en ligne d'accès restreint

management
type: ConceptConcept
type: Concept
creator: Commission d'enrichissement de la langue française, FranceTerme
date parution JO: 2005-05-14
equivalent EN: management @en
equivalent EN: management (en)
part of speech: nom masculin
broader: concept-innovation
definition: Ensemble des activités d'organisation et de gestion de l'entreprise et de son personnel.
in scheme: Économie et gestion d'entreprise
in scheme: concepts
notation: ECON935
note: Ce terme ne doit pas se prononcer à l'anglaise.
related: concept-developpement
scope note: Cette publication annule et remplace celle du Journal officiel du 22 septembre 2000.

mode de la rue
type: ConceptConcept
type: Concept
creator: Commission d'enrichissement de la langue française, FranceTerme
date parution JO: 2005-05-14
equivalent EN: street fashion @en
equivalent EN: street fashion (en)
equivalent EN: street trend @en
equivalent EN: street trend (en)
part of speech: locution nominale féminine
broader: concept-mode
definition: Tendance dominante dans les villes, en matière vestimentaire.
in scheme: Économie et gestion d'entreprise
in scheme: Habillement et mode
in scheme: concepts
notation: ECON936

rapport social
type: ConceptConcept
type: Concept
creator: Commission d'enrichissement de la langue française, FranceTerme
date parution JO: 2005-05-14
deconseille ou frequent: reporting social
equivalent EN: social reporting @en
equivalent EN: social reporting (en)
alternative label: compte rendu social
definition: Rapport qui rend compte à l'ensemble des acteurs concernés de l'activité d'une entreprise, considérée du point de vue des relations humaines, de la morale professionnelle et des effets sur l'environnement.
in scheme: Économie et gestion d'entreprise
in scheme: concepts
notation: ECON937
note: L'expression « reporting social » est à éviter.
related: notation sociale

rendement de l'actif
type: ConceptConcept
type: Concept
creator: Commission d'enrichissement de la langue française, FranceTerme
abbreviation: RDA
abbreviation: ROA @en
date parution JO: 2005-05-14
equivalent EN: ROA @en
equivalent EN: ROA (en)
equivalent EN: return on assets @en
equivalent EN: return on assets (en)
definition: Quotient du bénéfice net augmenté des intérêts et des charges afférents aux capitaux empruntés par le total de l'actif.
in scheme: Économie et gestion d'entreprise
in scheme: concepts
notation: ECON938

rendement de l'investissement
type: ConceptConcept
type: Concept
creator: Commission d'enrichissement de la langue française, FranceTerme
abbreviation: RDI
abbreviation: ROI @en
abbreviation: ROIC @en
date parution JO: 2005-05-14
equivalent EN: ROI @en
equivalent EN: ROI (en)
equivalent EN: ROIC @en
equivalent EN: ROIC (en)
equivalent EN: return on invested capital @en
equivalent EN: return on invested capital (en)
equivalent EN: return on investment @en
equivalent EN: return on investment (en)
definition: Quotient du bénéfice net par le capital investi.
in scheme: Économie et gestion d'entreprise
in scheme: concepts
notation: ECON939

prévision autoproductrice
type: ConceptConcept
type: Concept
creator: Commission d'enrichissement de la langue française, FranceTerme
date parution JO: 2000-05-12
equivalent EN: self-fulfilling prophecy @en
equivalent EN: self-fulfilling prophecy (en)
definition: Anticipation qui contribue à la réalisation du phénomène prévu, en suscitant la convergence des comportements d'un ensemble d'agents économiques.
in scheme: Économie générale
in scheme: concepts
notation: ECON94
note: À la Bourse, il suffit qu'une hausse soit anticipée pour que la hausse se produise effectivement, puisque cette anticipation incite les agents économiques à acheter des valeurs mobilières, ce qui fait monter les cours.

rendement des capitaux engagés
type: ConceptConcept
type: Concept
creator: Commission d'enrichissement de la langue française, FranceTerme
abbreviation: RCE
abbreviation: ROCE @en
date parution JO: 2005-05-14
equivalent EN: ROCE @en
equivalent EN: ROCE (en)
equivalent EN: return on capital employed @en
equivalent EN: return on capital employed (en)
definition: Quotient du résultat d'exploitation par les capitaux propres augmentés des dettes à long terme.
in scheme: Économie et gestion d'entreprise
in scheme: concepts
notation: ECON940

rendement des capitaux propres
type: ConceptConcept
type: Concept
creator: Commission d'enrichissement de la langue française, FranceTerme
abbreviation: RCP
abbreviation: ROE @en
date parution JO: 2005-05-14
equivalent EN: ROE @en
equivalent EN: ROE (en)
equivalent EN: return on equity @en
equivalent EN: return on equity (en)
definition: Quotient du bénéfice net par les capitaux propres.
in scheme: Économie et gestion d'entreprise
in scheme: concepts
notation: ECON941

rentabilité totale d'une activité
type: ConceptConcept
type: Concept
creator: Commission d'enrichissement de la langue française, FranceTerme
abbreviation: RTA
abbreviation: TBR @en
date parution JO: 2005-05-14
equivalent EN: TBR @en
equivalent EN: TBR (en)
equivalent EN: total business return @en
equivalent EN: total business return (en)
definition: Quotient de la valeur finale des investissements pour un secteur donné, augmentée des flux qu'ils engendrent, par leur valeur initiale en début de période.
in scheme: Économie et gestion d'entreprise
in scheme: concepts
notation: ECON942

résultat net d'exploitation
type: ConceptConcept
type: Concept
creator: Commission d'enrichissement de la langue française, FranceTerme
abbreviation: NOPAT @en
abbreviation: RNE
date parution JO: 2005-05-14
equivalent EN: NOPAT @en
equivalent EN: NOPAT (en)
equivalent EN: net operating profit after tax @en
equivalent EN: net operating profit after tax (en)
definition: Recettes dégagées par les activités d'exploitation de l'entreprise diminuées des impôts afférents.
in scheme: Économie et gestion d'entreprise
in scheme: concepts
notation: ECON944

salon professionnel en ligne
type: ConceptConcept
type: Concept
creator: Commission d'enrichissement de la langue française, FranceTerme
date parution JO: 2005-05-14
deconseille ou frequent: E-salon
definition: Présentation sur la toile des nouveautés aux professionnels d'un secteur d'activité.
in scheme: Économie et gestion d'entreprise
in scheme: concepts
notation: ECON946
note: « E-salon » est un terme impropre.

service d'appui
type: ConceptConcept
type: Concept
creator: Commission d'enrichissement de la langue française, FranceTerme
date parution JO: 2005-05-14
equivalent EN: back office @en
equivalent EN: back office (en)
definition: Ensemble de fonctions administratives ou logistiques liées à la vente, telles que la mise à jour des stocks, les livraisons et les paiements.
in scheme: Économie et gestion d'entreprise
in scheme: concepts
notation: ECON947
related: service de clientèle

service de clientèle
type: ConceptConcept
type: Concept
creator: Commission d'enrichissement de la langue française, FranceTerme
date parution JO: 2005-05-14
equivalent EN: front office @en
equivalent EN: front office (en)
definition: Ensemble des services commerciaux de l'entreprise proposés au client, tels que les bons de commande et les catalogues.
in scheme: Économie et gestion d'entreprise
in scheme: concepts
notation: ECON948
related: service d'appui

transfert sectoriel
type: ConceptConcept
type: Concept
creator: Commission d'enrichissement de la langue française, FranceTerme
date parution JO: 2005-05-14
equivalent EN: spillover @en
equivalent EN: spillover (en)
definition: Passage massif de personnes actives d'un secteur de l'économie à un autre.
in scheme: Économie et gestion d'entreprise
in scheme: concepts
notation: ECON949

primauté
type: ConceptConcept
type: Concept
creator: Commission d'enrichissement de la langue française, FranceTerme
date parution JO: 2000-05-12
deconseille ou frequent: domination
deconseille ou frequent: prédominance
deconseille ou frequent: prépondérance
deconseille ou frequent: suprématie
equivalent EN: leadership @en
equivalent EN: leadership (en)
part of speech: nom féminin
definition: Le fait pour une personne ou une organisation d'occuper le premier rang dans son domaine d'activité.
in scheme: Tous domaines
in scheme: concepts
notation: ECON95
note: Selon les cas, « domination », « prépondérance », « prédominance », « suprématie » peuvent être également utilisés.

valeur actionnariale
type: ConceptConcept
type: Concept
creator: Commission d'enrichissement de la langue française, FranceTerme
date parution JO: 2005-05-14
equivalent EN: shareholder value @en
equivalent EN: shareholder value (en)
definition: Différence entre le prix de vente et le prix d'achat d'une action augmenté des dividendes reçus au cours d'une période donnée.
in scheme: Économie et gestion d'entreprise
in scheme: concepts
notation: ECON950
related: création de valeur actionnariale

valeur ajoutée de trésorerie
type: ConceptConcept
type: Concept
creator: Commission d'enrichissement de la langue française, FranceTerme
abbreviation: CVA @en
abbreviation: VAT
date parution JO: 2005-05-14
equivalent EN: CVA @en
equivalent EN: CVA (en)
equivalent EN: cash value added @en
equivalent EN: cash value added (en)
definition: Excédent de trésorerie dégagé par l'exploitation, corrigé du coût de financement des capitaux engagés.
in scheme: Économie et gestion d'entreprise
in scheme: concepts
notation: ECON951

valeur de marché créée
type: ConceptConcept
type: Concept
creator: Commission d'enrichissement de la langue française, FranceTerme
abbreviation: MVA @en
abbreviation: VMC
date parution JO: 2005-05-14
equivalent EN: MVA @en
equivalent EN: MVA (en)
equivalent EN: market value added @en
equivalent EN: market value added (en)
definition: Montant de la capitalisation boursière, diminué des capitaux propres et de l'endettement.
in scheme: Économie et gestion d'entreprise
in scheme: concepts
notation: ECON952

administration à consommateur en ligne
type: ConceptConcept
type: Concept
creator: Commission d'enrichissement de la langue française, FranceTerme
abbreviation: A-to-C @en
abbreviation: A2C @en
abbreviation: ACL
date parution JO: 2005-05-14
equivalent EN: A-to-C @en
equivalent EN: A-to-C (en)
equivalent EN: A2C @en
equivalent EN: A2C (en)
equivalent EN: administration-to-consumer @en
equivalent EN: administration-to-consumer (en)
in scheme: Économie et gestion d'entreprise
in scheme: concepts
notation: ECON953

boisson énergétique
type: ConceptConcept
type: Concept
creator: Commission d'enrichissement de la langue française, FranceTerme
date parution JO: 2005-05-14
equivalent EN: energy drink @en
equivalent EN: energy drink (en)
equivalent EN: power drink @en
equivalent EN: power drink (en)
in scheme: Économie et gestion d'entreprise
in scheme: Restauration
in scheme: concepts
notation: ECON954

candidat en ligne
type: ConceptConcept
type: Concept
creator: Commission d'enrichissement de la langue française, FranceTerme
date parution JO: 2005-05-14
equivalent EN: e-applicant @en
equivalent EN: e-applicant (en)
equivalent EN: on-line applicant @en
equivalent EN: on-line applicant (en)
in scheme: Économie et gestion d'entreprise
in scheme: concepts
notation: ECON955

création de valeur actionnariale
type: ConceptConcept
type: Concept
creator: Commission d'enrichissement de la langue française, FranceTerme
date parution JO: 2005-05-14
equivalent EN: shareholder value creation @en
equivalent EN: shareholder value creation (en)
in scheme: Économie et gestion d'entreprise
in scheme: concepts
notation: ECON957
related: valeur actionnariale

détaillant en ligne
type: ConceptConcept
type: Concept
creator: Commission d'enrichissement de la langue française, FranceTerme
date parution JO: 2005-05-14
equivalent EN: e-tailer @en
equivalent EN: e-tailer (en)
in scheme: Économie et gestion d'entreprise
in scheme: concepts
notation: ECON958

fabriqué en, à, au
type: ConceptConcept
type: Concept
creator: Commission d'enrichissement de la langue française, FranceTerme
date parution JO: 2005-05-14
deconseille ou frequent: fabriqué au
deconseille ou frequent: fabriqué en
deconseille ou frequent: fabriqué à
equivalent EN: made in @en
equivalent EN: made in (en)
in scheme: Économie et gestion d'entreprise
in scheme: concepts
notation: ECON959

prix en trompe-l'œil
type: ConceptConcept
type: Concept
creator: Commission d'enrichissement de la langue française, FranceTerme
date parution JO: 2000-05-12
deconseille ou frequent: oeil
equivalent EN: odd price @en
equivalent EN: odd price (en)
definition: Prix de vente d'un produit fixé juste au-dessous du prix arrondi.
in scheme: Économie et gestion d'entreprise
in scheme: concepts
notation: ECON96

plat à emporter
type: ConceptConcept
type: Concept
creator: Commission d'enrichissement de la langue française, FranceTerme
date parution JO: 2005-05-14
equivalent EN: food on the move @en
equivalent EN: food on the move (en)
in scheme: Économie et gestion d'entreprise
in scheme: Restauration
in scheme: concepts
notation: ECON960

responsable de la sécurité
type: ConceptConcept
type: Concept
creator: Commission d'enrichissement de la langue française, FranceTerme
date parution JO: 2005-05-14
equivalent EN: safety manager @en
equivalent EN: safety manager (en)
equivalent EN: security manager @en
equivalent EN: security manager (en)
in scheme: Économie et gestion d'entreprise
in scheme: concepts
notation: ECON961

responsable des exportations
type: ConceptConcept
type: Concept
creator: Commission d'enrichissement de la langue française, FranceTerme
date parution JO: 2005-05-14
equivalent EN: export sales manager @en
equivalent EN: export sales manager (en)
in scheme: Économie et gestion d'entreprise
in scheme: concepts
notation: ECON962

services en ligne
type: ConceptConcept
type: Concept
creator: Commission d'enrichissement de la langue française, FranceTerme
date parution JO: 2005-05-14
equivalent EN: e-services @en
equivalent EN: e-services (en)
in scheme: Économie et gestion d'entreprise
in scheme: concepts
notation: ECON963

bureau combiné
type: ConceptConcept
type: Concept
creator: Commission d'enrichissement de la langue française, FranceTerme
date parution JO: 2006-10-26
equivalent EN: combi-office @en
equivalent EN: combi-office (en)
definition: Espace associant une surface collective destinée au travail en équipe et de petits bureaux individuels.
in scheme: Économie et gestion d'entreprise
in scheme: Habitat et construction
in scheme: concepts
notation: ECON967

compte rendu
type: ConceptConcept
type: Concept
creator: Commission d'enrichissement de la langue française, FranceTerme
date parution JO: 2006-10-26
equivalent EN: reporting @en
equivalent EN: reporting (en)
definition: Opération consistant, pour une entreprise, à faire rapport de son activité.
in scheme: Économie et gestion d'entreprise
in scheme: concepts
notation: ECON968
related: compte rendu

compte rendu
type: ConceptConcept
type: Concept
creator: Commission d'enrichissement de la langue française, FranceTerme
date parution JO: 2006-10-26
equivalent EN: report @en
equivalent EN: report (en)
definition: Document analysant le fonctionnement et l'activité d'une entreprise dans un ou plusieurs domaines, pour une période donnée.
in scheme: Économie et gestion d'entreprise
in scheme: concepts
notation: ECON969
related: compte rendu

consultant pour l'internet
type: ConceptConcept
type: Concept
creator: Commission d'enrichissement de la langue française, FranceTerme
date parution JO: 2006-10-26
equivalent EN: e-business consultant @en
equivalent EN: e-business consultant (en)
definition: Spécialiste qui aide les entreprises à développer ou à diversifier leurs activités en ligne.
in scheme: Économie et gestion d'entreprise
in scheme: concepts
notation: ECON970

cosourçage
type: ConceptConcept
type: Concept
creator: Commission d'enrichissement de la langue française, FranceTerme
date parution JO: 2006-10-26
equivalent EN: co-sourcing @en
equivalent EN: co-sourcing (en)
part of speech: nom masculin
definition: Activité de sourçage conduite en commun par plusieurs sourceurs.
in scheme: Économie et gestion d'entreprise
in scheme: concepts
notation: ECON971
related: sourçage

délai de lancement
type: ConceptConcept
type: Concept
creator: Commission d'enrichissement de la langue française, FranceTerme
abbreviation: TMM
abbreviation: TTM @en
date parution JO: 2006-10-26
equivalent EN: TTM @en
equivalent EN: TTM (en)
equivalent EN: time-to-market @en
equivalent EN: time-to-market (en)
alternative label: temps de mise sur le marché
definition: Temps écoulé entre la décision de s'implanter sur un marché et la mise en vente effective d'un produit.
in scheme: Économie et gestion d'entreprise
in scheme: concepts
notation: ECON972

évaluateur, -trice
type: ConceptConcept
type: Concept
creator: Commission d'enrichissement de la langue française, FranceTerme
date parution JO: 2006-10-26
equivalent EN: valuator @en
equivalent EN: valuator (en)
part of speech: nom
definition: Personne qui, dans un établissement financier, est chargée de procéder à l'évaluation des titres de la clientèle et à leur suivi sur les marchés financiers.
in scheme: Finance
in scheme: concepts
notation: ECON974

gestion des données de la production
type: ConceptConcept
type: Concept
creator: Commission d'enrichissement de la langue française, FranceTerme
abbreviation: PDM @en
date parution JO: 2006-10-26
equivalent EN: PDM @en
equivalent EN: PDM (en)
equivalent EN: product data management @en
equivalent EN: product data management (en)
definition: Utilisation d'un progiciel de gestion intégré pour améliorer, au cours d'un processus de production, l'échange des informations entre les différents services d'une entreprise, ainsi qu'avec ses fournisseurs ou ses partenaires.
in scheme: Économie et gestion d'entreprise
in scheme: concepts
notation: ECON975
related: progiciel de gestion intégré

gestion des ressources humaines en ligne
type: ConceptConcept
type: Concept
creator: Commission d'enrichissement de la langue française, FranceTerme
abbreviation: GRHL
abbreviation: e-HRM @en
date parution JO: 2006-10-26
deconseille ou frequent: e-ressources humaines
equivalent EN: e-HRM @en
equivalent EN: e-HRM (en)
equivalent EN: e-human resources management @en
equivalent EN: e-human resources management (en)
forme abregee: GRH en ligne
definition: Gestion du personnel d'une entreprise par l'internet et l'intranet.
in scheme: Économie et gestion d'entreprise
in scheme: concepts
notation: ECON976
note: L'expression « e-ressources humaines » est à proscrire.

gestionnaire des besoins
type: ConceptConcept
type: Concept
creator: Commission d'enrichissement de la langue française, FranceTerme
date parution JO: 2006-10-26
equivalent EN: demand manager @en
equivalent EN: demand manager (en)
definition: Responsable qui, au sein de la chaîne logistique, assure, à partir des prévisions de vente de l'entreprise, l'approvisionnement des marchés en produits finis.
in scheme: Économie et gestion d'entreprise
in scheme: concepts
notation: ECON977

groupe cible
type: ConceptConcept
type: Concept
creator: Commission d'enrichissement de la langue française, FranceTerme
date parution JO: 2006-10-26
equivalent EN: focus group @en
equivalent EN: focus group (en)
equivalent EN: target group @en
equivalent EN: target group (en)
definition: Ensemble de personnes qui présentent des caractéristiques communes et peuvent ainsi faire l'objet d'une étude mercatique.
in scheme: Économie et gestion d'entreprise
in scheme: concepts
notation: ECON978

groupement d'acheteurs
type: ConceptConcept
type: Concept
creator: Commission d'enrichissement de la langue française, FranceTerme
date parution JO: 2006-10-26
equivalent EN: buying group @en
equivalent EN: buying group (en)
equivalent EN: group buying club @en
equivalent EN: group buying club (en)
definition: Regroupement de particuliers, notamment par l'intermédiaire de sites spécialisés sur l'internet, afin d'obtenir de meilleurs prix.
in scheme: Économie et gestion d'entreprise
in scheme: concepts
notation: ECON979

management par la qualité
type: ConceptConcept
type: Concept
creator: Commission d'enrichissement de la langue française, FranceTerme
abbreviation: TQM @en
date parution JO: 2006-10-26
equivalent EN: TQM @en
equivalent EN: TQM (en)
equivalent EN: total quality management @en
equivalent EN: total quality management (en)
definition: Gestion visant à obtenir un meilleur résultat grâce à une démarche d'ensemble fondée sur la qualité.
in scheme: Économie et gestion d'entreprise
in scheme: concepts
notation: ECON980

méthode d'enveloppement
type: ConceptConcept
type: Concept
creator: Commission d'enrichissement de la langue française, FranceTerme
abbreviation: DEA @en
date parution JO: 2006-10-26
equivalent EN: DEA @en
equivalent EN: DEA (en)
equivalent EN: data envelopment analysis @en
equivalent EN: data envelopment analysis (en)
definition: Mode de détermination de la performance d'unités de production, à l'aide d'une représentation graphique d'une surface dite d'enveloppement des différents cas.
in scheme: Économie et gestion d'entreprise
in scheme: concepts
notation: ECON981

navetteur, -euse
type: ConceptConcept
type: Concept
creator: Commission d'enrichissement de la langue française, FranceTerme
date parution JO: 2006-10-26
deconseille ou frequent: travailleur pendulaire
equivalent EN: commuter @en
equivalent EN: commuter (en)
part of speech: nom
definition: Personne qui effectue l'aller et le retour entre son domicile et son lieu de travail.
in scheme: Économie et gestion d'entreprise
in scheme: Transports et mobilité
in scheme: concepts
notation: ECON982
note: On trouve également l'expression « travailleur pendulaire ».

premier cité
type: ConceptConcept
type: Concept
creator: Commission d'enrichissement de la langue française, FranceTerme
date parution JO: 2006-10-26
equivalent EN: top-of-mind @en
equivalent EN: top-of-mind (en)
definition: Logo ou nom de marque, d'enseigne ou d'entreprise arrivant en tête des réponses spontanées d'une enquête de notoriété.
in scheme: Économie et gestion d'entreprise
in scheme: concepts
notation: ECON984

régression pas à pas
type: ConceptConcept
type: Concept
creator: Commission d'enrichissement de la langue française, FranceTerme
date parution JO: 2006-10-26
equivalent EN: stepwise regression @en
equivalent EN: stepwise regression (en)
alternative label: régression séquentielle
definition: Procédure de détermination par étapes des variables explicatives d'une ou de plusieurs autres variables.
in scheme: Économie générale
in scheme: Statistique
in scheme: concepts
notation: ECON985

responsable du développement
type: ConceptConcept
type: Concept
creator: Commission d'enrichissement de la langue française, FranceTerme
date parution JO: 2006-10-26
deconseille ou frequent: directeur du développement
deconseille ou frequent: prospecteur d'affaires
deconseille ou frequent: responsable du développement commercial
equivalent EN: business developer @en
equivalent EN: business developer (en)
equivalent EN: business development director @en
equivalent EN: business development director (en)
equivalent EN: business development manager @en
equivalent EN: business development manager (en)
definition: Personne chargée, dans l'entreprise, de faire croître le chiffre d'affaires ou de favoriser sa croissance.
in scheme: Économie et gestion d'entreprise
in scheme: concepts
notation: ECON986
note: 1. Les objectifs du responsable du développement peuvent être atteints au sein de l'entreprise par une meilleure valorisation des produits ou services existants, la recherche de nouveaux débouchés - ou à l'extérieur de l'entreprise - par la recherche d'alliances ou de partenariats, ou par la prospection de nouveaux domaines d'activités.
note: 2. Le terme s'emploie aussi pour désigner plus spécialement le responsable du développement commercial de l'entreprise.
note: 3. L'expression « prospecteur d'affaires » est aussi utilisée pour désigner plus spécialement une personne responsable du développement sur un marché déterminé.
scope note: Cette publication annule et remplace celle du terme « directeur du développement » au Journal officiel du 28 juillet 2001.

services partagés
type: ConceptConcept
type: Concept
creator: Commission d'enrichissement de la langue française, FranceTerme
date parution JO: 2006-10-26
equivalent EN: shared services @en
equivalent EN: shared services (en)
definition: Gestion en commun des services nécessaires à plusieurs sociétés ou divisions d'un même groupe.
in scheme: Économie et gestion d'entreprise
in scheme: concepts
notation: ECON987
related: centre de services partagés

seuil de rentabilité
type: ConceptConcept
type: Concept
creator: Commission d'enrichissement de la langue française, FranceTerme
abbreviation: BEP @en
date parution JO: 2006-10-26
equivalent EN: BEP @en
equivalent EN: BEP (en)
equivalent EN: break-even point @en
equivalent EN: break-even point (en)
alternative label: point mort
definition: Niveau d'activité auquel l'entreprise réalise des produits d'exploitation égaux à ses charges d'exploitation.
in scheme: Économie et gestion d'entreprise
in scheme: concepts
notation: ECON988

téléstratège
type: ConceptConcept
type: Concept
creator: Commission d'enrichissement de la langue française, FranceTerme
date parution JO: 2006-10-26
equivalent EN: e-business strategist @en
equivalent EN: e-business strategist (en)
part of speech: nom
definition: Responsable du développement stratégique d'une entreprise par le recours aux communications électroniques.
in scheme: Économie et gestion d'entreprise
in scheme: concepts
notation: ECON989

publireportage
type: ConceptConcept
type: Concept
creator: Commission d'enrichissement de la langue française, FranceTerme
date parution JO: 2000-05-12
deconseille ou frequent: minimercial
equivalent EN: infomercial @en
equivalent EN: infomercial (en)
part of speech: nom masculin
definition: Message publicitaire écrit ou télévisé qui est présenté sous la forme d'un reportage et qui permet de fournir au consommateur des informations plus détaillées que par les messages classiques.
in scheme: Communication
in scheme: Économie et gestion d'entreprise
in scheme: concept-SD-communication-publicite
in scheme: concept-SD-economie-et-gestion-d-entreprise-publicite
in scheme: concepts
notation: ECON99
note: En anglais, on utilise le terme minimercial lorsque le publireportage est limité à quelques minutes.

télétravailleur
type: ConceptConcept
type: Concept
creator: Commission d'enrichissement de la langue française, FranceTerme
abbreviation: SOHO @en
date parution JO: 2006-10-26
equivalent EN: SOHO @en
equivalent EN: SOHO (en)
equivalent EN: small office home office @en
equivalent EN: small office home office (en)
part of speech: nom masculin
definition: Professionnel qui travaille à domicile en utilisant les télécommunications et l'informatique.
in scheme: Économie et gestion d'entreprise
in scheme: concepts
notation: ECON990

valeur économique du client
type: ConceptConcept
type: Concept
creator: Commission d'enrichissement de la langue française, FranceTerme
date parution JO: 2006-10-26
equivalent EN: customer value @en
equivalent EN: customer value (en)
forme abregee: valeur du client
definition: Gain qu'un client peut procurer à une entreprise durant toute la période où il se fournit chez elle ou recourt régulièrement à ses services.
in scheme: Économie et gestion d'entreprise
in scheme: concepts
notation: ECON991

mercatique de communauté
type: ConceptConcept
type: Concept
creator: Commission d'enrichissement de la langue française, FranceTerme
date parution JO: 2006-10-26
deconseille ou frequent: marketing tribal
equivalent EN: tribal marketing @en
equivalent EN: tribal marketing (en)
definition: Démarche mercatique appliquée à des groupes de consommateurs repérés selon un critère ethnosociologique.
in scheme: Économie et gestion d'entreprise
in scheme: concepts
notation: ECON992

agent technico-commercial
type: ConceptConcept
type: Concept
creator: Commission d'enrichissement de la langue française, FranceTerme
date parution JO: 2006-10-26
equivalent EN: field service engineer @en
equivalent EN: field service engineer (en)
in scheme: Économie et gestion d'entreprise
in scheme: concepts
notation: ECON993

analyste en rémunération
type: ConceptConcept
type: Concept
creator: Commission d'enrichissement de la langue française, FranceTerme
date parution JO: 2006-10-26
equivalent EN: remuneration analyst @en
equivalent EN: remuneration analyst (en)
in scheme: Économie et gestion d'entreprise
in scheme: concepts
notation: ECON994

bureau à domicile
type: ConceptConcept
type: Concept
creator: Commission d'enrichissement de la langue française, FranceTerme
date parution JO: 2006-10-26
equivalent EN: home office @en
equivalent EN: home office (en)
in scheme: Économie et gestion d'entreprise
in scheme: concepts
notation: ECON995

chef de projet
type: ConceptConcept
type: Concept
creator: Commission d'enrichissement de la langue française, FranceTerme
date parution JO: 2006-10-26
equivalent EN: project manager @en
equivalent EN: project manager (en)
in scheme: Économie et gestion d'entreprise
in scheme: concepts
notation: ECON996

démarcheur, -euse
type: ConceptConcept
type: Concept
creator: Commission d'enrichissement de la langue française, FranceTerme
date parution JO: 2006-10-26
equivalent EN: direct marketer @en
equivalent EN: direct marketer (en)
part of speech: nom
in scheme: Économie et gestion d'entreprise
in scheme: concepts
notation: ECON997

gain immédiat
type: ConceptConcept
type: Concept
creator: Commission d'enrichissement de la langue française, FranceTerme
date parution JO: 2006-10-26
equivalent EN: instant win @en
equivalent EN: instant win (en)
in scheme: Économie et gestion d'entreprise
in scheme: concepts
notation: ECON998

adresse informatique
type: ConceptConcept
type: Concept
creator: Commission d'enrichissement de la langue française, FranceTerme
source: révision de l'arrêté du 27 août 1992
date parution JO: 2000-09-22
equivalent EN: address @en
equivalent EN: address (en)
forme abregee: adresse, n.f.
definition: Caractère ou groupe de caractères ayant pour fonction de localiser une information dans une mémoire ou d'indiquer le destinataire d'un message.
in scheme: Informatique
in scheme: concepts
notation: EDUC1

espace partagé de travail en ligne
type: ConceptConcept
type: Concept
creator: Commission d'enrichissement de la langue française, FranceTerme
date parution JO: 2017-01-10
deconseille ou frequent: espace collaboratif
definition: Espace en ligne, le plus souvent d’accès restreint, qui permet le partage, l’échange et la production de documents et de ressources.
in scheme: Tous domaines
in scheme: concepts
notation: EDUC100
note: On trouve aussi le terme « espace collaboratif ».
related: cotravail

cours en ligne ouvert à tous
type: ConceptConcept
type: Concept
creator: Commission d'enrichissement de la langue française, FranceTerme
abbreviation: CLOM
date parution JO: 2017-01-10
equivalent EN: MOOC @en
equivalent EN: MOOC (en)
equivalent EN: massive open online course @en
equivalent EN: massive open online course (en)
equivalent EN: massively open online course @en
equivalent EN: massively open online course (en)
alternative label: cours en ligne ouvert massivement
definition: Formation accessible à tous, dispensée dans l'internet par des établissements d'enseignement, des entreprises, des organismes ou des particuliers, qui offre à chacun la possibilité d'évaluer ses connaissances et peut déboucher sur une certification.
in scheme: Éducation
in scheme: Formation
in scheme: concepts
notation: EDUC105
note: Les certifications proposées sont parfois payantes.
related: formation en ligne
related: cours en ligne d'entreprise
related: cours en ligne d'accès restreint
scope note: Cette publication annule et remplace celle du Journal officiel du 21 septembre 2013.

référencer
type: ConceptConcept
type: Concept
creator: Commission d'enrichissement de la langue française, FranceTerme
date parution JO: 2018-02-25
deconseille ou frequent: benchmarker
equivalent EN: benchmark @en
equivalent EN: benchmark (en)
part of speech: verbe
alternative label: parangonner
definition: Procéder à une évaluation par rapport à un ou plusieurs modèles reconnus, en s’inscrivant dans une recherche d’excellence.
in scheme: Tous domaines
in scheme: concepts
notation: EDUC106
note: On préférera utiliser le terme « parangonner » lorsque l’emploi du terme « référencer » peut prêter à confusion, par exemple dans le domaine documentaire.
related: référenciation
scope note: Cette publication annule et remplace celle du Journal officiel du 18 mars 2011.

référenciation
type: ConceptConcept
type: Concept
creator: Commission d'enrichissement de la langue française, FranceTerme
date parution JO: 2018-02-25
deconseille ou frequent: benchmark
deconseille ou frequent: étalonnage
equivalent EN: benchmarking @en
equivalent EN: benchmarking (en)
part of speech: nom féminin
alternative label: parangonnage
definition: Procédure d’évaluation effectuée par rapport à un ou plusieurs modèles reconnus, qui s’inscrit dans une recherche d’excellence.
in scheme: Tous domaines
in scheme: concepts
notation: EDUC107
note: On préférera utiliser le terme « parangonnage » lorsque l’emploi du terme « référenciation » peut prêter à confusion, par exemple dans le domaine documentaire.
related: référencer
scope note: Cette publication annule et remplace celle des termes « référenciation » et « méthode de référence » au Journal officiel du 14 août 1998 et du 22 septembre 2000.

apprentissage adaptatif
type: ConceptConcept
type: Concept
creator: Commission d'enrichissement de la langue française, FranceTerme
date parution JO: 2018-02-25
deconseille ou frequent: adaptative learning
deconseille ou frequent: enseignement adaptatif
equivalent EN: adaptive learning @en
equivalent EN: adaptive learning (en)
definition: Démarche de formation reposant sur l’usage en ligne de cours, d’exercices et d’évaluations s’ajustant en temps réel aux rythmes et aux besoins d’un apprenant.
in scheme: Éducation
in scheme: Formation
in scheme: concepts
notation: EDUC108
related: apprenant, -e

classe d'immersion numérique
type: ConceptConcept
type: Concept
creator: Commission d'enrichissement de la langue française, FranceTerme
date parution JO: 2018-02-25
equivalent EN: immersive classroom @en
equivalent EN: immersive classroom (en)
alternative label: classe immersive
definition: Salle équipée d’un dispositif technologique qui plonge les élèves dans un univers tridimensionnel, multisensoriel et interactif, recréé numériquement ; par extension, enseignement dispensé grâce à ce dispositif.
in scheme: Éducation
in scheme: concepts
notation: EDUC109

cours en ligne d'entreprise
type: ConceptConcept
type: Concept
creator: Commission d'enrichissement de la langue française, FranceTerme
abbreviation: CLE
date parution JO: 2018-02-25
deconseille ou frequent: corporate open on-line course
equivalent EN: COOC @en
equivalent EN: COOC (en)
equivalent EN: corporate open online course @en
equivalent EN: corporate open online course (en)
definition: Formation en ligne proposée par une entreprise à ses salariés, à ses partenaires et à ses clients.
in scheme: Économie et gestion d'entreprise
in scheme: Formation
in scheme: concepts
notation: EDUC110
related: formation en ligne
related: cours en ligne ouvert à tous
related: cours en ligne d'accès restreint

indice de citations
type: ConceptConcept
type: Concept
creator: Commission d'enrichissement de la langue française, FranceTerme
abbreviation: FI
date parution JO: 2018-02-25
equivalent EN: IF @en
equivalent EN: IF (en)
equivalent EN: impact factor @en
equivalent EN: impact factor (en)
alternative label: facteur d'impact
definition: Indicateur bibliométrique relatif à un périodique, correspondant au nombre de fois où les articles qui y sont publiés sont cités, rapporté au nombre total des articles publiés dans ce périodique, au cours d’une période donnée.
in scheme: Recherche
in scheme: concepts
notation: EDUC111
note: L’indice de citations peut s’étendre, selon la discipline, à d’autres types de productions scientifiques telles que des ouvrages collectifs, des bases de données ou des corpus.

inclusion scolaire
type: ConceptConcept
type: Concept
creator: Commission d'enrichissement de la langue française, FranceTerme
date parution JO: 2018-02-25
deconseille ou frequent: inclusion
deconseille ou frequent: école inclusive
deconseille ou frequent: éducation inclusive
equivalent EN: inclusive education @en
equivalent EN: inclusive education (en)
definition: Principe pédagogique qui préconise d’accueillir dans une même classe tous les enfants sans distinction, en accordant un soutien approprié à ceux qui ont des besoins particuliers.
in scheme: Éducation
in scheme: concepts
notation: EDUC113
note: On trouve aussi les expressions « éducation inclusive » et « école inclusive ».

instruction à domicile
type: ConceptConcept
type: Concept
creator: Commission d'enrichissement de la langue française, FranceTerme
date parution JO: 2018-02-25
deconseille ou frequent: home education
deconseille ou frequent: école à la maison
equivalent EN: home school @en
equivalent EN: home school (en)
equivalent EN: home schooling @en
equivalent EN: home schooling (en)
definition: Instruction reçue intégralement dans la sphère familiale par des enfants soumis à l’obligation scolaire.
in scheme: Éducation
in scheme: concepts
notation: EDUC114
note: 1. L’instruction à domicile peut être dispensée, par exemple, par un organisme d’enseignement à distance ou par les parents.
note: 2. En France, l’instruction à domicile est contrôlée et évaluée par l’État.

enseignement parallèle
type: ConceptConcept
type: Concept
creator: Commission d'enrichissement de la langue française, FranceTerme
date parution JO: 2019-07-09
deconseille ou frequent: soutien scolaire
deconseille ou frequent: soutien scolaire privé
deconseille ou frequent: éducation de l'ombre
equivalent EN: shadow education @en
equivalent EN: shadow education (en)
definition: Système d’enseignement payant, dispensé hors de l’institution scolaire ou universitaire, dont le but est d’améliorer les performances des élèves ou des étudiants sans se substituer à celle-ci.
in scheme: Éducation
in scheme: concepts
notation: EDUC115
note: L’enseignement parallèle doit être distingué du soutien scolaire, qui vise à aider ponctuellement des élèves et n’est pas toujours apporté à titre onéreux.

jeu d'évasion
type: ConceptConcept
type: Concept
creator: Commission d'enrichissement de la langue française, FranceTerme
date parution JO: 2019-07-09
deconseille ou frequent: escape room
deconseille ou frequent: jeu d'escape
equivalent EN: escape game @en
equivalent EN: escape game (en)
definition: Jeu, construit autour d’un scénario, qui consiste à résoudre, collectivement et dans un temps limité, un problème ou une énigme afin de s’échapper d’un espace clos, qu’il soit réel ou virtuel.
in scheme: Éducation
in scheme: Loisirs
in scheme: concepts
notation: EDUC116
related: livre-jeu d'évasion

publication de données
type: ConceptConcept
type: Concept
creator: Commission d'enrichissement de la langue française, FranceTerme
date parution JO: 2019-07-09
equivalent EN: DP @en
equivalent EN: DP (en)
equivalent EN: data paper @en
equivalent EN: data paper (en)
definition: Document publié qui présente, selon des normes déterminées, des données brutes relatives à une activité de recherche scientifique.
in scheme: Enseignement supérieur
in scheme: Recherche
in scheme: concepts
notation: EDUC117
related: revue de données

démarche inspirée du design
type: ConceptConcept
type: Concept
creator: Commission d'enrichissement de la langue française, FranceTerme
date parution JO: 2019-07-09
deconseille ou frequent: démarche design
deconseille ou frequent: pensée design
equivalent EN: design thinking @en
equivalent EN: design thinking (en)
definition: Manière d’aborder un problème ou de concevoir un objet, qui conjugue l’analyse des besoins des usagers, la mise en œuvre de compétences techniques et une approche créative.
in scheme: Tous domaines
in scheme: concepts
notation: EDUC118
note: On trouve aussi le terme « démarche design ».

ludification
type: ConceptConcept
type: Concept
creator: Commission d'enrichissement de la langue française, FranceTerme
date parution JO: 2019-07-09
equivalent EN: gamification @en
equivalent EN: gamification (en)
part of speech: nom féminin
definition: Utilisation de ressorts ludiques dans une démarche pédagogique ou mercatique.
in scheme: Communication
in scheme: Éducation
in scheme: concepts
notation: EDUC119
related: ludopublicité
related: jeu vidéo publicitaire
related: jeu sérieux

humanités numériques
type: ConceptConcept
type: Concept
creator: Commission d'enrichissement de la langue française, FranceTerme
date parution JO: 2019-07-09
deconseille ou frequent: DH
deconseille ou frequent: humanités digitales
deconseille ou frequent: sciences humaines numériques
equivalent EN: digital humanities @en
equivalent EN: digital humanities (en)
definition: Domaine de recherche et d’enseignement au croisement de l’informatique et des lettres, des arts, des sciences humaines et des sciences sociales, visant à produire et à partager des savoirs, des méthodes et de nouveaux objets de connaissance à partir d’un corpus de données numériques.
in scheme: Éducation
in scheme: Recherche
in scheme: concepts
notation: EDUC120

jeu sérieux
type: ConceptConcept
type: Concept
creator: Commission d'enrichissement de la langue française, FranceTerme
date parution JO: 2019-07-09
deconseille ou frequent: serious video game
equivalent EN: serious game @en
equivalent EN: serious game (en)
definition: Jeu vidéo conçu à des fins d’éducation, de formation, de communication ou d’information.
in scheme: Éducation
in scheme: Formation
in scheme: concepts
notation: EDUC121
related: jeu d'entreprise
related: ludification
scope note: Cette publication annule et remplace celle du Journal officiel du 24 avril 2010.

mastérant, -e
type: ConceptConcept
type: Concept
creator: Commission d'enrichissement de la langue française, FranceTerme
date parution JO: 2019-07-09
part of speech: nom
definition: Étudiant inscrit dans une formation conduisant au diplôme national de master.
in scheme: Enseignement supérieur
in scheme: concepts
notation: EDUC122

observable
type: ConceptConcept
type: Concept
creator: Commission d'enrichissement de la langue française, FranceTerme
date parution JO: 2019-07-09
part of speech: nom masculin
definition: Objet d’observation jugé pertinent pour une étude ou une évaluation.
in scheme: Éducation
in scheme: Recherche
in scheme: concepts
notation: EDUC123
related: attendu

revue de données
type: ConceptConcept
type: Concept
creator: Commission d'enrichissement de la langue française, FranceTerme
date parution JO: 2019-07-09
equivalent EN: data journal @en
equivalent EN: data journal (en)
definition: Revue qui rassemble des publications de données.
in scheme: Enseignement supérieur
in scheme: Recherche
in scheme: concepts
notation: EDUC125
related: publication de données

attendu
type: ConceptConcept
type: Concept
creator: Commission d'enrichissement de la langue française, FranceTerme
date parution JO: 2021-03-16
deconseille ou frequent: attendus
part of speech: nom masculin
definition: Savoir ou compétence que tout apprenant doit maîtriser dans une discipline ou une formation, à un niveau donné.
in scheme: Éducation
in scheme: Enseignement supérieur
in scheme: concepts
notation: EDUC127
note: 1. Le terme « attendu » se rencontre le plus souvent au pluriel.
note: 2. Dans l’enseignement supérieur, les attendus peuvent inclure le niveau de qualification que tout étudiant doit avoir atteint pour obtenir un diplôme ou une certification.
related: observable
related: apprenant, -e

attendu
type: ConceptConcept
type: Concept
creator: Commission d'enrichissement de la langue française, FranceTerme
date parution JO: 2021-03-16
deconseille ou frequent: attendus
part of speech: nom masculin
definition: Objectif défini lors de la mise en œuvre d’un modèle théorique ou d’un protocole expérimental.
in scheme: Recherche
in scheme: concepts
notation: EDUC128

badge numérique
type: ConceptConcept
type: Concept
creator: Commission d'enrichissement de la langue française, FranceTerme
date parution JO: 2021-03-16
deconseille ou frequent: badge digital
equivalent EN: digital badge @en
equivalent EN: digital badge (en)
equivalent EN: digital open badge @en
equivalent EN: digital open badge (en)
equivalent EN: learning badge @en
equivalent EN: learning badge (en)
equivalent EN: open badge @en
equivalent EN: open badge (en)
definition: Image numérique à laquelle sont attachées des données attestant les savoir-être et les savoir-faire du détenteur, qui font apparaître notamment son identité et celle de la structure émettrice, ainsi que les critères d’attribution du badge.
in scheme: Éducation
in scheme: Emploi et travail
in scheme: concepts
notation: EDUC129
note: Les badges numériques sont rassemblés dans une badgeothèque.
related: savoir-être professionnel
related: savoir-faire professionnel
related: badgeothèque

badgeothèque
type: ConceptConcept
type: Concept
creator: Commission d'enrichissement de la langue française, FranceTerme
date parution JO: 2021-03-16
equivalent EN: backpack @en
equivalent EN: backpack (en)
part of speech: nom féminin
definition: Espace numérique dans lequel une personne rassemble ses badges numériques, auxquels elle donne accès selon les modalités de son choix.
in scheme: Éducation
in scheme: Emploi et travail
in scheme: concepts
notation: EDUC130
note: La badgeothèque peut figurer dans un curriculum vitae en ligne.
related: badge numérique

carte heuristique
type: ConceptConcept
type: Concept
creator: Commission d'enrichissement de la langue française, FranceTerme
date parution JO: 2021-03-16
deconseille ou frequent: carte cognitive
deconseille ou frequent: carte conceptuelle
deconseille ou frequent: carte des idées
deconseille ou frequent: carte mentale
deconseille ou frequent: mapping
deconseille ou frequent: mind mapping
equivalent EN: mind map @en
equivalent EN: mind map (en)
definition: Représentation graphique d’informations, de connaissances et d’idées, qui sont organisées en arborescences autour d’un thème central afin de rendre intelligibles leurs relations.
in scheme: Tous domaines
in scheme: concepts
notation: EDUC131
note: 1. On trouve aussi le terme « carte mentale ».
note: 2. L’emploi du mot mapping, emprunté de l’anglais, est à proscrire.
related: facilitation graphique
related: graphe de connaissances

facilitation graphique
type: ConceptConcept
type: Concept
creator: Commission d'enrichissement de la langue française, FranceTerme
date parution JO: 2021-03-16
equivalent EN: graphic facilitation @en
equivalent EN: graphic facilitation (en) [pratique de groupe]
equivalent EN: graphic recording @en
equivalent EN: graphic recording (en) [pratique individuelle]
equivalent EN: scribing @en
equivalent EN: scribing (en) [pratique individuelle]
definition: Pratique qui consiste à représenter, à l’aide d’images et de textes, des informations et des idées de manière organisée et explicite, en vue de parvenir à une meilleure compréhension de leurs interactions.
in scheme: Tous domaines
in scheme: concepts
notation: EDUC132
note: La facilitation graphique peut donner lieu à une carte heuristique.
related: carte heuristique
related: notes graphiques

notes graphiques
type: ConceptConcept
type: Concept
creator: Commission d'enrichissement de la langue française, FranceTerme
date parution JO: 2021-03-16
deconseille ou frequent: note graphique
deconseille ou frequent: prise de notes graphiques
deconseille ou frequent: sketchnoting
equivalent EN: sketchnote @en
equivalent EN: sketchnote (en)
definition: Notes issues d’une technique relevant de la facilitation graphique, qui consiste à organiser des informations en associant l’écrit et le dessin.
in scheme: Tous domaines
in scheme: concepts
notation: EDUC133
note: On parle de « prise de notes graphiques » (en anglais : sketchnoting) pour désigner la technique elle-même.
related: facilitation graphique

document d’accompagnement
type: ConceptConcept
type: Concept
creator: Commission d'enrichissement de la langue française, FranceTerme
date parution JO: 2021-03-16
deconseille ou frequent: document à distribuer
equivalent EN: hand-out @en
equivalent EN: hand-out (en)
equivalent EN: handout @en
equivalent EN: handout (en)
alternative label: document d'appui
definition: Document imprimé qui est mis à la disposition d’un auditoire et qui accompagne un exposé, un cours ou une présentation.
in scheme: Communication
in scheme: Formation
in scheme: concepts
notation: EDUC134

classe de maître
type: ConceptConcept
type: Concept
creator: Commission d'enrichissement de la langue française, FranceTerme
date parution JO: 2021-03-16
deconseille ou frequent: master classe
equivalent EN: master class @en
equivalent EN: master class (en)
definition: Session de formation extraordinaire dispensée par un artiste ou une personnalité que sa compétence, son autorité ou sa notoriété distinguent dans son domaine.
in scheme: Arts
in scheme: Enseignement supérieur
in scheme: concepts
notation: EDUC135
scope note: Cette publication annule et remplace celle du Journal officiel du 16 septembre 2006.

Recommandation sur les équivalents français à donner au terme webinar
type: ConceptConcept
type: Concept
creator: Commission d'enrichissement de la langue française, FranceTerme
date parution JO: 2021-03-09
deconseille ou frequent: audioconférence
deconseille ou frequent: conférence
deconseille ou frequent: conférence en ligne
deconseille ou frequent: cyberconférence
deconseille ou frequent: seminar
deconseille ou frequent: séminaire en ligne
deconseille ou frequent: téléconférence
deconseille ou frequent: visioconférence
deconseille ou frequent: webinaire
deconseille ou frequent: webinar
in scheme: Tous domaines
in scheme: concepts
notation: EDUC136
related: cyberconférence
related: concept-TELE113
related: concept-TELE26
related: concept-TELE92
scope note: Lire la recommandation "http://www.culture.fr/Ressources/FranceTerme/Recommandations-d-usage/WEBINAR" ; toutes les recommandations d'usage publiées par la Commission générale de terminologie et de néologie au Journal officiel à l'adresse suivante : "http://www.culture.fr/Ressources/FranceTerme/Recommandations-d-usage".

Recommandation sur les équivalents français à donner au terme graduate school
type: ConceptConcept
type: Concept
creator: Commission d'enrichissement de la langue française, FranceTerme
date parution JO: 2021-08-28
deconseille ou frequent: EUR
deconseille ou frequent: école d'études supérieures
deconseille ou frequent: école de
deconseille ou frequent: école du cycle supérieur
deconseille ou frequent: école graduée
deconseille ou frequent: école magistrale et doctorale
deconseille ou frequent: école magistrale et doctorale de site
deconseille ou frequent: école supérieure
deconseille ou frequent: école universitaire de recherche
in scheme: Enseignement supérieur
in scheme: concepts
notation: EDUC137
scope note: Lire la recommandation "http://www.culture.fr/Ressources/FranceTerme/Recommandations-d-usage/GRADUATE-SCHOOL" ; toutes les recommandations d'usage publiées par la Commission générale de terminologie et de néologie au Journal officiel à l'adresse suivante : "http://www.culture.fr/Ressources/FranceTerme/Recommandations-d-usage".

numérosité
type: ConceptConcept
type: Concept
creator: Commission d'enrichissement de la langue française, FranceTerme
date parution JO: 2022-05-24
equivalent EN: numerosity @en
equivalent EN: numerosity (en)
part of speech: nom féminin
definition: Nombre d’éléments d’un ensemble fini qui peut être appréhendé par subitisation, par comptage ou par estimation.
in scheme: Éducation
in scheme: Enseignement supérieur
in scheme: concepts
notation: EDUC138
related: subitisation

subitisation
type: ConceptConcept
type: Concept
creator: Commission d'enrichissement de la langue française, FranceTerme
date parution JO: 2022-05-24
deconseille ou frequent: subitising
deconseille ou frequent: subitization
equivalent EN: subitizing @en
equivalent EN: subitizing (en)
part of speech: nom féminin
alternative label: intuition numérique
definition: Capacité spontanée à appréhender immédiatement, sans compter, le nombre des éléments d’un ensemble fini de faible extension.
in scheme: Éducation
in scheme: Enseignement supérieur
in scheme: concepts
notation: EDUC139
note: Le nombre d’éléments qui peut être appréhendé sans comptage évolue en fonction de l’âge ; il est estimé à trois pour les humains dès la première année de la vie.
related: numérosité

accès ouvert
type: ConceptConcept
type: Concept
creator: Commission d'enrichissement de la langue française, FranceTerme
date parution JO: 2022-05-24
deconseille ou frequent: OA
equivalent EN: open access @en
equivalent EN: open access (en)
part of speech: locution nominale masculine
definition: Modalité de dépôt, par un public identifié, ou de consultation en ligne de ressources et de travaux issus de la recherche scientifique, sans barrières techniques, éditoriales ou commerciales.
in scheme: Édition et livre
in scheme: Recherche
in scheme: concepts
notation: EDUC140
related: accès libre

accès libre
type: ConceptConcept
type: Concept
creator: Commission d'enrichissement de la langue française, FranceTerme
date parution JO: 2022-05-24
deconseille ou frequent: OA
deconseille ou frequent: en accès libre
deconseille ou frequent: libre accès
deconseille ou frequent: open access
part of speech: locution nominale masculine
definition: Modalité d’exploitation et de modification sans aucune restriction de ressources en ligne.
in scheme: Informatique
in scheme: concept-SD-informatique-internet
in scheme: concepts
notation: EDUC141
note: Les ressources en accès libre sont par exemple des documents, des données métatextuelles ou des logiciels.
related: accès ouvert

préciput
type: ConceptConcept
type: Concept
creator: Commission d'enrichissement de la langue française, FranceTerme
date parution JO: 2022-05-24
deconseille ou frequent: frais de siège
part of speech: nom masculin
definition: Part du financement alloué à un projet de recherche, qui revient à l’établissement gestionnaire de l’unité à laquelle est associé le porteur du projet.
in scheme: Enseignement supérieur
in scheme: Recherche
in scheme: concepts
notation: EDUC142
note: Le préciput est destiné à couvrir notamment les coûts indirects liés au projet.

plateforme de données de l'éducation et de l'enseignement
type: ConceptConcept
type: Concept
creator: Commission d'enrichissement de la langue française, FranceTerme
date parution JO: 2022-05-24
deconseille ou frequent: data hub
deconseille ou frequent: education data
deconseille ou frequent: plate-forme de données
deconseille ou frequent: plateforme de données
deconseille ou frequent: plateforme de données sur l'éducation
deconseille ou frequent: portail de données
equivalent EN: education data hub @en
equivalent EN: education data hub (en)
part of speech: locution nominale féminine
definition: Plateforme de données numériques produites en masse qui mettent à la disposition du public des informations relatives à l’apprentissage, à l’éducation et à l’enseignement.
in scheme: Éducation
in scheme: Enseignement supérieur
in scheme: concepts
notation: EDUC143

oratie
type: ConceptConcept
type: Concept
creator: Commission d'enrichissement de la langue française, FranceTerme
equivalent EN: oracy @en
equivalent EN: oracy (en)
part of speech: nom féminin
definition: Maîtrise de la communication orale dans la production et dans la réception du discours.
in scheme: Éducation
in scheme: Enseignement supérieur
in scheme: concepts
notation: EDUC144
note: L’oratie suppose d’adopter une position active dans l’interaction verbale qui met notamment en œuvre des compétences d’écoute, d’exercice critique du jugement et d’expression structurée.

syllabus
type: ConceptConcept
type: Concept
creator: Commission d'enrichissement de la langue française, FranceTerme
date parution JO: 2022-05-24
deconseille ou frequent: plan de cours
deconseille ou frequent: programme d'étude
deconseille ou frequent: programme de cours
equivalent EN: syllabus @en
equivalent EN: syllabus (en)
part of speech: nom masculin
alternative label: programme d'étude
definition: Document synoptique dans lequel le contenu d’un enseignement universitaire est présenté sous la forme d’une table des matières commentée.
in scheme: Enseignement supérieur
in scheme: concepts
notation: EDUC145

prépublication
type: ConceptConcept
type: Concept
creator: Commission d'enrichissement de la langue française, FranceTerme
date parution JO: 2022-05-24
deconseille ou frequent: pré publication
deconseille ou frequent: pré-publication
deconseille ou frequent: texte préliminaire
equivalent EN: preprint @en
equivalent EN: preprint (en)
equivalent EN: submitted version @en
equivalent EN: submitted version (en)
part of speech: nom féminin
definition: Version mise en ligne d’un article scientifique destiné à être publié par un éditeur.
in scheme: Édition et livre
in scheme: Recherche
in scheme: concepts
notation: EDUC146
note: Le texte peut avoir été soumis à une évaluation par les pairs.
related: évaluation par les pairs

boîte aux lettres
type: ConceptConcept
type: Concept
creator: Commission d'enrichissement de la langue française, FranceTerme
source: révision de l'arrêté du 27 août 1992
date parution JO: 2000-09-22
equivalent EN: mail box @en
equivalent EN: mail box (en)
definition: Dans une messagerie électronique, espace de mémoire réservé à un abonné, dans lequel sont conservés les messages qui lui sont destinés et éventuellement les messages qu'il envoie.
in scheme: Informatique
in scheme: Télécommunications
in scheme: concepts
notation: EDUC2

crédit
type: ConceptConcept
type: Concept
creator: Commission d'enrichissement de la langue française, FranceTerme
date parution JO: 2007-06-16
deconseille ou frequent: ECTS
deconseille ou frequent: SECT
deconseille ou frequent: crédit ECTS
deconseille ou frequent: crédits
deconseille ou frequent: crédits ECTS
deconseille ou frequent: european credits transfer system
deconseille ou frequent: système européen de crédits transférables
equivalent EN: credit @en
equivalent EN: credit (en)
part of speech: nom masculin
definition: Ensemble d'unités de compte affectées à un module d'enseignement qui, une fois obtenues par un étudiant, peuvent être capitalisées et transférées d'un établissement d'enseignement à un autre ; par extension, chacune de ces unités.
in scheme: Éducation
in scheme: concepts
notation: EDUC24
note: Le terme « crédit », généralement au pluriel, s'emploie dans le cadre de la mise en œuvre du « système européen de crédits transférables, SECT » (en anglais : european credits transfer system, ECTS).

évaluation certificative
type: ConceptConcept
type: Concept
creator: Commission d'enrichissement de la langue française, FranceTerme
date parution JO: 2007-06-16
definition: Évaluation sommative sanctionnée par la délivrance d'une attestation.
in scheme: Éducation
in scheme: Formation
in scheme: concepts
notation: EDUC25
related: évaluation sommative

évaluation diagnostique
type: ConceptConcept
type: Concept
creator: Commission d'enrichissement de la langue française, FranceTerme
date parution JO: 2007-06-16
equivalent EN: diagnostic assessment @en
equivalent EN: diagnostic assessment (en)
equivalent EN: diagnostic evaluation @en
equivalent EN: diagnostic evaluation (en)
definition: Évaluation intervenant au début, voire au cours d'un apprentissage ou d'une formation, qui permet de repérer et d'identifier les difficultés rencontrées par l'élève ou l'étudiant afin d'y apporter des réponses pédagogiques adaptées.
in scheme: Éducation
in scheme: Formation
in scheme: concepts
notation: EDUC26

évaluation formative
type: ConceptConcept
type: Concept
creator: Commission d'enrichissement de la langue française, FranceTerme
date parution JO: 2007-06-16
equivalent EN: formative assessment @en
equivalent EN: formative assessment (en)
equivalent EN: formative evaluation @en
equivalent EN: formative evaluation (en)
definition: Évaluation intervenant au cours d'un apprentissage ou d'une formation, qui permet à l'élève ou à l'étudiant de prendre conscience de ses acquis et des difficultés rencontrées, et de découvrir par lui-même les moyens de progresser.
in scheme: Éducation
in scheme: Formation
in scheme: concepts
notation: EDUC27

évaluation sommative
type: ConceptConcept
type: Concept
creator: Commission d'enrichissement de la langue française, FranceTerme
date parution JO: 2007-06-16
equivalent EN: summative assessment @en
equivalent EN: summative assessment (en)
equivalent EN: summative evaluation @en
equivalent EN: summative evaluation (en)
definition: Évaluation intervenant au terme d'un processus d'apprentissage ou de formation afin de mesurer les acquis de l'élève ou de l'étudiant.
in scheme: Éducation
in scheme: Formation
in scheme: concepts
notation: EDUC28
related: évaluation certificative

portefeuille de compétences
type: ConceptConcept
type: Concept
creator: Commission d'enrichissement de la langue française, FranceTerme
date parution JO: 2007-06-16
deconseille ou frequent: e-portfolio
deconseille ou frequent: eportfolio
equivalent EN: portfolio @en
equivalent EN: portfolio (en)
definition: Dossier individuel progressivement constitué de documents de nature variée, permettant à une personne d'attester des compétences qu'elle a acquises par la formation et l'expérience.
in scheme: Formation
in scheme: concepts
notation: EDUC29

convivialité
type: ConceptConcept
type: Concept
creator: Commission d'enrichissement de la langue française, FranceTerme
source: révision de l'arrêté du 27 août 1992
date parution JO: 2000-09-22
equivalent EN: user-friendliness @en
equivalent EN: user-friendliness (en)
part of speech: nom féminin
definition: Qualité d'un système de traitement de l'information qui comporte des éléments destinés à rendre aisé et vivant le dialogue avec l'utilisateur.
in scheme: Communication
in scheme: Informatique
in scheme: concepts
notation: EDUC3

remédiation
type: ConceptConcept
type: Concept
creator: Commission d'enrichissement de la langue française, FranceTerme
date parution JO: 2007-06-16
deconseille ou frequent: rattrapage
equivalent EN: remedial work @en
equivalent EN: remedial work (en)
equivalent EN: remediation @en
equivalent EN: remediation (en)
part of speech: nom féminin
definition: Mise en œuvre des moyens permettant de résoudre des difficultés d'apprentissage repérées au cours d'une évaluation.
in scheme: Éducation
in scheme: concepts
notation: EDUC30
note: La « remédiation » doit être distinguée du « rattrapage », qui consiste en une remise à niveau des connaissances.

curriculaire
type: ConceptConcept
type: Concept
creator: Commission d'enrichissement de la langue française, FranceTerme
date parution JO: 2018-02-25
deconseille ou frequent: formation curriculaire
deconseille ou frequent: réforme curriculaire
equivalent EN: curricular @en
equivalent EN: curricular (en)
part of speech: adjectif
definition: Qui se rapporte à un curriculum.
in scheme: Éducation
in scheme: Formation
in scheme: concepts
notation: EDUC32
related: curriculum

curriculum
type: ConceptConcept
type: Concept
creator: Commission d'enrichissement de la langue française, FranceTerme
date parution JO: 2018-02-25
deconseille ou frequent: parcours de formation
equivalent EN: curriculum @en
equivalent EN: curriculum (en)
part of speech: nom masculin
definition: Parcours de formation initiale ou continue dont les objectifs, les programmes ainsi que les modalités d’apprentissage et d’évaluation des acquis sont conçus comme un ensemble cohérent.
in scheme: Éducation
in scheme: Formation
in scheme: concepts
notation: EDUC33
related: curriculaire

rendre anonyme
type: ConceptConcept
type: Concept
creator: Commission d'enrichissement de la langue française, FranceTerme
date parution JO: 2009-09-25
deconseille ou frequent: anonymiser
equivalent EN: anonymise @en
equivalent EN: anonymise (en)
in scheme: Tous domaines
in scheme: concepts
notation: EDUC36

apprenant, -e
type: ConceptConcept
type: Concept
creator: Commission d'enrichissement de la langue française, FranceTerme
date parution JO: 2009-09-25
equivalent EN: learner @en
equivalent EN: learner (en)
part of speech: nom
definition: Toute personne, de l'enfant à l'adulte, engagée dans un processus d'acquisition de connaissances et de compétences.
in scheme: Éducation
in scheme: Formation
in scheme: concepts
notation: EDUC37
related: apprentissage adaptatif
related: attendu
related: démarche d'investigation

apprentissage par la pratique
type: ConceptConcept
type: Concept
creator: Commission d'enrichissement de la langue française, FranceTerme
date parution JO: 2009-09-25
equivalent EN: learning by doing @en
equivalent EN: learning by doing (en)
alternative label: formation par la pratique
definition: Méthode d'acquisition de capacités professionnelles par leur mise en œuvre sur le terrain.
in scheme: Formation
in scheme: concepts
notation: EDUC38
related: concept-formation

apprentissage tout au long de la vie
type: ConceptConcept
type: Concept
creator: Commission d'enrichissement de la langue française, FranceTerme
date parution JO: 2009-09-25
equivalent EN: lifelong learning @en
equivalent EN: lifelong learning (en)
alternative label: formation tout au long de la vie
in scheme: Éducation
in scheme: Formation
in scheme: concepts
notation: EDUC39
related: concept-formation

définition
type: ConceptConcept
type: Concept
creator: Commission d'enrichissement de la langue française, FranceTerme
source: révision de l'arrêté du 27 août 1992
date parution JO: 2000-09-22
equivalent EN: scrolling @en
equivalent EN: scrolling (en)
part of speech: nom féminin
definition: Nombre fixé de lignes, formées de pixels, qui constituent l'image sur un écran.
in scheme: Audiovisuel
in scheme: Télécommunications
in scheme: concepts
notation: EDUC4
note: En télévision, les définitions normalisées sont de 625 et de 819 lignes ; la télévision à haute définition (TVHD) commence à 1125 lignes.

banque de connaissances
type: ConceptConcept
type: Concept
creator: Commission d'enrichissement de la langue française, FranceTerme
date parution JO: 2009-09-25
equivalent EN: knowledge pool @en
equivalent EN: knowledge pool (en)
definition: Base de données qui rassemble des ressources mises à disposition par un réseau à des fins d'information, de formation ou de recherche.
in scheme: Éducation
in scheme: Formation
in scheme: concepts
notation: EDUC40
related: gestion du savoir

décrochage
type: ConceptConcept
type: Concept
creator: Commission d'enrichissement de la langue française, FranceTerme
date parution JO: 2009-09-25
deconseille ou frequent: décrocheur
equivalent EN: dropping-out @en
equivalent EN: dropping-out (en)
part of speech: nom masculin
definition: Abandon, par un élève ou par un étudiant en difficulté, d'une formation ou d'une qualification avant son terme.
in scheme: Éducation
in scheme: Formation
in scheme: concepts
notation: EDUC41

doctorant, -e
type: ConceptConcept
type: Concept
creator: Commission d'enrichissement de la langue française, FranceTerme
date parution JO: 2009-09-25
equivalent EN: PhD student @en
equivalent EN: PhD student (en)
part of speech: nom
definition: Étudiant qui prépare un doctorat.
in scheme: Enseignement supérieur
in scheme: concepts
notation: EDUC43
related: concept-enseignement-superieur

harmonisation des cursus
type: ConceptConcept
type: Concept
creator: Commission d'enrichissement de la langue française, FranceTerme
date parution JO: 2009-09-25
equivalent EN: tuning @en
equivalent EN: tuning (en)
definition: Mise en concordance des cursus de formation par comparaison et ajustement éventuel des éléments qui les composent.
in scheme: Éducation
in scheme: Formation
in scheme: concepts
notation: EDUC44
note: Le terme « harmonisation » s'emploie dans le cadre de la mise en œuvre de l'espace européen de l'enseignement supérieur.

postuler
type: ConceptConcept
type: Concept
creator: Commission d'enrichissement de la langue française, FranceTerme
date parution JO: 2009-09-25
deconseille ou frequent: candidater
deconseille ou frequent: to apply
equivalent EN: apply @en
equivalent EN: apply (en)
part of speech: verbe
definition: Présenter sa candidature.
in scheme: Tous domaines
in scheme: concepts
notation: EDUC45
note: On trouve aussi le terme « candidater », qui n'est pas recommandé.

présence (en)
type: ConceptConcept
type: Concept
creator: Commission d'enrichissement de la langue française, FranceTerme
date parution JO: 2009-09-25
deconseille ou frequent: en présence
deconseille ou frequent: présentiel
equivalent EN: presential @en
equivalent EN: presential (en)
part of speech: locution adjectivale
definition: Se dit d'un enseignement ou d'une formation qui met en présence enseignants et apprenants.
in scheme: Éducation
in scheme: Formation
in scheme: concepts
notation: EDUC47
note: L'enseignement en présence se distingue de l'enseignement à distance.
related: apprentissage combiné

promouvable
type: ConceptConcept
type: Concept
creator: Commission d'enrichissement de la langue française, FranceTerme
date parution JO: 2009-09-25
equivalent EN: promotable @en
equivalent EN: promotable (en)
part of speech: adjectif
definition: Se dit d'une personne qui remplit les conditions pour obtenir une promotion.
in scheme: Tous domaines
in scheme: concepts
notation: EDUC48

jumelage électronique
type: ConceptConcept
type: Concept
creator: Commission d'enrichissement de la langue française, FranceTerme
date parution JO: 2014-04-16
deconseille ou frequent: eTwinning
equivalent EN: e-twinning @en
equivalent EN: e-twinning (en)
definition: Dispositif d’échanges électroniques entre établissements de formation, généralement de pays différents, dont le but est notamment de favoriser le plurilinguisme et le dialogue interculturel.
in scheme: Éducation
in scheme: Formation
in scheme: concepts
notation: EDUC51

Recommandation sur les équivalents français à donner à l'expression learning centre
type: ConceptConcept
type: Concept
creator: Commission d'enrichissement de la langue française, FranceTerme
date parution JO: 2018-02-25
deconseille ou frequent: bibliothèque
deconseille ou frequent: centre de ressources
deconseille ou frequent: forum des savoirs
deconseille ou frequent: learning center
deconseille ou frequent: learning centre
deconseille ou frequent: médiathèque
in scheme: Éducation
in scheme: Enseignement supérieur
in scheme: concepts
notation: EDUC52
scope note: Lire la recommandation "http://www.culture.fr/Ressources/FranceTerme/Recommandations-d-usage/LEARNING-CENTRE" ; toutes les recommandations d'usage publiées par la Commission générale de terminologie et de néologie au Journal officiel à l'adresse suivante : "http://www.culture.fr/Ressources/FranceTerme/Recommandations-d-usage".

innumérisme
type: ConceptConcept
type: Concept
creator: Commission d'enrichissement de la langue française, FranceTerme
antonym: numérisme
date parution JO: 2014-04-16
deconseille ou frequent: innuméracie
deconseille ou frequent: innumératie
equivalent EN: innumeracy @en
equivalent EN: innumeracy (en)
part of speech: nom masculin
definition: Incapacité d'une personne à manier les nombres et le calcul dans les situations de la vie courante, même après avoir reçu un enseignement.
in scheme: Éducation
in scheme: Formation
in scheme: concepts
notation: EDUC53
related: lettrisme

carte-éclair
type: ConceptConcept
type: Concept
creator: Commission d'enrichissement de la langue française, FranceTerme
date parution JO: 2014-04-16
deconseille ou frequent: cartes-éclairs
equivalent EN: flash card @en
equivalent EN: flash card (en)
equivalent EN: flashcard @en
equivalent EN: flashcard (en)
part of speech: nom féminin
definition: Support pédagogique imprimé ou numérique, se présentant sous forme de fiche, qui permet l’acquisition de connaissances et de compétences et sa vérification rapide.
in scheme: Éducation
in scheme: Formation
in scheme: concepts
notation: EDUC59
note: On utilise également des cartes-éclairs dans certains jeux éducatifs.

mémoire magnétique
type: ConceptConcept
type: Concept
creator: Commission d'enrichissement de la langue française, FranceTerme
source: révision de l'arrêté du 27 août 1992
date parution JO: 2000-09-22
equivalent EN: magnetic storage @en
equivalent EN: magnetic storage (en)
definition: Support magnétique, susceptible d'être modifié ou effacé, constituant une mémoire d'information permanente.
in scheme: Informatique
in scheme: concepts
notation: EDUC6

collégium
type: ConceptConcept
type: Concept
creator: Commission d'enrichissement de la langue française, FranceTerme
date parution JO: 2014-04-16
deconseille ou frequent: PRES
deconseille ou frequent: pôle de recherche et d'enseignement supérieur
part of speech: nom masculin
definition: Regroupement d’instances d’enseignement supérieur et de recherche autour de projets ou d’objets d’intérêt commun.
in scheme: Enseignement supérieur
in scheme: Recherche
in scheme: concepts
notation: EDUC60

exercice de complètement
type: ConceptConcept
type: Concept
creator: Commission d'enrichissement de la langue française, FranceTerme
date parution JO: 2015-05-24
deconseille ou frequent: exercice de complétement
deconseille ou frequent: test de closure
equivalent EN: C-test @en
equivalent EN: C-test (en)
equivalent EN: cloze deletion test @en
equivalent EN: cloze deletion test (en)
equivalent EN: cloze test @en
equivalent EN: cloze test (en)
definition: Exercice à trous consistant, pour un lecteur, à compléter un texte inconnu de lui, conçu pour développer ou évaluer les compétences mises en œuvre dans la lecture.
in scheme: Éducation
in scheme: Formation
in scheme: concepts
notation: EDUC63
related: exercice à trous

bibaccalauréat
type: ConceptConcept
type: Concept
creator: Commission d'enrichissement de la langue française, FranceTerme
date parution JO: 2014-04-16
deconseille ou frequent: abibac
deconseille ou frequent: bachibac
deconseille ou frequent: esabac
forme abregee: bibac, n.m.
part of speech: nom masculin
definition: Certification de fin d’études secondaires délivrée simultanément à l’issue d’un examen unique à des élèves en France et dans un pays partenaire, et reconnue dans les deux pays pour l’accès à l’enseignement supérieur.
in scheme: Éducation
in scheme: Formation
in scheme: concepts
notation: EDUC70
note: L’« abibac », commun à la France et à l’Allemagne (de Abitur et « baccalauréat »), le « bachibac », commun à la France et à l’Espagne (de bachillerato et « baccalauréat ») et l’« esabac », commun à la France et à l’Italie (de esame di Stato et « baccalauréat ») sont des bibaccalauréats.

livrable
type: ConceptConcept
type: Concept
creator: Commission d'enrichissement de la langue française, FranceTerme
date parution JO: 2014-04-16
equivalent EN: deliverable @en
equivalent EN: deliverable (en)
part of speech: nom masculin
definition: Produit d’une prestation qui doit être remis selon les termes d’un contrat, d’une commande ou d’un projet.
in scheme: Tous domaines
in scheme: concepts
notation: EDUC71

mot-cheville
type: ConceptConcept
type: Concept
creator: Commission d'enrichissement de la langue française, FranceTerme
date parution JO: 2014-04-16
deconseille ou frequent: mots-chevilles
equivalent EN: filler @en
equivalent EN: filler (en)
equivalent EN: filler word @en
equivalent EN: filler word (en)
equivalent EN: gap filler @en
equivalent EN: gap filler (en)
part of speech: nom masculin
definition: Mot ou groupe de mots qui est utilisé non pour sa signification propre mais pour maintenir, renforcer ou interrompre la communication avec un interlocuteur, ou pour combler les lacunes d’un discours oral.
in scheme: Sciences humaines
in scheme: concept-SD-sciences-humaines-etude-du-langage
in scheme: concepts
notation: EDUC72

évaluation par les pairs
type: ConceptConcept
type: Concept
creator: Commission d'enrichissement de la langue française, FranceTerme
date parution JO: 2014-04-16
deconseille ou frequent: examen par les pairs
deconseille ou frequent: peerreview
deconseille ou frequent: revue par les pairs
equivalent EN: peer-review @en
equivalent EN: peer-review (en)
definition: Appréciation de la qualité d’un texte, d’un ensemble de travaux ou d’un projet, ou encore d’un enseignant ou d’un chercheur, d’une équipe, d’un laboratoire ou d’une institution, effectuée par des experts, à la fois indépendants et qualifiés dans l’activité en question.
in scheme: Enseignement supérieur
in scheme: Recherche
in scheme: concepts
notation: EDUC73
note: 1. L’évaluation par les pairs intervient, par exemple, dans l’attribution d’un financement, lors d’une publication ou en vue de l’amélioration des pratiques pédagogiques.
note: 2. On trouve aussi le terme « examen par les pairs ».
related: lecteur, -trice expert, -e
related: prépublication

étude collective de leçon
type: ConceptConcept
type: Concept
creator: Commission d'enrichissement de la langue française, FranceTerme
abbreviation: ECL
date parution JO: 2014-04-16
deconseille ou frequent: jugyo-kenkyuu
deconseille ou frequent: jugyokenkyu
equivalent EN: lesson study @en
equivalent EN: lesson study (en)
definition: Préparation, mise en œuvre et analyse, par un groupe d’enseignants en formation, d’une leçon ou d’un ensemble de leçons.
in scheme: Éducation
in scheme: Formation
in scheme: concepts
notation: EDUC74

lot de travaux
type: ConceptConcept
type: Concept
creator: Commission d'enrichissement de la langue française, FranceTerme
abbreviation: WP @en
date parution JO: 2014-04-16
deconseille ou frequent: workpackage
equivalent EN: WP @en
equivalent EN: WP (en)
equivalent EN: work package @en
equivalent EN: work package (en)
forme abregee: lot, n.m.
definition: Ensemble cohérent de tâches issu du découpage d’un projet.
in scheme: Tous domaines
in scheme: concepts
notation: EDUC75

démarche d'investigation
type: ConceptConcept
type: Concept
creator: Commission d'enrichissement de la langue française, FranceTerme
abbreviation: EBL @en
abbreviation: IBE @en
abbreviation: IBL @en
date parution JO: 2014-04-16
equivalent EN: EBL @en
equivalent EN: EBL (en)
equivalent EN: IBE @en
equivalent EN: IBE (en)
equivalent EN: IBL @en
equivalent EN: IBL (en)
equivalent EN: enquiry-based education @en
equivalent EN: enquiry-based education (en)
equivalent EN: enquiry-based learning @en
equivalent EN: enquiry-based learning (en)
equivalent EN: inquiry-based education @en
equivalent EN: inquiry-based education (en)
equivalent EN: inquiry-based learning @en
equivalent EN: inquiry-based learning (en)
definition: Méthode pédagogique qui place l’apprenant en situation d’observation et d’expérimentation.
in scheme: Éducation
in scheme: Formation
in scheme: concepts
notation: EDUC76
related: apprenant, -e

formation par les pairs
type: ConceptConcept
type: Concept
creator: Commission d'enrichissement de la langue française, FranceTerme
abbreviation: PAL @en
date parution JO: 2014-04-16
deconseille ou frequent: apprentissage assisté par des pairs
deconseille ou frequent: apprentissage assisté par les pairs
deconseille ou frequent: formation par des pairs
equivalent EN: PAL @en
equivalent EN: PAL (en)
equivalent EN: peer education @en
equivalent EN: peer education (en)
equivalent EN: peer-assisted learning @en
equivalent EN: peer-assisted learning (en)
broader: concept-formation
definition: Mode de formation fondé sur l’échange de connaissances ou d’expériences entre des personnes de même statut.
in scheme: Éducation
in scheme: Formation
in scheme: concepts
notation: EDUC77

numérisme
type: ConceptConcept
type: Concept
creator: Commission d'enrichissement de la langue française, FranceTerme
antonym: innumérisme
date parution JO: 2014-04-16
deconseille ou frequent: numéracie
deconseille ou frequent: numératie
equivalent EN: numeracy @en
equivalent EN: numeracy (en)
part of speech: nom masculin
definition: Capacité d'une personne à manier les nombres et le calcul dans les situations de la vie courante.
in scheme: Éducation
in scheme: Formation
in scheme: concepts
notation: EDUC79
related: lettrisme

inhabileté numérique
type: ConceptConcept
type: Concept
creator: Commission d'enrichissement de la langue française, FranceTerme
antonym: habileté numérique
date parution JO: 2017-01-10
deconseille ou frequent: illectronisme
equivalent EN: computer illiteracy @en
equivalent EN: computer illiteracy (en)
equivalent EN: digital illiteracy @en
equivalent EN: digital illiteracy (en)
equivalent EN: information illiteracy @en
equivalent EN: information illiteracy (en)
definition: Difficulté, voire incapacité, d’une personne à utiliser les appareils numériques et les outils informatiques de la vie courante.
in scheme: Tous domaines
in scheme: concepts
notation: EDUC80

enfant du numérique
type: ConceptConcept
type: Concept
creator: Commission d'enrichissement de la langue française, FranceTerme
date parution JO: 2015-05-24
deconseille ou frequent: natif du numérique
deconseille ou frequent: native du numérique
equivalent EN: digital native @en
equivalent EN: digital native (en)
definition: Personne qui, ayant toujours vécu dans un environnement numérique, est présumée familière des outils et des usages des nouvelles techniques d’information et de communication.
in scheme: Tous domaines
in scheme: concepts
notation: EDUC81
related: millénial, -e
related: habileté numérique

psychométrie
type: ConceptConcept
type: Concept
creator: Commission d'enrichissement de la langue française, FranceTerme
date parution JO: 2015-05-24
part of speech: nom féminin
definition: Ensemble des procédures et des techniques d’analyse statistique qui visent à garantir la qualité des tests destinés à mesurer des compétences ou des connaissances.
in scheme: Éducation
in scheme: Formation
in scheme: concepts
notation: EDUC82
related: édumétrie
related: calibrage masqué

édumétrie
type: ConceptConcept
type: Concept
creator: Commission d'enrichissement de la langue française, FranceTerme
date parution JO: 2015-05-24
equivalent EN: edumetrics @en
equivalent EN: edumetrics (en)
part of speech: nom féminin
definition: Évaluation scientifique des effets d’un apprentissage.
in scheme: Éducation
in scheme: Formation
in scheme: concepts
notation: EDUC83
note: L’édumétrie s’appuie notamment sur les procédures et les techniques de la psychométrie.
related: psychométrie

calibrage masqué
type: ConceptConcept
type: Concept
creator: Commission d'enrichissement de la langue française, FranceTerme
date parution JO: 2015-05-24
equivalent EN: seeding test @en
equivalent EN: seeding test (en)
definition: Technique de psychométrie qui permet d’évaluer la difficulté des items d’un test en les mêlant à des items déjà calibrés, sans que les candidats soient en mesure de les distinguer.
in scheme: Éducation
in scheme: Formation
in scheme: concepts
notation: EDUC84
related: psychométrie

mise en équivalence
type: ConceptConcept
type: Concept
creator: Commission d'enrichissement de la langue française, FranceTerme
date parution JO: 2015-05-24
equivalent EN: equating @en
equivalent EN: equating (en)
definition: Technique statistique visant à permettre la comparaison entre des notes obtenues à des examens distincts portant sur les mêmes compétences ou évaluant des connaissances identiques.
in scheme: Éducation
in scheme: Formation
in scheme: concepts
notation: EDUC85

détermination des seuils
type: ConceptConcept
type: Concept
creator: Commission d'enrichissement de la langue française, FranceTerme
date parution JO: 2015-05-24
equivalent EN: standard setting @en
equivalent EN: standard setting (en)
definition: Procédure permettant d’attribuer une ou plusieurs valeurs discriminantes aux résultats d’une évaluation.
in scheme: Éducation
in scheme: Formation
in scheme: concepts
notation: EDUC86
note: La détermination des seuils permet de délimiter la frontière entre l’échec et la réussite à un examen, entre deux mentions différentes ou entre deux niveaux successifs d’un test.

exercice à trous
type: ConceptConcept
type: Concept
creator: Commission d'enrichissement de la langue française, FranceTerme
date parution JO: 2015-05-24
equivalent EN: gap-fill exercise @en
equivalent EN: gap-fill exercise (en)
definition: Exercice consistant à compléter un document présenté de façon lacunaire.
in scheme: Éducation
in scheme: Formation
in scheme: concepts
notation: EDUC87
related: exercice de complètement

écriture par approximations
type: ConceptConcept
type: Concept
creator: Commission d'enrichissement de la langue française, FranceTerme
date parution JO: 2017-01-10
deconseille ou frequent: écriture inventée
equivalent EN: invented spelling @en
equivalent EN: invented spelling (en)
definition: Processus d’acquisition du système graphique qui conduit le jeune enfant de l’imitation de l’écriture à l’appropriation progressive de la langue écrite.
in scheme: Éducation
in scheme: concepts
notation: EDUC89

enseignement inversé
type: ConceptConcept
type: Concept
creator: Commission d'enrichissement de la langue française, FranceTerme
date parution JO: 2017-01-10
deconseille ou frequent: classe inversée
deconseille ou frequent: pédagogie inversée
equivalent EN: flipped classroom @en
equivalent EN: flipped classroom (en)
equivalent EN: inverted classroom @en
equivalent EN: inverted classroom (en)
equivalent EN: reverse teaching @en
equivalent EN: reverse teaching (en)
definition: Mode d’apprentissage dans lequel l’élève étudie, de manière autonome, la partie notionnelle du cours en amont de sa phase dirigée, consacrée pour l’essentiel à des exercices d’application menés par l’enseignant.
in scheme: Éducation
in scheme: Formation
in scheme: concepts
notation: EDUC90
note: On trouve aussi les termes « classe inversée » et « pédagogie inversée ».
related: apprentissage combiné

atelier collaboratif
type: ConceptConcept
type: Concept
creator: Commission d'enrichissement de la langue française, FranceTerme
date parution JO: 2017-01-10
deconseille ou frequent: fab lab
deconseille ou frequent: laboratoire de fabrication
deconseille ou frequent: maker space
deconseille ou frequent: makerspace
equivalent EN: fablab @en
equivalent EN: fablab (en)
equivalent EN: fabrication laboratory @en
equivalent EN: fabrication laboratory (en)
definition: Lieu ouvert à tous, dans lequel des ressources intellectuelles et matérielles sont mises en commun pour faciliter l’innovation et le processus de création et de fabrication de prototypes.
in scheme: Économie générale
in scheme: Industrie
in scheme: Recherche
in scheme: concepts
notation: EDUC91
related: innovation ouverte
related: recherche participative
related: concept-INFO956

recherche participative
type: ConceptConcept
type: Concept
creator: Commission d'enrichissement de la langue française, FranceTerme
date parution JO: 2017-01-10
deconseille ou frequent: laboratoire d'innovation
deconseille ou frequent: laboratoire d'innovation ouverte
deconseille ou frequent: laboratoire vivant
equivalent EN: living lab @en
equivalent EN: living lab (en)
equivalent EN: living laboratory @en
equivalent EN: living laboratory (en)
definition: Activité de recherche appliquée, publique ou privée, associant des usagers à la conception ou à l’expérimentation de produits ou de services innovants.
in scheme: Économie générale
in scheme: Industrie
in scheme: Recherche
in scheme: concepts
notation: EDUC92
related: atelier collaboratif

lettrisme
type: ConceptConcept
type: Concept
creator: Commission d'enrichissement de la langue française, FranceTerme
antonym: illettrisme, n.m.
date parution JO: 2017-01-10
deconseille ou frequent: littéracie
deconseille ou frequent: littératie
deconseille ou frequent: littérisme
deconseille ou frequent: litéracie
deconseille ou frequent: litératie
equivalent EN: literacy @en
equivalent EN: literacy (en)
part of speech: nom masculin
definition: Capacité d'une personne, dans les situations de la vie courante, à lire un texte en le comprenant, ainsi qu'à utiliser et à communiquer une information écrite.
in scheme: Éducation
in scheme: concepts
notation: EDUC93
note: On trouve aussi le terme « littérisme ».
related: innumérisme
related: numérisme
scope note: Cette publication annule et remplace celle du terme « littérisme » au Journal officiel du 30 août 2005.

apprentissage par les réseaux
type: ConceptConcept
type: Concept
creator: Commission d'enrichissement de la langue française, FranceTerme
date parution JO: 2017-01-10
equivalent EN: social learning @en
equivalent EN: social learning (en)
definition: Mode d’acquisition et de partage de connaissances et de compétences, qui se pratique en dehors d’un cadre institutionnel et repose sur l’utilisation d’outils collaboratifs offerts par l’internet et les réseaux sociaux.
in scheme: Éducation
in scheme: Formation
in scheme: concepts
notation: EDUC94

cours en ligne d'accès restreint
type: ConceptConcept
type: Concept
creator: Commission d'enrichissement de la langue française, FranceTerme
abbreviation: CLAR
date parution JO: 2017-01-10
equivalent EN: SPOC @en
equivalent EN: SPOC (en)
equivalent EN: small private online course @en
equivalent EN: small private online course (en)
definition: Formation accessible à un nombre limité de participants, dispensée dans l’internet par des établissements d’enseignement, des entreprises, des organismes ou des particuliers.
in scheme: Éducation
in scheme: Formation
in scheme: concepts
notation: EDUC95
related: formation en ligne
related: cours en ligne ouvert à tous
related: cours en ligne d'entreprise

habileté numérique
type: ConceptConcept
type: Concept
creator: Commission d'enrichissement de la langue française, FranceTerme
antonym: inhabileté numérique
date parution JO: 2017-01-10
deconseille ou frequent: littératie digitale
deconseille ou frequent: littératie numérique
equivalent EN: computer literacy @en
equivalent EN: computer literacy (en)
equivalent EN: digital literacy @en
equivalent EN: digital literacy (en)
equivalent EN: information literacy @en
equivalent EN: information literacy (en)
definition: Capacité d’une personne à utiliser avec aisance les appareils numériques et les outils informatiques de la vie courante.
in scheme: Tous domaines
in scheme: concepts
notation: EDUC96
related: enfant du numérique
related: concept-acculturation

apprentissage combiné
type: ConceptConcept
type: Concept
creator: Commission d'enrichissement de la langue française, FranceTerme
date parution JO: 2017-01-10
equivalent EN: blended learning @en
equivalent EN: blended learning (en)
definition: Dispositif d’apprentissage qui repose sur l’association de plusieurs modes de formation, en présence d’un enseignant ou à distance.
in scheme: Éducation
in scheme: Formation
in scheme: concepts
notation: EDUC97
note: 1. La formation peut être dispensée en ligne ou hors ligne, de manière individuelle ou collective.
note: 2. L’enseignement inversé est un exemple d’apprentissage combiné.
related: présence (en)
related: enseignement inversé

observation des oiseaux
type: ConceptConcept
type: Concept
creator: Commission d'enrichissement de la langue française, FranceTerme
date parution JO: 2013-09-08
equivalent EN: birding @en
equivalent EN: birding (en)
equivalent EN: birdwatching @en
equivalent EN: birdwatching (en)
in scheme: Environnement
in scheme: concepts
notation: ENVI100
related: ornithologue amateur

ornithologue amateur
type: ConceptConcept
type: Concept
creator: Commission d'enrichissement de la langue française, FranceTerme
date parution JO: 2013-09-08
equivalent EN: birder @en
equivalent EN: birder (en)
equivalent EN: birdwatcher @en
equivalent EN: birdwatcher (en)
in scheme: Environnement
in scheme: concepts
notation: ENVI101
related: observation des oiseaux

sous-recyclage
type: ConceptConcept
type: Concept
creator: Commission d'enrichissement de la langue française, FranceTerme
date parution JO: 2018-05-18
deconseille ou frequent: infrarecyclage
equivalent EN: downcycling @en
equivalent EN: downcycling (en)
part of speech: nom masculin
alternative label: recyclage dévalorisant
definition: Fabrication, à partir d’objets ou de matériaux de récupération, de produits de moindre valeur que les objets ou matériaux d’origine.
in scheme: Économie et gestion d'entreprise
in scheme: Environnement
in scheme: concepts
notation: ENVI102
related: recyclage valorisant

reméandrage
type: ConceptConcept
type: Concept
creator: Commission d'enrichissement de la langue française, FranceTerme
date parution JO: 2013-09-08
part of speech: nom masculin
definition: Technique consistant à allonger le tracé et à réduire la pente d'un cours d'eau pour rendre sa morphologie plus sinueuse et lui faire ainsi retrouver ses fonctions hydrobiologiques.
in scheme: Environnement
in scheme: concepts
notation: ENVI103
note: Le reméandrage peut, par exemple, favoriser la régulation du régime des eaux, améliorer le niveau de la nappe phréatique ou permettre la préservation et la diversification d'habitats aquatiques.

service écosystémique
type: ConceptConcept
type: Concept
creator: Commission d'enrichissement de la langue française, FranceTerme
date parution JO: 2013-09-08
deconseille ou frequent: services écosystémiques
equivalent EN: ecosystem service @en
equivalent EN: ecosystem service (en)
definition: Avantage matériel ou immatériel que l'homme retire des écosystèmes.
in scheme: Économie générale
in scheme: Environnement
in scheme: concepts
notation: ENVI105
note: Certains services écosystémiques sont des avantages matériels liés à des processus naturels tels que la production de biens directement consommables, l'autoépuration des eaux, la stabilisation des sols ou la pollinisation ; d'autres sont des avantages immatériels, comme des activités récréatives ou culturelles.
related: théorie de l'effondrement

économie circulaire
type: ConceptConcept
type: Concept
creator: Commission d'enrichissement de la langue française, FranceTerme
date parution JO: 2015-08-18
equivalent EN: circular economy @en
equivalent EN: circular economy (en)
broader: concept-economie-generale
definition: Organisation d’activités économiques et sociales recourant à des modes de production, de consommation et d’échange fondés sur l’écoconception, la réparation, le réemploi et le recyclage, et visant à diminuer les ressources utilisées ainsi que les dommages causés à l’environnement.
definition: Organisation of economic and social activities using production, consumption and exchanges methods based on ecodesign, repairing, reuse and recycling, and aiming to decrease the resources used as well as the environmental damage. @en
in scheme: Économie générale
in scheme: Environnement
in scheme: concepts
notation: ENVI106
preferred label: circular economy @en
related: recyclerie
related: écoconception
related: développement durable
related: économie verte

espèce clé de voûte
type: ConceptConcept
type: Concept
creator: Commission d'enrichissement de la langue française, FranceTerme
date parution JO: 2015-08-18
equivalent EN: keystone species @en
equivalent EN: keystone species (en)
definition: Espèce dont la disparition compromettrait la structure et le fonctionnement d’un écosystème.
in scheme: Biologie
in scheme: Environnement
in scheme: concepts
notation: ENVI107
note: Une espèce clé de voûte est caractérisée par la qualité, le nombre et l’importance des liens qu’elle entretient avec son habitat et les autres espèces.
related: espèce exotique
related: espèce envahissante
related: espèce proliférante
related: espèce parapluie
related: écosystème

espèce exotique
type: ConceptConcept
type: Concept
creator: Commission d'enrichissement de la langue française, FranceTerme
date parution JO: 2015-08-18
equivalent EN: alien species @en
equivalent EN: alien species (en)
equivalent EN: allochthonous species @en
equivalent EN: allochthonous species (en)
equivalent EN: exotic species @en
equivalent EN: exotic species (en)
equivalent EN: non-native species @en
equivalent EN: non-native species (en)
alternative label: espèce allochtone
definition: Espèce qui est délibérément introduite ou s’installe accidentellement dans une aire distincte de son aire d’origine.
in scheme: Biologie
in scheme: Environnement
in scheme: concepts
notation: ENVI108
note: Une espèce exotique n’est pas nécessairement envahissante.
related: espèce clé de voûte
related: espèce envahissante
related: espèce proliférante
related: espèce parapluie

espèce envahissante
type: ConceptConcept
type: Concept
creator: Commission d'enrichissement de la langue française, FranceTerme
date parution JO: 2015-08-18
deconseille ou frequent: espèce invasive
equivalent EN: invasive species @en
equivalent EN: invasive species (en)
definition: Espèce exotique dont la population se maintient ou accroît son aire d’implantation en perturbant le fonctionnement des écosystèmes ou en nuisant aux espèces autochtones, par compétition ou par prédation.
in scheme: Biologie
in scheme: Environnement
in scheme: concepts
notation: ENVI109
note: 1. Les espèces envahissantes ne représentent qu’un très faible pourcentage des espèces exotiques.
note: 2. On trouve aussi le terme « espèce invasive », qui est déconseillé.
related: compétition
related: guidage génétique
related: espèce clé de voûte
related: espèce exotique
related: espèce proliférante
related: espèce parapluie

déchet biodégradable
type: ConceptConcept
type: Concept
creator: Commission d'enrichissement de la langue française, FranceTerme
date parution JO: 2009-04-12
equivalent EN: biodegradable waste @en
equivalent EN: biodegradable waste (en)
in scheme: Environnement
in scheme: concept-SD-environnement-dechets
in scheme: concepts
notation: ENVI11
related: biodégradable

espèce proliférante
type: ConceptConcept
type: Concept
creator: Commission d'enrichissement de la langue française, FranceTerme
date parution JO: 2015-08-18
deconseille ou frequent: espèce invasive
equivalent EN: expanding species @en
equivalent EN: expanding species (en)
definition: Espèce autochtone ou exotique dont la population connaît une expansion massive ou rapide, souvent au détriment d’autres espèces.
in scheme: Biologie
in scheme: Environnement
in scheme: concepts
notation: ENVI110
note: 1. Une espèce prolifère notamment à la suite de modifications de son habitat.
note: 2. On trouve aussi le terme « espèce invasive », qui est déconseillé.
related: espèce clé de voûte
related: espèce exotique
related: espèce envahissante
related: espèce parapluie

espèce parapluie
type: ConceptConcept
type: Concept
creator: Commission d'enrichissement de la langue française, FranceTerme
date parution JO: 2015-08-18
equivalent EN: umbrella species @en
equivalent EN: umbrella species (en)
definition: Espèce dont l’habitat doit être sauvegardé pour que soient conservées d’autres espèces, parmi lesquelles certaines sont rares et menacées.
in scheme: Biologie
in scheme: Environnement
in scheme: concepts
notation: ENVI111
note: La loutre, le tigre et le panda géant sont des exemples d’espèce parapluie.
related: espèce clé de voûte
related: espèce exotique
related: espèce envahissante
related: espèce proliférante

génie écologique
type: ConceptConcept
type: Concept
creator: Commission d'enrichissement de la langue française, FranceTerme
date parution JO: 2015-08-18
definition: Ensemble des connaissances scientifiques, des techniques et des pratiques qui prend en compte les mécanismes écologiques, appliqué à la gestion de ressources, à la conception et à la réalisation d’aménagements ou d’équipements, et qui est propre à assurer la protection de l’environnement.
in scheme: Environnement
in scheme: concepts
notation: ENVI112
related: ingénierie écologique
related: génie de l'environnement

ingénierie écologique
type: ConceptConcept
type: Concept
creator: Commission d'enrichissement de la langue française, FranceTerme
date parution JO: 2015-08-18
definition: Conduite de projets qui, dans sa mise en œuvre et son suivi, applique les principes du génie écologique et favorise la résilience des écosystèmes.
in scheme: Environnement
in scheme: concepts
notation: ENVI113
note: L’ingénierie écologique permet notamment la reconstitution de milieux naturels, la restauration de milieux dégradés et l’optimisation de fonctions assurées par les écosystèmes.
related: génie écologique
related: génie de l'environnement
related: résilience
related: écosystème
related: concept-SPAT1597

eaux usées
type: ConceptConcept
type: Concept
creator: Commission d'enrichissement de la langue française, FranceTerme
date parution JO: 2017-01-15
deconseille ou frequent: eau usée
deconseille ou frequent: waste water
equivalent EN: sewage @en
equivalent EN: sewage (en)
equivalent EN: wastewater @en
equivalent EN: wastewater (en)
definition: Eaux souillées par l’usage qui en a été fait.
in scheme: Environnement
in scheme: concepts
notation: ENVI116
note: 1. Les eaux usées d’origine domestique ou industrielle sont généralement rejetées dans un dispositif d’évacuation, voire d’assainissement.
note: 2. Certaines eaux de ruissellement, qui, notamment en milieu urbain, sont souvent plus contaminées que les eaux usées d’origine domestique, sont considérées comme des eaux usées.
related: eaux grises
related: eaux noires
related: eau de ruissellement
related: concept-ressources-hydrauliques

eaux grises
type: ConceptConcept
type: Concept
creator: Commission d'enrichissement de la langue française, FranceTerme
date parution JO: 2017-01-15
deconseille ou frequent: eau grise
deconseille ou frequent: gray water
deconseille ou frequent: grey water
equivalent EN: graywater (US) @en
equivalent EN: graywater (en-US)
equivalent EN: greywater (GB) @en
equivalent EN: greywater (en-GB)
definition: Eaux usées produites par les activités domestiques, à l’exclusion des eaux noires.
in scheme: Environnement
in scheme: concepts
notation: ENVI117
note: Les eaux grises ont vocation à être réutilisées après avoir subi un traitement.
related: eaux usées
related: eaux noires

sauvageté
type: ConceptConcept
type: Concept
creator: Commission d'enrichissement de la langue française, FranceTerme
date parution JO: 2017-01-15
deconseille ou frequent: espace sauvage
deconseille ou frequent: nature sauvage
deconseille ou frequent: région sauvage
equivalent EN: Wildnis @de
equivalent EN: Wildnis (de)
equivalent EN: wilderness @en
equivalent EN: wilderness (en)
part of speech: nom féminin
definition: Caractère d’un espace naturel que l’homme laisse évoluer sans intervenir ; par extension, cet espace lui-même.
in scheme: Environnement
in scheme: concepts
notation: ENVI118
related: réensauvagement
related: dédomestication

économie de l'usage
type: ConceptConcept
type: Concept
creator: Commission d'enrichissement de la langue française, FranceTerme
date parution JO: 2018-05-18
deconseille ou frequent: économie collaborative
deconseille ou frequent: économie d'usage
deconseille ou frequent: économie de fonctionnalité
equivalent EN: économie de la fonctionnalité
alternative label: économie de la fonctionnalité
definition: Modèle économique qui privilégie l’usage de biens en location par rapport à leur possession.
in scheme: Économie générale
in scheme: Environnement
in scheme: concepts
notation: ENVI119
note: L’économie de l’usage a notamment pour but de diminuer la consommation de ressources et d’énergie.
related: partage de véhicule

biodiversité
type: ConceptConcept
type: Concept
creator: Commission d'enrichissement de la langue française, FranceTerme
date parution JO: 2009-04-12
equivalent EN: biodiversity @en
equivalent EN: biodiversity (en)
part of speech: nom féminin
alternative label: diversité biologique
definition: Diversity of the living organisms, which is appreciated when the diversity of the species together with the genes within each species, as well as the ecosystems' organisation and distribution are considered. @en
definition: Diversité des organismes vivants, qui s'apprécie en considérant la diversité des espèces, celle des gènes au sein de chaque espèce, ainsi que l'organisation et la répartition des écosystèmes.
in scheme: Biologie
in scheme: Environnement
in scheme: concepts
notation: ENVI12
note: Biodiversity maintenance is essential for sustainable development. @en
note: Le maintien de la biodiversité est une composante essentielle du développement durable.
preferred label: biodiversity @en
related: permaculture
related: développement durable
related: zone critique de biodiversité

eaux noires
type: ConceptConcept
type: Concept
creator: Commission d'enrichissement de la langue française, FranceTerme
date parution JO: 2017-01-15
deconseille ou frequent: black water
deconseille ou frequent: eau noire
equivalent EN: blackwater @en
equivalent EN: blackwater (en)
alternative label: eaux-vannes
definition: Eaux usées issues des cabinets d’aisance.
in scheme: Environnement
in scheme: concepts
notation: ENVI120
note: Les eaux noires n’ont pas vocation à être réutilisées.
related: eaux usées
related: eaux grises

eau météorique
type: ConceptConcept
type: Concept
creator: Commission d'enrichissement de la langue française, FranceTerme
date parution JO: 2017-01-15
equivalent EN: meteoric water @en
equivalent EN: meteoric water (en)
definition: Eau issue des précipitations atmosphériques qui n’a pas encore touché une surface.
in scheme: Environnement
in scheme: Sciences de la Terre
in scheme: concept-SD-environnement-hydrologie
in scheme: concept-SD-sciences-de-la-terre-hydrologie
in scheme: concepts
notation: ENVI121
related: eau de ruissellement

eau de ruissellement
type: ConceptConcept
type: Concept
creator: Commission d'enrichissement de la langue française, FranceTerme
date parution JO: 2017-01-15
deconseille ou frequent: eau pluviale
deconseille ou frequent: eaux pluviales
deconseille ou frequent: run off
equivalent EN: runoff @en
equivalent EN: runoff (en)
definition: Eau issue des précipitations atmosphériques qui s’écoule sur une surface.
in scheme: Environnement
in scheme: Sciences de la Terre
in scheme: concept-SD-environnement-hydrologie
in scheme: concept-SD-sciences-de-la-terre-hydrologie
in scheme: concepts
notation: ENVI123
note: 1. Dans le langage professionnel, on utilise fréquemment le terme « eaux pluviales ».
note: 2. L’eau de ruissellement s’infiltre dans le sol, rejoint le réseau hydrique ou est collectée. Dans ce dernier cas, lorsqu’elle a ruisselé sur une surface non contaminée, elle peut être utilisée par exemple pour l’arrosage et les chasses d’eau des cabinets d’aisance.
related: eaux usées
related: eau météorique
related: eau verte
related: eau bleue

eau verte
type: ConceptConcept
type: Concept
creator: Commission d'enrichissement de la langue française, FranceTerme
date parution JO: 2017-01-15
definition: Part de l’eau issue des précipitations atmosphériques qui est absorbée par les végétaux.
in scheme: Environnement
in scheme: Sciences de la Terre
in scheme: concept-SD-environnement-hydrologie
in scheme: concept-SD-sciences-de-la-terre-hydrologie
in scheme: concepts
notation: ENVI124
related: eau de ruissellement
related: eau bleue

eau bleue
type: ConceptConcept
type: Concept
creator: Commission d'enrichissement de la langue française, FranceTerme
date parution JO: 2017-01-15
definition: Part de l’eau issue des précipitations atmosphériques qui s’écoule dans les cours d’eau jusqu’à la mer, ou qui est recueillie dans les lacs, les aquifères ou les réservoirs.
in scheme: Environnement
in scheme: Sciences de la Terre
in scheme: concept-SD-environnement-hydrologie
in scheme: concept-SD-sciences-de-la-terre-hydrologie
in scheme: concepts
notation: ENVI125
note: L’eau bleue est disponible pour l’alimentation des animaux, et, après traitement, pour les usages domestiques humains.
related: eau de ruissellement
related: eau verte

réservoir de biodiversité
type: ConceptConcept
type: Concept
creator: Commission d'enrichissement de la langue française, FranceTerme
date parution JO: 2017-01-15
equivalent EN: reservoir of biodiversity @en
equivalent EN: reservoir of biodiversity (en)
definition: Territoire doté d’une biodiversité particulièrement riche, dans lequel les espèces trouvent des conditions favorables pour se développer, se disperser et coloniser d’autres territoires.
in scheme: Environnement
in scheme: concepts
notation: ENVI127

compostage
type: ConceptConcept
type: Concept
creator: Commission d'enrichissement de la langue française, FranceTerme
date parution JO: 2009-04-12
equivalent EN: composting @en
equivalent EN: composting (en)
part of speech: nom masculin
definition: Traitement biologique de déchets organiques par fermentation aérobie permettant d'obtenir du compost.
in scheme: Environnement
in scheme: concept-SD-environnement-dechets
in scheme: concepts
notation: ENVI13
note: Le terme « compostage » désigne, dans son acception première, l'amendement des terres à l'aide de compost.
related: bioplastique

génie de l'environnement
type: ConceptConcept
type: Concept
creator: Commission d'enrichissement de la langue française, FranceTerme
date parution JO: 2017-01-15
deconseille ou frequent: ingénierie de l'environnement
deconseille ou frequent: ingénierie environnementale
equivalent EN: environmental engineering @en
equivalent EN: environmental engineering (en)
definition: Ensemble des connaissances scientifiques, des techniques et des pratiques permettant de comprendre et d’améliorer les interactions entre les êtres humains et les milieux naturels.
in scheme: Environnement
in scheme: concepts
notation: ENVI130
related: génie écologique
related: ingénierie écologique

bioturbation
type: ConceptConcept
type: Concept
creator: Commission d'enrichissement de la langue française, FranceTerme
date parution JO: 2017-01-15
equivalent EN: bioturbation @en
equivalent EN: bioturbation (en)
part of speech: nom féminin
definition: Remaniement de sols ou de sédiments aquatiques produit par les activités des organismes vivants présents dans ces milieux.
in scheme: Environnement
in scheme: concepts
notation: ENVI131
note: La bioturbation est assurée par des organismes animaux tels que des lombrics et des vers de vase.

paiement aux déchets
type: ConceptConcept
type: Concept
creator: Commission d'enrichissement de la langue française, FranceTerme
date parution JO: 2018-05-18
equivalent EN: PAYT @en
equivalent EN: PAYT (en)
equivalent EN: pay as you throw @en
equivalent EN: pay as you throw (en)
definition: Système de tarification incitative consistant, pour un service de gestion des déchets, à fixer ses prix proportionnellement à la quantité des déchets collectés.
in scheme: Environnement
in scheme: concepts
notation: ENVI133
note: Le paiement aux déchets vise à réduire la quantité de déchets produits et contribue à financer leur collecte et leur traitement.
related: principe du pollueur-payeur

opérateur de compensation écologique
type: ConceptConcept
type: Concept
creator: Commission d'enrichissement de la langue française, FranceTerme
date parution JO: 2019-10-16
deconseille ou frequent: banque de compensation
equivalent EN: mitigation bank @en
equivalent EN: mitigation bank (en)
equivalent EN: mitigation banking @en
equivalent EN: mitigation banking (en)
definition: Opérateur qui constitue un ensemble de sites naturels de compensation écologique afin de les vendre à des maîtres d’ouvrage devant compenser les dommages causés à l’environnement par leurs projets.
in scheme: Économie générale
in scheme: Environnement
in scheme: concepts
notation: ENVI135
related: site naturel de compensation écologique
related: ratio de compensation écologique
related: mesure compensatoire
related: compensation écologique
related: concept-SPAT1484

site naturel de compensation écologique
type: ConceptConcept
type: Concept
creator: Commission d'enrichissement de la langue française, FranceTerme
date parution JO: 2019-10-16
deconseille ou frequent: banque d'actifs naturels
deconseille ou frequent: banque d'habitats
deconseille ou frequent: banque de compensation écologique
deconseille ou frequent: habitat bank
deconseille ou frequent: réserve d'actifs naturels
equivalent EN: habitat banking @en
equivalent EN: habitat banking (en)
forme abregee: site de compensation
definition: Réserve foncière d’habitats naturels ayant bénéficié d’une opération de sauvegarde, de réhabilitation ou de restauration écologiques de la part d’un opérateur de compensation écologique pour être proposés ultérieurement à des maîtres d’ouvrage qui doivent compenser les dommages causés à l’environnement par leurs projets.
in scheme: Économie générale
in scheme: Environnement
in scheme: concepts
notation: ENVI136
note: 1. Un site naturel de compensation écologique doit présenter des fonctions écologiques équivalentes à celles de la zone endommagée ; il peut se trouver à proximité ou à distance des zones qui subissent les dommages.
note: 2. On trouve aussi le terme « banque d’actifs naturels », qui n’est pas recommandé.
related: opérateur de compensation écologique
related: ratio de compensation écologique
related: compensation écologique

ratio de compensation écologique
type: ConceptConcept
type: Concept
creator: Commission d'enrichissement de la langue française, FranceTerme
date parution JO: 2019-10-16
equivalent EN: compensation ratio @en
equivalent EN: compensation ratio (en)
forme abregee: ratio de compensation
definition: Rapport entre la surface des milieux qui doivent être sauvegardés, réhabilités ou restaurés et celle des milieux endommagés par un projet, dans le cadre d’une compensation tenant compte de l’évolution écologique probable des écosystèmes considérés.
in scheme: Environnement
in scheme: concepts
notation: ENVI137
note: L’estimation de la surface des milieux qui doivent être sauvegardés prend en compte la qualité et la complexité des écosystèmes endommagés ; elle doit aussi intégrer leurs fonctions écologiques dans le processus de sauvegarde, de réhabilitation ou de restauration, ainsi que les perspectives de réussite à long terme de l’action de compensation.
related: opérateur de compensation écologique
related: site naturel de compensation écologique
related: mesure compensatoire
related: compensation écologique

biodégradable
type: ConceptConcept
type: Concept
creator: Commission d'enrichissement de la langue française, FranceTerme
date parution JO: 2016-12-22
equivalent EN: biodegradable @en
equivalent EN: biodegradable (en)
part of speech: adjectif
definition: Se dit d’une substance ou d’un matériau qui se décompose en éléments divers sous l’action d’organismes vivants.
in scheme: Environnement
in scheme: Matériaux
in scheme: concepts
notation: ENVI139
note: Le caractère biodégradable d’une substance ou d’un matériau s’apprécie, en matière d’environnement, en fonction du degré de décomposition, du temps nécessaire à cette décomposition et de l’effet des éléments obtenus sur les milieux.
related: oxybiodégradable
related: déchet biodégradable
related: biodégradabilité
related: biodégradation totale
related: bioplastique
scope note: Cette publication annule et remplace celle du Journal officiel du 12 avril 2009.

étude de dangers
type: ConceptConcept
type: Concept
creator: Commission d'enrichissement de la langue française, FranceTerme
date parution JO: 2009-04-12
equivalent EN: safety report @en
equivalent EN: safety report (en)
definition: Étude précisant l'ensemble des risques auxquels se trouvent exposés, lors d'un accident d'origine interne ou externe, les personnes et les biens situés à l'intérieur ou à proximité d'une installation, ainsi que les dommages qui en résultent pour l'environnement.
in scheme: Environnement
in scheme: concept-SD-environnement-risques
in scheme: concepts
notation: ENVI14
note: L'étude de dangers identifie les sources de dangers et expose les scénarios d'accident. Elle comporte une analyse des mesures propres à réduire la probabilité et les conséquences des accidents.
related: concept-PETR424
related: concept-PETR425

biodégradabilité
type: ConceptConcept
type: Concept
creator: Commission d'enrichissement de la langue française, FranceTerme
date parution JO: 2016-12-22
equivalent EN: biodegradability @en
equivalent EN: biodegradability (en)
part of speech: nom féminin
definition: Qualité d’une substance ou d’un matériau biodégradable.
in scheme: Environnement
in scheme: Matériaux
in scheme: concepts
notation: ENVI140
related: biodégradable
scope note: Cette publication annule et remplace celle du Journal officiel du 12 avril 2009.

biodégradation totale
type: ConceptConcept
type: Concept
creator: Commission d'enrichissement de la langue française, FranceTerme
date parution JO: 2016-12-22
deconseille ou frequent: biodégradation aérobie ultime
deconseille ou frequent: biodégradation totale anaérobie
deconseille ou frequent: biodégradation totale aérobie
deconseille ou frequent: biodégradation ultime
deconseille ou frequent: ultimate aerobic biodegradation
deconseille ou frequent: ultimate anaerobic biodegradation
equivalent EN: ultimate biodegradation @en
equivalent EN: ultimate biodegradation (en)
definition: Biodégradation complète de composés organiques en dioxyde de carbone, en sels minéraux et en eau en présence d’oxygène, ainsi qu’en méthane en l’absence d’oxygène.
in scheme: Environnement
in scheme: Matériaux
in scheme: concepts
notation: ENVI141
note: 1. On trouve aussi l’expression « biodégradation ultime », qui est déconseillée.
note: 2. Lorsque la biodégradation totale se produit en présence d’oxygène, on parle de « biodégradation totale aérobie » (en anglais : ultimate aerobic biodegradation) ; lorsqu’elle se produit en l’absence d’oxygène, on parle de « biodégradation totale anaérobie » (en anglais : ultimate anaerobic biodegradation).
related: biodégradable

immission
type: ConceptConcept
type: Concept
creator: Commission d'enrichissement de la langue française, FranceTerme
date parution JO: 2018-05-18
equivalent EN: Immission @de
equivalent EN: Immission (de)
equivalent EN: immission @en
equivalent EN: immission (en)
part of speech: nom féminin
definition: Incorporation et accumulation d’une substance, notamment d’un polluant, dans un milieu récepteur.
in scheme: Environnement
in scheme: concepts
notation: ENVI143
note: 1. Les résultats de l’immission peuvent être analysés en termes de concentration de substances dans les milieux récepteurs.
note: 2. L’atmosphère, l’eau, les sols et les organismes vivants sont des exemples de milieux récepteurs.

bioénergie
type: ConceptConcept
type: Concept
creator: Commission d'enrichissement de la langue française, FranceTerme
date parution JO: 2018-05-26
deconseille ou frequent: bio-energy
deconseille ou frequent: bio-énergie
equivalent EN: bioenergy @en
equivalent EN: bioenergy (en)
part of speech: nom féminin
definition: Énergie obtenue à partir de la biomasse.
in scheme: Énergie
in scheme: Environnement
in scheme: concepts
notation: ENVI144
note: La bioénergie peut provenir directement de la biomasse, ou de biocombustibles, de biocarburants ou de biogaz tirés de la biomasse.
related: électricité d'origine renouvelable
related: biogaz
related: biométhane
related: centrale à biomasse
related: concept-PETR218
related: concept-PETR219
scope note: Cette publication annule et remplace celle du Journal officiel du 15 décembre 2013.

électricité d'origine renouvelable
type: ConceptConcept
type: Concept
creator: Commission d'enrichissement de la langue française, FranceTerme
date parution JO: 2018-05-26
deconseille ou frequent: électricité verte
equivalent EN: renewable electricity @en
equivalent EN: renewable electricity (en)
forme abregee: électricité renouvelable
definition: Électricité produite à partir de sources d’énergie renouvelables.
in scheme: Énergie
in scheme: Environnement
in scheme: concepts
notation: ENVI145
note: Les sources d’énergie renouvelables sont principalement l’éolien, le solaire, l’hydraulique, la géothermie et la biomasse.
related: bioénergie
related: développement durable

biogaz
type: ConceptConcept
type: Concept
creator: Commission d'enrichissement de la langue française, FranceTerme
date parution JO: 2018-05-26
deconseille ou frequent: gaz naturel
equivalent EN: biogas @en
equivalent EN: biogas (en)
part of speech: nom masculin
definition: Mélange gazeux contenant essentiellement du méthane et du dioxyde de carbone, qui est produit par digestion anaérobie.
in scheme: Énergie
in scheme: Environnement
in scheme: concepts
notation: ENVI146
note: 1. L’intérêt énergétique du biogaz réside dans le méthane qu’il contient.
note: 2. Le « biogaz » doit être distingué du « gaz naturel ».
note: 3. Le biogaz est couramment produit à partir de boues de stations d’épuration, ainsi que de déchets agricoles et urbains.
related: bioénergie
related: biométhane
related: centrale à biomasse
related: digestion anaérobie
related: potentiel méthanogène de biomasse

biométhane
type: ConceptConcept
type: Concept
creator: Commission d'enrichissement de la langue française, FranceTerme
date parution JO: 2018-05-26
equivalent EN: biomethane @en
equivalent EN: biomethane (en)
part of speech: nom masculin
definition: Biogaz épuré de façon à conserver principalement le méthane.
in scheme: Énergie
in scheme: Environnement
in scheme: concepts
notation: ENVI147
note: Le biométhane, produit à faible débit, en provenance notamment d’une station d’épuration, d’une exploitation agricole ou d’un site de stockage de déchets organiques, peut être injecté dans le réseau de transport et de distribution de gaz naturel.
related: bioénergie
related: biogaz
related: biométhane pour véhicules
related: centrale à biomasse

biométhane pour véhicules
type: ConceptConcept
type: Concept
creator: Commission d'enrichissement de la langue française, FranceTerme
date parution JO: 2018-05-26
deconseille ou frequent: Bio-GNV
deconseille ou frequent: bio-NGV
deconseille ou frequent: biogaz naturel pour véhicule
deconseille ou frequent: biogaz naturel pour véhicules
deconseille ou frequent: biogaz pour véhicule
deconseille ou frequent: biométhane pour véhicule
definition: Biométhane comprimé pour être utilisé comme carburant dans des véhicules.
in scheme: Énergie
in scheme: Environnement
in scheme: concepts
notation: ENVI148
note: On trouve aussi le terme « bio-GNV », abréviation de « biogaz naturel pour véhicules », qui est déconseillé.
related: biométhane
related: concept-PETR316

centrale à biomasse
type: ConceptConcept
type: Concept
creator: Commission d'enrichissement de la langue française, FranceTerme
date parution JO: 2018-05-26
equivalent EN: biomass power plant @en
equivalent EN: biomass power plant (en)
definition: Installation qui produit de l’énergie thermique et électrique par combustion de biomasse ou de biogaz.
in scheme: Énergie
in scheme: Environnement
in scheme: concepts
notation: ENVI149
related: bioénergie
related: biogaz
related: biométhane

étude d'impact sur l'environnement
type: ConceptConcept
type: Concept
creator: Commission d'enrichissement de la langue française, FranceTerme
abbreviation: EIA @en
abbreviation: EIE
date parution JO: 2010-02-04
equivalent EN: EIA @en
equivalent EN: EIA (en)
equivalent EN: environmental impact assessment @en
equivalent EN: environmental impact assessment (en)
forme abregee: étude d'impact
forme abregee: étude d'incidences
alternative label: étude d'incidences sur l'environnement
definition: Étude préalable à la mise en œuvre de programmes ou de plans et à la réalisation d'équipements, qui permet d'estimer leurs effets probables sur l'environnement.
in scheme: Environnement
in scheme: concepts
notation: ENVI15
note: 1. L'étude d'impact sur l'environnement relève de la responsabilité du maître d'ouvrage.
note: 2. L'étude d'impact sur l'environnement permet notamment de justifier le parti retenu et de préciser les mesures envisagées tendant à supprimer, réduire ou compenser les dommages éventuels liés à un projet.
note: 3. L'étude d'impact sur l'environnement est nécessaire à l'évaluation environnementale.
related: évaluation environnementale

digestion anaérobie
type: ConceptConcept
type: Concept
creator: Commission d'enrichissement de la langue française, FranceTerme
date parution JO: 2018-05-26
equivalent EN: anaerobic digestion @en
equivalent EN: anaerobic digestion (en)
definition: Décomposition de biomasse à forte teneur en matière organique en biogaz par l’action de microorganismes et en l’absence d’oxygène gazeux.
in scheme: Agriculture
in scheme: Environnement
in scheme: concepts
notation: ENVI150
note: La digestion anaérobie se produit naturellement ou est réalisée dans un digesteur.
related: biogaz
related: méthanisation
related: codigestion anaérobie
related: digesteur
related: digestat
related: potentiel méthanogène de biomasse

méthanisation
type: ConceptConcept
type: Concept
creator: Commission d'enrichissement de la langue française, FranceTerme
date parution JO: 2018-05-26
part of speech: nom féminin
definition: Dernière phase de la digestion anaérobie, destinée à produire du méthane.
in scheme: Agriculture
in scheme: Environnement
in scheme: concepts
notation: ENVI151
note: Le terme « méthanisation » est parfois utilisé pour désigner la totalité du processus de digestion anaérobie.
related: digestion anaérobie
related: codigestion anaérobie
related: digesteur
related: digestat
related: méthanation
related: hydrogène d'origine biologique

codigestion anaérobie
type: ConceptConcept
type: Concept
creator: Commission d'enrichissement de la langue française, FranceTerme
date parution JO: 2018-05-26
deconseille ou frequent: anaerobic co-digestion
deconseille ou frequent: anaerobic codigestion
deconseille ou frequent: co-digestion
deconseille ou frequent: co-digestion anaérobie
equivalent EN: codigestion @en
equivalent EN: codigestion (en)
forme abregee: codigestion, n.f.
definition: Digestion anaérobie d’un mélange de biomasse de différentes natures.
in scheme: Agriculture
in scheme: Environnement
in scheme: concepts
notation: ENVI152
note: La biomasse soumise à la codigestion anaérobie peut provenir, par exemple, de produits de culture agricole ou de résidus végétaux.
related: digestion anaérobie
related: méthanisation

digesteur
type: ConceptConcept
type: Concept
creator: Commission d'enrichissement de la langue française, FranceTerme
date parution JO: 2018-05-26
deconseille ou frequent: méthaniseur
equivalent EN: digester @en
equivalent EN: digester (en)
equivalent EN: digestor @en
equivalent EN: digestor (en)
part of speech: nom masculin
definition: Réacteur où s’opère la digestion anaérobie.
in scheme: Agriculture
in scheme: Environnement
in scheme: concepts
notation: ENVI153
note: 1. Le digesteur est utilisé pour traiter principalement des déchets organiques.
note: 2. On trouve aussi, dans l’usage, le terme « méthaniseur », qui met l’accent sur la production de méthane.
related: digestion anaérobie
related: méthanisation
related: digestat

digestat
type: ConceptConcept
type: Concept
creator: Commission d'enrichissement de la langue française, FranceTerme
date parution JO: 2018-05-26
equivalent EN: digestate @en
equivalent EN: digestate (en)
part of speech: nom masculin
definition: Matière résiduaire organique qui subsiste après la digestion anaérobie.
in scheme: Agriculture
in scheme: Environnement
in scheme: concepts
notation: ENVI154
note: Le digestat peut être traité pour être utilisé comme amendement ou engrais.
related: digestion anaérobie
related: méthanisation
related: digesteur

potentiel méthanogène de biomasse
type: ConceptConcept
type: Concept
creator: Commission d'enrichissement de la langue française, FranceTerme
date parution JO: 2018-05-26
deconseille ou frequent: potentiel méthanogène de la biomasse
equivalent EN: methanogenic potential @en
equivalent EN: methanogenic potential (en)
equivalent EN: methanogenic potential of biomass @en
equivalent EN: methanogenic potential of biomass (en)
forme abregee: potentiel méthanogène
definition: Quantité maximale de méthane pouvant être obtenue par digestion anaérobie d’une biomasse donnée.
in scheme: Énergie
in scheme: Environnement
in scheme: concepts
notation: ENVI155
note: Le potentiel méthanogène de la biomasse considérée varie en fonction de la composition de celle-ci.
related: biogaz
related: digestion anaérobie

méthanation
type: ConceptConcept
type: Concept
creator: Commission d'enrichissement de la langue française, FranceTerme
date parution JO: 2018-05-26
equivalent EN: methanation @en
equivalent EN: methanation (en)
part of speech: nom féminin
definition: Procédé physicochimique qui consiste à produire du méthane par réaction de l’hydrogène avec du monoxyde ou du dioxyde de carbone.
in scheme: Énergie
in scheme: Environnement
in scheme: concepts
notation: ENVI157
related: méthanisation
related: production d'hydrogène par électrolyse de l'eau

absorption anthropique de carbone
type: ConceptConcept
type: Concept
creator: Commission d'enrichissement de la langue française, FranceTerme
date parution JO: 2019-09-24
deconseille ou frequent: CO2 removals
deconseille ou frequent: absorption anthropique de Co2
deconseille ou frequent: absorptions anthropiques
deconseille ou frequent: anthropogenic removals
equivalent EN: anthropogenic removal @en
equivalent EN: anthropogenic removal (en)
definition: Absorption de dioxyde de carbone dans des puits de carbone naturels conservés ou aménagés par l’homme, ou dans des installations de captage et de stockage du CO2.
in scheme: Énergie
in scheme: Environnement
in scheme: concepts
notation: ENVI159
note: Le terme « absorption anthropique de carbone » est parfois généralisé à certains gaz à effet de serre autres que le dioxyde de carbone, tel le méthane.
related: captage et stockage du CO
related: compensation des émissions de gaz à effet de serre
related: faible émission de gaz à effet de serre (à)
related: décarbonation
related: puits de carbone
related: neutralité en matière de gaz à effet de serre

récupération des déchets
type: ConceptConcept
type: Concept
creator: Commission d'enrichissement de la langue française, FranceTerme
date parution JO: 2009-04-12
equivalent EN: waste recovery @en
equivalent EN: waste recovery (en)
definition: Opération de collecte et de tri des déchets, en vue du réemploi ou du recyclage de produits et de matériaux.
in scheme: Environnement
in scheme: concept-SD-environnement-dechets
in scheme: concepts
notation: ENVI16
related: recyclage des déchets
related: recyclerie
related: valorisation énergétique des déchets

bilan d'émissions de gaz à effet de serre
type: ConceptConcept
type: Concept
creator: Commission d'enrichissement de la langue française, FranceTerme
abbreviation: BEGES
date parution JO: 2019-09-24
deconseille ou frequent: GHG emissions assessment
deconseille ou frequent: GHG emissions audit
deconseille ou frequent: bilan CO2
deconseille ou frequent: bilan carbone
equivalent EN: greenhouse gas emissions assessment @en
equivalent EN: greenhouse gas emissions assessment (en)
equivalent EN: greenhouse gas emissions audit @en
equivalent EN: greenhouse gas emissions audit (en)
forme abregee: bilan GES
definition: Évaluation de la quantité totale de gaz à effet de serre d’origine anthropique émis dans l’atmosphère, pendant une durée déterminée.
in scheme: Énergie
in scheme: Environnement
in scheme: concepts
notation: ENVI160
note: 1. Le bilan d’émissions de gaz à effet de serre est mesuré par son équivalent en dioxyde de carbone.
note: 2. Le bilan d’émissions de gaz à effet de serre inclut les émissions directement issues de la zone géographique considérée, tels le transport et le chauffage des ménages, des administrations, des commerces et des activités liées à la consommation locale, ainsi que celles qui lui sont extérieures, résultant de la fabrication et du transport des biens et des services importés ou exportés.
note: 3. Le terme « bilan carbone » est une marque déposée.
related: délocalisation d'émissions de gaz à effet de serre
related: équivalent en dioxyde de carbone
related: contenu en carbone
related: intensité des émissions de gaz à effet de serre
related: potentiel de réchauffement climatique
related: empreinte en gaz à effet de serre

compensation des émissions de gaz à effet de serre
type: ConceptConcept
type: Concept
creator: Commission d'enrichissement de la langue française, FranceTerme
date parution JO: 2019-09-24
deconseille ou frequent: CO2 compensation
deconseille ou frequent: carbon compensation
deconseille ou frequent: compensation carbone
deconseille ou frequent: compensation des émissions de CO2
deconseille ou frequent: compensation des émissions de carbone
deconseille ou frequent: compensation des émissions de dioxyde de carbone
forme abregee: compensation des GES
definition: Ensemble des mesures techniques ou financières permettant de contrebalancer, en partie ou en totalité, les émissions, dans l’atmosphère, de gaz à effet de serre d’origine anthropique qui n’ont pu être évitées.
in scheme: Énergie
in scheme: Environnement
in scheme: concepts
notation: ENVI161
note: 1. La compensation des émissions de gaz à effet de serre se fonde sur le fait qu’une quantité donnée de gaz à effet de serre émis en un lieu peut être compensée par l’absorption ou la réduction d’une émission de quantité équivalente de gaz à effet de serre en un autre lieu.
note: 2. Quand la compensation concerne les émissions de dioxyde de carbone, on parle de « compensation des émissions de dioxyde de carbone » ou de « compensation carbone » (en anglais : carbon compensation).
related: absorption anthropique de carbone
related: marché des émissions de gaz à effet de serre
related: décarbonation
related: effet de serre
related: puits de carbone
related: neutralité en matière de gaz à effet de serre
scope note: Cette publication annule et remplace celle du terme « compensation des émissions de carbone » au Journal officiel du 8 septembre 2013.

délocalisation d'émissions de gaz à effet de serre
type: ConceptConcept
type: Concept
creator: Commission d'enrichissement de la langue française, FranceTerme
date parution JO: 2019-09-24
deconseille ou frequent: CO2 leakage
deconseille ou frequent: GES leakage
deconseille ou frequent: carbon leakage
deconseille ou frequent: délocalisation de CO2
deconseille ou frequent: délocalisation de carbone
deconseille ou frequent: fuite de CO2
deconseille ou frequent: fuite de carbone
equivalent EN: greenhouse gas leakage @en
equivalent EN: greenhouse gas leakage (en)
forme abregee: délocalisation de GES
definition: Transfert d’une activité fortement émettrice de gaz à effet de serre, notamment de dioxyde de carbone, dans un pays où la législation sur l’environnement est moins contraignante.
in scheme: Énergie
in scheme: Environnement
in scheme: concepts
notation: ENVI164
note: Quand la délocalisation concerne les émissions de dioxyde de carbone, on parle de « délocalisation de carbone » (en anglais : carbon leakage). On trouve aussi le terme « fuite de carbone », qui est déconseillé.
related: bilan d'émissions de gaz à effet de serre
related: intensité des émissions de gaz à effet de serre
related: marché des émissions de gaz à effet de serre
related: empreinte en gaz à effet de serre

équivalent en dioxyde de carbone
type: ConceptConcept
type: Concept
creator: Commission d'enrichissement de la langue française, FranceTerme
date parution JO: 2019-09-24
deconseille ou frequent: carbon dioxide equivalent
deconseille ou frequent: équivalent CO2
deconseille ou frequent: équivalent carbone
deconseille ou frequent: équivalent en CO2
deconseille ou frequent: équivalent en carbone
forme abregee: équivalent CO2
definition: Masse de dioxyde de carbone qui aurait le même potentiel de réchauffement climatique qu’une quantité donnée d’un autre gaz à effet de serre.
in scheme: Énergie
in scheme: Environnement
in scheme: concepts
notation: ENVI165
note: 1. Une émission de gaz à effet de serre exprimée en équivalent en dioxyde de carbone est le produit de la masse de ce gaz à effet de serre par son potentiel de réchauffement climatique.
note: 2. L’équivalent en dioxyde de carbone étant utilisé comme valeur de référence, il sert d’unité.
note: 3. On trouve aussi le terme « équivalent carbone ».
related: bilan d'émissions de gaz à effet de serre
related: contenu en carbone
related: intensité des émissions de gaz à effet de serre
related: potentiel de réchauffement climatique
related: empreinte en gaz à effet de serre
related: écocalculateur

contenu en carbone
type: ConceptConcept
type: Concept
creator: Commission d'enrichissement de la langue française, FranceTerme
date parution JO: 2019-09-24
deconseille ou frequent: CO2 content
deconseille ou frequent: contenu CO2
deconseille ou frequent: contenu carbone
deconseille ou frequent: contenu en CO2
deconseille ou frequent: contenu en équivalent carbone
equivalent EN: carbon content @en
equivalent EN: carbon content (en)
definition: Évaluation de la quantité de dioxyde de carbone contenue dans les émissions de gaz à effet de serre associées à un produit, à un procédé ou à une activité humaine pendant une durée déterminée.
in scheme: Énergie
in scheme: Environnement
in scheme: concepts
notation: ENVI167
note: 1. Le contenu en carbone est établi par unité de produit ou d’activité, par exemple par kilomètre parcouru, ou encore par kilowattheure ou par tonne d’acier produits.
note: 2. La mesure du contenu en carbone contribue à établir le bilan d’émissions de gaz à effet de serre.
note: 3. On trouve aussi le terme « contenu carbone ».
related: bilan d'émissions de gaz à effet de serre
related: équivalent en dioxyde de carbone
related: intensité des émissions de gaz à effet de serre
related: faible émission de gaz à effet de serre (à)
related: décarbonation
related: empreinte en gaz à effet de serre

intensité des émissions de gaz à effet de serre
type: ConceptConcept
type: Concept
creator: Commission d'enrichissement de la langue française, FranceTerme
date parution JO: 2019-09-24
deconseille ou frequent: CO2 intensity
deconseille ou frequent: carbon intensity
deconseille ou frequent: intensité CO2
deconseille ou frequent: intensité carbone
deconseille ou frequent: intensité en CO2
deconseille ou frequent: intensité en carbone
equivalent EN: GHG intensity @en
equivalent EN: GHG intensity (en)
equivalent EN: greenhouse gas intensity @en
equivalent EN: greenhouse gas intensity (en)
forme abregee: intensité GES
definition: Indicateur qui rapporte la quantité de gaz à effet de serre émis, mesurée par son équivalent en dioxyde de carbone, au produit intérieur brut.
in scheme: Énergie
in scheme: Environnement
in scheme: concepts
notation: ENVI168
note: 1. L’intensité des émissions de gaz à effet de serre permet d’effectuer des comparaisons, notamment entre des pays ou des secteurs économiques.
note: 2. Bien que l’intensité des émissions de gaz à effet de serre ne concerne pas exclusivement le dioxyde de carbone, on parle fréquemment d’« intensité carbone » (en anglais : carbon intensity).
related: bilan d'émissions de gaz à effet de serre
related: délocalisation d'émissions de gaz à effet de serre
related: équivalent en dioxyde de carbone
related: contenu en carbone
related: potentiel de réchauffement climatique
related: faible émission de gaz à effet de serre (à)
related: empreinte en gaz à effet de serre

marché des émissions de gaz à effet de serre
type: ConceptConcept
type: Concept
creator: Commission d'enrichissement de la langue française, FranceTerme
date parution JO: 2019-09-24
deconseille ou frequent: CO2 market
deconseille ou frequent: carbon market
deconseille ou frequent: marché carbone
deconseille ou frequent: marché du CO2
deconseille ou frequent: marché du carbone
deconseille ou frequent: marché du dioxyde de carbone
equivalent EN: GHG market @en
equivalent EN: GHG market (en)
equivalent EN: greenhouse gas market @en
equivalent EN: greenhouse gas market (en)
forme abregee: marché GES
definition: Marché d’échange de droits d’émission de gaz à effet de serre, qui repose sur un dispositif de quotas d’émission cessibles.
in scheme: Énergie
in scheme: Environnement
in scheme: concepts
notation: ENVI169
note: Quand ce marché concerne les quotas d’émission de dioxyde de carbone, on parle de « marché du dioxyde de carbone » ou de « marché du carbone » (en anglais : carbon market).
related: compensation des émissions de gaz à effet de serre
related: délocalisation d'émissions de gaz à effet de serre
related: quota d'émission de gaz à effet de serre
related: dispositif de quotas d'émission cessibles
related: unité de réduction certifiée des émissions

recyclage des déchets
type: ConceptConcept
type: Concept
creator: Commission d'enrichissement de la langue française, FranceTerme
date parution JO: 2009-04-12
equivalent EN: waste recycling @en
equivalent EN: waste recycling (en)
definition: Ensemble des techniques de transformation des déchets après récupération, visant à en réintroduire tout ou partie dans un cycle de production.
definition: Waste processing techniques aiming at reintroducing them in full or in part in a production cycle. @en
in scheme: Environnement
in scheme: concept-SD-environnement-dechets
in scheme: concepts
notation: ENVI17
preferred label: waste recycling @en
related: récupération des déchets
related: valorisation énergétique des déchets
related: recyclage valorisant

potentiel de réchauffement climatique
type: ConceptConcept
type: Concept
creator: Commission d'enrichissement de la langue française, FranceTerme
date parution JO: 2019-09-24
deconseille ou frequent: PRG
deconseille ou frequent: pouvoir de réchauffement global
equivalent EN: GWP @en
equivalent EN: GWP (en)
equivalent EN: global warming potential @en
equivalent EN: global warming potential (en)
definition: Indice obtenu en divisant le forçage radiatif résultant d’une masse de gaz à effet de serre émis, par celui de la même masse de dioxyde de carbone, les effets de ces gaz étant considérés sur une période identique.
in scheme: Énergie
in scheme: Environnement
in scheme: concepts
notation: ENVI170
note: On trouve aussi, dans le langage professionnel, le terme « pouvoir de réchauffement global (PRG) ».
related: bilan d'émissions de gaz à effet de serre
related: équivalent en dioxyde de carbone
related: intensité des émissions de gaz à effet de serre
related: forçage radiatif

faible émission de gaz à effet de serre (à)
type: ConceptConcept
type: Concept
creator: Commission d'enrichissement de la langue française, FranceTerme
date parution JO: 2019-09-24
deconseille ou frequent: bas-carbone
deconseille ou frequent: faible émission de carbone
deconseille ou frequent: low carbon
deconseille ou frequent: sobre en carbone
deconseille ou frequent: à faible émission de GES
deconseille ou frequent: à faible émission de carbone
deconseille ou frequent: à faible émission de gaz à effet de serre
equivalent EN: low GHG @en
equivalent EN: low GHG (en)
equivalent EN: low greenhouse gas @en
equivalent EN: low greenhouse gas (en)
forme abregee: faible émission de GES (à), loc.adj.
part of speech: locution adjectivale
definition: Se dit d’une technologie ou d’une chaîne de production qui permet une réduction significative des émissions de gaz à effet de serre, notamment de dioxyde de carbone.
in scheme: Énergie
in scheme: Environnement
in scheme: concepts
notation: ENVI172
note: 1. Une politique de faible émission de gaz à effet de serre consiste notamment à limiter l’usage des combustibles et des carburants d’origine fossile et à améliorer l’efficacité énergétique.
note: 2. On trouve aussi le terme « sobre en carbone » (en anglais : low carbon), ainsi que le terme « bas-carbone », qui n’est pas recommandé.
related: absorption anthropique de carbone
related: contenu en carbone
related: intensité des émissions de gaz à effet de serre
related: décarbonation
related: neutralité en matière de gaz à effet de serre
related: hydrogène à faible empreinte carbone

décarbonation
type: ConceptConcept
type: Concept
creator: Commission d'enrichissement de la langue française, FranceTerme
date parution JO: 2019-09-24
deconseille ou frequent: decarbonation
deconseille ou frequent: decarbonise
deconseille ou frequent: decarbonised
deconseille ou frequent: decarbonization
deconseille ou frequent: decarbonize
deconseille ou frequent: decarbonized
deconseille ou frequent: décarboner
deconseille ou frequent: décarbonisation
deconseille ou frequent: décarboné
deconseille ou frequent: zero carbone
equivalent EN: decarbonisation @en
equivalent EN: decarbonisation (en)
part of speech: nom féminin
definition: Ensemble des mesures et des techniques permettant de réduire les émissions de dioxyde de carbone.
in scheme: Énergie
in scheme: Environnement
in scheme: concepts
notation: ENVI173
note: 1. La décarbonation peut être le fait d’une entité territoriale, d’une entreprise ou même de particuliers.
note: 2. L’arrêt du recours aux centrales à charbon ou la suppression des véhicules à moteur thermique sont des exemples de décarbonation.
related: absorption anthropique de carbone
related: compensation des émissions de gaz à effet de serre
related: contenu en carbone
related: faible émission de gaz à effet de serre (à)
related: empreinte en gaz à effet de serre
related: neutralité en matière de gaz à effet de serre
related: hydrogène à faible empreinte carbone

empreinte en gaz à effet de serre
type: ConceptConcept
type: Concept
creator: Commission d'enrichissement de la langue française, FranceTerme
date parution JO: 2019-09-24
deconseille ou frequent: CO2 footprint
deconseille ou frequent: carbon footprint
deconseille ou frequent: empreinte CO2
deconseille ou frequent: empreinte carbone
deconseille ou frequent: empreinte en CO2
deconseille ou frequent: empreinte en carbone
deconseille ou frequent: empreinte en dioxyde de carbone
equivalent EN: GHG footprint @en
equivalent EN: GHG footprint (en)
equivalent EN: greenhouse gas footprint @en
equivalent EN: greenhouse gas footprint (en)
forme abregee: empreinte GES
definition: Bilan d’émissions et d’absorptions anthropiques de gaz à effet de serre effectué dans une zone géographique donnée et relatif à une activité, à une population, voire à un ou plusieurs individus.
in scheme: Énergie
in scheme: Environnement
in scheme: concepts
notation: ENVI174
note: 1. L’empreinte en gaz à effet de serre est mesurée par son équivalent en dioxyde de carbone.
note: 2. Quand l’empreinte en gaz à effet de serre se restreint au bilan de la quantité de dioxyde de carbone émis et absorbé, on parle d’« empreinte en dioxyde de carbone » ou d’« empreinte carbone » (en anglais : carbon footprint).
related: bilan d'émissions de gaz à effet de serre
related: délocalisation d'émissions de gaz à effet de serre
related: équivalent en dioxyde de carbone
related: contenu en carbone
related: intensité des émissions de gaz à effet de serre
related: décarbonation
related: empreinte en matières premières
related: empreinte écologique
related: empreinte en eau
related: hydrogène à faible empreinte carbone

bilan sédimentaire
type: ConceptConcept
type: Concept
creator: Commission d'enrichissement de la langue française, FranceTerme
date parution JO: 2019-10-16
deconseille ou frequent: budget sédimentaire
equivalent EN: sediment balance @en
equivalent EN: sediment balance (en)
equivalent EN: sediment budget @en
equivalent EN: sediment budget (en)
equivalent EN: sedimentary budget @en
equivalent EN: sedimentary budget (en)
definition: Bilan des apports et des pertes de sédiments dans une zone donnée d’un littoral, d’un lac ou d’un cours d’eau.
in scheme: Environnement
in scheme: concepts
notation: ENVI175
note: 1. Le bilan sédimentaire permet d’apprécier l’évolution morphologique – érosion, stabilité ou accumulation de matières – de la zone concernée.
note: 2. On trouve aussi le terme « budget sédimentaire », qui est déconseillé.
related: trait de côte
related: casier sédimentaire

boue rouge
type: ConceptConcept
type: Concept
creator: Commission d'enrichissement de la langue française, FranceTerme
date parution JO: 2021-07-16
deconseille ou frequent: boues rouges
deconseille ou frequent: red muds
equivalent EN: red mud @en
equivalent EN: red mud (en)
definition: Effluent constitué de résidus de l’industrie extractive, dont la couleur provient de matières en suspension riches en oxydes de fer.
in scheme: Chimie
in scheme: Environnement
in scheme: concepts
notation: ENVI176
note: 1. Les boues rouges sont principalement issues des centres de production d’alumine ou de dioxyde de titane.
note: 2. Les boues rouges présentent des risques environnementaux et sanitaires en raison d’une part de leur caractère basique et de leur teneur en métaux lourds, d’autre part de leur sédimentation lorsqu’elles sont déversées en mer ou en eau douce, ou encore stockées à terre dans des décharges.

cellule sédimentaire
type: ConceptConcept
type: Concept
date parution JO: 2022-08-04
deconseille ou frequent: cellule hydro-sédimentaire
deconseille ou frequent: cellule littorale
deconseille ou frequent: cellule sédimentaire littorale
equivalent EN: hydro-sedimentary cell @en
equivalent EN: hydro-sedimentary cell (en)
equivalent EN: littoral cell @en
equivalent EN: littoral cell (en)
equivalent EN: littoral sediment cell @en
equivalent EN: littoral sediment cell (en)
equivalent EN: sedimentary cell @en
equivalent EN: sedimentary cell (en)
part of speech: locution nominale féminine
definition: Portion de littoral ou de berge qui se caractérise par un fonctionnement géomorphologique et dynamique particulier en matière de transports sédimentaires transversaux et longitudinaux, et qui associe une zone d’érosion et une zone d’accrétion.
in scheme: Environnement
in scheme: concepts
notation: ENVI177
note: 1. Les limites d’une cellule sédimentaire, qui s’étend généralement sur plusieurs kilomètres, peuvent être naturelles, dans le cas de caps ou de fleuves, ou artificielles, dans le cas de digues ou de jetées.
note: 2. La cellule sédimentaire définit une zone géographique dans laquelle le bilan sédimentaire peut être estimé.
related: casier sédimentaire

poldérisation
type: ConceptConcept
type: Concept
creator: Commission d'enrichissement de la langue française, FranceTerme
date parution JO: 2019-10-16
part of speech: nom féminin
definition: Conquête de terres sur la mer, un estuaire, une zone humide, un lac ou un étang, qui est obtenue par endiguement, par assèchement ou, parfois, par remblaiement.
in scheme: Aménagement et urbanisme
in scheme: Environnement
in scheme: concepts
notation: ENVI178
related: dépoldérisation

dépoldérisation
type: ConceptConcept
type: Concept
creator: Commission d'enrichissement de la langue française, FranceTerme
date parution JO: 2019-10-16
part of speech: nom féminin
definition: Remise en eau d’un polder.
in scheme: Aménagement et urbanisme
in scheme: Environnement
in scheme: concepts
notation: ENVI179
note: La dépoldérisation a notamment pour objet de créer ou d’agrandir une zone d’expansion des eaux pour faire face aux crues ou aux submersions marines.
related: poldérisation

réduction des déchets
type: ConceptConcept
type: Concept
creator: Commission d'enrichissement de la langue française, FranceTerme
date parution JO: 2009-04-12
deconseille ou frequent: prévention des déchets
equivalent EN: waste prevention @en
equivalent EN: waste prevention (en)
definition: Ensemble des mesures et des actions qui, de la conception à la distribution d'un produit, visent à réduire la diversité, la quantité et la nocivité des déchets.
in scheme: Environnement
in scheme: concept-SD-environnement-dechets
in scheme: concepts
notation: ENVI18

encrassement biologique
type: ConceptConcept
type: Concept
creator: Commission d'enrichissement de la langue française, FranceTerme
date parution JO: 2019-10-16
deconseille ou frequent: biological fouling
equivalent EN: biofouling @en
equivalent EN: biofouling (en)
definition: Développement d’organismes vivants sur la surface d’engins ou d’équipements en contact permanent ou fréquent avec l’eau, qui nuit à l’utilisation de ceux-ci.
in scheme: Environnement
in scheme: concepts
notation: ENVI180
related: antisalissure

internalisation environnementale
type: ConceptConcept
type: Concept
creator: Commission d'enrichissement de la langue française, FranceTerme
date parution JO: 2019-10-16
deconseille ou frequent: internalisation des externalités environnementales
definition: Intégration, dans le coût complet d’une activité ou d’un projet, du coût des externalités environnementales liées à cette activité ou à ce projet.
in scheme: Économie générale
in scheme: Environnement
in scheme: concepts
notation: ENVI181
related: externalité
related: évaluation environnementale

réestuarisation
type: ConceptConcept
type: Concept
creator: Commission d'enrichissement de la langue française, FranceTerme
date parution JO: 2019-10-16
deconseille ou frequent: ré-estuarisation
part of speech: nom féminin
definition: Restauration de l’embouchure d’un fleuve consistant le plus souvent à réaménager ou à supprimer les ouvrages, notamment d’endiguement, qui réduisent les échanges d’eau entre un fleuve et la mer.
in scheme: Aménagement et urbanisme
in scheme: Environnement
in scheme: concepts
notation: ENVI182

trait de côte
type: ConceptConcept
type: Concept
creator: Commission d'enrichissement de la langue française, FranceTerme
date parution JO: 2021-07-16
deconseille ou frequent: coastline
deconseille ou frequent: limite du rivage
equivalent EN: coast line @en
equivalent EN: coast line (en)
definition: Ligne de séparation de la terre et de la mer, qui est située, par convention, à la limite des plus hautes eaux marines par temps calme.
in scheme: Environnement
in scheme: concepts
notation: ENVI184
note: Le trait de côte, qui est soumis à des évolutions liées à des facteurs climatiques ou anthropiques, est mobile, et sa transcription cartographique est révisée périodiquement.
related: bilan sédimentaire
related: compression côtière

forçage radiatif
type: ConceptConcept
type: Concept
creator: Commission d'enrichissement de la langue française, FranceTerme
date parution JO: 2019-09-24
equivalent EN: radiative forcing @en
equivalent EN: radiative forcing (en)
definition: Écart entre le rayonnement solaire reçu par une planète et le rayonnement infrarouge qu’elle émet sous l’effet de facteurs d’évolution du climat, tels que la variation de la concentration en gaz à effet de serre.
in scheme: Énergie
in scheme: Environnement
in scheme: concepts
notation: ENVI185
note: 1. Le forçage radiatif est calculé au sommet de la troposphère et il est exprimé en watts par mètre carré (W/m2).
note: 2. Un forçage radiatif positif contribue à réchauffer la surface de la planète tandis qu’un forçage radiatif négatif contribue à la refroidir.
related: potentiel de réchauffement climatique

alluvionnement
type: ConceptConcept
type: Concept
creator: Commission d'enrichissement de la langue française, FranceTerme
date parution JO: 2021-07-16
deconseille ou frequent: agradation
deconseille ou frequent: atterrissement
equivalent EN: aggradation @en
equivalent EN: aggradation (en)
equivalent EN: alluviation @en
equivalent EN: alluviation (en)
part of speech: nom masculin
alternative label: aggradation
definition: Processus de formation d’un atterrissement.
in scheme: Environnement
in scheme: concepts
notation: ENVI186
note: L’alluvionnement résulte essentiellement de la houle marine ou des crues des cours d’eau.

théorie de l'effondrement
type: ConceptConcept
type: Concept
creator: Commission d'enrichissement de la langue française, FranceTerme
date parution JO: 2021-07-16
deconseille ou frequent: collapsus écologique
deconseille ou frequent: effondrement
definition: Théorie selon laquelle des populations végétales et animales, voire des écosystèmes, sont voués à disparaître du fait d’une surexploitation qui excède leur résilience, entraînant la perte des services écosystémiques et un effondrement de la civilisation qui dépend de ces services.
in scheme: Environnement
in scheme: concepts
notation: ENVI187
related: service écosystémique
related: collapsologie
related: résilience
related: catastrophisme
related: écosystème

collapsologie
type: ConceptConcept
type: Concept
creator: Commission d'enrichissement de la langue française, FranceTerme
date parution JO: 2021-07-16
part of speech: nom féminin
definition: Spéculation prospective qui, en s’appuyant sur des données chiffrées, produit des scénarios décrivant la disparition plus ou moins proche de la civilisation industrielle.
in scheme: Environnement
in scheme: concepts
notation: ENVI188
note: Les données sur lesquelles se fonde la collapsologie concernent par exemple le changement climatique, l’évolution démographique ou la disponibilité des ressources.
related: théorie de l'effondrement
related: catastrophisme

empreinte en matières premières
type: ConceptConcept
type: Concept
creator: Commission d'enrichissement de la langue française, FranceTerme
date parution JO: 2021-07-16
deconseille ou frequent: empreinte matière
deconseille ou frequent: empreinte matières
equivalent EN: RMC @en
equivalent EN: RMC (en)
equivalent EN: material footprint @en
equivalent EN: material footprint (en)
equivalent EN: raw material consumption @en
equivalent EN: raw material consumption (en)
forme abregee: empreinte en matières
definition: Estimation de la quantité des matières premières nécessaires pour satisfaire la consommation d’un territoire pendant une période donnée, que ces matières soient extraites sur ce territoire ou hors de ses frontières, consommées en l’état ou transformées, ou encore utilisées pour traiter les déchets correspondants.
in scheme: Économie générale
in scheme: Environnement
in scheme: concepts
notation: ENVI189
note: 1. L’empreinte en matières premières peut être calculée pour tout ou partie d’un ensemble de matières, y compris les matériaux ou la biomasse.
note: 2. On peut aussi parler de l’empreinte en matières premières d’un individu, d’un service, d’une institution ou d’un processus de production.
related: empreinte en gaz à effet de serre
related: empreinte écologique
related: empreinte en eau

résilience
type: ConceptConcept
type: Concept
creator: Commission d'enrichissement de la langue française, FranceTerme
date parution JO: 2009-04-12
equivalent EN: resilience @en
equivalent EN: resilience (en)
part of speech: nom féminin
definition: Capacité d'un écosystème à résister et à survivre à des altérations ou à des perturbations affectant sa structure ou son fonctionnement, et à trouver, à terme, un nouvel équilibre.
in scheme: Environnement
in scheme: concepts
notation: ENVI19
related: ingénierie écologique
related: théorie de l'effondrement

empreinte écologique
type: ConceptConcept
type: Concept
creator: Commission d'enrichissement de la langue française, FranceTerme
date parution JO: 2021-07-16
equivalent EN: ecological footprint @en
equivalent EN: ecological footprint (en)
definition: Estimation de la quantité des ressources naturelles nécessaires pour produire ce que consomment un individu, une population ou une activité, et pour traiter les déchets correspondants, en les ramenant conventionnellement à la surface de la Terre qui permet de les fournir, pendant une période donnée.
in scheme: Économie générale
in scheme: Environnement
in scheme: concepts
notation: ENVI190
note: L’empreinte écologique peut entrer dans l’appréciation des performances d’un État.
related: empreinte en gaz à effet de serre
related: empreinte en matières premières
related: empreinte en eau
scope note: Cette publication annule et remplace celle du Journal officiel du 13 juillet 2012.

empreinte en eau
type: ConceptConcept
type: Concept
creator: Commission d'enrichissement de la langue française, FranceTerme
date parution JO: 2021-07-16
deconseille ou frequent: empreinte eau
equivalent EN: water footprint @en
equivalent EN: water footprint (en)
definition: Estimation du volume d’eau utilisé directement dans un territoire, auquel est ajouté celui qui a été nécessaire pour produire les objets importés, pendant une période donnée.
in scheme: Environnement
in scheme: concepts
notation: ENVI191
note: 1. On peut aussi parler de l’empreinte en eau d’un individu, d’un service ou d’une institution.
note: 2. L’empreinte en eau peut aussi intégrer des données concernant la dégradation de la qualité de l’eau.
related: empreinte en gaz à effet de serre
related: empreinte en matières premières
related: empreinte écologique
scope note: Cette publication annule et remplace celle du Journal officiel du 13 juillet 2012.

géothermie marine
type: ConceptConcept
type: Concept
creator: Commission d'enrichissement de la langue française, FranceTerme
date parution JO: 2021-07-16
deconseille ou frequent: thalassothermie
definition: Utilisation des différences de température entre les eaux marines de surface et les eaux marines profondes pour produire de l’énergie au moyen de pompes à chaleur.
in scheme: Énergie
in scheme: Environnement
in scheme: concepts
notation: ENVI192
related: thalassothermie

houlomotricité
type: ConceptConcept
type: Concept
creator: Commission d'enrichissement de la langue française, FranceTerme
date parution JO: 2021-07-16
deconseille ou frequent: centrale houlomotrice
equivalent EN: wave-induced motion @en
equivalent EN: wave-induced motion (en)
part of speech: nom féminin
definition: Utilisation de l’énergie de la houle marine pour produire de l’électricité.
in scheme: Énergie
in scheme: Environnement
in scheme: concepts
notation: ENVI193
note: Les centrales houlomotrices sont des structures flottantes de différentes formes, qui tirent leur énergie des oscillations marines verticales.

compression côtière
type: ConceptConcept
type: Concept
creator: Commission d'enrichissement de la langue française, FranceTerme
date parution JO: 2021-07-16
equivalent EN: coastal squeeze @en
equivalent EN: coastal squeeze (en)
definition: Rétrécissement de l’estran qui résulte de l’élévation du niveau de la mer et de la présence d’un obstacle naturel ou artificiel, bordant cet estran.
in scheme: Environnement
in scheme: concepts
notation: ENVI194
note: 1. L’élévation du niveau de la mer résulte principalement du changement climatique.
note: 2. La compression côtière nuit aux zones humides, comme les vasières et les marais salants.
related: trait de côte
related: changement climatique

recyclerie
type: ConceptConcept
type: Concept
creator: Commission d'enrichissement de la langue française, FranceTerme
date parution JO: 2021-07-16
deconseille ou frequent: decheterie
deconseille ou frequent: dechetterie
deconseille ou frequent: décheterie
deconseille ou frequent: déchetterie
deconseille ou frequent: ressourcerie
part of speech: nom féminin
definition: Lieu où sont remis des objets usagés afin d’être réparés et valorisés pour être vendus au public.
in scheme: Économie et gestion d'entreprise
in scheme: Environnement
in scheme: concepts
notation: ENVI198
note: 1. La recyclerie, en évitant que les objets usagés deviennent des déchets, participe de l’économie circulaire.
note: 2. On trouve aussi le terme « ressourcerie », qui est une marque déposée.
related: économie circulaire
related: récupération des déchets
related: recyclage valorisant

catastrophisme
type: ConceptConcept
type: Concept
creator: Commission d'enrichissement de la langue française, FranceTerme
date parution JO: 2021-07-16
deconseille ou frequent: catastrophisme éclairé
deconseille ou frequent: catastrophiste
deconseille ou frequent: effondrisme
part of speech: nom masculin
definition: Ensemble de comportements qui procèdent de la conviction que la survenue de catastrophes, d’origine naturelle ou anthropique, est probable et qu’il convient de prendre des mesures pour les éviter ou, à défaut, pour s’y préparer.
in scheme: Environnement
in scheme: Santé et médecine
in scheme: concepts
notation: ENVI199
related: théorie de l'effondrement
related: collapsologie
related: principe de précaution
related: principe de prévention

risque majeur
type: ConceptConcept
type: Concept
creator: Commission d'enrichissement de la langue française, FranceTerme
date parution JO: 2009-04-12
equivalent EN: major risk @en
equivalent EN: major risk (en)
definition: Possibilité que se produise un évènement naturel ou technique spécifique ayant des conséquences graves pour les populations ou sur l'environnement.
in scheme: Environnement
in scheme: concept-SD-environnement-risques
in scheme: concepts
notation: ENVI20

réalimentation de plage
type: ConceptConcept
type: Concept
creator: Commission d'enrichissement de la langue française, FranceTerme
date parution JO: 2021-07-16
deconseille ou frequent: realimentation
deconseille ou frequent: rechargement
deconseille ou frequent: réalimentation
equivalent EN: beach nourishment @en
equivalent EN: beach nourishment (en)
equivalent EN: beach replenishment @en
equivalent EN: beach replenishment (en)
definition: Réapprovisionnement d’une plage en voie d’érosion en sable, en gravier ou en galets prélevés ailleurs, notamment dans des plages en formation.
in scheme: Environnement
in scheme: concepts
notation: ENVI200
related: remodelage de plage

remodelage de plage
type: ConceptConcept
type: Concept
creator: Commission d'enrichissement de la langue française, FranceTerme
date parution JO: 2021-07-16
deconseille ou frequent: reprofilage
equivalent EN: beach scraping @en
equivalent EN: beach scraping (en)
alternative label: reprofilage de plage
definition: Prélèvement, sur une plage en zone basse ou intertidale, de sable, de gravier ou de galets qui sont ensuite déposés et répartis en haut de cette plage.
in scheme: Environnement
in scheme: concepts
notation: ENVI201
related: réalimentation de plage

continent de plastique
type: ConceptConcept
type: Concept
creator: Commission d'enrichissement de la langue française, FranceTerme
date parution JO: 2021-07-16
deconseille ou frequent: soupe de plastique
deconseille ou frequent: soupe plastique
equivalent EN: garbage patch @en
equivalent EN: garbage patch (en)
equivalent EN: plastic soup @en
equivalent EN: plastic soup (en)
alternative label: vortex océanique de déchets
definition: Étendue très vaste de déchets flottants, majoritairement en matière plastique, qui, sous l’effet de courants marins, s’accumulent dans certains espaces océaniques.
in scheme: Environnement
in scheme: Sciences de la Terre
in scheme: concept-SD-environnement-oceanographie
in scheme: concept-SD-sciences-de-la-terre-oceanographie
in scheme: concepts
notation: ENVI202
note: 1. Les microplastiques sont les composants majoritaires des continents de plastique.
note: 2. On trouve aussi les termes « soupe de plastique » et « soupe plastique », qui sont déconseillés.
related: microplastique

thalassothermie
type: ConceptConcept
type: Concept
creator: Commission d'enrichissement de la langue française, FranceTerme
date parution JO: 2021-07-16
part of speech: nom féminin
definition: Utilisation de la géothermie marine pour le chauffage et le refroidissement des bâtiments.
in scheme: Énergie
in scheme: Environnement
in scheme: concepts
notation: ENVI204
related: géothermie marine

évaluation environnementale
type: ConceptConcept
type: Concept
creator: Commission d'enrichissement de la langue française, FranceTerme
abbreviation: EIE
date parution JO: 2010-02-04
equivalent EN: EIA @en
equivalent EN: EIA (en)
equivalent EN: environmental impact assessment @en
equivalent EN: environmental impact assessment (en)
alternative label: évaluation d'incidences sur l'environnement
definition: Avis émis sur l'étude d'impact sur l'environnement, afin d'en vérifier la qualité et d'apprécier comment les incidences négatives sur l'environnement sont effectivement annulées, réduites ou compensées.
in scheme: Environnement
in scheme: concepts
notation: ENVI205
related: étude d'impact sur l'environnement
related: internalisation environnementale
related: évaluation environnementale
related: mesure compensatoire

biocharbon
type: ConceptConcept
type: Concept
creator: Commission d'enrichissement de la langue française, FranceTerme
date parution JO: 2022-08-04
deconseille ou frequent: bio-charbon
equivalent EN: bio charcoal @en
equivalent EN: bio charcoal (en)
equivalent EN: biochar @en
equivalent EN: biochar (en)
equivalent EN: biocharcoal @en
equivalent EN: biocharcoal (en)
part of speech: nom masculin
definition: Charbon qui est issu de la pyrolyse de biomasse.
in scheme: Énergie
in scheme: Environnement
in scheme: concepts
notation: ENVI206
note: 1. Le biocharbon est utilisé notamment comme combustible, comme amendement agricole et comme agent de purification des eaux.
note: 2. Le charbon actif et le charbon de bois sont des exemples de biocharbon.
related: charbon actif

charbon actif
type: ConceptConcept
type: Concept
creator: Commission d'enrichissement de la langue française, FranceTerme
equivalent EN: activated carbon @en
equivalent EN: activated carbon (en)
definition: Biocharbon utilisé en traitement des eaux pour adsorber les micropolluants organiques.
in scheme: Environnement
in scheme: concepts
notation: ENVI207
related: biocharbon

clôture de bassin versant
type: ConceptConcept
type: Concept
creator: Commission d'enrichissement de la langue française, FranceTerme
date parution JO: 2022-08-04
deconseille ou frequent: cuvette endoréique
equivalent EN: river basin closure @en
equivalent EN: river basin closure (en)
part of speech: locution nominale féminine
definition: Fermeture, provoquée par des actions anthropiques, du cours d’eau d’un bassin versant qui, dès lors, ne va plus jusqu’à la mer ou jusqu’à la confluence.
in scheme: Environnement
in scheme: Sciences de la Terre
in scheme: concept-SD-environnement-hydrologie
in scheme: concept-SD-sciences-de-la-terre-hydrologie
in scheme: concepts
notation: ENVI208
note: 1. La clôture de bassin versant est souvent causée par la dérivation de l’eau en dehors de ce bassin et par l’irrigation des cultures.
note: 2. Un bassin versant fermé naturellement est appelé « cuvette endoréique ».

casier sédimentaire
type: ConceptConcept
type: Concept
creator: Commission d'enrichissement de la langue française, FranceTerme
date parution JO: 2022-08-04
deconseille ou frequent: casier hydro-sédimentaire
part of speech: locution nominale masculine
definition: Ensemble de cellules sédimentaires adjacentes qui présentent une homogénéité du fait de leur approvisionnement en sédiments, de l’orientation des courants marins côtiers ou de la morphologie des fleuves.
in scheme: Environnement
in scheme: concepts
notation: ENVI209
related: bilan sédimentaire
related: cellule sédimentaire

stabilisation des déchets
type: ConceptConcept
type: Concept
creator: Commission d'enrichissement de la langue française, FranceTerme
date parution JO: 2009-04-12
equivalent EN: waste inerting @en
equivalent EN: waste inerting (en)
definition: Traitement qui empêche la dissolution et la dissémination des composés nocifs, toxiques ou polluants présents dans les déchets et tend à réduire le plus possible leurs effets dommageables sur l'environnement.
in scheme: Environnement
in scheme: concept-SD-environnement-dechets
in scheme: concepts
notation: ENVI21

prolifération d'algues
type: ConceptConcept
type: Concept
creator: Commission d'enrichissement de la langue française, FranceTerme
date parution JO: 2022-08-04
equivalent EN: algal bloom @en
equivalent EN: algal bloom (en)
part of speech: locution nominale féminine
definition: Croissance rapide et massive d’algues due à des rejets excessifs d’azote et de phosphore dans des milieux aquatiques, éventuellement associés à des conditions de température élevée.
in scheme: Environnement
in scheme: Sciences de la Terre
in scheme: concepts
notation: ENVI210
note: La prolifération d’algues est une manifestation de l’eutrophisation.

remise en état d’un site
type: ConceptConcept
type: Concept
creator: Commission d'enrichissement de la langue française, FranceTerme
equivalent EN: recovery @en
equivalent EN: recovery (en)
definition: Ensemble des actions de réparation des dommages environnementaux occasionnés à un site.
in scheme: Environnement
in scheme: concepts
notation: ENVI211

traitement par aération
type: ConceptConcept
type: Concept
creator: Commission d'enrichissement de la langue française, FranceTerme
date parution JO: 2022-08-04
deconseille ou frequent: bio-sparging
deconseille ou frequent: bio-venting
deconseille ou frequent: in situ air stripping
deconseille ou frequent: in situ volatilization
equivalent EN: air sparging @en
equivalent EN: air sparging (en)
equivalent EN: biosparging @en
equivalent EN: biosparging (en)
equivalent EN: bioventing @en
equivalent EN: bioventing (en)
part of speech: locution nominale masculine
definition: Technique de dépollution qui consiste à injecter de l’air dans les sols ou dans les eaux afin soit d’entraîner dans l’atmosphère des composés volatils, soit de faciliter la biodégradation aérobie des polluants organiques qu’ils contiennent.
in scheme: Environnement
in scheme: concepts
notation: ENVI212

bombe cyclonique
type: ConceptConcept
type: Concept
creator: Commission d'enrichissement de la langue française, FranceTerme
date parution JO: 2022-08-04
deconseille ou frequent: bombe météo
deconseille ou frequent: bombe météorologique
equivalent EN: bomb cyclone @en
equivalent EN: bomb cyclone (en)
part of speech: locution nominale féminine
alternative label: cyclone explosif
definition: Cyclone particulièrement violent, qui résulte de l’intensification extrêmement rapide d’une dépression.
in scheme: Environnement
in scheme: Météorologie
in scheme: concepts
notation: ENVI213

réduction d'échelle
type: ConceptConcept
type: Concept
creator: Commission d'enrichissement de la langue française, FranceTerme
date parution JO: 2022-08-04
deconseille ou frequent: downscale
equivalent EN: downgrade @en
equivalent EN: downgrade (en)
equivalent EN: downscaling @en
equivalent EN: downscaling (en)
part of speech: locution nominale féminine
definition: Méthode par laquelle, à partir de données et de modèles établis pour une vaste zone, sont déduites des informations relatives à une zone plus petite.
in scheme: Aménagement et urbanisme
in scheme: Environnement
in scheme: concepts
notation: ENVI214
note: La réduction d’échelle peut être utilisée, par exemple, pour étudier l’effet local du changement climatique.
related: changement climatique

réensauvagement
type: ConceptConcept
type: Concept
creator: Commission d'enrichissement de la langue française, FranceTerme
date parution JO: 2022-08-04
equivalent EN: rewilding @en
equivalent EN: rewilding (en)
part of speech: nom masculin
definition: Ensemble des actions qui visent à rétablir un fonctionnement naturel d’écosystèmes de milieux anthropisés, pour les laisser ensuite évoluer sans intervention de l’homme.
in scheme: Environnement
in scheme: concepts
notation: ENVI215
note: Le réensauvagement consiste, par exemple, à supprimer des barrages, à remettre en état des zones humides, à laisser une forêt évoluer naturellement ou à restaurer des corridors biologiques.
related: sauvageté
related: dédomestication
related: corridor biologique

dédomestication
type: ConceptConcept
type: Concept
creator: Commission d'enrichissement de la langue française, FranceTerme
date parution JO: 2022-08-04
part of speech: nom féminin
definition: Fait de laisser une population d’une espèce domestique évoluer naturellement en limitant ses contacts avec l’homme.
in scheme: Agriculture
in scheme: Environnement
in scheme: concepts
notation: ENVI216
note: La dédomestication peut concerner des espèces telles que le chat, le porc, la chèvre ou le cheval.
related: sauvageté
related: réensauvagement

pollution lumineuse
type: ConceptConcept
type: Concept
creator: Commission d'enrichissement de la langue française, FranceTerme
date parution JO: 2022-08-04
equivalent EN: PLP @en
equivalent EN: PLP (en)
equivalent EN: light pollution @en
equivalent EN: light pollution (en)
equivalent EN: photopollution @en
equivalent EN: photopollution (en)
equivalent EN: polarized light pollution @en
equivalent EN: polarized light pollution (en)
part of speech: locution nominale féminine
definition: Ensemble de nuisances dues au halo produit pendant la nuit par des éclairages artificiels excessifs, multiples et prolongés.
in scheme: Environnement
in scheme: concepts
notation: ENVI217
note: 1. La pollution lumineuse affecte par exemple les déplacements des chiroptères, des oiseaux et des poissons, le métabolisme des plantes et le rythme circadien de l’homme.
note: 2. La pollution lumineuse nuit particulièrement aux espèces nocturnes en réduisant et en fragmentant leurs habitats naturels.
note: 3. La pollution lumineuse gêne les observations astronomiques.
related: empreinte lumineuse
related: réserve de ciel étoilé
related: trame noire
related: corridor écologique nocturne

empreinte lumineuse
type: ConceptConcept
type: Concept
creator: Commission d'enrichissement de la langue française, FranceTerme
date parution JO: 2022-08-04
part of speech: locution nominale féminine
definition: Phénomène de halo lumineux observable la nuit, dû à la diffusion dans l’atmosphère de sources d’éclairage artificiel.
in scheme: Environnement
in scheme: concepts
notation: ENVI218
note: 1. L’empreinte lumineuse est plus ou moins importante selon la quantité des aérosols présents dans l’atmosphère.
note: 2. L’empreinte lumineuse est quantifiée par des mesures d’intensité lumineuse avec différents appareils terrestres, aériens et satellitaires, tels des photomètres, qui permettent de cartographier cette luminosité.
related: pollution lumineuse
related: réserve de ciel étoilé
related: trame noire
related: corridor écologique nocturne

réserve de ciel étoilé
type: ConceptConcept
type: Concept
creator: Commission d'enrichissement de la langue française, FranceTerme
date parution JO: 2022-08-04
part of speech: locution nominale féminine
definition: Espace public ou privé de vaste étendue, jouissant d’un ciel étoilé d’une grande pureté, qui fait l’objet d’une protection à des fins scientifiques, éducatives ou esthétiques.
in scheme: Environnement
in scheme: concepts
notation: ENVI219
related: pollution lumineuse
related: empreinte lumineuse
related: trame noire
related: corridor écologique nocturne

trame noire
type: ConceptConcept
type: Concept
creator: Commission d'enrichissement de la langue française, FranceTerme
definition: Réseau de sites et de corridors biologiques où la pollution lumineuse est fortement limitée afin d’empêcher la fragmentation qu’elle provoque au sein des habitats naturels des espèces nocturnes et ainsi de protéger la biodiversité.
in scheme: Environnement
in scheme: concepts
notation: ENVI220
note: La trame noire est également utile au repos des espèces diurnes.
related: pollution lumineuse
related: empreinte lumineuse
related: réserve de ciel étoilé
related: corridor écologique nocturne

corridor écologique nocturne
type: ConceptConcept
type: Concept
creator: Commission d'enrichissement de la langue française, FranceTerme
date parution JO: 2022-08-04
part of speech: locution nominale masculine
definition: Corridor biologique où l’éclairage artificiel nocturne est limité de manière à ne pas perturber les conditions écologiques nécessaires à certaines espèces animales et végétales.
in scheme: Biologie
in scheme: Environnement
in scheme: concepts
notation: ENVI221
note: Dans un corridor écologique nocturne, un éclairage limité est maintenu s’il est indispensable à la sécurité humaine.
related: pollution lumineuse
related: empreinte lumineuse
related: réserve de ciel étoilé
related: trame noire

écocide
type: ConceptConcept
type: Concept
creator: Commission d'enrichissement de la langue française, FranceTerme
date parution JO: 2022-08-04
equivalent EN: ecocide @en
equivalent EN: ecocide (en)
part of speech: nom masculin
definition: Action ou ensemble d’actions délibérées, commises alors même que leurs auteurs savent qu’elles auront des conséquences néfastes pour l’environnement, qui entraînent la destruction d’un écosystème ou d’une espèce particulière, ou qui leur infligent des dommages étendus, graves et durables.
in scheme: Environnement
in scheme: concepts
notation: ENVI222
note: L’écocide doit être distingué d’une catastrophe écologique.

trame noire
type: ConceptConcept
type: Concept
date parution JO: 2022-08-04
part of speech: locution nominale féminine
definition: Réseau formé de sites où l’empreinte lumineuse est fortement limitée, voire nulle, et de corridors écologiques nocturnes.
in scheme: Biologie
in scheme: Environnement
in scheme: concepts
notation: ENVI223
note: 1. La trame noire permet d’éviter la fragmentation provoquée par l’empreinte lumineuse au sein des habitats naturels des espèces nocturnes et protège ainsi la biodiversité.
note: 2. La trame noire est favorable au repos des espèces diurnes.
related: pollution lumineuse
related: corridor écologique nocturne

analyse du cycle de vie d'un produit
type: ConceptConcept
type: Concept
creator: Commission d'enrichissement de la langue française, FranceTerme
abbreviation: ACV
abbreviation: LCA @en
date parution JO: 2010-02-04
deconseille ou frequent: écobilan
equivalent EN: LCA @en
equivalent EN: LCA (en)
equivalent EN: life cycle analysis @en
equivalent EN: life cycle analysis (en)
equivalent EN: life cycle assessment @en
equivalent EN: life cycle assessment (en)
forme abregee: analyse du cycle de vie
definition: Évaluation des effets directs ou indirects d'un produit sur l'environnement, depuis l'extraction des matières premières qui entrent dans sa composition jusqu'à son élimination.
in scheme: Environnement
in scheme: concepts
notation: ENVI24
note: 1. L'analyse du cycle de vie, qui recense et quantifie les flux physiques de matière et d'énergie associés à chaque étape de la vie d'un produit, peut également être appliquée à un service.
note: 2. Le terme « écobilan » subsiste dans certaines zones francophones.
related: énergie grise

audit environnemental
type: ConceptConcept
type: Concept
creator: Commission d'enrichissement de la langue française, FranceTerme
date parution JO: 2010-02-04
equivalent EN: environmental audit @en
equivalent EN: environmental audit (en)
equivalent EN: environmental auditing @en
equivalent EN: environmental auditing (en)
definition: Évaluation du fonctionnement et de l'efficacité d'un système de gestion mis en place en vue d'assurer la protection de l'environnement.
in scheme: Environnement
in scheme: concepts
notation: ENVI25
note: L'audit environnemental est conduit en référence aux règlements, aux normes ou aux bonnes pratiques professionnelles.

écocertification
type: ConceptConcept
type: Concept
creator: Commission d'enrichissement de la langue française, FranceTerme
date parution JO: 2010-02-04
equivalent EN: environmental certification @en
equivalent EN: environmental certification (en)
equivalent EN: green certification @en
equivalent EN: green certification (en)
part of speech: nom féminin
definition: Procédure qui garantit qu'un produit ou un procédé de fabrication prend en compte, selon un cahier des charges correspondant, la protection de l'environnement ; par extension, la garantie elle-même.
in scheme: Environnement
in scheme: concepts
notation: ENVI28
note: L'écocertification implique de la part des opérateurs économiques une adhésion volontaire au cahier des charges.
related: écoconformité

écoconception
type: ConceptConcept
type: Concept
creator: Commission d'enrichissement de la langue française, FranceTerme
date parution JO: 2010-02-04
equivalent EN: ecodesign @en
equivalent EN: ecodesign (en)
equivalent EN: green design @en
equivalent EN: green design (en)
equivalent EN: sustainable design @en
equivalent EN: sustainable design (en)
part of speech: nom féminin
definition: Conception d'un produit, d'un bien ou d'un service, qui prend en compte, afin de les réduire, ses effets négatifs sur l'environnement au long de son cycle de vie, en s'efforçant de préserver ses qualités ou ses performances.
definition: Design of a product, good, or service which takes into account its negative effects on the environment during its life cycle in order to reduce them while ensuring the same level of quality or performance. @en
in scheme: Environnement
in scheme: concepts
notation: ENVI29
preferred label: ecodesign @en
related: économie circulaire

changement climatique
type: ConceptConcept
type: Concept
creator: Commission d'enrichissement de la langue française, FranceTerme
date parution JO: 2009-04-12
equivalent EN: climate change @en
equivalent EN: climate change (en)
definition: Climate variation due to natural or human factors. @en
definition: Variation du climat due à des facteurs naturels ou humains.
in scheme: Environnement
in scheme: concepts
notation: ENVI3
preferred label: climate change @en
related: fiction climatique
related: compression côtière
related: réduction d'échelle
related: changement climatique anthropique
related: résistant, -e au changement climatique

écodéveloppement
type: ConceptConcept
type: Concept
creator: Commission d'enrichissement de la langue française, FranceTerme
date parution JO: 2010-02-04
equivalent EN: ecodevelopment @en
equivalent EN: ecodevelopment (en)
part of speech: nom masculin
definition: Mode de développement fondé sur le respect de l'environnement.
in scheme: Environnement
in scheme: concepts
notation: ENVI31
note: L'écodéveloppement est une des composantes du développement durable.
related: développement durable
related: croissance verte

écotoxicologie
type: ConceptConcept
type: Concept
creator: Commission d'enrichissement de la langue française, FranceTerme
date parution JO: 2010-02-04
equivalent EN: ecotoxicology @en
equivalent EN: ecotoxicology (en)
part of speech: nom féminin
definition: Branche de la toxicologie qui étudie les effets directs et indirects des polluants sur l'environnement.
in scheme: Environnement
in scheme: concepts
notation: ENVI32
note: L'écotoxicologie étudie notamment le transfert des polluants dans les biotopes et les biocénoses, ainsi que leurs transformations et leurs effets sur les organismes vivants et sur les processus écologiques fondamentaux.
related: biocénose
related: biotope

écotype
type: ConceptConcept
type: Concept
creator: Commission d'enrichissement de la langue française, FranceTerme
date parution JO: 2010-02-04
equivalent EN: ecotype @en
equivalent EN: ecotype (en)
part of speech: nom masculin
definition: Ensemble des caractères distinctifs d'une population géographiquement localisée d'une même espèce animale ou végétale, qui résultent de la sélection naturelle liée aux facteurs du milieu.
in scheme: Biologie
in scheme: Environnement
in scheme: concepts
notation: ENVI33

effet de serre
type: ConceptConcept
type: Concept
creator: Commission d'enrichissement de la langue française, FranceTerme
date parution JO: 2010-02-04
deconseille ou frequent: gaz à effet de serre
equivalent EN: greenhouse effect @en
equivalent EN: greenhouse effect (en)
definition: Heating of the Earth's surface and of the lower layers of the atmosphere phenomenon which is due to the fact that some atmosphere gases absorb and reflect a part of the Earth's infrared radiation, which compensates for the solar radiation it absorbs. @en
definition: Phénomène d'échauffement de la surface de la Terre et des couches basses de l'atmosphère, dû au fait que certains gaz de l'atmosphère absorbent et renvoient une partie du rayonnement infrarouge émis par la Terre, ce dernier compensant le rayonnement solaire qu'elle absorbe elle-même.
in scheme: Environnement
in scheme: concepts
notation: ENVI34
note: 1. Gases responsible for this phenomenon, such as steam water, carbon dioxide, or methane, are called "greenhouse gases". 2. Greenhouse effect also exists on planets like Venus and Mars. 3. Usually, the expression "greenhouse effect" refers to the "anthropogenic greenhouse effect", which refers to the global warming caused by an increase of greenhouse gases concentrations, due to an increase of their emission in human activities. @en
note: 1. Les gaz qui provoquent ce phénomène, tels que la vapeur d'eau, le dioxyde de carbone ou le méthane, sont appelés « gaz à effet de serre ».
note: 2. Un effet de serre existe également sur des planètes telles que Vénus et Mars.
note: 3. L'expression « effet de serre » est employée usuellement dans le sens d'« effet de serre anthropique », qui désigne le réchauffement global du climat attribué à l'augmentation de la concentration des gaz à effet de serre, résultant de l'accroissement de leurs émissions dues aux activités humaines.
preferred label: greenhouse effect @en
related: compensation des émissions de gaz à effet de serre
related: changement climatique anthropique
related: quota d'émission de gaz à effet de serre
related: concept-empreinte carbone

cindynique
type: ConceptConcept
type: Concept
creator: Commission d'enrichissement de la langue française, FranceTerme
date parution JO: 2010-02-04
equivalent EN: cindynics @en
equivalent EN: cindynics (en)
part of speech: nom féminin
definition: Étude des risques et des situations dangereuses qui prend en compte les aspects techniques, humains et organisationnels liés à une activité donnée.
in scheme: Environnement
in scheme: concept-SD-environnement-risques
in scheme: concepts
notation: ENVI39

changement climatique anthropique
type: ConceptConcept
type: Concept
creator: Commission d'enrichissement de la langue française, FranceTerme
date parution JO: 2009-04-12
deconseille ou frequent: manmade climate change
equivalent EN: anthropogenic climate change @en
equivalent EN: anthropogenic climate change (en)
equivalent EN: man-made climate change @en
equivalent EN: man-made climate change (en)
definition: Évolution du climat venant s'ajouter à ses variations naturelles, qui est attribuée aux émissions de gaz à effet de serre engendrées par les activités humaines, et altérant la composition de l'atmosphère de la planète.
in scheme: Environnement
in scheme: concepts
notation: ENVI4
note: 1. On désigne souvent le « changement climatique anthropique » par la forme abrégée « changement climatique ».
note: 2. Les phénomènes actuellement observés et faisant l'objet de prévisions sont en particulier l'élévation du niveau des mers, la modification des régimes de précipitations qui entraîne sécheresses et inondations accrues, ou la multiplication à l'échelle régionale de manifestations climatiques extrêmes (tempêtes, ouragans et canicules).
related: changement climatique
related: effet de serre
related: résistant, -e au changement climatique
related: concept-SPAT1597

bioaccumulation
type: ConceptConcept
type: Concept
creator: Commission d'enrichissement de la langue française, FranceTerme
date parution JO: 2010-02-04
equivalent EN: bioaccumulation @en
equivalent EN: bioaccumulation (en)
forme abregee: accumulation, n.f.
part of speech: nom féminin
alternative label: accumulation biologique
definition: Processus selon lequel une substance polluante présente dans un biotope pénètre et s'accumule dans tout ou partie d'un être vivant et peut devenir nocive ; par extension, le résultat de ce processus.
in scheme: Biologie
in scheme: Environnement
in scheme: concepts
notation: ENVI40
related: bioamplification
related: biotope

bioamplification
type: ConceptConcept
type: Concept
creator: Commission d'enrichissement de la langue française, FranceTerme
abbreviation: biomagnification @en
date parution JO: 2010-02-04
equivalent EN: biological magnification @en
equivalent EN: biological magnification (en)
equivalent EN: biomagnification @en
equivalent EN: biomagnification (en)
forme abregee: amplification, n.f.
part of speech: nom féminin
alternative label: amplification biologique
definition: Processus selon lequel la concentration d'une substance présente dans un biotope augmente tout au long d'une chaîne alimentaire ; par extension, le résultat de ce processus.
in scheme: Biologie
in scheme: Environnement
in scheme: concepts
notation: ENVI41
related: bioaccumulation
related: biotope

écosystème
type: ConceptConcept
type: Concept
creator: Commission d'enrichissement de la langue française, FranceTerme
date parution JO: 2010-02-04
equivalent EN: ecosystem @en
equivalent EN: ecosystem (en)
operande: biocénose
operande: biotope
part of speech: nom masculin
definition: Functional ecological unit constituted of biotope and biocenosis, in constant interaction. @en
definition: Unité écologique fonctionnelle formée par le biotope et la biocénose, en constante interaction.
in scheme: Biologie
in scheme: Environnement
in scheme: concepts
notation: ENVI42
preferred label: ecosystem @en
related: espèce clé de voûte
related: ingénierie écologique
related: théorie de l'effondrement
related: biocénose
related: biotope
related: corridor biologique

biocénose
type: ConceptConcept
type: Concept
creator: Commission d'enrichissement de la langue française, FranceTerme
date parution JO: 2010-02-04
equivalent EN: biocoenosis @en
equivalent EN: biocoenosis (en)
part of speech: nom féminin
resultat: écosystème
definition: Ensemble des êtres qui vivent dans les mêmes conditions de milieu, dans un espace donné.
in scheme: Biologie
in scheme: Environnement
in scheme: concepts
notation: ENVI43
related: écotoxicologie
related: écosystème
related: biotope

biotope
type: ConceptConcept
type: Concept
creator: Commission d'enrichissement de la langue française, FranceTerme
date parution JO: 2010-02-04
equivalent EN: biotope @en
equivalent EN: biotope (en)
part of speech: nom masculin
resultat: écosystème
definition: Aire géographique caractérisée par des conditions climatiques et physicochimiques homogènes permettant l'existence d'une faune et d'une flore spécifiques.
in scheme: Biologie
in scheme: Environnement
in scheme: concepts
notation: ENVI44
related: compétition
related: écotoxicologie
related: bioaccumulation
related: bioamplification
related: écosystème
related: biocénose

taxon
type: ConceptConcept
type: Concept
creator: Commission d'enrichissement de la langue française, FranceTerme
date parution JO: 2010-02-04
equivalent EN: taxon @en
equivalent EN: taxon (en)
part of speech: nom masculin
definition: Ensemble d'êtres vivants partageant certaines caractéristiques, à partir desquelles est établie leur classification.
in scheme: Biologie
in scheme: concepts
notation: ENVI45
note: Les catégories de la classification biologique, telles que l'espèce, le genre, la famille, l'ordre, la classe ou l'embranchement, sont des taxons.
related: synapomorphe

cogénération
type: ConceptConcept
type: Concept
creator: Commission d'enrichissement de la langue française, FranceTerme
abbreviation: CHPG @en
abbreviation: combined heat and power generation @en
date parution JO: 2010-02-04
equivalent EN: CHP generation @en
equivalent EN: CHP generation (en)
equivalent EN: CHPG @en
equivalent EN: CHPG (en)
equivalent EN: combined heat and power generation @en
equivalent EN: combined heat and power generation (en)
part of speech: nom féminin
definition: Production simultanée d'électricité et de chaleur utile.
in scheme: Énergie
in scheme: concepts
notation: ENVI46

diatomiste
type: ConceptConcept
type: Concept
creator: Commission d'enrichissement de la langue française, FranceTerme
date parution JO: 2010-02-04
equivalent EN: diatomist @en
equivalent EN: diatomist (en)
part of speech: nom
definition: Hydrobiologiste spécialiste des diatomées.
in scheme: Biologie
in scheme: Environnement
in scheme: concepts
notation: ENVI47
note: Les diatomées sont des algues brunes unicellulaires, utilisées notamment comme indicateurs de la qualité de l'eau.

éco-industrie
type: ConceptConcept
type: Concept
creator: Commission d'enrichissement de la langue française, FranceTerme
date parution JO: 2010-02-04
deconseille ou frequent: écoindustrie
equivalent EN: ecoindustry @en
equivalent EN: ecoindustry (en)
part of speech: nom féminin
definition: Industrie qui propose des produits ou des prestations ayant pour objet d'améliorer ou de protéger l'environnement, ou qui utilise des procédés favorables à l'environnement.
in scheme: Environnement
in scheme: concepts
notation: ENVI48

écotechnologie
type: ConceptConcept
type: Concept
creator: Commission d'enrichissement de la langue française, FranceTerme
abbreviation: clean technology @en
date parution JO: 2010-02-04
deconseille ou frequent: Greentech
deconseille ou frequent: green tech
equivalent EN: clean tech @en
equivalent EN: clean tech (en)
equivalent EN: clean technology @en
equivalent EN: clean technology (en)
equivalent EN: ecotechnology @en
equivalent EN: ecotechnology (en)
equivalent EN: green technology @en
equivalent EN: green technology (en)
part of speech: nom féminin
alternative label: technologie environnementale
definition: Ensemble des procédés industriels qui visent à prévenir ou réduire les effets négatifs sur l'environnement des produits à chaque stade de leur cycle de vie, ainsi que des activités humaines.
in scheme: Environnement
in scheme: concepts
notation: ENVI49
note: Ces procédés permettent une utilisation plus économe des ressources ou ont des effets moins polluants.
related: écotechniques de l'information et de la communication

développement durable
type: ConceptConcept
type: Concept
creator: Commission d'enrichissement de la langue française, FranceTerme
date parution JO: 2009-04-12
equivalent EN: sustainable development @en
equivalent EN: sustainable development (en)
broader: concept-developpement
definition: Development policy which consists in combining environment protection with economical efficiency and social justice to meet the needs of current generations without compromising the ability of future generations to meet theirs. @en
definition: Politique de développement qui s'efforce de concilier la protection de l'environnement, l'efficience économique et la justice sociale, en vue de répondre aux besoins des générations présentes sans compromettre la capacité des générations futures de satisfaire les leurs.
in scheme: Tous domaines
in scheme: concepts
notation: ENVI5
note: 1. Le développement durable est une finalité dont la réalisation peut faire l'objet de différentes stratégies.
note: 1. Sustainable development is a goal the realisation of which may need various strategies. 2. Sustainable development may concern the activities of a territorial entity as well as those of a business or of a social group. @en
note: 2. Le développement durable peut concerner les activités d'une entité territoriale aussi bien que celles d'une entreprise ou d'un groupe social.
preferred label: sustainable development @en
related: agriculture durable
related: permaculture
related: écoquartier
related: écocité
related: économie circulaire
related: biodiversité
related: électricité d'origine renouvelable
related: écodéveloppement
related: croissance verte
related: mobilité durable
related: concept-objectifs-de-developpement-durable
related: concept-ville-connectee
related: concept-ville-durable

évaluation environnementale
type: ConceptConcept
type: Concept
creator: Commission d'enrichissement de la langue française, FranceTerme
abbreviation: EIA @en
abbreviation: EIE
date parution JO: 2010-02-04
equivalent EN: EIA @en
equivalent EN: EIA (en)
equivalent EN: environmental impact assessment @en
equivalent EN: environmental impact assessment (en)
alternative label: évaluation d'incidences sur l'environnement
definition: Mise en œuvre des méthodes et des procédures permettant d'estimer les conséquences sur l'environnement d'une politique, d'un programme ou d'un plan, d'un projet ou d'une réalisation ; par extension, le rapport qui en rend compte.
in scheme: Environnement
in scheme: concepts
notation: ENVI50
related: étude d'impact sur l'environnement
related: internalisation environnementale
related: évaluation environnementale
related: mesure compensatoire

mesure compensatoire
type: ConceptConcept
type: Concept
creator: Commission d'enrichissement de la langue française, FranceTerme
date parution JO: 2010-02-04
equivalent EN: compensatory measure @en
equivalent EN: compensatory measure (en)
definition: Mesure en faveur de l'environnement permettant de contrebalancer les dommages qui lui sont causés par un projet et qui n'ont pu être évités ou limités par d'autres moyens.
in scheme: Environnement
in scheme: concept-SD-environnement-amenagement-du-territoire
in scheme: concepts
notation: ENVI51
related: opérateur de compensation écologique
related: ratio de compensation écologique
related: évaluation environnementale
related: compensation écologique

compensation écologique
type: ConceptConcept
type: Concept
creator: Commission d'enrichissement de la langue française, FranceTerme
abbreviation: offset @en
date parution JO: 2010-02-04
equivalent EN: environmental offset @en
equivalent EN: environmental offset (en)
equivalent EN: offset @en
equivalent EN: offset (en)
definition: Ensemble d'actions en faveur de l'environnement permettant de contrebalancer les dommages causés par la réalisation d'un projet qui n'ont pu être évités ou limités.
in scheme: Environnement
in scheme: concept-SD-environnement-amenagement-du-territoire
in scheme: concepts
notation: ENVI52
note: La compensation écologique peut consister en la protection d'espaces naturels, la restauration, la valorisation ou la gestion dans la durée d'habitats naturels.
related: opérateur de compensation écologique
related: site naturel de compensation écologique
related: ratio de compensation écologique
related: mesure compensatoire

nettoyage par le ressac
type: ConceptConcept
type: Concept
creator: Commission d'enrichissement de la langue française, FranceTerme
date parution JO: 2010-02-04
equivalent EN: surfwashing @en
equivalent EN: surfwashing (en)
definition: Nettoyage des plages consistant à déplacer, dans la zone de déferlement, des sédiments littoraux souillés par des hydrocarbures, en vue de les soumettre au mouvement des vagues pour leur lavage naturel.
in scheme: Environnement
in scheme: concepts
notation: ENVI53
note: Le polluant, qui s'agglutine en surface à l'arrière des sédiments, est ensuite récupéré avec des filets capteurs.

puits de carbone
type: ConceptConcept
type: Concept
creator: Commission d'enrichissement de la langue française, FranceTerme
date parution JO: 2010-02-04
equivalent EN: carbon sink @en
equivalent EN: carbon sink (en)
definition: Système naturel ou artificiel permettant de capter et de stocker une quantité significative de dioxyde de carbone (CO2), de manière à en limiter la concentration dans l'atmosphère.
in scheme: Énergie
in scheme: Environnement
in scheme: concepts
notation: ENVI54
related: captage et stockage du CO
related: absorption anthropique de carbone
related: compensation des émissions de gaz à effet de serre
related: concept-empreinte carbone

quota d'émission de gaz à effet de serre
type: ConceptConcept
type: Concept
creator: Commission d'enrichissement de la langue française, FranceTerme
date parution JO: 2010-02-04
equivalent EN: greenhouse gas emission allowance @en
equivalent EN: greenhouse gas emission allowance (en)
definition: Quantité de gaz à effet de serre allouée à une activité dans le cadre d'un système de plafonnement d'émission.
in scheme: Environnement
in scheme: concepts
notation: ENVI55
related: externalité
related: marché des émissions de gaz à effet de serre
related: effet de serre
related: dispositif de quotas d'émission cessibles
related: unité de réduction certifiée des émissions

refroidissement par une source naturelle
type: ConceptConcept
type: Concept
creator: Commission d'enrichissement de la langue française, FranceTerme
date parution JO: 2010-02-04
deconseille ou frequent: freecooling
equivalent EN: free cooling @en
equivalent EN: free cooling (en)
forme abregee: refroidissement naturel
definition: Méthode consistant à utiliser une circulation d'eau ou d'air pour refroidir un produit ou un bâtiment, sans recourir à une machine thermodynamique.
in scheme: Énergie
in scheme: Habitat et construction
in scheme: concepts
notation: ENVI56

corridor biologique
type: ConceptConcept
type: Concept
creator: Commission d'enrichissement de la langue française, FranceTerme
date parution JO: 2011-02-01
equivalent EN: biocorridor @en
equivalent EN: biocorridor (en)
alternative label: biocorridor
definition: Espace reliant des écosystèmes ou des habitats naturels, qui permet le déplacement des espèces ainsi que le brassage génétique de leurs populations.
in scheme: Biologie
in scheme: Environnement
in scheme: concepts
notation: ENVI57
related: réensauvagement
related: écosystème

écotaxe
type: ConceptConcept
type: Concept
creator: Commission d'enrichissement de la langue française, FranceTerme
date parution JO: 2011-02-01
equivalent EN: ecological tax @en
equivalent EN: ecological tax (en)
equivalent EN: ecotax @en
equivalent EN: ecotax (en)
equivalent EN: environmental tax @en
equivalent EN: environmental tax (en)
equivalent EN: green tax @en
equivalent EN: green tax (en)
equivalent EN: greentax @en
equivalent EN: greentax (en)
part of speech: nom féminin
definition: Prélèvement fiscal opéré sur un bien, un service ou une activité en raison des dommages qu'ils sont susceptibles d'occasionner à l'environnement.
in scheme: Économie générale
in scheme: Environnement
in scheme: concept-SD-economie-generale-fiscalite
in scheme: concept-SD-environnement-fiscalite
in scheme: concepts
notation: ENVI58
related: externalité
related: tarification incitative

principe de participation
type: ConceptConcept
type: Concept
creator: Commission d'enrichissement de la langue française, FranceTerme
date parution JO: 2009-04-12
equivalent EN: participation principle @en
equivalent EN: participation principle (en)
definition: Principe selon lequel le corps social est pleinement associé à l'élaboration de projets et de décisions publics ayant une incidence sur l'environnement, et dispose d'une possibilité de recours une fois la décision prise.
in scheme: Environnement
in scheme: concepts
notation: ENVI6
related: habilitation

gestion intégrée
type: ConceptConcept
type: Concept
creator: Commission d'enrichissement de la langue française, FranceTerme
date parution JO: 2011-02-01
equivalent EN: comprehensive approach @en
equivalent EN: comprehensive approach (en)
equivalent EN: integrated management @en
equivalent EN: integrated management (en)
definition: Mode de gestion de certaines activités qui intègre, dès la phase de conception, l'ensemble des facteurs écologiques, économiques et sociaux qui leur sont liés.
in scheme: Économie générale
in scheme: Environnement
in scheme: concepts
notation: ENVI60
note: En évaluant l'ensemble de ses conséquences sur un milieu donné, il apparaît que la gestion intégrée contribue à économiser temps, espace et moyens de production et à diminuer les pertes en matière d'énergies et de ressources naturelles.

lombrifiltration
type: ConceptConcept
type: Concept
creator: Commission d'enrichissement de la langue française, FranceTerme
date parution JO: 2011-02-01
equivalent EN: lombrifiltration @en
equivalent EN: lombrifiltration (en)
part of speech: nom féminin
definition: Procédé d'épuration des eaux usées utilisant des vers de terre pour la digestion de matières organiques.
in scheme: Environnement
in scheme: concept-SD-environnement-dechets
in scheme: concepts
notation: ENVI61
note: La lombrifiltration ne convient que pour de faibles volumes d'eaux usées.

phytoréhabilitation
type: ConceptConcept
type: Concept
creator: Commission d'enrichissement de la langue française, FranceTerme
date parution JO: 2011-02-01
equivalent EN: phytoremediation @en
equivalent EN: phytoremediation (en)
part of speech: nom féminin
alternative label: décontamination végétale
definition: Dépollution du sol ou de l'eau d'un site au moyen de végétaux qui dégradent certains polluants ou les concentrent avant d'être retirés du site pour être traités.
in scheme: Environnement
in scheme: concepts
notation: ENVI62
related: bioréhabilitation

valorisation énergétique des déchets
type: ConceptConcept
type: Concept
creator: Commission d'enrichissement de la langue française, FranceTerme
abbreviation: EfW @en
abbreviation: WtE @en
date parution JO: 2011-02-01
equivalent EN: EfW @en
equivalent EN: EfW (en)
equivalent EN: WtE @en
equivalent EN: WtE (en)
equivalent EN: energy recovery from waste @en
equivalent EN: energy recovery from waste (en)
equivalent EN: energy-from-waste @en
equivalent EN: energy-from-waste (en)
equivalent EN: incineration with energy recovery @en
equivalent EN: incineration with energy recovery (en)
equivalent EN: waste-to-energy @en
equivalent EN: waste-to-energy (en)
forme abregee: valorisation énergétique
definition: Utilisation de la chaleur produite par l'incinération des déchets, essentiellement pour la production d'électricité et le chauffage.
in scheme: Environnement
in scheme: concept-SD-environnement-dechets
in scheme: concepts
notation: ENVI64
related: récupération des déchets
related: recyclage des déchets

verdissement d'image
type: ConceptConcept
type: Concept
creator: Commission d'enrichissement de la langue française, FranceTerme
date parution JO: 2013-09-08
deconseille ou frequent: badigeonnage vert
deconseille ou frequent: blanchiment écologique
deconseille ou frequent: green washing
deconseille ou frequent: écobadigeonnage
deconseille ou frequent: écoblanchiment
equivalent EN: greenwashing @en
equivalent EN: greenwashing (en)
definition: Attribution abusive de qualités écologiques à un produit, à un service ou à une organisation.
in scheme: Communication
in scheme: Environnement
in scheme: concepts
notation: ENVI65
note: On trouve aussi les termes « écoblanchiment » et « blanchiment écologique ».

dispositif de quotas d'émission cessibles
type: ConceptConcept
type: Concept
creator: Commission d'enrichissement de la langue française, FranceTerme
date parution JO: 2012-07-13
equivalent EN: cap-and-trade programme (GB) @en
equivalent EN: cap-and-trade programme (en-GB)
equivalent EN: cap-and-trade scheme (US) @en
equivalent EN: cap-and-trade scheme (en-US)
equivalent EN: cap-and-trade system @en
equivalent EN: cap-and-trade system (en)
broader: concept-finance-verte
definition: Système imposant aux entreprises des quotas limitant leurs émissions dans l'atmosphère de gaz à effet de serre, tout en leur permettant de vendre leurs droits surnuméraires à d'autres entreprises.
in scheme: Environnement
in scheme: concepts
notation: ENVI66
related: marché des émissions de gaz à effet de serre
related: quota d'émission de gaz à effet de serre
related: unité de réduction certifiée des émissions

approche prudente
type: ConceptConcept
type: Concept
creator: Commission d'enrichissement de la langue française, FranceTerme
date parution JO: 2013-09-08
equivalent EN: conservativeness @en
equivalent EN: conservativeness (en)
definition: Méthode d'étude de l'évolution d'un milieu naturel qui tient compte de l'état des sciences et des techniques et procède par extrapolation des lois connues en retenant par principe les hypothèses les plus pessimistes, de façon à préserver l'environnement.
in scheme: Environnement
in scheme: concepts
notation: ENVI67
related: principe de précaution

écobénéfice
type: ConceptConcept
type: Concept
creator: Commission d'enrichissement de la langue française, FranceTerme
date parution JO: 2012-07-13
equivalent EN: environmental ancillary benefit @en
equivalent EN: environmental ancillary benefit (en)
part of speech: nom masculin
definition: Conséquence avantageuse pour l'environnement d'une mesure, d'un dispositif ou d'un service à caractère économique ou social.
definition: Favourable consequence for the environment of a measure, a device or a service of an economic or social nature. @en
in scheme: Économie générale
in scheme: Environnement
in scheme: concepts
notation: ENVI69

principe de précaution
type: ConceptConcept
type: Concept
creator: Commission d'enrichissement de la langue française, FranceTerme
date parution JO: 2009-04-12
equivalent EN: Vorsorgeprinzip @de
equivalent EN: Vorsorgeprinzip (de)
equivalent EN: precautionary principle @en
equivalent EN: precautionary principle (en)
definition: Principe selon lequel l'éventualité d'un dommage susceptible d'affecter l'environnement de manière grave et irréversible appelle, malgré l'absence de certitudes scientifiques sur les risques encourus, la mise en œuvre de procédures d'évaluation des risques et l'adoption de mesures provisoires et proportionnées au dommage envisagé.
in scheme: Environnement
in scheme: concepts
notation: ENVI7
note: Le « principe de précaution » doit être distingué du « principe de prévention », qui s'applique exclusivement aux risques avérés.
related: catastrophisme
related: approche prudente
related: principe de prévention

empreinte en eau
type: ConceptConcept
type: Concept
creator: Commission d'enrichissement de la langue française, FranceTerme
date parution JO: 2012-07-13
equivalent EN: water footprint @en
equivalent EN: water footprint (en)
definition: Estimation du volume d'eau utilisé durant le cycle de vie d'un produit, depuis l'extraction des matières qui le composent jusqu'à son élimination.
in scheme: Environnement
in scheme: concepts
notation: ENVI71
note: On peut aussi parler de l'empreinte en eau d'une personne, d'un service, d'une institution, d'une région ou d'un pays, qui est évaluée en déterminant la somme des empreintes en eau des produits qu'ils consomment pendant une période donnée.
related: concept-ressources-hydrauliques

gestion de crise
type: ConceptConcept
type: Concept
creator: Commission d'enrichissement de la langue française, FranceTerme
date parution JO: 2012-07-13
equivalent EN: crisis management @en
equivalent EN: crisis management (en)
definition: Ensemble des processus d'organisation, des techniques et des moyens mis en œuvre par une collectivité pour se préparer à une crise, y faire face et en atténuer les conséquences.
in scheme: Tous domaines
in scheme: concepts
notation: ENVI73
note: La gestion de crise comprend l'alerte, l'intervention coordonnée des secours et l'analyse rétrospective du déroulement et des effets des deux premières phases.

déchets interdits
type: ConceptConcept
type: Concept
creator: Commission d'enrichissement de la langue française, FranceTerme
date parution JO: 2012-07-13
equivalent EN: no litter @en
equivalent EN: no litter (en)
equivalent EN: no littering @en
equivalent EN: no littering (en)
in scheme: Environnement
in scheme: concepts
notation: ENVI74

mitigation
type: ConceptConcept
type: Concept
creator: Commission d'enrichissement de la langue française, FranceTerme
date parution JO: 2012-07-13
equivalent EN: mitigation @en
equivalent EN: mitigation (en)
part of speech: nom féminin
definition: Atténuation d'une atteinte à l'environnement obtenue par la mise en œuvre de dispositions et de mesures appropriées.
in scheme: Environnement
in scheme: concept-SD-environnement-risques
in scheme: concepts
notation: ENVI76

zone critique de biodiversité
type: ConceptConcept
type: Concept
creator: Commission d'enrichissement de la langue française, FranceTerme
date parution JO: 2012-07-13
deconseille ou frequent: area of high ecological value
deconseille ou frequent: point chaud de biodiversité
equivalent EN: biodiversity hot spot @en
equivalent EN: biodiversity hot spot (en)
equivalent EN: biodiversity hotspot @en
equivalent EN: biodiversity hotspot (en)
definition: Territoire dont la biodiversité, particulièrement riche, est menacée.
in scheme: Environnement
in scheme: concepts
notation: ENVI77
note: 1. La qualification de « zone critique de biodiversité » se fonde sur le nombre important d'espèces endémiques recensées et sur le taux de disparition de celles-ci.
note: 2. On trouve aussi le terme « point chaud de biodiversité ».
related: biodiversité

résistant, -e au changement climatique
type: ConceptConcept
type: Concept
creator: Commission d'enrichissement de la langue française, FranceTerme
date parution JO: 2013-09-08
equivalent EN: climate-proof @en
equivalent EN: climate-proof (en)
part of speech: locution adjectivale
alternative label: à l'épreuve du changement climatique
definition: Se dit d'une population ou d'un écosystème qui, soit naturellement, soit du fait de mesures matérielles ou d'interventions biologiques, sont peu vulnérables au changement climatique, en particulier d'origine anthropique.
in scheme: Environnement
in scheme: concepts
notation: ENVI78
note: Ces mesures ou ces interventions consistent, par exemple, à mieux gérer les ressources en eau, à protéger les terres agricoles ou à rechercher des variétés et des races domestiques résistantes.
related: agriculture climato-compatible
related: changement climatique
related: changement climatique anthropique
related: vulnérabilité au climat

principe de prévention
type: ConceptConcept
type: Concept
creator: Commission d'enrichissement de la langue française, FranceTerme
date parution JO: 2009-04-12
equivalent EN: prevention principle @en
equivalent EN: prevention principle (en)
definition: Principe selon lequel il est nécessaire d'éviter ou de réduire les dommages liés aux risques avérés d'atteinte à l'environnement, en agissant en priorité à la source et en recourant aux meilleures techniques disponibles.
in scheme: Environnement
in scheme: concepts
notation: ENVI8
related: catastrophisme
related: principe de précaution

sécurité industrielle
type: ConceptConcept
type: Concept
creator: Commission d'enrichissement de la langue française, FranceTerme
date parution JO: 2013-09-08
equivalent EN: industrial safety @en
equivalent EN: industrial safety (en)
definition: Ensemble des dispositions techniques, des moyens humains et des mesures d'organisation internes aux installations et aux activités industrielles, destinés à prévenir les accidents ou à atténuer leurs conséquences ; par extension, état résultant de ces dispositions.
in scheme: Économie générale
in scheme: Environnement
in scheme: Industrie
in scheme: concept-SD-environnement-risques
in scheme: concept-SD-industrie-risques
in scheme: concepts
narrower: concept-NUCL436
notation: ENVI81
related: sûreté industrielle
related: concept-NUCL436
related: concept-PETR424
related: concept-PETR425
related: concept-industrie

sûreté industrielle
type: ConceptConcept
type: Concept
creator: Commission d'enrichissement de la langue française, FranceTerme
date parution JO: 2013-09-08
equivalent EN: industrial security @en
equivalent EN: industrial security (en)
definition: Ensemble des dispositions techniques, des moyens humains et des mesures d'organisation internes et externes aux installations industrielles, destinés à prévenir les actes de malveillance venant de l'intérieur ou de l'extérieur, et à atténuer les conséquences des accidents ; par extension, état résultant de ces dispositions.
in scheme: Économie générale
in scheme: Environnement
in scheme: Industrie
in scheme: concept-SD-environnement-risques
in scheme: concept-SD-industrie-risques
in scheme: concepts
notation: ENVI82
related: sécurité industrielle
related: concept-NUCL437
related: concept-industrie

vulnérabilité au climat
type: ConceptConcept
type: Concept
creator: Commission d'enrichissement de la langue française, FranceTerme
date parution JO: 2012-07-13
equivalent EN: climate sensitivity @en
equivalent EN: climate sensitivity (en)
equivalent EN: sensitivity to climate @en
equivalent EN: sensitivity to climate (en)
definition: Propension d'une population ou d'un écosystème à subir des dommages en cas de variations climatiques, qui dépend de leur capacité d'adaptation.
in scheme: Environnement
in scheme: concepts
notation: ENVI83
related: résistant, -e au changement climatique

tarification incitative
type: ConceptConcept
type: Concept
creator: Commission d'enrichissement de la langue française, FranceTerme
date parution JO: 2012-07-13
deconseille ou frequent: feebate scheme
equivalent EN: feebates @en
equivalent EN: feebates (en)
definition: Dispositif de décote ou de surcote appliqué aux tarifs de vente et à la taxation de biens ou de services en fonction de leur impact sur l'environnement.
in scheme: Environnement
in scheme: concepts
notation: ENVI84
note: La tarification incitative a pour objectif d'encourager ou de décourager l'achat de ces biens et services.
related: écotaxe

unité de réduction certifiée des émissions
type: ConceptConcept
type: Concept
creator: Commission d'enrichissement de la langue française, FranceTerme
abbreviation: CER @en
abbreviation: CERU @en
abbreviation: URCE
date parution JO: 2012-07-13
deconseille ou frequent: crédit carbone
equivalent EN: CER @en
equivalent EN: CER (en)
equivalent EN: CERU @en
equivalent EN: CERU (en)
equivalent EN: certified emission reduction @en
equivalent EN: certified emission reduction (en)
equivalent EN: certified emission reduction unit @en
equivalent EN: certified emission reduction unit (en)
definition: Crédit, transmissible et négociable, qui est inscrit au compte des émissions d'une entreprise, d'une institution, d'un pays, après constatation d'une diminution de ses émissions de gaz à effet de serre.
in scheme: Environnement
in scheme: concepts
notation: ENVI85
note: 1. L'unité de réduction certifiée des émissions correspond à une tonne d'émissions en équivalent CO2.
note: 2. On trouve aussi le terme « crédit carbone ».
related: marché des émissions de gaz à effet de serre
related: quota d'émission de gaz à effet de serre
related: dispositif de quotas d'émission cessibles

technologie du charbon propre
type: ConceptConcept
type: Concept
creator: Commission d'enrichissement de la langue française, FranceTerme
abbreviation: CCT @en
date parution JO: 2012-07-13
equivalent EN: CCT @en
equivalent EN: CCT (en)
equivalent EN: clean coal technology @en
equivalent EN: clean coal technology (en)
definition: Ensemble des techniques permettant de réduire l'émission dans l'atmosphère de dioxyde de carbone et d'autres substances nocives liée à l'utilisation du charbon.
in scheme: Environnement
in scheme: concepts
notation: ENVI86
note: L'anaérocombustion, l'oxycombustion ainsi que le captage et le stockage géologique du CO2 sont des exemples de technologies du charbon propre.
related: anaérocombustion
related: captage et stockage du CO
related: oxycombustion

zone à émissions limitées
type: ConceptConcept
type: Concept
creator: Commission d'enrichissement de la langue française, FranceTerme
abbreviation: LEZ @en
abbreviation: ZEL
date parution JO: 2012-07-13
deconseille ou frequent: ZAPA
deconseille ou frequent: ZCR
deconseille ou frequent: zone d'actions prioritaires pour l'air
deconseille ou frequent: zone à circulation restreinte
equivalent EN: LEZ @en
equivalent EN: LEZ (en)
equivalent EN: low emission zone @en
equivalent EN: low emission zone (en)
definition: Zone dans laquelle ne peuvent circuler que des véhicules dont les émissions polluantes respectent les limites autorisées.
in scheme: Environnement
in scheme: Transports et mobilité
in scheme: concepts
notation: ENVI87
note: La zone d'actions prioritaires pour l'air (ZAPA), dont l'accès est interdit aux véhicules fortement polluants, est un exemple de zone à émissions limitées.

principe du pollueur-payeur
type: ConceptConcept
type: Concept
creator: Commission d'enrichissement de la langue française, FranceTerme
abbreviation: PPP
date parution JO: 2009-04-12
equivalent EN: PPP @en
equivalent EN: PPP (en)
equivalent EN: pay as you pollute principle @en
equivalent EN: pay as you pollute principle (en)
equivalent EN: polluter pays principle @en
equivalent EN: polluter pays principle (en)
definition: Principe, à l'origine de dispositions juridiques, selon lequel les frais engagés pour prévenir, réduire ou combattre une pollution ou toute autre atteinte à l'environnement sont à la charge de celui qui en est reconnu responsable.
in scheme: Environnement
in scheme: concepts
notation: ENVI9
related: paiement aux déchets

émulation écologique
type: ConceptConcept
type: Concept
creator: Commission d'enrichissement de la langue française, FranceTerme
date parution JO: 2013-09-08
deconseille ou frequent: nudge vert
deconseille ou frequent: nudges verts
equivalent EN: green nudge @en
equivalent EN: green nudge (en)
definition: Incitation, par effet d'entraînement au sein d'un groupe, à adopter un comportement plus respectueux de l'environnement.
in scheme: Environnement
in scheme: concepts
notation: ENVI90

recyclage valorisant
type: ConceptConcept
type: Concept
creator: Commission d'enrichissement de la langue française, FranceTerme
date parution JO: 2013-09-08
deconseille ou frequent: up cycling
equivalent EN: upcycling @en
equivalent EN: upcycling (en)
definition: Fabrication, à partir d'objets ou de matériaux de récupération, de produits de plus haute valeur que les objets ou matériaux d'origine.
in scheme: Économie et gestion d'entreprise
in scheme: Environnement
in scheme: concepts
notation: ENVI91
related: sous-recyclage
related: recyclage des déchets
related: recyclerie

bioplastique
type: ConceptConcept
type: Concept
creator: Commission d'enrichissement de la langue française, FranceTerme
date parution JO: 2016-12-22
deconseille ou frequent: bio-plastique
equivalent EN: bioplastic @en
equivalent EN: bioplastic (en)
part of speech: nom masculin
definition: Plastique biosourcé et biodégradable.
in scheme: Environnement
in scheme: Matériaux
in scheme: concept-SD-environnement-polymeres
in scheme: concept-SD-materiaux-polymeres
in scheme: concepts
notation: ENVI92
note: Un bioplastique est généralement compostable.
related: biosourcé, -e
related: compostage
related: biodégradable

croissance verte
type: ConceptConcept
type: Concept
creator: Commission d'enrichissement de la langue française, FranceTerme
date parution JO: 2013-09-08
equivalent EN: green growth @en
equivalent EN: green growth (en)
definition: Croissance économique respectueuse de l'environnement naturel, et visant, par des actions ou des innovations spécifiques, à remédier aux atteintes qui lui sont portées.
definition: Environmentally friendly economic growth aiming, through specific actions or innovations, to address the infringements suffered by the natural environment. @en
in scheme: Économie générale
in scheme: Environnement
in scheme: concepts
notation: ENVI94
preferred label: green growth @en
related: écodéveloppement
related: développement durable
related: économie verte
related: concept-energie-renouvelable
related: concept-transition-energetique

économie verte
type: ConceptConcept
type: Concept
creator: Commission d'enrichissement de la langue française, FranceTerme
date parution JO: 2013-09-08
equivalent EN: green economy @en
equivalent EN: green economy (en)
alternative label: économie bas carbone
broader: concept-economie-generale
definition: Economy characterised by investments and technical provisions aiming to avoid, reduce or erradicate pollutions, and, in particular, carbon dioxyde emissions, while making the best use of available energy resources. @en
definition: Économie caractérisée par des investissements et des dispositions techniques qui visent à éviter, à réduire ou à supprimer les pollutions et, en particulier, les émissions de dioxyde de carbone, tout en utilisant au mieux les ressources énergétiques disponibles.
in scheme: Économie générale
in scheme: Environnement
in scheme: concepts
narrower: concept-finance-verte
notation: ENVI95
note: Les innovations liées à l'économie verte favorisent la création d'emplois.
related: économie circulaire
related: croissance verte

récupérateur de chaleur des eaux usées
type: ConceptConcept
type: Concept
creator: Commission d'enrichissement de la langue française, FranceTerme
date parution JO: 2013-09-08
deconseille ou frequent: power pipe
deconseille ou frequent: powerpipe
equivalent EN: waste water heat recovery unit @en
equivalent EN: waste water heat recovery unit (en)
forme abregee: récupérateur de chaleur
definition: Échangeur servant à récupérer partiellement l'énergie thermique des eaux usées.
in scheme: Énergie
in scheme: Habitat et construction
in scheme: concepts
notation: ENVI96
note: L'emploi du terme power-pipe, qui est un nom de marque, est à proscrire.

énergie grise
type: ConceptConcept
type: Concept
creator: Commission d'enrichissement de la langue française, FranceTerme
date parution JO: 2013-09-08
deconseille ou frequent: énergie incorporée
equivalent EN: embodied energy @en
equivalent EN: embodied energy (en)
broader: concept-energie
definition: Quantité d'énergie nécessaire à la fabrication d'un produit ou à la fourniture de services.
in scheme: Énergie
in scheme: Environnement
in scheme: concepts
notation: ENVI97
note: 1. L'énergie grise prise en compte dans l'analyse du cycle de vie d'un produit peut également l'être dans celle de la fourniture de services.
note: 2. On trouve aussi le terme « énergie incorporée ».
related: analyse du cycle de vie d'un produit

étrépage
type: ConceptConcept
type: Concept
creator: Commission d'enrichissement de la langue française, FranceTerme
date parution JO: 2013-09-08
deconseille ou frequent: décapage
part of speech: nom masculin
definition: Technique de restauration écologique d'un sol consistant à en prélever une couche superficielle pour réduire sa teneur en matières organiques et favoriser ainsi l'installation d'espèces pionnières, tant végétales qu'animales.
in scheme: Environnement
in scheme: concepts
notation: ENVI98
note: 1. L'étrépage est une technique appliquée particulièrement à des milieux pauvres en nutriments, tels que les pelouses naturelles et les landes.
note: 2. L'étrépage se distingue du décapage, qui est pratiqué plus profondément et à des fins de dépollution.

neutralité en matière de gaz à effet de serre
type: ConceptConcept
type: Concept
creator: Commission d'enrichissement de la langue française, FranceTerme
date parution JO: 2019-09-24
deconseille ou frequent: CO2 neutrality
deconseille ou frequent: carbon neutrality
deconseille ou frequent: neutralité CO2
deconseille ou frequent: neutralité carbone
deconseille ou frequent: neutralité en CO2
deconseille ou frequent: neutralité en carbone
deconseille ou frequent: zero net emission
equivalent EN: zero net emissions @en
equivalent EN: zero net emissions (en)
forme abregee: neutralité GES
forme abregee: neutralité en gaz à effet de serre
definition: Situation dans laquelle les émissions de gaz à effet de serre sont totalement compensées par les absorptions de gaz à effet de serre.
in scheme: Énergie
in scheme: Environnement
in scheme: concepts
notation: ENVI99
note: Quand la neutralité en matière de gaz à effet de serre concerne le dioxyde de carbone, on parle de « neutralité carbone » (en anglais : carbon neutrality).
related: absorption anthropique de carbone
related: compensation des émissions de gaz à effet de serre
related: faible émission de gaz à effet de serre (à)
related: décarbonation

absorbeur de vapeur d'essence
type: ConceptConcept
type: Concept
creator: Commission d'enrichissement de la langue française, FranceTerme
date parution JO: 1997-12-02
deconseille ou frequent: fuel vapor canister
deconseille ou frequent: fuel vapour canister
equivalent EN: fuel vapor canister (US) @en
equivalent EN: fuel vapor canister (en-US)
equivalent EN: fuel vapour canister (GB) @en
equivalent EN: fuel vapour canister (en-GB)
forme abregee: absorbeur, n.m.
definition: Dispositif servant à absorber et à retenir les vapeurs de carburant provenant d'un appareil de remplissage de son réservoir afin d'éviter qu'elles ne s'échappent dans l'atmosphère.
in scheme: Transports et mobilité
in scheme: concepts
notation: EQUI1

acheminement par le transporteur maritime
type: ConceptConcept
type: Concept
creator: Commission d'enrichissement de la langue française, FranceTerme
source: révision de l'arrêté du 23 septembre 1987
date parution JO: 2000-09-22
equivalent EN: carrier haulage @en
equivalent EN: carrier haulage (en)
forme abregee: acheminement par le transporteur
definition: Acheminement intérieur assuré par le transporteur maritime en vertu du contrat de transport maritime.
in scheme: Transports et mobilité
in scheme: concept-SD-transports-et-mobilite-transport-maritime
in scheme: concepts
notation: EQUI10
note: Le transporteur maritime exécute lui-même cet acheminement ou le sous-traite.

musoir
type: ConceptConcept
type: Concept
creator: Commission d'enrichissement de la langue française, FranceTerme
source: révision de l'arrêté du 27 mai 1992
date parution JO: 2000-09-22
equivalent EN: bull-nose @en
equivalent EN: bull-nose (en)
equivalent EN: nose of island @en
equivalent EN: nose of island (en)
equivalent EN: nose-approach @en
equivalent EN: nose-approach (en)
part of speech: nom masculin
definition: Pointe extrême située à la séparation de deux voies de circulation de même sens.
in scheme: Transports et mobilité
in scheme: concept-SD-transports-et-mobilite-transport-routier
in scheme: concepts
notation: EQUI100
note: Le musoir ne doit pas être confondu avec sa balise de signalisation.

navire collecteur
type: ConceptConcept
type: Concept
creator: Commission d'enrichissement de la langue française, FranceTerme
source: révision de l'arrêté du 23 septembre 1987
date parution JO: 2000-09-22
equivalent EN: feeder ship @en
equivalent EN: feeder ship (en)
definition: Dans une opération associant navires gros porte-conteneurs faisant peu d'escales et navires plus petits desservant d'autres ports de la région, désigne les navires plus petits.
in scheme: Transports et mobilité
in scheme: concept-SD-transports-et-mobilite-transport-maritime
in scheme: concepts
notation: EQUI101
related: navire principal
related: port d'éclatement
related: trafic d'éclatement

note de réservation de fret
type: ConceptConcept
type: Concept
creator: Commission d'enrichissement de la langue française, FranceTerme
source: révision de l'arrêté du 23 septembre 1987
date parution JO: 2000-09-22
equivalent EN: booking note @en
equivalent EN: booking note (en)
forme abregee: note de réservation
definition: Document destiné à réserver un emplacement sur un navire, avant l'établissement du titre de transport.
in scheme: Transports et mobilité
in scheme: concept-SD-transports-et-mobilite-transport-maritime
in scheme: concepts
notation: EQUI102

office
type: ConceptConcept
type: Concept
creator: Commission d'enrichissement de la langue française, FranceTerme
source: révision de l'arrêté du 17 février 1986
date parution JO: 2000-09-22
equivalent EN: pantry @en
equivalent EN: pantry (en)
part of speech: nom masculin
definition: Annexe à la cuisine.
in scheme: Habitat et construction
in scheme: concepts
notation: EQUI103

organisateur de voyages
type: ConceptConcept
type: Concept
creator: Commission d'enrichissement de la langue française, FranceTerme
source: révision de l'arrêté du 30 juin 1992
date parution JO: 2000-09-22
equivalent EN: tour operator @en
equivalent EN: tour operator (en)
alternative label: voyagiste
definition: Personne morale ou physique qui conçoit et met en œuvre des voyages.
in scheme: Tourisme
in scheme: concepts
notation: EQUI104
note: Le terme « tour-opérateur » ne doit pas être employé.

panneau à message variable
type: ConceptConcept
type: Concept
creator: Commission d'enrichissement de la langue française, FranceTerme
source: révision de l'arrêté du 27 mai 1992
abbreviation: PMV
abbreviation: VMS @en
date parution JO: 2000-09-22
equivalent EN: VMS @en
equivalent EN: VMS (en)
equivalent EN: variable message sign @en
equivalent EN: variable message sign (en)
definition: Panneau de signalisation comportant un dispositif télécommandé permettant d'afficher des messages rapidement modifiables.
in scheme: Transports et mobilité
in scheme: concept-SD-transports-et-mobilite-transport-aerien
in scheme: concept-SD-transports-et-mobilite-transport-terrestre
in scheme: concepts
notation: EQUI105

parc relais
type: ConceptConcept
type: Concept
creator: Commission d'enrichissement de la langue française, FranceTerme
source: révision de l'arrêté du 21 septembre 1993
date parution JO: 2000-09-22
deconseille ou frequent: PR
deconseille ou frequent: parc de dissuasion
equivalent EN: park and ride @en
equivalent EN: park and ride (en)
definition: Lieu aménagé à proximité d'un arrêt de transport public, destiné à inciter un automobiliste à garer son véhicule pour emprunter ensuite un moyen de transport en commun.
in scheme: Aménagement et urbanisme
in scheme: Transports et mobilité
in scheme: concept-SD-amenagement-et-urbanisme-transport-routier
in scheme: concept-SD-transports-et-mobilite-transport-routier
in scheme: concepts
notation: EQUI106
note: 1. Le terme « parc relais » a été retenu en raison du fait qu'il correspond à l'abréviation d'usage international « P.R. », « PR » ou « P et R ».
note: 2. On trouve également, dans l'usage, le terme « parc de dissuasion ».
related: parc de stationnement

pétrolier-minéralier
type: ConceptConcept
type: Concept
creator: Commission d'enrichissement de la langue française, FranceTerme
source: révision de l'arrêté du 28 novembre 1985
abbreviation: OO carrier @en
date parution JO: 2000-09-22
equivalent EN: OO carrier @en
equivalent EN: OO carrier (en)
equivalent EN: oil tanker @en
equivalent EN: oil tanker (en)
equivalent EN: oil-ore carrier @en
equivalent EN: oil-ore carrier (en)
equivalent EN: ore tanker @en
equivalent EN: ore tanker (en)
part of speech: nom masculin
definition: Navire pouvant transporter en vrac des hydrocarbures ou du minerai.
in scheme: Pétrole et gaz
in scheme: Transports et mobilité
in scheme: concept-SD-petrole-et-gaz-transport-maritime
in scheme: concept-SD-transports-et-mobilite-transport-maritime
in scheme: concepts
notation: EQUI107

pisé
type: ConceptConcept
type: Concept
creator: Commission d'enrichissement de la langue française, FranceTerme
source: révision de l'arrêté du 17 février 1986
date parution JO: 2000-09-22
equivalent EN: loam @en
equivalent EN: loam (en)
part of speech: nom masculin
definition: Matériau de construction fabriqué à partir de terre argileuse délayée, à laquelle sont ajoutés des cailloux, de la paille ou d'autres constituants, et mis en place dans des branches servant de coffrage.
in scheme: Habitat et construction
in scheme: concept-SD-habitat-et-construction-materiaux-de-construction
in scheme: concepts
notation: EQUI108
related: adobe
related: torchis

adobe
type: ConceptConcept
type: Concept
creator: Commission d'enrichissement de la langue française, FranceTerme
source: révision de l'arrêté du 17 février 1986
abbreviation: adobe @en
date parution JO: 2000-09-22
deconseille ou frequent: banco
equivalent EN: adobe @en
equivalent EN: adobe (en)
equivalent EN: adobe brick @en
equivalent EN: adobe brick (en)
part of speech: nom masculin
definition: Brique durcie au soleil, fabriquée à partir de terre essentiellement argileuse, délayée et mélangée à de la paille ou de l'herbe sèche hachée ; par extension, matériau constitué par assemblage de briques de ce type.
in scheme: Habitat et construction
in scheme: concept-SD-habitat-et-construction-materiaux-de-construction
in scheme: concepts
notation: EQUI11
note: En Afrique, on utilise plutôt le terme « banco ».
related: pisé

point d'accès
type: ConceptConcept
type: Concept
creator: Commission d'enrichissement de la langue française, FranceTerme
source: révision de l'arrêté du 30 juin 1992
date parution JO: 2000-09-22
equivalent EN: gate-way @en
equivalent EN: gate-way (en)
equivalent EN: gateway @en
equivalent EN: gateway (en)
definition: Lieu où les accords internationaux permettent aux transporteurs étrangers d'embarquer ou de débarquer des voyageurs ou des marchandises.
in scheme: Transports et mobilité
in scheme: concepts
notation: EQUI110

port d'aéroglisseurs
type: ConceptConcept
type: Concept
creator: Commission d'enrichissement de la langue française, FranceTerme
source: révision de l'arrêté du 23 septembre 1987
date parution JO: 2000-09-22
equivalent EN: hoverport @en
equivalent EN: hoverport (en)
definition: Site aménagé pour la réception des aéroglisseurs.
in scheme: Transports et mobilité
in scheme: concept-SD-transports-et-mobilite-transport-maritime
in scheme: concepts
notation: EQUI111

pose-tubes
type: ConceptConcept
type: Concept
creator: Commission d'enrichissement de la langue française, FranceTerme
source: révision de l'arrêté du 17 février 1986
date parution JO: 2000-09-22
equivalent EN: pipe layer @en
equivalent EN: pipe layer (en)
part of speech: nom masculin
definition: Tracteur équipé d'une flèche latérale, et servant à mettre en place les éléments d'une canalisation importante, notamment d'eau, de gaz ou d'hydrocarbures.
in scheme: Habitat et construction
in scheme: concept-SD-habitat-et-construction-engins
in scheme: concepts
notation: EQUI112

première sortie
type: ConceptConcept
type: Concept
creator: Commission d'enrichissement de la langue française, FranceTerme
source: révision de l'arrêté du 21 septembre 1993
date parution JO: 2000-09-22
equivalent EN: roll-out @en
equivalent EN: roll-out (en)
definition: Sortie d'atelier et, éventuellement, présentation publique du prototype ou de la tête de série d'un véhicule de transport.
in scheme: Transports et mobilité
in scheme: concept-SD-transports-et-mobilite-transport-aerien
in scheme: concept-SD-transports-et-mobilite-transport-ferroviaire
in scheme: concepts
notation: EQUI113
note: Ce genre d'évènement donne souvent lieu à une manifestation médiatique à retentissement commercial.

prime de célérité
type: ConceptConcept
type: Concept
creator: Commission d'enrichissement de la langue française, FranceTerme
source: révision de l'arrêté du 23 septembre 1987
date parution JO: 2000-09-22
equivalent EN: dispatch money @en
equivalent EN: dispatch money (en)
definition: Prime accordée pour le temps gagné par rapport au temps prévu par le contrat pour effectuer un chargement ou un déchargement.
in scheme: Marine
in scheme: concept-SD-marine-manutention
in scheme: concepts
notation: EQUI114

pulvérisateur-mélangeur
type: ConceptConcept
type: Concept
creator: Commission d'enrichissement de la langue française, FranceTerme
source: révision de l'arrêté du 17 février 1986
date parution JO: 2000-09-22
equivalent EN: pulvimixer @en
equivalent EN: pulvimixer (en)
part of speech: nom masculin
definition: Machine automatique servant à incorporer de manière homogène des matériaux dans le sol.
in scheme: Habitat et construction
in scheme: concept-SD-habitat-et-construction-engins
in scheme: concepts
notation: EQUI115

ravitaillement
type: ConceptConcept
type: Concept
creator: Commission d'enrichissement de la langue française, FranceTerme
source: révision de l'arrêté du 21 septembre 1993
date parution JO: 2000-09-22
equivalent EN: catering @en
equivalent EN: catering (en)
part of speech: nom masculin
alternative label: armement
definition: Opération d'approvisionnement d'un aéronef couvrant la restauration et les besoins du service en vol.
in scheme: Restauration
in scheme: Transports et mobilité
in scheme: concept-SD-restauration-transport-aerien
in scheme: concept-SD-transports-et-mobilite-transport-aerien
in scheme: concepts
notation: EQUI116
note: Il convient de distinguer « ravitaillement » et « avitaillement ».
related: service d'escale
related: société de service d'escale

refoulement
type: ConceptConcept
type: Concept
creator: Commission d'enrichissement de la langue française, FranceTerme
source: révision de l'arrêté du 18 juillet 1989
date parution JO: 2000-09-22
equivalent EN: push back @en
equivalent EN: push back (en)
part of speech: nom masculin
definition: Action de déplacer un aéronef vers l'arrière.
in scheme: Transports et mobilité
in scheme: concept-SD-transports-et-mobilite-transport-aerien
in scheme: concepts
notation: EQUI117
note: Le refoulement peut être effectué au tracteur ou au moteur.

refouler
type: ConceptConcept
type: Concept
creator: Commission d'enrichissement de la langue française, FranceTerme
source: révision de l'arrêté du 18 juillet 1989
date parution JO: 2000-09-22
deconseille ou frequent: to push back
equivalent EN: push back @en
equivalent EN: push back (en)
part of speech: verbe
definition: Déplacer un aéronef vers l'arrière.
in scheme: Transports et mobilité
in scheme: concept-SD-transports-et-mobilite-transport-aerien
in scheme: concepts
notation: EQUI118
note: Le refoulement peut s'effectuer au tracteur ou au moteur.

régulateur, -trice
type: ConceptConcept
type: Concept
creator: Commission d'enrichissement de la langue française, FranceTerme
source: révision de l'arrêté du 21 septembre 1993
date parution JO: 2000-09-22
equivalent EN: dispatcher @en
equivalent EN: dispatcher (en)
part of speech: nom
definition: Agent d'une compagnie aérienne ou d'une société d'assistance chargé de l'affectation et du suivi des aéronefs en fonction des programmes d'exploitation.
in scheme: Transports et mobilité
in scheme: concept-SD-transports-et-mobilite-transport-aerien
in scheme: concepts
notation: EQUI119
related: régulation
related: réguler
related: concept-PETR59

agence d'architecture
type: ConceptConcept
type: Concept
creator: Commission d'enrichissement de la langue française, FranceTerme
source: révision de l'arrêté du 17 février 1986
date parution JO: 2000-09-22
equivalent EN: architectural studio office @en
equivalent EN: architectural studio office (en)
definition: Organisme dans lequel des architectes, ingénieurs, dessinateurs et représentants d'autres disciplines élaborent des projets architecturaux pour le compte de l'État, d'une collectivité territoriale ou du secteur privé.
in scheme: Habitat et construction
in scheme: concept-SD-habitat-et-construction-architecture
in scheme: concepts
notation: EQUI12

régulation
type: ConceptConcept
type: Concept
creator: Commission d'enrichissement de la langue française, FranceTerme
source: révision de l'arrêté du 21 septembre 1993
date parution JO: 2000-09-22
deconseille ou frequent: répartition
deconseille ou frequent: ventilation
equivalent EN: dispatching @en
equivalent EN: dispatching (en)
part of speech: nom féminin
definition: Activité d'affectation et de suivi des aéronefs exercée à la direction d'une compagnie aérienne pour l'ensemble de sa flotte, en fonction des programmes d'exploitation, en matière de contrôle de la circulation aérienne et sur chaque plateforme aéroportuaire pour les vols qui y arrivent ou en partent.
in scheme: Transports et mobilité
in scheme: concept-SD-transports-et-mobilite-transport-aerien
in scheme: concepts
notation: EQUI120
note: 1. À l'aéroport, la régulation s'exerce en coordination avec le contrôle aérien.
note: 2. Dans cette acception, on dit aussi « répartition », « ventilation ».
related: régulateur, -trice
related: réguler

réguler
type: ConceptConcept
type: Concept
creator: Commission d'enrichissement de la langue française, FranceTerme
source: révision de l'arrêté du 21 septembre 1993
date parution JO: 2000-09-22
deconseille ou frequent: répartir
deconseille ou frequent: to dispatch
deconseille ou frequent: ventiler
equivalent EN: dispatch @en
equivalent EN: dispatch (en)
part of speech: verbe
definition: Pour une compagnie aérienne ou une autorité aéroportuaire, affecter les aéronefs et assurer le suivi de leur exploitation.
in scheme: Transports et mobilité
in scheme: concept-SD-transports-et-mobilite-transport-aerien
in scheme: concepts
notation: EQUI121
note: 1. Dans cette acception, on dit aussi « répartir », « ventiler ».
note: 2. Le terme « dispatcher » ne doit pas être utilisé en français.
related: régulateur, -trice
related: régulation

remblayeuse
type: ConceptConcept
type: Concept
creator: Commission d'enrichissement de la langue française, FranceTerme
source: révision de l'arrêté du 17 février 1986
date parution JO: 2000-09-22
equivalent EN: back filler @en
equivalent EN: back filler (en)
part of speech: nom féminin
definition: Équipement de terrassement constitué par un godet racleur supporté par une flèche, et servant à remblayer les tranchées.
in scheme: Habitat et construction
in scheme: concept-SD-habitat-et-construction-engins
in scheme: concepts
notation: EQUI122

remodelage
type: ConceptConcept
type: Concept
creator: Commission d'enrichissement de la langue française, FranceTerme
source: révision de l'arrêté du 18 décembre 1990
date parution JO: 2000-09-22
equivalent EN: lifting @en
equivalent EN: lifting (en)
equivalent EN: restyling @en
equivalent EN: restyling (en)
part of speech: nom masculin
definition: Action de modifier un véhicule de façon plus prononcée que lors d'un restylage, mais sans apporter de transformations profondes à sa ligne générale.
in scheme: Automobile
in scheme: Transports et mobilité
in scheme: concepts
notation: EQUI123

remodeler
type: ConceptConcept
type: Concept
creator: Commission d'enrichissement de la langue française, FranceTerme
source: révision de l'arrêté du 18 décembre 1990
date parution JO: 2000-09-22
part of speech: verbe
definition: Modifier un véhicule de façon plus prononcée que lors d'un restylage, mais sans apporter de transformations profondes à sa ligne générale.
in scheme: Automobile
in scheme: Transports et mobilité
in scheme: concepts
notation: EQUI124

ristourne
type: ConceptConcept
type: Concept
creator: Commission d'enrichissement de la langue française, FranceTerme
source: révision de l'arrêté du 30 juin 1992
date parution JO: 2000-09-22
equivalent EN: discount @en
equivalent EN: discount (en)
part of speech: nom féminin
definition: Réduction accordée dans le cadre d'une transaction commerciale.
in scheme: Économie et gestion d'entreprise
in scheme: Tourisme
in scheme: concepts
notation: EQUI126
related: discompte

roulage
type: ConceptConcept
type: Concept
creator: Commission d'enrichissement de la langue française, FranceTerme
source: révision de l'arrêté du 28 novembre 1985
abbreviation: ro-ro @en
date parution JO: 2000-09-22
equivalent EN: ro-ro @en
equivalent EN: ro-ro (en)
equivalent EN: roll on-roll off @en
equivalent EN: roll on-roll off (en)
part of speech: nom masculin
definition: Technique de chargement ou de déchargement des navires par rampes d'accès qu'empruntent tous engins sur roues, automoteurs, tractés ou poussés.
in scheme: Transports et mobilité
in scheme: concept-SD-transports-et-mobilite-transport-maritime
in scheme: concepts
notation: EQUI127
related: roulier

roulier
type: ConceptConcept
type: Concept
creator: Commission d'enrichissement de la langue française, FranceTerme
source: révision de l'arrêté du 28 novembre 1985
abbreviation: ro-ro ship @en
date parution JO: 2000-09-22
equivalent EN: ro-ro ship @en
equivalent EN: ro-ro ship (en)
equivalent EN: roll on-roll off ship @en
equivalent EN: roll on-roll off ship (en)
part of speech: nom masculin
alternative label: navire roulier
definition: Navire conçu pour le chargement et le déchargement par roulage.
in scheme: Transports et mobilité
in scheme: concept-SD-transports-et-mobilite-transport-maritime
in scheme: concepts
notation: EQUI128
related: roulage

rue piétonnière
type: ConceptConcept
type: Concept
creator: Commission d'enrichissement de la langue française, FranceTerme
source: révision de l'arrêté du 17 février 1986
date parution JO: 2000-09-22
equivalent EN: pedestrian thoroughfare @en
equivalent EN: pedestrian thoroughfare (en)
definition: Voie réservée en priorité à la circulation des piétons et aménagée en conséquence.
in scheme: Aménagement et urbanisme
in scheme: concepts
notation: EQUI129

sans différence
type: ConceptConcept
type: Concept
creator: Commission d'enrichissement de la langue française, FranceTerme
source: révision de l'arrêté du 23 septembre 1987
date parution JO: 2000-09-22
deconseille ou frequent: en assiette nulle
equivalent EN: even keel @en
equivalent EN: even keel (en)
part of speech: locution adjectivale
definition: Se dit d'un navire dont le tirant d'eau avant et le tirant d'eau arrière sont égaux.
in scheme: Transports et mobilité
in scheme: concept-SD-transports-et-mobilite-transport-maritime
in scheme: concepts
notation: EQUI130
note: On dit aussi « en assiette nulle », notamment dans les conventions internationales.

sans réservation
type: ConceptConcept
type: Concept
creator: Commission d'enrichissement de la langue française, FranceTerme
source: révision de l'arrêté du 27 mai 1992
abbreviation: SR
date parution JO: 2000-09-22
equivalent EN: go show @en
equivalent EN: go show (en)
part of speech: locution adjectivale
definition: Pour les transports soumis à réservation, se dit d'un voyageur sans réservation, prêt à utiliser une place disponible.
in scheme: Transports et mobilité
in scheme: concept-SD-transports-et-mobilite-transport-aerien
in scheme: concept-SD-transports-et-mobilite-transport-ferroviaire
in scheme: concepts
notation: EQUI131

sauterelle
type: ConceptConcept
type: Concept
creator: Commission d'enrichissement de la langue française, FranceTerme
source: révision de l'arrêté du 17 février 1986
date parution JO: 2000-09-22
equivalent EN: apron conveyor @en
equivalent EN: apron conveyor (en)
part of speech: nom féminin
definition: Bande transporteuse inclinable.
in scheme: Habitat et construction
in scheme: concept-SD-habitat-et-construction-engins
in scheme: concepts
notation: EQUI132

section
type: ConceptConcept
type: Concept
creator: Commission d'enrichissement de la langue française, FranceTerme
source: révision de l'arrêté du 17 février 1986
date parution JO: 2000-09-22
equivalent EN: section @en
equivalent EN: section (en)
part of speech: nom féminin
definition: Document graphique représentant exclusivement l'intersection du plan de coupe et de la matière de l'élément.
in scheme: Habitat et construction
in scheme: concept-SD-habitat-et-construction-architecture
in scheme: concepts
notation: EQUI133
note: Il convient de distinguer la section de la coupe.

service d'escale
type: ConceptConcept
type: Concept
creator: Commission d'enrichissement de la langue française, FranceTerme
source: révision de l'arrêté du 5 octobre 1984
abbreviation: handling @en
date parution JO: 2000-09-22
equivalent EN: ground handling @en
equivalent EN: ground handling (en)
equivalent EN: handling @en
equivalent EN: handling (en)
alternative label: assistance en escale
definition: Ensemble des opérations à accomplir durant l'escale d'un aéronef comprenant toutes les interventions effectuées sur l'aéronef au sol, son chargement (fret, poste, ravitaillement) et le service aux voyageurs.
in scheme: Transports et mobilité
in scheme: concept-SD-transports-et-mobilite-transport-aerien
in scheme: concepts
notation: EQUI134
related: ravitaillement
related: société de service d'escale

site propre
type: ConceptConcept
type: Concept
creator: Commission d'enrichissement de la langue française, FranceTerme
source: révision de l'arrêté du 21 septembre 1993
date parution JO: 2000-09-22
equivalent EN: exclusive lane @en
equivalent EN: exclusive lane (en)
equivalent EN: exclusive way @en
equivalent EN: exclusive way (en)
definition: Emprise affectée exclusivement à l'exploitation de lignes de transport.
in scheme: Transports et mobilité
in scheme: concept-SD-transports-et-mobilite-transport-terrestre
in scheme: concepts
notation: EQUI135

société de service d'escale
type: ConceptConcept
type: Concept
creator: Commission d'enrichissement de la langue française, FranceTerme
source: révision de l'arrêté du 21 septembre 1993
date parution JO: 2000-09-22
equivalent EN: ground handling agent @en
equivalent EN: ground handling agent (en)
alternative label: société d'assistance en escale
definition: Société de services aéroportuaires ou compagnie assurant tout ou partie des opérations d'assistance en escale.
in scheme: Transports et mobilité
in scheme: concept-SD-transports-et-mobilite-transport-aerien
in scheme: concepts
notation: EQUI136
note: Le terme « agent de service d'escale » désigne uniquement le responsable ou employé de cette société.
related: ravitaillement
related: service d'escale

sous-équipage (en)
type: ConceptConcept
type: Concept
creator: Commission d'enrichissement de la langue française, FranceTerme
source: révision de l'arrêté du 23 septembre 1987
date parution JO: 2000-09-22
deconseille ou frequent: en sous-équipage
deconseille ou frequent: sous-normes
equivalent EN: undermanned @en
equivalent EN: undermanned (en)
part of speech: locution adjectivale
definition: Se dit d'un navire dont l'équipage est insuffisant en nombre ou en qualification.
in scheme: Transports et mobilité
in scheme: concept-SD-transports-et-mobilite-transport-maritime
in scheme: concepts
notation: EQUI137
note: Ce terme ne doit pas être confondu avec l'expression « sous-normes ».

stockage thermique
type: ConceptConcept
type: Concept
creator: Commission d'enrichissement de la langue française, FranceTerme
source: révision de l'arrêté du 17 février 1986
date parution JO: 2000-09-22
equivalent EN: heat storage @en
equivalent EN: heat storage (en)
equivalent EN: thermal storage @en
equivalent EN: thermal storage (en)
definition: Ensemble de dispositions permettant d'accumuler de la chaleur et d'en contrôler la restitution ultérieure.
in scheme: Énergie
in scheme: Habitat et construction
in scheme: concepts
notation: EQUI138

structure gonflable
type: ConceptConcept
type: Concept
creator: Commission d'enrichissement de la langue française, FranceTerme
source: révision de l'arrêté du 17 février 1986
date parution JO: 2000-09-22
equivalent EN: air-supported structure @en
equivalent EN: air-supported structure (en)
equivalent EN: inflated structure @en
equivalent EN: inflated structure (en)
definition: Local clos dont les parois souples sont maintenues en place par surpression, et auquel on accède par un sas.
in scheme: Habitat et construction
in scheme: concepts
notation: EQUI139

arrière-pays portuaire
type: ConceptConcept
type: Concept
creator: Commission d'enrichissement de la langue française, FranceTerme
source: révision de l'arrêté du 27 mai 1992
date parution JO: 2000-09-22
deconseille ou frequent: arrière-pays
equivalent EN: Hinterland @de
equivalent EN: Hinterland (de)
definition: Zone d'influence et d'attraction économique d'un port.
in scheme: Transports et mobilité
in scheme: concept-SD-transports-et-mobilite-transport-maritime
in scheme: concepts
notation: EQUI14
note: Dans l'usage, l'emploi du terme « arrière-pays » est fréquent.

surréservation
type: ConceptConcept
type: Concept
creator: Commission d'enrichissement de la langue française, FranceTerme
source: révision de l'arrêté du 18 juillet 1989
date parution JO: 2000-09-22
deconseille ou frequent: surbooking
equivalent EN: overbooking @en
equivalent EN: overbooking (en)
part of speech: nom féminin
definition: Action de réserver des places en nombre plus important que celui des places offertes.
in scheme: Transports et mobilité
in scheme: concepts
notation: EQUI140
note: Le terme « surbooking » ne doit pas être employé.

système d'aide à l'exploitation
type: ConceptConcept
type: Concept
creator: Commission d'enrichissement de la langue française, FranceTerme
source: révision de l'arrêté du 21 septembre 1993
abbreviation: SAE
abbreviation: VSCS @en
date parution JO: 2000-09-22
equivalent EN: VSCS @en
equivalent EN: VSCS (en)
equivalent EN: vehicle scheduling control system @en
equivalent EN: vehicle scheduling control system (en)
definition: Système automatisé permettant le suivi permanent des véhicules d'une flotte de transport.
in scheme: Transports et mobilité
in scheme: concept-SD-transports-et-mobilite-transport-terrestre
in scheme: concepts
notation: EQUI141

télépéage
type: ConceptConcept
type: Concept
creator: Commission d'enrichissement de la langue française, FranceTerme
source: révision de l'arrêté du 18 juillet 1989
abbreviation: ERP @en
abbreviation: ETC @en
abbreviation: electronic pricing @en
date parution JO: 2000-09-22
equivalent EN: ERP @en
equivalent EN: ERP (en)
equivalent EN: ETC @en
equivalent EN: ETC (en)
equivalent EN: electronic pricing @en
equivalent EN: electronic pricing (en)
equivalent EN: electronic road pricing @en
equivalent EN: electronic road pricing (en)
equivalent EN: electronic toll collection @en
equivalent EN: electronic toll collection (en)
part of speech: nom masculin
definition: Acquittement ou enregistrement du péage par un dispositif automatique, sans arrêt du véhicule.
in scheme: Transports et mobilité
in scheme: concept-SD-transports-et-mobilite-transport-routier
in scheme: concepts
notation: EQUI142

temps de vol cale à cale
type: ConceptConcept
type: Concept
creator: Commission d'enrichissement de la langue française, FranceTerme
source: révision de l'arrêté du 21 septembre 1993
date parution JO: 2000-09-22
equivalent EN: block time @en
equivalent EN: block time (en)
definition: Temps de vol compris entre le moment où les cales sont retirées avant le départ et le moment où elles sont remises après immobilisation de l'aéronef au sol.
in scheme: Transports et mobilité
in scheme: concept-SD-transports-et-mobilite-transport-aerien
in scheme: concepts
notation: EQUI143
note: 1. Le temps de vol cale à cale comprend également le temps de roulage.
note: 2. Les termes « temps bloc » et block-block sont à éviter.
related: temps de vol réel

temps de vol réel
type: ConceptConcept
type: Concept
creator: Commission d'enrichissement de la langue française, FranceTerme
source: révision de l'arrêté du 21 septembre 1993
date parution JO: 2000-09-22
equivalent EN: airborne time @en
equivalent EN: airborne time (en)
definition: Temps de vol compris entre le moment où l'aéronef quitte le sol et le moment où il reprend contact avec le sol au point d'atterrissage suivant.
in scheme: Transports et mobilité
in scheme: concept-SD-transports-et-mobilite-transport-aerien
in scheme: concepts
notation: EQUI144
note: Le terme « temps airborne » ne doit pas être utilisé en français.
related: temps de vol cale à cale

torchis
type: ConceptConcept
type: Concept
creator: Commission d'enrichissement de la langue française, FranceTerme
source: révision de l'arrêté du 17 février 1986
date parution JO: 2000-09-22
equivalent EN: cob @en
equivalent EN: cob (en)
part of speech: nom masculin
definition: Matériau constitué par un mélange de terre grasse argileuse, de chaux et de fibres végétales et éventuellement animales, notamment poils de vache, qui est utilisé pour lier les pierres d'un mur ou pour former le hourdis d'une construction en colombage.
in scheme: Habitat et construction
in scheme: concept-SD-habitat-et-construction-materiaux-de-construction
in scheme: concepts
notation: EQUI146
related: pisé

trancheuse
type: ConceptConcept
type: Concept
creator: Commission d'enrichissement de la langue française, FranceTerme
source: révision de l'arrêté du 17 février 1986
date parution JO: 2000-09-22
equivalent EN: ditcher @en
equivalent EN: ditcher (en)
part of speech: nom féminin
definition: Engin de terrassement servant à creuser les tranchées.
in scheme: Habitat et construction
in scheme: concept-SD-habitat-et-construction-engins
in scheme: concepts
notation: EQUI147

transbordeur
type: ConceptConcept
type: Concept
creator: Commission d'enrichissement de la langue française, FranceTerme
source: révision de l'arrêté du 18 juillet 1989
date parution JO: 2000-09-22
deconseille ou frequent: ferry
equivalent EN: car ferry @en
equivalent EN: car ferry (en)
equivalent EN: ferry-boat @en
equivalent EN: ferry-boat (en)
equivalent EN: train ferry @en
equivalent EN: train ferry (en)
part of speech: nom masculin
definition: Navire ayant pour fonction principale de transporter des véhicules routiers ou ferroviaires avec leur chargement et leurs passagers dans les traversées maritimes.
in scheme: Transports et mobilité
in scheme: concept-SD-transports-et-mobilite-transport-maritime
in scheme: concepts
notation: EQUI148
note: On dit aussi « ferry ».

transporteur intégral
type: ConceptConcept
type: Concept
creator: Commission d'enrichissement de la langue française, FranceTerme
source: révision de l'arrêté du 21 septembre 1993
date parution JO: 2000-09-22
deconseille ou frequent: intégrateur
deconseille ou frequent: transporteur intégré
equivalent EN: integrator @en
equivalent EN: integrator (en)
definition: Entreprise ou groupe assurant tout ou partie d'activités généralement couvertes par des partenaires différents, à savoir vente et formalités, transport, pré- et post-acheminement de fret ou de la poste.
in scheme: Transports et mobilité
in scheme: concept-SD-transports-et-mobilite-transport-aerien
in scheme: concepts
notation: EQUI149
note: 1. Le transporteur intégral couvre la totalité de la chaîne de transport.
note: 2. On trouve aussi « intégrateur », qui n'est pas recommandé.
note: 3. Le terme « transporteur intégré » ne doit pas être utilisé.

aubette
type: ConceptConcept
type: Concept
creator: Commission d'enrichissement de la langue française, FranceTerme
source: révision de l'arrêté du 18 juillet 1989
date parution JO: 2000-09-22
equivalent EN: bus shelter @en
equivalent EN: bus shelter (en)
part of speech: nom féminin
definition: Abri aménagé aux points de départ ou d'arrêt d'un moyen de transport en commun.
in scheme: Transports et mobilité
in scheme: concepts
notation: EQUI15

trémie
type: ConceptConcept
type: Concept
creator: Commission d'enrichissement de la langue française, FranceTerme
source: révision de l'arrêté du 17 février 1986
date parution JO: 2000-09-22
equivalent EN: floor opening @en
equivalent EN: floor opening (en)
part of speech: nom féminin
definition: Ouverture pratiquée dans un plancher pour permettre le passage d'un escalier, d'un ascenseur ou de certains équipements.
in scheme: Habitat et construction
in scheme: concepts
notation: EQUI150

trémie
type: ConceptConcept
type: Concept
creator: Commission d'enrichissement de la langue française, FranceTerme
source: révision de l'arrêté du 17 février 1986
date parution JO: 2000-09-22
equivalent EN: pit @en
equivalent EN: pit (en)
part of speech: nom féminin
definition: Dispositif en forme de pyramide renversée destiné au stockage ou au passage de matières solides en vrac.
in scheme: Habitat et construction
in scheme: concepts
notation: EQUI151

trépan-benne
type: ConceptConcept
type: Concept
creator: Commission d'enrichissement de la langue française, FranceTerme
source: révision de l'arrêté du 17 février 1986
date parution JO: 2000-09-22
equivalent EN: hammer-grab @en
equivalent EN: hammer-grab (en)
part of speech: nom masculin
definition: Outil de forage constitué par une benne tubulaire lourde équipée de coquilles ouvrantes.
in scheme: Habitat et construction
in scheme: concept-SD-habitat-et-construction-engins
in scheme: concepts
notation: EQUI152
note: Il permet à la fois de creuser le sol par percussion et d'extraire les déblais.

tunnelier
type: ConceptConcept
type: Concept
creator: Commission d'enrichissement de la langue française, FranceTerme
source: révision de l'arrêté du 17 février 1986
date parution JO: 2000-09-22
equivalent EN: mole @en
equivalent EN: mole (en)
part of speech: nom masculin
alternative label: taupe
definition: Engin de génie civil servant à creuser des tunnels, travaillant de manière continue et à pleine section.
in scheme: Habitat et construction
in scheme: concept-SD-habitat-et-construction-engins
in scheme: concepts
notation: EQUI153

véhicule à deux volumes
type: ConceptConcept
type: Concept
creator: Commission d'enrichissement de la langue française, FranceTerme
source: révision de l'arrêté du 27 mai 1992
date parution JO: 2000-09-22
equivalent EN: hatchback vehicle @en
equivalent EN: hatchback vehicle (en)
alternative label: véhicule bicorps
broader: concept-automobile
definition: Véhicule dont le volume de carrosserie est constitué de deux corps : un pour l'habitacle et l'espace pour les bagages et un autre pour le compartiment moteur.
in scheme: Automobile
in scheme: Transports et mobilité
in scheme: concepts
notation: EQUI154
note: La séparation entre ces corps est constituée par un décrochement à l'avant, à la base du pare-brise.

véhicule à trois volumes
type: ConceptConcept
type: Concept
creator: Commission d'enrichissement de la langue française, FranceTerme
source: révision de l'arrêté du 27 mai 1992
date parution JO: 2000-09-22
equivalent EN: notchback vehicle @en
equivalent EN: notchback vehicle (en)
alternative label: véhicule tricorps
definition: Véhicule dont le compartiment moteur, l'habitacle et l'espace pour les bagages constituent trois corps distincts dans un même volume.
in scheme: Automobile
in scheme: Transports et mobilité
in scheme: concepts
notation: EQUI155
note: La séparation entre ces corps est constituée par un décrochement, à l'avant et à l'arrière, à la base de la lunette.

véhicule à un volume
type: ConceptConcept
type: Concept
creator: Commission d'enrichissement de la langue française, FranceTerme
source: révision de l'arrêté du 27 mai 1992
date parution JO: 2000-09-22
equivalent EN: one-box vehicle @en
equivalent EN: one-box vehicle (en)
alternative label: véhicule monocorps
definition: Véhicule qui réunit dans un même volume le compartiment moteur, l'habitacle et l'espace pour les bagages et dont le profil longitudinal de carrosserie forme une ligne en tous points convexe de l'avant à l'arrière.
in scheme: Automobile
in scheme: Transports et mobilité
in scheme: concepts
notation: EQUI156

vêture isolante
type: ConceptConcept
type: Concept
creator: Commission d'enrichissement de la langue française, FranceTerme
source: révision de l'arrêté du 17 février 1986
date parution JO: 2000-09-22
equivalent EN: insulating wall panel @en
equivalent EN: insulating wall panel (en)
definition: Revêtement extérieur préfabriqué qui comprend un isolant et une peau, destiné à être collé ou fixé mécaniquement sur la face extérieure d'une paroi.
in scheme: Énergie
in scheme: Habitat et construction
in scheme: concepts
notation: EQUI157
related: isolant
related: isolant thermique

vol de réception
type: ConceptConcept
type: Concept
creator: Commission d'enrichissement de la langue française, FranceTerme
source: révision de l'arrêté du 18 décembre 1990
date parution JO: 2000-09-22
equivalent EN: acceptance flight @en
equivalent EN: acceptance flight (en)
definition: Vol non commercial par lequel l'exploitant s'assure de la conformité d'un aéronef aux spécifications contractuelles et en prend livraison.
in scheme: Transports et mobilité
in scheme: concept-SD-transports-et-mobilite-transport-aerien
in scheme: concepts
notation: EQUI158

voyage à forfait
type: ConceptConcept
type: Concept
creator: Commission d'enrichissement de la langue française, FranceTerme
source: révision de l'arrêté du 30 juin 1992
date parution JO: 2000-09-22
equivalent EN: inclusive tour @en
equivalent EN: inclusive tour (en)
equivalent EN: package @en
equivalent EN: package (en)
forme abregee: forfait, n.m.
definition: Ensemble de prestations de services (transport, hébergement, restauration, visites, excursions, distractions, etc.) proposé à prix fixe par un organisateur de voyages ou de séjours.
in scheme: Tourisme
in scheme: concepts
notation: EQUI159
related: forfait

audition publique
type: ConceptConcept
type: Concept
creator: Commission d'enrichissement de la langue française, FranceTerme
source: révision de l'arrêté du 17 février 1986
date parution JO: 2000-09-22
equivalent EN: hearing @en
equivalent EN: hearing (en)
definition: Réunion de concertation de l'ensemble des personnes concernées par la réalisation d'un projet, afin d'en définir toutes les contraintes et de proposer des solutions pour en réduire les inconvénients et les nuisances.
in scheme: Tous domaines
in scheme: concepts
notation: EQUI16

voyage à la carte
type: ConceptConcept
type: Concept
creator: Commission d'enrichissement de la langue française, FranceTerme
source: révision de l'arrêté du 30 juin 1992
date parution JO: 2000-09-22
equivalent EN: package travel @en
equivalent EN: package travel (en)
definition: Voyage à forfait composé d'éléments choisis par le client parmi les possibilités proposées par un organisateur de voyages.
in scheme: Tourisme
in scheme: concepts
notation: EQUI160
note: Le terme « voyage en kit » ne doit pas être employé.

voyage de motivation
type: ConceptConcept
type: Concept
creator: Commission d'enrichissement de la langue française, FranceTerme
source: révision de l'arrêté du 30 juin 1992
date parution JO: 2000-09-22
equivalent EN: incentive @en
equivalent EN: incentive (en)
equivalent EN: incentive-tour @en
equivalent EN: incentive-tour (en)
equivalent EN: incentive-travel @en
equivalent EN: incentive-travel (en)
definition: Voyage de récompense offert par une entreprise ou un organisme pour stimuler un salarié ou un distributeur.
in scheme: Tourisme
in scheme: concepts
notation: EQUI161

vraquier
type: ConceptConcept
type: Concept
creator: Commission d'enrichissement de la langue française, FranceTerme
source: révision de l'arrêté du 23 septembre 1987
date parution JO: 2000-09-22
equivalent EN: bulk carrier @en
equivalent EN: bulk carrier (en)
part of speech: nom masculin
definition: Nom générique des navires transportant des produits secs en vrac.
in scheme: Transports et mobilité
in scheme: concept-SD-transports-et-mobilite-transport-maritime
in scheme: concepts
notation: EQUI162
note: Suivant le produit transporté, on parle de céréalier, de charbonnier, de minéralier, de phosphatier, etc.

sac gonflable
type: ConceptConcept
type: Concept
creator: Commission d'enrichissement de la langue française, FranceTerme
source: révision de l'arrêté du 27 mai 1992
date parution JO: 2000-09-22
deconseille ou frequent: air bag
equivalent EN: airbag @en
equivalent EN: airbag (en)
alternative label: coussin gonflable
definition: Dispositif de sécurité constitué par une enveloppe souple qui, en cas de choc, se gonfle instantanément en s'interposant entre l'occupant et les parties agressives de l'habitacle.
in scheme: Automobile
in scheme: Transports et mobilité
in scheme: concepts
notation: EQUI163
note: On dit aussi « coussin de sécurité ».
related: rideau gonflable

autocaravane
type: ConceptConcept
type: Concept
creator: Commission d'enrichissement de la langue française, FranceTerme
source: révision de l'arrêté du 30 juin 1992
date parution JO: 2000-09-22
equivalent EN: camping-car @en
equivalent EN: camping-car (en)
equivalent EN: motor-home @en
equivalent EN: motor-home (en)
part of speech: nom féminin
definition: Caravane autotractée ou véhicule automobile dont l'intérieur est équipé pour le séjour.
in scheme: Automobile
in scheme: Tourisme
in scheme: concepts
notation: EQUI17
related: autocaravane à cellule
related: autocaravane intégrale
related: autocaravanier, -ière
related: caravane

autocaravane à cellule
type: ConceptConcept
type: Concept
creator: Commission d'enrichissement de la langue française, FranceTerme
source: révision de l'arrêté du 27 mai 1992
date parution JO: 2000-09-22
equivalent EN: detachable motor caravan @en
equivalent EN: detachable motor caravan (en)
definition: Autocaravane fabriquée sur la base d'un ensemble châssis-cabine par adjonction d'une cellule habitable.
in scheme: Automobile
in scheme: Tourisme
in scheme: concepts
notation: EQUI18
related: autocaravane

autocaravane intégrale
type: ConceptConcept
type: Concept
creator: Commission d'enrichissement de la langue française, FranceTerme
source: révision de l'arrêté du 27 mai 1992
date parution JO: 2000-09-22
equivalent EN: motor caravan @en
equivalent EN: motor caravan (en)
definition: Autocaravane fabriquée sur la base d'un châssis nu entièrement carrossé.
in scheme: Automobile
in scheme: Tourisme
in scheme: concepts
notation: EQUI19
related: autocaravane

compagnie majeure
type: ConceptConcept
type: Concept
creator: Commission d'enrichissement de la langue française, FranceTerme
date parution JO: 1997-12-02
equivalent EN: major @en
equivalent EN: major (en)
forme abregee: majeure, n.f.
alternative label: grande compagnie
definition: Compagnie caractérisée par l'importance de son chiffre d'affaires, par celle de son réseau et l'importance des moyens humains et techniques dont elle dispose, et qui occupe de ce fait une place prépondérante sur le marché.
in scheme: Transports et mobilité
in scheme: concept-SD-transports-et-mobilite-transport-aerien
in scheme: concepts
notation: EQUI2

autocaravanier, -ière
type: ConceptConcept
type: Concept
creator: Commission d'enrichissement de la langue française, FranceTerme
source: révision de l'arrêté du 30 juin 1992
date parution JO: 2000-09-22
equivalent EN: caravaner @en
equivalent EN: caravaner (en)
equivalent EN: caravanner @en
equivalent EN: caravanner (en)
equivalent EN: trailerist @en
equivalent EN: trailerist (en)
part of speech: nom
definition: Utilisateur d'une autocaravane.
in scheme: Automobile
in scheme: Tourisme
in scheme: concepts
notation: EQUI20
note: On peut admettre l'usage adjectival du nom « autocaravanier ».
related: autocaravane
related: autocaravanier, -ière

autocariste
type: ConceptConcept
type: Concept
creator: Commission d'enrichissement de la langue française, FranceTerme
source: révision de l'arrêté du 27 mai 1992
date parution JO: 2000-09-22
equivalent EN: bus operator @en
equivalent EN: bus operator (en)
equivalent EN: motorcoach operator @en
equivalent EN: motorcoach operator (en)
part of speech: nom
definition: Entrepreneur ou entreprise de transport par autocar.
in scheme: Transports et mobilité
in scheme: concept-SD-transports-et-mobilite-transport-routier
in scheme: concepts
notation: EQUI21

avion de transport régional
type: ConceptConcept
type: Concept
creator: Commission d'enrichissement de la langue française, FranceTerme
source: révision de l'arrêté du 21 septembre 1993
date parution JO: 2000-09-22
equivalent EN: commuter @en
equivalent EN: commuter (en)
definition: Avion de transport destiné à des liaisons de courte distance.
in scheme: Transports et mobilité
in scheme: concept-SD-transports-et-mobilite-transport-aerien
in scheme: concepts
notation: EQUI22

bail à effet de levier
type: ConceptConcept
type: Concept
creator: Commission d'enrichissement de la langue française, FranceTerme
source: révision de l'arrêté du 18 décembre 1990
date parution JO: 2000-09-22
equivalent EN: leverage lease @en
equivalent EN: leverage lease (en)
definition: Bail financier dont le rapport entre le traitement fiscal de l'amortissement du bien loué et son financement constitue l'effet de levier.
in scheme: Finance
in scheme: Transports et mobilité
in scheme: concepts
notation: EQUI23
related: bail financier

bail d'exploitation
type: ConceptConcept
type: Concept
creator: Commission d'enrichissement de la langue française, FranceTerme
source: révision de l'arrêté du 18 décembre 1990
date parution JO: 2000-09-22
equivalent EN: operating lease @en
equivalent EN: operating lease (en)
definition: Bail permettant au preneur de disposer, pour son exploitation, de l'objet du bail pendant une période prédéterminée ; le loyer ne couvre pas entièrement l'amortissement et les intérêts financiers, le bien retournant au bailleur à l'issue du bail.
in scheme: Finance
in scheme: Transports et mobilité
in scheme: concepts
notation: EQUI24
note: Contrairement au bail financier, le bail d'exploitation ne comporte pas de clause de rachat.

bail financier
type: ConceptConcept
type: Concept
creator: Commission d'enrichissement de la langue française, FranceTerme
source: révision de l'arrêté du 18 décembre 1990
date parution JO: 2000-09-22
equivalent EN: financial lease @en
equivalent EN: financial lease (en)
definition: Bail à usage professionnel de durée prédéterminée permettant au bailleur de recouvrer au moyen de loyers le coût de l'objet du bail, ainsi qu'un revenu pour son investissement, et donnant au preneur la possibilité de lever une option d'achat stipulée à son profit, mais dont la valeur n'est pas obligatoirement prévue à l'origine du bail.
in scheme: Finance
in scheme: Transports et mobilité
in scheme: concepts
notation: EQUI25
note: Le bail financier est une forme de crédit-bail tel que défini dans la législation française.
related: crédit-bail
related: bail à effet de levier

bande transporteuse
type: ConceptConcept
type: Concept
creator: Commission d'enrichissement de la langue française, FranceTerme
source: révision de l'arrêté du 17 février 1986
date parution JO: 2000-09-22
equivalent EN: belt conveyor @en
equivalent EN: belt conveyor (en)
definition: Bande mobile pour le transport des solides sur un chantier.
in scheme: Habitat et construction
in scheme: concept-SD-habitat-et-construction-engins
in scheme: concepts
notation: EQUI27

baraquage
type: ConceptConcept
type: Concept
creator: Commission d'enrichissement de la langue française, FranceTerme
source: révision de l'arrêté du 21 septembre 1993
date parution JO: 2000-09-22
equivalent EN: kneeling @en
equivalent EN: kneeling (en)
part of speech: nom masculin
alternative label: agenouillement
definition: Dispositif permettant de modifier l'assiette d'un véhicule afin d'en faciliter l'accès.
in scheme: Automobile
in scheme: Transports et mobilité
in scheme: concepts
notation: EQUI28
note: Le terme « baraquage » dérive du verbe « baraquer », qui désigne notamment la façon dont les dromadaires et les chameaux s'accroupissent pour faciliter la montée ou la descente des personnes et le chargement ou le déchargement des marchandises.

bardage
type: ConceptConcept
type: Concept
creator: Commission d'enrichissement de la langue française, FranceTerme
source: révision de l'arrêté du 17 février 1986
date parution JO: 2000-09-22
equivalent EN: siding @en
equivalent EN: siding (en)
part of speech: nom masculin
definition: Partie d'ouvrage sensiblement verticale constituant à elle seule soit la séparation, soit un des éléments de cette séparation, des ambiances extérieure et intérieure.
in scheme: Habitat et construction
in scheme: concept-SD-habitat-et-construction-materiaux-de-construction
in scheme: concepts
notation: EQUI29
note: On distingue les bardages rapportés, qui sont des écrans disposés devant une paroi continue et les bardages-murs, qui constituent à eux seuls la séparation entre les ambiances extérieure et intérieure.

conversion rapide
type: ConceptConcept
type: Concept
creator: Commission d'enrichissement de la langue française, FranceTerme
date parution JO: 1997-12-02
equivalent EN: quick change @en
equivalent EN: quick change (en)
forme abregee: conversion
definition: Transformation rapide et temporaire de la cabine d'un avion pour lui permettre de passer du transport de passagers au transport de marchandises, de courrier, etc., et inversement.
in scheme: Transports et mobilité
in scheme: concept-SD-transports-et-mobilite-transport-aerien
in scheme: concepts
notation: EQUI3
note: Cette opération, effectuée en très peu de temps, permet de mieux adapter certains avions aux contraintes de l'exploitation commerciale.

batardeau
type: ConceptConcept
type: Concept
creator: Commission d'enrichissement de la langue française, FranceTerme
source: révision de l'arrêté du 17 février 1986
date parution JO: 2000-09-22
equivalent EN: cofferdam @en
equivalent EN: cofferdam (en)
part of speech: nom masculin
definition: Construction formant une retenue d'eau, afin d'assécher un terrain où l'on doit effectuer des travaux.
in scheme: Habitat et construction
in scheme: concepts
notation: EQUI30

bâtiment industriel monovalent
type: ConceptConcept
type: Concept
creator: Commission d'enrichissement de la langue française, FranceTerme
source: révision de l'arrêté du 17 février 1986
date parution JO: 2000-09-22
equivalent EN: single function industrial building @en
equivalent EN: single function industrial building (en)
broader: concept-batiment
definition: Bâtiment conçu pour une destination précise, et non susceptible d'une utilisation différente.
in scheme: Habitat et construction
in scheme: concepts
notation: EQUI31
note: Exemples : centrale nucléaire, raffinerie de pétrole.

bâtiment industriel polyvalent
type: ConceptConcept
type: Concept
creator: Commission d'enrichissement de la langue française, FranceTerme
source: révision de l'arrêté du 17 février 1986
date parution JO: 2000-09-22
equivalent EN: multifunctional industrial building @en
equivalent EN: multifunctional industrial building (en)
broader: concept-batiment
definition: Bâtiment adaptable à plusieurs utilisations.
in scheme: Habitat et construction
in scheme: concepts
notation: EQUI32

billet ouvert
type: ConceptConcept
type: Concept
creator: Commission d'enrichissement de la langue française, FranceTerme
source: révision de l'arrêté du 18 juillet 1989
date parution JO: 2000-09-22
deconseille ou frequent: billet open
equivalent EN: open ticket @en
equivalent EN: open ticket (en)
definition: Billet permettant à un voyageur de fixer librement la date de son voyage.
in scheme: Transports et mobilité
in scheme: concepts
notation: EQUI33

bon d'échange
type: ConceptConcept
type: Concept
creator: Commission d'enrichissement de la langue française, FranceTerme
source: révision de l'arrêté du 30 juin 1992
date parution JO: 2000-09-22
equivalent EN: voucher @en
equivalent EN: voucher (en)
forme abregee: bon, n.m.
alternative label: coupon
definition: Titre permettant d'obtenir des prestations ou des services payés d'avance ou non, notamment dans les hôtels et les restaurants (nuitées, hébergement, repas), ainsi que la location d'automobiles.
in scheme: Tourisme
in scheme: concepts
notation: EQUI34

bourse professionnelle
type: ConceptConcept
type: Concept
creator: Commission d'enrichissement de la langue française, FranceTerme
source: révision de l'arrêté du 30 juin 1992
date parution JO: 2000-09-22
equivalent EN: workshop @en
equivalent EN: workshop (en)
alternative label: rencontre interprofessionnelle
definition: Manifestation permettant un échange d'informations ou des négociations entre professionnels d'un ou de plusieurs secteurs d'activité sur les problèmes les concernant.
in scheme: Économie et gestion d'entreprise
in scheme: Tourisme
in scheme: concepts
notation: EQUI35

boutique hors taxes
type: ConceptConcept
type: Concept
creator: Commission d'enrichissement de la langue française, FranceTerme
source: révision de l'arrêté du 18 juillet 1989
date parution JO: 2000-09-22
equivalent EN: duty-free shop @en
equivalent EN: duty-free shop (en)
definition: Boutique où sont proposées à la vente des marchandises qui ne sont pas soumises au paiement de taxes.
in scheme: Économie et gestion d'entreprise
in scheme: Économie générale
in scheme: concept-SD-economie-et-gestion-d-entreprise-fiscalite
in scheme: concept-SD-economie-generale-fiscalite
in scheme: concepts
notation: EQUI36

bureau d'études techniques
type: ConceptConcept
type: Concept
creator: Commission d'enrichissement de la langue française, FranceTerme
source: révision de l'arrêté du 17 février 1986
date parution JO: 2000-09-22
equivalent EN: engineering and design department @en
equivalent EN: engineering and design department (en)
definition: Organisme dans lequel des ingénieurs et autres techniciens traitent les problèmes généraux ou spéciaux liés à une réalisation architecturale ou à une réalisation de génie civil.
in scheme: Habitat et construction
in scheme: concept-SD-habitat-et-construction-architecture
in scheme: concepts
notation: EQUI37

cafétéria
type: ConceptConcept
type: Concept
creator: Commission d'enrichissement de la langue française, FranceTerme
source: révision de l'arrêté du 30 juin 1992
date parution JO: 2000-09-22
equivalent EN: cafeteria @en
equivalent EN: cafeteria (en)
part of speech: nom féminin
broader: concept-restauration
definition: Lieu où l'on peut boire du café et diverses boissons ou prendre un repas léger.
in scheme: Restauration
in scheme: Tourisme
in scheme: concepts
notation: EQUI38
related: aire de restauration

caisse mobile
type: ConceptConcept
type: Concept
creator: Commission d'enrichissement de la langue française, FranceTerme
source: révision de l'arrêté du 18 juillet 1989
date parution JO: 2000-09-22
equivalent EN: swap body @en
equivalent EN: swap body (en)
definition: Superstructure amovible d'un véhicule de transport routier ou ferroviaire dont les dimensions et certains dispositifs sont issus des normes routières.
in scheme: Transports et mobilité
in scheme: concept-SD-transports-et-mobilite-transport-terrestre
in scheme: concepts
notation: EQUI39

créneau horaire
type: ConceptConcept
type: Concept
creator: Commission d'enrichissement de la langue française, FranceTerme
abbreviation: slot @en
date parution JO: 1997-12-02
equivalent EN: slot @en
equivalent EN: slot (en)
equivalent EN: time slot @en
equivalent EN: time slot (en)
forme abregee: créneau, n.m.
definition: Plage horaire de décollage ou d'atterrissage allouée à un transporteur pour le mouvement de ses aéronefs sur une ligne déterminée.
in scheme: Transports et mobilité
in scheme: concept-SD-transports-et-mobilite-transport-aerien
in scheme: concepts
notation: EQUI4

caisse profonde
type: ConceptConcept
type: Concept
creator: Commission d'enrichissement de la langue française, FranceTerme
source: révision de l'arrêté du 23 septembre 1987
date parution JO: 2000-09-22
equivalent EN: deep tank @en
equivalent EN: deep tank (en)
definition: Cale spécialement prévue pour le lest d'eau mais pouvant éventuellement recevoir des cargaisons liquides.
in scheme: Marine
in scheme: concept-SD-marine-construction-navale
in scheme: concepts
notation: EQUI40

capteur solaire
type: ConceptConcept
type: Concept
creator: Commission d'enrichissement de la langue française, FranceTerme
source: révision de l'arrêté du 17 février 1986
date parution JO: 2000-09-22
equivalent EN: solar collector @en
equivalent EN: solar collector (en)
definition: Dispositif qui reçoit le rayonnement solaire et en transforme l'énergie en chaleur qu'il transmet par l'intermédiaire d'un fluide caloporteur.
in scheme: Énergie
in scheme: Habitat et construction
in scheme: concepts
notation: EQUI41
related: fluide caloporteur

agrafe
type: ConceptConcept
type: Concept
creator: Commission d'enrichissement de la langue française, FranceTerme
source: révision de l'arrêté du 17 février 1986
date parution JO: 2000-09-22
equivalent EN: clip @en
equivalent EN: clip (en)
part of speech: nom féminin
in scheme: Habitat et construction
in scheme: concept-SD-habitat-et-construction-materiaux-de-construction
in scheme: concepts
notation: EQUI418

caravane
type: ConceptConcept
type: Concept
creator: Commission d'enrichissement de la langue française, FranceTerme
source: révision de l'arrêté du 30 juin 1992
date parution JO: 2000-09-22
deconseille ou frequent: caravan
deconseille ou frequent: trailer
equivalent EN: caravan (GB) @en
equivalent EN: caravan (en-GB)
equivalent EN: trailer (US) @en
equivalent EN: trailer (en-US)
part of speech: nom féminin
definition: Véhicule ou élément de véhicule qui, équipé pour le séjour ou l'exercice d'une activité, conserve en permanence les moyens de mobilité lui permettant d'être déplacé par simple traction.
in scheme: Automobile
in scheme: Tourisme
in scheme: concepts
notation: EQUI42
related: autocaravane

construction parasismique
type: ConceptConcept
type: Concept
creator: Commission d'enrichissement de la langue française, FranceTerme
source: révision de l'arrêté du 17 février 1986
date parution JO: 2000-09-22
equivalent EN: earthquake-proof construction @en
equivalent EN: earthquake-proof construction (en)
equivalent EN: earthquake-resistant construction @en
equivalent EN: earthquake-resistant construction (en)
equivalent EN: earthquakeproof construction @en
equivalent EN: earthquakeproof construction (en)
in scheme: Habitat et construction
in scheme: concepts
notation: EQUI420

avion de ligne
type: ConceptConcept
type: Concept
creator: Commission d'enrichissement de la langue française, FranceTerme
source: révision de l'arrêté du 12 août 1976
abbreviation: liner @en
date parution JO: 2000-09-22
equivalent EN: airliner @en
equivalent EN: airliner (en)
equivalent EN: liner @en
equivalent EN: liner (en)
in scheme: Transports et mobilité
in scheme: concept-SD-transports-et-mobilite-transport-aerien
in scheme: concepts
notation: EQUI422

compagnie de transport régional
type: ConceptConcept
type: Concept
creator: Commission d'enrichissement de la langue française, FranceTerme
source: révision de l'arrêté du 21 septembre 1993
date parution JO: 2000-09-22
equivalent EN: commuter airline @en
equivalent EN: commuter airline (en)
forme abregee: compagnie régionale
in scheme: Transports et mobilité
in scheme: concepts
notation: EQUI423

vélo tout-terrain
type: ConceptConcept
type: Concept
creator: Commission d'enrichissement de la langue française, FranceTerme
source: révision de l'arrêté du 18 décembre 1990
abbreviation: VTT
date parution JO: 2000-09-22
equivalent EN: mountain bike @en
equivalent EN: mountain bike (en)
in scheme: Cycle
in scheme: concepts
notation: EQUI424
related: concept-SPOR272
related: concept-SPOR335
related: concept-SPOR461
related: concept-SPOR462

transporteur
type: ConceptConcept
type: Concept
creator: Commission d'enrichissement de la langue française, FranceTerme
source: révision de l'arrêté du 23 septembre 1987
date parution JO: 2000-09-22
equivalent EN: common carrier @en
equivalent EN: common carrier (en)
part of speech: nom masculin
in scheme: Transports et mobilité
in scheme: concept-SD-transports-et-mobilite-transport-maritime
in scheme: concepts
notation: EQUI425

tractage
type: ConceptConcept
type: Concept
creator: Commission d'enrichissement de la langue française, FranceTerme
source: révision de l'arrêté du 18 juillet 1989
date parution JO: 2000-09-22
equivalent EN: towing @en
equivalent EN: towing (en)
part of speech: nom masculin
in scheme: Transports et mobilité
in scheme: concept-SD-transports-et-mobilite-transport-aerien
in scheme: concepts
notation: EQUI426

tangage
type: ConceptConcept
type: Concept
creator: Commission d'enrichissement de la langue française, FranceTerme
source: révision de l'arrêté du 12 août 1976
date parution JO: 2000-09-22
equivalent EN: pitch @en
equivalent EN: pitch (en)
part of speech: nom masculin
in scheme: Transports et mobilité
in scheme: concept-SD-transports-et-mobilite-transport-aerien
in scheme: concept-SD-transports-et-mobilite-transport-maritime
in scheme: concepts
notation: EQUI427

service d'appoint
type: ConceptConcept
type: Concept
creator: Commission d'enrichissement de la langue française, FranceTerme
source: révision de l'arrêté du 23 septembre 1987
date parution JO: 2000-09-22
equivalent EN: back-up service @en
equivalent EN: back-up service (en)
in scheme: Transports et mobilité
in scheme: concept-SD-transports-et-mobilite-transport-maritime
in scheme: concepts
notation: EQUI428

service de navette
type: ConceptConcept
type: Concept
creator: Commission d'enrichissement de la langue française, FranceTerme
source: révision de l'arrêté du 18 juillet 1989
date parution JO: 2000-09-22
equivalent EN: shuttle service @en
equivalent EN: shuttle service (en)
in scheme: Transports et mobilité
in scheme: concepts
notation: EQUI429
related: navette

caravanier, -ière
type: ConceptConcept
type: Concept
creator: Commission d'enrichissement de la langue française, FranceTerme
source: révision de l'arrêté du 30 juin 1992
date parution JO: 2000-09-22
deconseille ou frequent: camper
deconseille ou frequent: caravaner
deconseille ou frequent: caravanner
equivalent EN: camper (US) @en
equivalent EN: camper (en-US)
equivalent EN: caravaner (GB) @en
equivalent EN: caravaner (en-GB)
equivalent EN: caravanner (GB) @en
equivalent EN: caravanner (en-GB)
part of speech: nom
definition: Utilisateur d'une caravane.
in scheme: Automobile
in scheme: Tourisme
in scheme: concepts
notation: EQUI43
note: On peut admettre l'usage adjectival du terme « caravanier ».
related: caravanier, -ière

remorquage
type: ConceptConcept
type: Concept
creator: Commission d'enrichissement de la langue française, FranceTerme
source: révision de l'arrêté du 18 juillet 1989
date parution JO: 2000-09-22
equivalent EN: towing @en
equivalent EN: towing (en)
part of speech: nom masculin
in scheme: Transports et mobilité
in scheme: concept-SD-transports-et-mobilite-transport-aerien
in scheme: concepts
notation: EQUI430

parc de stationnement
type: ConceptConcept
type: Concept
creator: Commission d'enrichissement de la langue française, FranceTerme
date parution JO: 2000-09-22
equivalent EN: car park (GB) @en
equivalent EN: car park (en-GB)
equivalent EN: parking @en
equivalent EN: parking (en)
equivalent EN: parking lot (US) @en
equivalent EN: parking lot (en-US)
forme abregee: parc, n.m.
in scheme: Aménagement et urbanisme
in scheme: Transports et mobilité
in scheme: concept-SD-amenagement-et-urbanisme-transport-routier
in scheme: concept-SD-transports-et-mobilite-transport-routier
in scheme: concepts
notation: EQUI432
related: parc relais
related: parc à étages

parc à étages
type: ConceptConcept
type: Concept
creator: Commission d'enrichissement de la langue française, FranceTerme
source: révision de l'arrêté du 27 mai 1992
date parution JO: 2000-09-22
equivalent EN: storey car park @en
equivalent EN: storey car park (en)
in scheme: Aménagement et urbanisme
in scheme: Transports et mobilité
in scheme: concept-SD-amenagement-et-urbanisme-transport-routier
in scheme: concept-SD-transports-et-mobilite-transport-routier
in scheme: concepts
notation: EQUI433
related: parc de stationnement

levage
type: ConceptConcept
type: Concept
creator: Commission d'enrichissement de la langue française, FranceTerme
source: révision de l'arrêté du 21 septembre 1993
date parution JO: 2000-09-22
equivalent EN: lift-off @en
equivalent EN: lift-off (en)
equivalent EN: lift-on @en
equivalent EN: lift-on (en)
part of speech: nom masculin
in scheme: Transports et mobilité
in scheme: concepts
notation: EQUI434

dérivation
type: ConceptConcept
type: Concept
creator: Commission d'enrichissement de la langue française, FranceTerme
source: révision de l'arrêté du 17 février 1986
date parution JO: 2000-09-22
equivalent EN: by-pass @en
equivalent EN: by-pass (en)
part of speech: nom féminin
in scheme: Habitat et construction
in scheme: Hydraulique
in scheme: concepts
notation: EQUI437

conteneur
type: ConceptConcept
type: Concept
creator: Commission d'enrichissement de la langue française, FranceTerme
source: révision de l'arrêté du 18 juillet 1989
date parution JO: 2000-09-22
equivalent EN: container @en
equivalent EN: container (en)
part of speech: nom masculin
in scheme: Transports et mobilité
in scheme: concepts
notation: EQUI438

chargeuse
type: ConceptConcept
type: Concept
creator: Commission d'enrichissement de la langue française, FranceTerme
source: révision de l'arrêté du 17 février 1986
date parution JO: 2000-09-22
equivalent EN: loader @en
equivalent EN: loader (en)
part of speech: nom féminin
definition: Engin automoteur équipé à l'avant d'un godet relevable et servant à soulever, à déplacer des matériaux.
in scheme: Habitat et construction
in scheme: concept-SD-habitat-et-construction-engins
in scheme: concepts
notation: EQUI44

couloir de péage
type: ConceptConcept
type: Concept
creator: Commission d'enrichissement de la langue française, FranceTerme
source: révision de l'arrêté du 27 mai 1992
date parution JO: 2000-09-22
equivalent EN: toll lane @en
equivalent EN: toll lane (en)
in scheme: Transports et mobilité
in scheme: concept-SD-transports-et-mobilite-transport-routier
in scheme: concepts
notation: EQUI441

colonne montante
type: ConceptConcept
type: Concept
creator: Commission d'enrichissement de la langue française, FranceTerme
source: révision de l'arrêté du 17 février 1986
date parution JO: 2000-09-22
equivalent EN: rise pipe @en
equivalent EN: rise pipe (en)
in scheme: Habitat et construction
in scheme: concepts
notation: EQUI442

colonne sèche
type: ConceptConcept
type: Concept
creator: Commission d'enrichissement de la langue française, FranceTerme
source: révision de l'arrêté du 17 février 1986
date parution JO: 2000-09-22
equivalent EN: dry standpipe @en
equivalent EN: dry standpipe (en)
in scheme: Habitat et construction
in scheme: concepts
notation: EQUI443

bardeau
type: ConceptConcept
type: Concept
creator: Commission d'enrichissement de la langue française, FranceTerme
source: révision de l'arrêté du 17 février 1986
date parution JO: 2000-09-22
equivalent EN: shingle @en
equivalent EN: shingle (en)
part of speech: nom masculin
in scheme: Habitat et construction
in scheme: concept-SD-habitat-et-construction-materiaux-de-construction
in scheme: concepts
notation: EQUI444

bajoyer
type: ConceptConcept
type: Concept
creator: Commission d'enrichissement de la langue française, FranceTerme
source: révision de l'arrêté du 17 février 1986
date parution JO: 2000-09-22
equivalent EN: dock wall @en
equivalent EN: dock wall (en)
part of speech: nom masculin
in scheme: Habitat et construction
in scheme: concepts
notation: EQUI445

isolant
type: ConceptConcept
type: Concept
creator: Commission d'enrichissement de la langue française, FranceTerme
source: révision de l'arrêté du 12 août 1976
date parution JO: 2000-09-22
equivalent EN: liner @en
equivalent EN: liner (en)
part of speech: nom masculin
in scheme: Énergie
in scheme: Habitat et construction
in scheme: concept-SD-energie-materiaux-de-construction
in scheme: concept-SD-habitat-et-construction-materiaux-de-construction
in scheme: concepts
notation: EQUI446
related: vêture isolante
related: isolant thermique

isolant thermique
type: ConceptConcept
type: Concept
creator: Commission d'enrichissement de la langue française, FranceTerme
source: révision de l'arrêté du 17 février 1986
date parution JO: 2000-09-22
equivalent EN: insulating material @en
equivalent EN: insulating material (en)
in scheme: Énergie
in scheme: Habitat et construction
in scheme: concept-SD-energie-materiaux-de-construction
in scheme: concept-SD-habitat-et-construction-materiaux-de-construction
in scheme: concepts
notation: EQUI447
related: vêture isolante
related: isolant
related: matériau alvéolaire
related: matériau fibreux

isolation thermique
type: ConceptConcept
type: Concept
creator: Commission d'enrichissement de la langue française, FranceTerme
source: révision de l'arrêté du 17 février 1986
date parution JO: 2000-09-22
equivalent EN: heat insulation @en
equivalent EN: heat insulation (en)
equivalent EN: thermal insulation @en
equivalent EN: thermal insulation (en)
in scheme: Énergie
in scheme: Habitat et construction
in scheme: concepts
notation: EQUI448
related: isolation hydrique

isolation thermique statique
type: ConceptConcept
type: Concept
creator: Commission d'enrichissement de la langue française, FranceTerme
source: révision de l'arrêté du 17 février 1986
date parution JO: 2000-09-22
equivalent EN: passive heat insulation @en
equivalent EN: passive heat insulation (en)
equivalent EN: static heat insulation @en
equivalent EN: static heat insulation (en)
equivalent EN: static thermal insulation @en
equivalent EN: static thermal insulation (en)
in scheme: Énergie
in scheme: Habitat et construction
in scheme: concepts
notation: EQUI449

chargeuse-pelleteuse
type: ConceptConcept
type: Concept
creator: Commission d'enrichissement de la langue française, FranceTerme
source: révision de l'arrêté du 17 février 1986
date parution JO: 2000-09-22
equivalent EN: back-hoe @en
equivalent EN: back-hoe (en)
equivalent EN: back-hoe loader @en
equivalent EN: back-hoe loader (en)
part of speech: nom féminin
definition: Engin automoteur comportant à l'avant un équipement de chargeuse, et à l'arrière un équipement de pelle.
in scheme: Habitat et construction
in scheme: concept-SD-habitat-et-construction-engins
in scheme: concepts
notation: EQUI45
related: concept-genie-civil-et-construction

isolation thermique dynamique
type: ConceptConcept
type: Concept
creator: Commission d'enrichissement de la langue française, FranceTerme
source: révision de l'arrêté du 17 février 1986
date parution JO: 2000-09-22
equivalent EN: active heat insulation @en
equivalent EN: active heat insulation (en)
equivalent EN: dynamic heat insulation @en
equivalent EN: dynamic heat insulation (en)
equivalent EN: dynamic thermal insulation @en
equivalent EN: dynamic thermal insulation (en)
in scheme: Énergie
in scheme: Habitat et construction
in scheme: concepts
notation: EQUI450

niveleuse
type: ConceptConcept
type: Concept
creator: Commission d'enrichissement de la langue française, FranceTerme
source: révision de l'arrêté du 17 février 1986
abbreviation: grader @en
date parution JO: 2000-09-22
equivalent EN: grader @en
equivalent EN: grader (en)
equivalent EN: land grader @en
equivalent EN: land grader (en)
equivalent EN: leveller @en
equivalent EN: leveller (en)
part of speech: nom féminin
in scheme: Habitat et construction
in scheme: concept-SD-habitat-et-construction-engins
in scheme: concepts
notation: EQUI451

noyau
type: ConceptConcept
type: Concept
creator: Commission d'enrichissement de la langue française, FranceTerme
source: révision de l'arrêté du 17 février 1986
date parution JO: 2000-09-22
equivalent EN: core @en
equivalent EN: core (en)
part of speech: nom masculin
in scheme: Habitat et construction
in scheme: concepts
notation: EQUI452

tombereau
type: ConceptConcept
type: Concept
creator: Commission d'enrichissement de la langue française, FranceTerme
source: révision de l'arrêté du 17 février 1986
date parution JO: 2000-09-22
equivalent EN: dumper @en
equivalent EN: dumper (en)
part of speech: nom masculin
in scheme: Habitat et construction
in scheme: concept-SD-habitat-et-construction-engins
in scheme: concepts
notation: EQUI453

travée
type: ConceptConcept
type: Concept
creator: Commission d'enrichissement de la langue française, FranceTerme
source: révision de l'arrêté du 17 février 1986
date parution JO: 2000-09-22
equivalent EN: case bay @en
equivalent EN: case bay (en)
part of speech: nom féminin
in scheme: Habitat et construction
in scheme: concepts
notation: EQUI454

salon professionnel
type: ConceptConcept
type: Concept
creator: Commission d'enrichissement de la langue française, FranceTerme
source: révision de l'arrêté du 30 juin 1992
date parution JO: 2000-09-22
equivalent EN: trade exhibition @en
equivalent EN: trade exhibition (en)
equivalent EN: trade show @en
equivalent EN: trade show (en)
in scheme: Économie et gestion d'entreprise
in scheme: Tourisme
in scheme: concepts
notation: EQUI455

saisonnalité
type: ConceptConcept
type: Concept
creator: Commission d'enrichissement de la langue française, FranceTerme
source: révision de l'arrêté du 30 juin 1992
date parution JO: 2000-09-22
equivalent EN: seasonality @en
equivalent EN: seasonality (en)
part of speech: nom féminin
in scheme: Tourisme
in scheme: concepts
notation: EQUI456

restauration rapide
type: ConceptConcept
type: Concept
creator: Commission d'enrichissement de la langue française, FranceTerme
source: révision de l'arrêté du 30 juin 1992
date parution JO: 2000-09-22
deconseille ou frequent: fast food
equivalent EN: fastfood @en
equivalent EN: fastfood (en)
broader: concept-restauration
in scheme: Restauration
in scheme: Tourisme
in scheme: concepts
notation: EQUI457

ralentisseur
type: ConceptConcept
type: Concept
creator: Commission d'enrichissement de la langue française, FranceTerme
source: révision de l'arrêté du 18 décembre 1990
date parution JO: 2000-09-22
equivalent EN: retarder @en
equivalent EN: retarder (en)
part of speech: nom masculin
in scheme: Automobile
in scheme: concepts
notation: EQUI458

passerelle
type: ConceptConcept
type: Concept
creator: Commission d'enrichissement de la langue française, FranceTerme
source: révision de l'arrêté du 18 juillet 1989
date parution JO: 2000-09-22
equivalent EN: jetway @en
equivalent EN: jetway (en)
part of speech: nom féminin
in scheme: Transports et mobilité
in scheme: concepts
notation: EQUI459

clairance
type: ConceptConcept
type: Concept
creator: Commission d'enrichissement de la langue française, FranceTerme
source: révision de l'arrêté du 18 juillet 1989
date parution JO: 2000-09-22
equivalent EN: clearance @en
equivalent EN: clearance (en)
part of speech: nom féminin
alternative label: autorisation de mouvement
definition: Autorisation donnée à un navire ou un aéronef de faire mouvement.
in scheme: Transports et mobilité
in scheme: concept-SD-transports-et-mobilite-transport-aerien
in scheme: concept-SD-transports-et-mobilite-transport-maritime
in scheme: concepts
notation: EQUI46
note: En ce qui concerne la circulation aérienne, cette autorisation est délivrée par les autorités chargées du contrôle.

transport pour le compte d'autrui
type: ConceptConcept
type: Concept
creator: Commission d'enrichissement de la langue française, FranceTerme
date parution JO: 1997-12-02
equivalent EN: common carriage @en
equivalent EN: common carriage (en)
in scheme: Transports et mobilité
in scheme: concept-SD-transports-et-mobilite-transport-de-marchandises
in scheme: concepts
notation: EQUI461

allonge de barre
type: ConceptConcept
type: Concept
creator: Commission d'enrichissement de la langue française, FranceTerme
date parution JO: 2003-06-20
equivalent EN: futtock @en
equivalent EN: futtock (en)
equivalent EN: tiller extension @en
equivalent EN: tiller extension (en)
forme abregee: allonge, n.f.
definition: Pièce s'articulant sur la barre et permettant la manœuvre en abord.
in scheme: Sports
in scheme: Transports et mobilité
in scheme: concept-SD-sports-transport-maritime
in scheme: concept-SD-transports-et-mobilite-transport-maritime
in scheme: concepts
notation: EQUI462

avitailleur de navire
type: ConceptConcept
type: Concept
creator: Commission d'enrichissement de la langue française, FranceTerme
date parution JO: 2003-06-20
equivalent EN: ship supplier @en
equivalent EN: ship supplier (en)
equivalent EN: shipchandler @en
equivalent EN: shipchandler (en)
definition: Entreprise ou personne spécialisée dans les fournitures pour navire.
in scheme: Transports et mobilité
in scheme: concept-SD-transports-et-mobilite-transport-maritime
in scheme: concepts
notation: EQUI463

coefficient de jauge
type: ConceptConcept
type: Concept
creator: Commission d'enrichissement de la langue française, FranceTerme
date parution JO: 2003-06-20
equivalent EN: rating @en
equivalent EN: rating (en)
forme abregee: coefficient, n.m.
definition: Coefficient calculé à partir des caractéristiques d'un voilier et que l'on applique au temps réel de parcours pour déterminer le temps corrigé.
in scheme: Sports
in scheme: concept-SD-sports-voile
in scheme: concepts
notation: EQUI464

compteur de vitesse
type: ConceptConcept
type: Concept
creator: Commission d'enrichissement de la langue française, FranceTerme
date parution JO: 2003-06-20
deconseille ou frequent: loch
deconseille ou frequent: spidomètre
equivalent EN: speedometer @en
equivalent EN: speedometer (en)
definition: Appareil destiné à mesurer la vitesse d'un navire.
in scheme: Sports
in scheme: Transports et mobilité
in scheme: concept-SD-sports-transport-maritime
in scheme: concept-SD-transports-et-mobilite-transport-maritime
in scheme: concepts
notation: EQUI465
note: 1. Le terme « spidomètre » est à déconseiller.
note: 2. On rencontre aussi le terme « loch ».

conteneur complet
type: ConceptConcept
type: Concept
creator: Commission d'enrichissement de la langue française, FranceTerme
abbreviation: CC
abbreviation: FCL @en
date parution JO: 2003-06-20
equivalent EN: FCL @en
equivalent EN: FCL (en)
equivalent EN: full container load @en
equivalent EN: full container load (en)
definition: Conteneur remis, prêt à l'embarquement, par un chargeur unique.
in scheme: Transports et mobilité
in scheme: concept-SD-transports-et-mobilite-transport-maritime
in scheme: concepts
notation: EQUI466

faux fret
type: ConceptConcept
type: Concept
creator: Commission d'enrichissement de la langue française, FranceTerme
abbreviation: DF @en
date parution JO: 2003-06-20
deconseille ou frequent: fret à la boîte
deconseille ou frequent: taxation à la boîte
equivalent EN: DF @en
equivalent EN: DF (en)
equivalent EN: dead freight @en
equivalent EN: dead freight (en)
definition: Montant dû au transporteur, en dédommagement du défaut de chargement de tout ou d'une partie des marchandises contractuellement prévues pour être embarquées.
in scheme: Transports et mobilité
in scheme: concept-SD-transports-et-mobilite-transport-maritime
in scheme: concepts
notation: EQUI467
note: On dit aussi « fret à la boîte » et « taxation à la boîte ».

fret au conteneur
type: ConceptConcept
type: Concept
creator: Commission d'enrichissement de la langue française, FranceTerme
abbreviation: FAC
abbreviation: FAK @en
date parution JO: 2003-06-20
equivalent EN: FAK @en
equivalent EN: FAK (en)
equivalent EN: freight all kind @en
equivalent EN: freight all kind (en)
definition: Prix de transport forfaitaire par conteneur, quel que soit le contenu.
in scheme: Transports et mobilité
in scheme: concept-SD-transports-et-mobilite-transport-maritime
in scheme: concepts
notation: EQUI468

transbordement
type: ConceptConcept
type: Concept
creator: Commission d'enrichissement de la langue française, FranceTerme
date parution JO: 2003-06-20
equivalent EN: transshipment @en
equivalent EN: transshipment (en)
part of speech: nom masculin
definition: Action de transférer un chargement d'un navire à un autre, éventuellement avec mise à quai intermédiaire.
in scheme: Transports et mobilité
in scheme: concept-SD-transports-et-mobilite-transport-maritime
in scheme: concepts
notation: EQUI469

coche de plaisance
type: ConceptConcept
type: Concept
creator: Commission d'enrichissement de la langue française, FranceTerme
source: révision de l'arrêté du 18 décembre 1990
date parution JO: 2000-09-22
deconseille ou frequent: coche d'eau
deconseille ou frequent: coche de rivière
equivalent EN: house-boat @en
equivalent EN: house-boat (en)
forme abregee: coche, n.m.
definition: Petit bateau habitable de tourisme fluvial.
in scheme: Transports et mobilité
in scheme: concept-SD-transports-et-mobilite-transport-fluvial
in scheme: concepts
notation: EQUI47
note: 1. Dans la règlementation française, le coche de plaisance a pour dimensions minimales et maximales cinq et quinze mètres, et ne peut accueillir plus de quatorze personnes.
note: 2. Le terme « coche de plaisance » a été formé à l'image des anciennes expressions « coche d'eau » et « coche de rivière ».

transmission en V
type: ConceptConcept
type: Concept
creator: Commission d'enrichissement de la langue française, FranceTerme
date parution JO: 2003-06-20
equivalent EN: V drive @en
equivalent EN: V drive (en)
definition: Transmission avec renvoi d'angle simple de l'arbre d'hélice.
in scheme: Transports et mobilité
in scheme: concept-SD-transports-et-mobilite-transport-maritime
in scheme: concepts
notation: EQUI470

transmission en Z
type: ConceptConcept
type: Concept
creator: Commission d'enrichissement de la langue française, FranceTerme
date parution JO: 2003-06-20
equivalent EN: Z drive @en
equivalent EN: Z drive (en)
definition: Transmission avec renvoi d'angle double de l'arbre d'hélice.
in scheme: Transports et mobilité
in scheme: concept-SD-transports-et-mobilite-transport-maritime
in scheme: concepts
notation: EQUI471

passerelle supérieure
type: ConceptConcept
type: Concept
creator: Commission d'enrichissement de la langue française, FranceTerme
date parution JO: 2003-06-20
equivalent EN: flying bridge @en
equivalent EN: flying bridge (en)
in scheme: Transports et mobilité
in scheme: concept-SD-transports-et-mobilite-transport-maritime
in scheme: concepts
notation: EQUI472

plan sustentateur
type: ConceptConcept
type: Concept
creator: Commission d'enrichissement de la langue française, FranceTerme
date parution JO: 2003-06-20
equivalent EN: foil @en
equivalent EN: foil (en)
in scheme: Marine
in scheme: concept-SD-marine-construction-navale
in scheme: concepts
notation: EQUI473

porte-barges
type: ConceptConcept
type: Concept
creator: Commission d'enrichissement de la langue française, FranceTerme
source: révision de l'arrêté du 23 septembre 1987
date parution JO: 2000-09-22
equivalent EN: barge carrier @en
equivalent EN: barge carrier (en)
equivalent EN: lighter carrier @en
equivalent EN: lighter carrier (en)
part of speech: nom masculin
in scheme: Transports et mobilité
in scheme: concept-SD-transports-et-mobilite-transport-maritime
in scheme: concepts
notation: EQUI475

déflecteur
type: ConceptConcept
type: Concept
creator: Commission d'enrichissement de la langue française, FranceTerme
source: révision de l'arrêté du 5 octobre 1984
date parution JO: 2000-09-22
equivalent EN: spoiler @en
equivalent EN: spoiler (en)
part of speech: nom masculin
definition: Dispositif aérodynamique modifiant l'écoulement de l'air autour d'un véhicule.
in scheme: Transports et mobilité
in scheme: concepts
notation: EQUI476
note: « Déflecteur » est un terme générique qui désigne, selon les cas, un becquet, une jupe, une bavette, un aileron, un volet, etc.

colonne en charge
type: ConceptConcept
type: Concept
creator: Commission d'enrichissement de la langue française, FranceTerme
source: révision de l'arrêté du 17 février 1986
date parution JO: 2000-09-22
equivalent EN: wet standpipe @en
equivalent EN: wet standpipe (en)
alternative label: colonne humide
definition: Tuyauterie verticale installée à demeure dans une construction, alimentée en eau sous pression et à l'usage des sapeurs-pompiers.
in scheme: Habitat et construction
in scheme: concepts
notation: EQUI48

vol direct
type: ConceptConcept
type: Concept
creator: Commission d'enrichissement de la langue française, FranceTerme
date parution JO: 2004-10-21
equivalent EN: direct flight @en
equivalent EN: direct flight (en)
definition: Vol d'un point à un autre sans changement d'avion, éventuellement avec atterrissage intermédiaire.
in scheme: Transports et mobilité
in scheme: concept-SD-transports-et-mobilite-transport-aerien
in scheme: concepts
notation: EQUI484
related: vol sans escale

vol sans escale
type: ConceptConcept
type: Concept
creator: Commission d'enrichissement de la langue française, FranceTerme
date parution JO: 2004-10-21
equivalent EN: non-stop flight @en
equivalent EN: non-stop flight (en)
definition: Vol d'un point à un autre sans atterrissage intermédiaire.
in scheme: Transports et mobilité
in scheme: concept-SD-transports-et-mobilite-transport-aerien
in scheme: concepts
notation: EQUI485
related: vol direct

antisalissure
type: ConceptConcept
type: Concept
creator: Commission d'enrichissement de la langue française, FranceTerme
date parution JO: 2004-10-22
equivalent EN: antifouling @en
equivalent EN: antifouling (en)
part of speech: adjectif
definition: Qualifie un revêtement ayant la propriété de s'opposer au développement d'organismes vivants sur les surfaces immergées.
in scheme: Sports
in scheme: Transports et mobilité
in scheme: concept-SD-sports-transport-maritime
in scheme: concept-SD-transports-et-mobilite-transport-maritime
in scheme: concepts
notation: EQUI486
related: encrassement biologique

dégazage
type: ConceptConcept
type: Concept
creator: Commission d'enrichissement de la langue française, FranceTerme
date parution JO: 2004-10-22
equivalent EN: degassing @en
equivalent EN: degassing (en)
part of speech: nom masculin
definition: Opération consistant, après déchargement, à ventiler les citernes à cargaison pour éliminer les gaz explosifs qu'elles contiennent.
in scheme: Transports et mobilité
in scheme: concept-SD-transports-et-mobilite-transport-maritime
in scheme: concepts
notation: EQUI487
note: Le terme « dégazage » est souvent utilisé improprement comme synonyme de « rejet en mer » (le plus souvent illicite) de déchets liquides ou solides.
related: rejet en mer

rejet en mer
type: ConceptConcept
type: Concept
creator: Commission d'enrichissement de la langue française, FranceTerme
date parution JO: 2004-10-22
equivalent EN: discharge @en
equivalent EN: discharge (en)
forme abregee: rejet, n.m.
definition: Le fait, pour un navire, de se débarrasser de résidus de cargaison ou de combustible en les rejetant à la mer.
in scheme: Transports et mobilité
in scheme: concept-SD-transports-et-mobilite-transport-maritime
in scheme: concepts
notation: EQUI488
note: Le terme « dégazage » est souvent utilisé improprement comme synonyme de « rejet en mer » (le plus souvent illicite) de déchets liquides ou solides.
related: dégazage

commodités
type: ConceptConcept
type: Concept
creator: Commission d'enrichissement de la langue française, FranceTerme
source: révision de l'arrêté du 17 février 1986
date parution JO: 2000-09-22
equivalent EN: utilities @en
equivalent EN: utilities (en)
part of speech: nom féminin pluriel
definition: Équipements qui apportent à une habitation, un immeuble, un quartier, le confort en rapport avec les modes de vie convenant à notre époque.
in scheme: Aménagement et urbanisme
in scheme: concepts
notation: EQUI49
note: Exemples : voirie, eau potable, électricité, évacuation des eaux usées, gaz notamment.

véhicule partagé
type: ConceptConcept
type: Concept
creator: Commission d'enrichissement de la langue française, FranceTerme
date parution JO: 2004-10-21
equivalent EN: shared car @en
equivalent EN: shared car (en)
alternative label: véhicule en temps partagé
definition: Véhicule dont l'usage est réservé à plusieurs utilisateurs successifs, selon une procédure de prise en charge simplifiée par rapport à la location traditionnelle.
in scheme: Transports et mobilité
in scheme: concept-SD-transports-et-mobilite-transport-terrestre
in scheme: concepts
notation: EQUI490
related: partage de véhicule

aconier
type: ConceptConcept
type: Concept
creator: Commission d'enrichissement de la langue française, FranceTerme
date parution JO: 2004-10-21
deconseille ou frequent: acconier
equivalent EN: stevedore @en
equivalent EN: stevedore (en)
part of speech: nom masculin
definition: Entrepreneur ou entreprise de manutention spécialisés dans l'embarquement et le débarquement de marchandises.
in scheme: Transports et mobilité
in scheme: concept-SD-transports-et-mobilite-transport-maritime
in scheme: concepts
notation: EQUI491

avis de mise à disposition
type: ConceptConcept
type: Concept
creator: Commission d'enrichissement de la langue française, FranceTerme
date parution JO: 2004-10-21
equivalent EN: notice of readiness @en
equivalent EN: notice of readiness (en)
definition: Document par lequel le capitaine notifie à l'affréteur que son navire est en mesure d'effectuer les opérations commerciales prévues au contrat.
in scheme: Transports et mobilité
in scheme: concept-SD-transports-et-mobilite-transport-maritime
in scheme: concepts
notation: EQUI492

corridor de fret
type: ConceptConcept
type: Concept
creator: Commission d'enrichissement de la langue française, FranceTerme
abbreviation: freightway @en
date parution JO: 2004-10-21
equivalent EN: freight corridor @en
equivalent EN: freight corridor (en)
equivalent EN: freight freeway @en
equivalent EN: freight freeway (en)
equivalent EN: freightway @en
equivalent EN: freightway (en)
definition: Infrastructure exploitée en commun par plusieurs gestionnaires pour permettre la circulation de trains de fret sur un même itinéraire ; par extension, l'ensemble des sillons horaires correspondants.
in scheme: Transports et mobilité
in scheme: concept-SD-transports-et-mobilite-transport-ferroviaire
in scheme: concepts
notation: EQUI493
related: sillon horaire

défaillance du voyageur
type: ConceptConcept
type: Concept
creator: Commission d'enrichissement de la langue française, FranceTerme
date parution JO: 2004-10-21
deconseille ou frequent: voyageur défaillant
equivalent EN: no-show @en
equivalent EN: no-show (en)
forme abregee: défaillance, n.f.
definition: Absence d'un voyageur ayant réservé une prestation de services.
in scheme: Tourisme
in scheme: Transports et mobilité
in scheme: concepts
notation: EQUI494
note: Ce voyageur est appelé « voyageur défaillant ».
related: défaillant, -e

éthylomètre
type: ConceptConcept
type: Concept
creator: Commission d'enrichissement de la langue française, FranceTerme
date parution JO: 2004-10-21
equivalent EN: breath analyzer @en
equivalent EN: breath analyzer (en)
part of speech: nom masculin
definition: Instrument de mesure de la concentration d'alcool dans l'air expiré.
in scheme: Transports et mobilité
in scheme: concept-SD-transports-et-mobilite-transport-terrestre
in scheme: concepts
notation: EQUI495
related: éthylotest

éthylotest
type: ConceptConcept
type: Concept
creator: Commission d'enrichissement de la langue française, FranceTerme
date parution JO: 2004-10-21
equivalent EN: alcohol test @en
equivalent EN: alcohol test (en)
equivalent EN: alcoholtest @en
equivalent EN: alcoholtest (en)
part of speech: nom masculin
definition: Appréciation du taux d'alcool dans l'air expiré au moyen d'un appareil ; cet appareil lui-même.
in scheme: Transports et mobilité
in scheme: concept-SD-transports-et-mobilite-transport-terrestre
in scheme: concepts
notation: EQUI496
related: éthylomètre

lettre de transport maritime
type: ConceptConcept
type: Concept
creator: Commission d'enrichissement de la langue française, FranceTerme
date parution JO: 2004-10-21
equivalent EN: seaway bill @en
equivalent EN: seaway bill (en)
definition: Document non négociable faisant preuve du contrat de transport maritime et des caractéristiques de la marchandise chargée.
in scheme: Transports et mobilité
in scheme: concept-SD-transports-et-mobilite-transport-maritime
in scheme: concepts
notation: EQUI497
note: À la différence du connaissement, la lettre de transport maritime ne constitue pas un titre représentatif de la marchandise.

mitage
type: ConceptConcept
type: Concept
creator: Commission d'enrichissement de la langue française, FranceTerme
date parution JO: 2004-10-21
equivalent EN: urban scattering @en
equivalent EN: urban scattering (en)
part of speech: nom masculin
definition: Prolifération non maîtrisée de constructions en milieu rural ou périurbain.
in scheme: Aménagement et urbanisme
in scheme: concepts
notation: EQUI498
related: étalement urbain
related: artificialisation des sols

salle d'embarquement
type: ConceptConcept
type: Concept
creator: Commission d'enrichissement de la langue française, FranceTerme
date parution JO: 2004-10-22
equivalent EN: boarding lounge @en
equivalent EN: boarding lounge (en)
equivalent EN: boarding room @en
equivalent EN: boarding room (en)
equivalent EN: departure lounge @en
equivalent EN: departure lounge (en)
equivalent EN: departure room @en
equivalent EN: departure room (en)
in scheme: Transports et mobilité
in scheme: concept-SD-transports-et-mobilite-transport-aerien
in scheme: concepts
notation: EQUI499

compartiment coupe-feu
type: ConceptConcept
type: Concept
creator: Commission d'enrichissement de la langue française, FranceTerme
source: révision de l'arrêté du 17 février 1986
date parution JO: 2000-09-22
equivalent EN: box @en
equivalent EN: box (en)
forme abregee: compartiment, n.m.
definition: Volume protégé par des parois coupe-feu.
in scheme: Habitat et construction
in scheme: concepts
notation: EQUI50

net de réserve
type: ConceptConcept
type: Concept
creator: Commission d'enrichissement de la langue française, FranceTerme
date parution JO: 2004-10-21
equivalent EN: clean on board @en
equivalent EN: clean on board (en)
definition: Se dit d'un connaissement sur lequel le transporteur n'a apposé aucune réserve relative aux marchandises lors de leur embarquement.
in scheme: Transports et mobilité
in scheme: concept-SD-transports-et-mobilite-transport-maritime
in scheme: concepts
notation: EQUI500

bagage enregistré
type: ConceptConcept
type: Concept
creator: Commission d'enrichissement de la langue française, FranceTerme
date parution JO: 2004-10-21
equivalent EN: checked-in baggage @en
equivalent EN: checked-in baggage (en)
equivalent EN: checked-in luggage @en
equivalent EN: checked-in luggage (en)
in scheme: Transports et mobilité
in scheme: concepts
notation: EQUI502

aménageur
type: ConceptConcept
type: Concept
creator: Commission d'enrichissement de la langue française, FranceTerme
date parution JO: 2004-10-21
equivalent EN: developer @en
equivalent EN: developer (en)
part of speech: nom masculin
in scheme: Aménagement et urbanisme
in scheme: concepts
notation: EQUI504

bagage à main
type: ConceptConcept
type: Concept
creator: Commission d'enrichissement de la langue française, FranceTerme
date parution JO: 2004-10-21
equivalent EN: hand baggage @en
equivalent EN: hand baggage (en)
equivalent EN: hand luggage @en
equivalent EN: hand luggage (en)
in scheme: Transports et mobilité
in scheme: concepts
notation: EQUI506

porte-autos
type: ConceptConcept
type: Concept
creator: Commission d'enrichissement de la langue française, FranceTerme
date parution JO: 2004-10-21
deconseille ou frequent: wagon porte-autos
equivalent EN: car carrier @en
equivalent EN: car carrier (en)
equivalent EN: car carrying wagon @en
equivalent EN: car carrying wagon (en)
part of speech: nom masculin invariable
definition: Véhicule aménagé pour le transport d'automobiles.
in scheme: Transports et mobilité
in scheme: concepts
notation: EQUI507
note: Pour les véhicules ferroviaires, on dit également « wagons porte-autos ».

reçu de bord
type: ConceptConcept
type: Concept
creator: Commission d'enrichissement de la langue française, FranceTerme
date parution JO: 2004-10-21
equivalent EN: mate's receipt @en
equivalent EN: mate's receipt (en)
definition: Document délivré par le second capitaine pour attester l'embarquement d'une marchandise.
in scheme: Transports et mobilité
in scheme: concept-SD-transports-et-mobilite-transport-maritime
in scheme: concepts
notation: EQUI508

compartiment individuel
type: ConceptConcept
type: Concept
creator: Commission d'enrichissement de la langue française, FranceTerme
source: révision de l'arrêté du 21 septembre 1993
date parution JO: 2000-09-22
deconseille ou frequent: cabine individuelle
equivalent EN: single @en
equivalent EN: single (en)
definition: Compartiment de voitures-lits aménagé pour une seule personne.
in scheme: Transports et mobilité
in scheme: concept-SD-transports-et-mobilite-transport-ferroviaire
in scheme: concepts
notation: EQUI51
note: En transport maritime, on utilise le terme « cabine individuelle ».

sillon horaire
type: ConceptConcept
type: Concept
creator: Commission d'enrichissement de la langue française, FranceTerme
date parution JO: 2004-10-21
equivalent EN: slot @en
equivalent EN: slot (en)
equivalent EN: train path @en
equivalent EN: train path (en)
forme abregee: sillon, n.m.
definition: Période durant laquelle une infrastructure donnée est affectée à la circulation d'un train entre deux points du réseau ferré.
in scheme: Transports et mobilité
in scheme: concept-SD-transports-et-mobilite-transport-ferroviaire
in scheme: concepts
notation: EQUI510
related: corridor de fret

navette
type: ConceptConcept
type: Concept
creator: Commission d'enrichissement de la langue française, FranceTerme
date parution JO: 2004-10-21
equivalent EN: shuttle @en
equivalent EN: shuttle (en)
part of speech: nom féminin
in scheme: Transports et mobilité
in scheme: concepts
notation: EQUI511
related: service de navette
related: cadencement

train auto-couchettes
type: ConceptConcept
type: Concept
creator: Commission d'enrichissement de la langue française, FranceTerme
abbreviation: CST @en
abbreviation: TAC
date parution JO: 2004-10-21
equivalent EN: CST @en
equivalent EN: CST (en)
equivalent EN: car-sleeper train @en
equivalent EN: car-sleeper train (en)
definition: Train qui transporte des automobiles et qui offre des places couchées à leurs passagers.
in scheme: Transports et mobilité
in scheme: concept-SD-transports-et-mobilite-transport-ferroviaire
in scheme: concepts
notation: EQUI512

délestage
type: ConceptConcept
type: Concept
creator: Commission d'enrichissement de la langue française, FranceTerme
source: révision de l'arrêté du 27 mai 1992
date parution JO: 2000-09-22
equivalent EN: diversion @en
equivalent EN: diversion (en)
part of speech: nom masculin
definition: En transport routier, déviation sélective d'un flux de circulation, destinée à résorber des encombrements.
in scheme: Transports et mobilité
in scheme: concept-SD-transports-et-mobilite-transport-routier
in scheme: concepts
notation: EQUI515

zonage
type: ConceptConcept
type: Concept
creator: Commission d'enrichissement de la langue française, FranceTerme
source: révision de l'arrêté du 17 février 1986
date parution JO: 2000-09-22
equivalent EN: zoning @en
equivalent EN: zoning (en)
part of speech: nom masculin
in scheme: Aménagement et urbanisme
in scheme: concepts
notation: EQUI516

création architecturale
type: ConceptConcept
type: Concept
creator: Commission d'enrichissement de la langue française, FranceTerme
source: révision de l'arrêté du 17 février 1986
date parution JO: 2000-09-22
equivalent EN: architectural design @en
equivalent EN: architectural design (en)
alternative label: stylisme architectural
in scheme: Habitat et construction
in scheme: concept-SD-habitat-et-construction-architecture
in scheme: concepts
notation: EQUI518

pétrolier-vraquier-minéralier
type: ConceptConcept
type: Concept
creator: Commission d'enrichissement de la langue française, FranceTerme
source: révision de l'arrêté du 28 novembre 1985
abbreviation: OBO carrier @en
date parution JO: 2000-09-22
equivalent EN: OBO carrier @en
equivalent EN: OBO carrier (en)
equivalent EN: oil-bulk-ore carrier @en
equivalent EN: oil-bulk-ore carrier (en)
part of speech: nom masculin
in scheme: Pétrole et gaz
in scheme: Transports et mobilité
in scheme: concept-SD-petrole-et-gaz-transport-maritime
in scheme: concept-SD-transports-et-mobilite-transport-maritime
in scheme: concepts
notation: EQUI519

composant
type: ConceptConcept
type: Concept
creator: Commission d'enrichissement de la langue française, FranceTerme
source: révision de l'arrêté du 17 février 1986
date parution JO: 2000-09-22
equivalent EN: component @en
equivalent EN: component (en)
part of speech: nom masculin
definition: Produit fabriqué comme unité distincte pour une ou plusieurs fonctions spécifiques, destiné à être intégré dans une construction.
in scheme: Habitat et construction
in scheme: concept-SD-habitat-et-construction-materiaux-de-construction
in scheme: concepts
notation: EQUI52

couverture
type: ConceptConcept
type: Concept
creator: Commission d'enrichissement de la langue française, FranceTerme
source: révision de l'arrêté du 17 février 1986
date parution JO: 2000-09-22
equivalent EN: roofing @en
equivalent EN: roofing (en)
part of speech: nom féminin
in scheme: Habitat et construction
in scheme: concepts
notation: EQUI520

connaissement complet
type: ConceptConcept
type: Concept
creator: Commission d'enrichissement de la langue française, FranceTerme
source: révision de l'arrêté du 23 septembre 1987
date parution JO: 2000-09-22
equivalent EN: long form @en
equivalent EN: long form (en)
definition: Connaissement sur lequel figure, outre les conditions particulières du transport considéré, la totalité des conditions générales de transport de la compagnie.
in scheme: Transports et mobilité
in scheme: concept-SD-transports-et-mobilite-transport-maritime
in scheme: concepts
notation: EQUI521

navire principal
type: ConceptConcept
type: Concept
creator: Commission d'enrichissement de la langue française, FranceTerme
source: révision de l'arrêté du 23 septembre 1987
date parution JO: 2000-09-22
deconseille ou frequent: porte-conteneur
equivalent EN: mother ship @en
equivalent EN: mother ship (en)
definition: Dans une opération associant gros porte-conteneurs faisant peu d'escales et navires plus petits desservant d'autres ports de la région, désigne un gros porte-conteneur.
in scheme: Transports et mobilité
in scheme: concept-SD-transports-et-mobilite-transport-maritime
in scheme: concepts
notation: EQUI522
related: navire collecteur
related: port d'éclatement

galerie marchande
type: ConceptConcept
type: Concept
creator: Commission d'enrichissement de la langue française, FranceTerme
source: révision de l'arrêté du 17 février 1986
date parution JO: 2000-09-22
equivalent EN: shopping mall @en
equivalent EN: shopping mall (en)
in scheme: Économie et gestion d'entreprise
in scheme: Habitat et construction
in scheme: concepts
notation: EQUI523

tirage
type: ConceptConcept
type: Concept
creator: Commission d'enrichissement de la langue française, FranceTerme
source: révision de l'arrêté du 17 février 1986
date parution JO: 2000-09-22
equivalent EN: printing @en
equivalent EN: printing (en)
part of speech: nom masculin
in scheme: Habitat et construction
in scheme: concept-SD-habitat-et-construction-architecture
in scheme: concepts
notation: EQUI524

salle de séjour
type: ConceptConcept
type: Concept
creator: Commission d'enrichissement de la langue française, FranceTerme
source: révision de l'arrêté du 17 février 1986
date parution JO: 2000-09-22
equivalent EN: living room @en
equivalent EN: living room (en)
in scheme: Habitat et construction
in scheme: concepts
notation: EQUI525

conseil architectural
type: ConceptConcept
type: Concept
creator: Commission d'enrichissement de la langue française, FranceTerme
source: révision de l'arrêté du 17 février 1986
date parution JO: 2000-09-22
equivalent EN: architectural advice @en
equivalent EN: architectural advice (en)
in scheme: Habitat et construction
in scheme: concept-SD-habitat-et-construction-architecture
in scheme: concepts
notation: EQUI526

balise
type: ConceptConcept
type: Concept
creator: Commission d'enrichissement de la langue française, FranceTerme
date parution JO: 2007-06-10
equivalent EN: beacon @en
equivalent EN: beacon (en)
part of speech: nom féminin
definition: Dispositif radioélectrique fixe de télécommunication à faible distance avec des véhicules.
in scheme: Transports et mobilité
in scheme: concept-SD-transports-et-mobilite-transport-terrestre
in scheme: concepts
notation: EQUI529
note: 1. La communication s'établit à la suite d'une interrogation provenant, selon le système, soit de la balise, soit du véhicule.
note: 2. Les informations transmises aux véhicules concernent par exemple le trafic à proximité, et celles reçues des véhicules permettent notamment leur identification.
scope note: Cette publication annule et remplace celle du Journal officiel du 22 septembre 2000.

conduit collecteur
type: ConceptConcept
type: Concept
creator: Commission d'enrichissement de la langue française, FranceTerme
source: révision de l'arrêté du 17 février 1986
date parution JO: 2000-09-22
equivalent EN: shunt @en
equivalent EN: shunt (en)
definition: Gaine d'évacuation des fumées ou de ventilation constituant un tronçon commun sur lequel viennent se brancher les raccordements individuels de hauteur d'étage.
in scheme: Habitat et construction
in scheme: concepts
notation: EQUI53
related: conduit collectif

chef de bord
type: ConceptConcept
type: Concept
creator: Commission d'enrichissement de la langue française, FranceTerme
date parution JO: 2007-06-10
equivalent EN: train manager @en
equivalent EN: train manager (en)
definition: Personne responsable, à bord d'un train, de la sécurité et des services proposés aux voyageurs.
in scheme: Transports et mobilité
in scheme: concept-SD-transports-et-mobilite-transport-ferroviaire
in scheme: concepts
notation: EQUI530

chef de bord
type: ConceptConcept
type: Concept
creator: Commission d'enrichissement de la langue française, FranceTerme
date parution JO: 2007-06-10
equivalent EN: captain @en
equivalent EN: captain (en)
equivalent EN: skipper @en
equivalent EN: skipper (en)
definition: Personne responsable du pilotage d'un navire.
in scheme: Sports
in scheme: Transports et mobilité
in scheme: concept-SD-sports-plaisance
in scheme: concept-SD-transports-et-mobilite-plaisance
in scheme: concepts
notation: EQUI531

contrôle en vol
type: ConceptConcept
type: Concept
creator: Commission d'enrichissement de la langue française, FranceTerme
date parution JO: 2007-06-10
deconseille ou frequent: calibration
equivalent EN: flight inspection @en
equivalent EN: flight inspection (en)
definition: Vérification en vol, par un avion spécialement équipé, du bon fonctionnement des systèmes de navigation au sol ou par satellite.
in scheme: Aéronautique
in scheme: Transports et mobilité
in scheme: concept-SD-aeronautique-transport-aerien
in scheme: concept-SD-transports-et-mobilite-transport-aerien
in scheme: concepts
notation: EQUI532
note: On trouve aussi, dans le langage professionnel, le terme « calibration ».

embranchement particulier
type: ConceptConcept
type: Concept
creator: Commission d'enrichissement de la langue française, FranceTerme
date parution JO: 2007-06-10
deconseille ou frequent: embranchement dédié
equivalent EN: private siding @en
equivalent EN: private siding (en)
definition: Voie ou ensemble de voies privées raccordées à un réseau de chemin de fer de façon à assurer, sans transbordement, la desserte d'établissements industriels ou commerciaux, d'installations portuaires.
in scheme: Aménagement et urbanisme
in scheme: Transports et mobilité
in scheme: concept-SD-amenagement-et-urbanisme-transport-ferroviaire
in scheme: concept-SD-transports-et-mobilite-transport-ferroviaire
in scheme: concepts
notation: EQUI533
note: L'expression « embranchement dédié » ne doit pas être utilisée.

exploitant
type: ConceptConcept
type: Concept
creator: Commission d'enrichissement de la langue française, FranceTerme
date parution JO: 2007-06-10
deconseille ou frequent: opérateur
equivalent EN: operator @en
equivalent EN: operator (en)
part of speech: nom masculin
definition: Personne physique ou morale qui assure le fonctionnement et la gestion commerciale d'un service maritime, ferroviaire, routier ou aérien.
in scheme: Transports et mobilité
in scheme: concepts
notation: EQUI534
note: Le terme « opérateur » ne doit pas être employé dans ce sens.

ferroutage
type: ConceptConcept
type: Concept
creator: Commission d'enrichissement de la langue française, FranceTerme
date parution JO: 2007-06-10
equivalent EN: Huckepack @de
equivalent EN: Huckepack (de)
equivalent EN: piggyback @en
equivalent EN: piggyback (en)
equivalent EN: rail-road transport @en
equivalent EN: rail-road transport (en)
equivalent EN: road-rail transport @en
equivalent EN: road-rail transport (en)
part of speech: nom masculin
definition: Transport intermodal de marchandises, utilisant des véhicules routiers acheminés sur des wagons.
in scheme: Transports et mobilité
in scheme: concepts
notation: EQUI535
related: transport intermodal
related: autoroute ferroviaire

forfait
type: ConceptConcept
type: Concept
creator: Commission d'enrichissement de la langue française, FranceTerme
date parution JO: 2007-06-10
equivalent EN: package @en
equivalent EN: package (en)
part of speech: nom masculin
definition: Ensemble de prestations proposées à la vente à un prix global.
in scheme: Tous domaines
in scheme: concepts
notation: EQUI536
related: voyage à forfait

géodistribution systématisée
type: ConceptConcept
type: Concept
creator: Commission d'enrichissement de la langue française, FranceTerme
abbreviation: GDS
date parution JO: 2007-06-10
equivalent EN: GDS @en
equivalent EN: GDS (en)
equivalent EN: global distribution system @en
equivalent EN: global distribution system (en)
forme abregee: géodistribution, n.f.
definition: Système informatisé traitant, à l'échelle mondiale et de manière coordonnée, en totalité ou en partie, les prestations liées au transport, au tourisme, à l'hôtellerie et aux loisirs.
in scheme: Transports et mobilité
in scheme: concepts
notation: EQUI537
scope note: Cette publication annule et remplace celle des termes « géodistribution » et « système mondial de distribution » au Journal officiel du 2 décembre 1997.

lecteur
type: ConceptConcept
type: Concept
creator: Commission d'enrichissement de la langue française, FranceTerme
date parution JO: 2007-06-10
equivalent EN: card reader @en
equivalent EN: card reader (en)
part of speech: nom masculin
definition: Boîtier permettant de lire tout ou partie des données informatisées d'une carte à puce en les affichant en clair sur un écran.
in scheme: Tous domaines
in scheme: concepts
notation: EQUI538
related: valideur

passe
type: ConceptConcept
type: Concept
creator: Commission d'enrichissement de la langue française, FranceTerme
date parution JO: 2007-06-10
equivalent EN: badge @en
equivalent EN: badge (en)
equivalent EN: pass @en
equivalent EN: pass (en)
part of speech: nom masculin
definition: Carte permettant à son détenteur de franchir un contrôle après avoir été identifiée par l'organisme émetteur, et à ce dernier de vérifier la validité des données, de gérer le compte du détenteur et de recueillir diverses informations.
in scheme: Tous domaines
in scheme: Transports et mobilité
in scheme: concepts
notation: EQUI539
note: Un passe peut fonctionner avec ou sans contact.

conduit collectif
type: ConceptConcept
type: Concept
creator: Commission d'enrichissement de la langue française, FranceTerme
source: révision de l'arrêté du 17 février 1986
date parution JO: 2000-09-22
equivalent EN: shunt @en
equivalent EN: shunt (en)
definition: Gaine d'évacuation des fumées ou de ventilation, constituée d'un conduit collecteur sur toute la hauteur du bâtiment et de raccordements à chaque étage, cheminant parallèlement au collecteur et débouchant dans celui-ci.
in scheme: Habitat et construction
in scheme: concepts
notation: EQUI54
related: conduit collecteur

tarification en temps réel
type: ConceptConcept
type: Concept
creator: Commission d'enrichissement de la langue française, FranceTerme
abbreviation: TTR
date parution JO: 2007-06-10
equivalent EN: yield management @en
equivalent EN: yield management (en)
definition: Ensemble des techniques de gestion consistant à utiliser au mieux tout ou partie des ressources d'une entreprise en vue d'augmenter ses recettes, grâce à un ajustement permanent des tarifs aux possibilités du marché.
in scheme: Économie et gestion d'entreprise
in scheme: Transports et mobilité
in scheme: concepts
notation: EQUI540
note: Dans le domaine des transports, on trouve aussi le terme « optimisation commerciale ».
scope note: Cette publication annule et remplace celle du Journal officiel du 22 septembre 2000.

tram-train
type: ConceptConcept
type: Concept
creator: Commission d'enrichissement de la langue française, FranceTerme
date parution JO: 2007-06-10
equivalent EN: Stadtbahn @de
equivalent EN: Stadtbahn (de)
part of speech: nom masculin
definition: Tramway pouvant circuler tant en ville que sur le réseau ferroviaire régional.
in scheme: Transports et mobilité
in scheme: concept-SD-transports-et-mobilite-transport-ferroviaire
in scheme: concepts
notation: EQUI541

tramway sur pneus
type: ConceptConcept
type: Concept
creator: Commission d'enrichissement de la langue française, FranceTerme
abbreviation: GLT @en
date parution JO: 2007-06-10
deconseille ou frequent: tram on tire
deconseille ou frequent: tram on tires
deconseille ou frequent: tram on tyre
deconseille ou frequent: tram on tyres
equivalent EN: GLT @en
equivalent EN: GLT (en)
equivalent EN: guided light transit @en
equivalent EN: guided light transit (en)
equivalent EN: tram on tires (GB) @en
equivalent EN: tram on tires (en-GB)
equivalent EN: tram on tyres (US) @en
equivalent EN: tram on tyres (en-US)
definition: Véhicule de transport en commun circulant en surface, équipé de pneus et doté d'un dispositif de guidage au sol.
in scheme: Transports et mobilité
in scheme: concept-SD-transports-et-mobilite-transport-ferroviaire
in scheme: concepts
notation: EQUI542
note: L'équivalent étranger GLT s'applique aussi à des véhicules sur rails.

transport intermodal
type: ConceptConcept
type: Concept
creator: Commission d'enrichissement de la langue française, FranceTerme
date parution JO: 2007-06-10
deconseille ou frequent: intermodal
equivalent EN: intermodal transport @en
equivalent EN: intermodal transport (en)
alternative label: transport combiné
definition: Transport multimodal de marchandises dans le même contenant sur la totalité du trajet.
in scheme: Transports et mobilité
in scheme: concepts
notation: EQUI543
related: ferroutage
related: transport multimodal
related: wagon squelette
related: wagon surbaissé
related: merroutage

transport multimodal
type: ConceptConcept
type: Concept
creator: Commission d'enrichissement de la langue française, FranceTerme
date parution JO: 2007-06-10
deconseille ou frequent: multimodal
equivalent EN: multimodal transport @en
equivalent EN: multimodal transport (en)
definition: Acheminement de voyageurs ou de marchandises par au moins deux modes de transport successifs.
in scheme: Transports et mobilité
in scheme: concepts
notation: EQUI544
related: transport intermodal
related: compte de mobilité
related: mobilité par association de services

trottoir rapide
type: ConceptConcept
type: Concept
creator: Commission d'enrichissement de la langue française, FranceTerme
date parution JO: 2007-06-10
deconseille ou frequent: Gateway
equivalent EN: high speed travelator @en
equivalent EN: high speed travelator (en)
definition: Trottoir mécanique sur lequel les piétons peuvent être transportés à une vitesse supérieure à celle d'un trottoir roulant.
in scheme: Transports et mobilité
in scheme: concepts
notation: EQUI545
note: « Gateway », qui est un nom de marque, ne doit pas être employé.

valideur
type: ConceptConcept
type: Concept
creator: Commission d'enrichissement de la langue française, FranceTerme
date parution JO: 2007-06-10
equivalent EN: Entwerter @de
equivalent EN: Entwerter (de)
equivalent EN: validator @en
equivalent EN: validator (en)
part of speech: nom masculin
definition: Appareil qui, après avoir validé un titre de transport, autorise le passage de son détenteur.
in scheme: Transports et mobilité
in scheme: concepts
notation: EQUI546
related: lecteur

wagon roulier
type: ConceptConcept
type: Concept
creator: Commission d'enrichissement de la langue française, FranceTerme
date parution JO: 2007-06-10
equivalent EN: Niederflurwagen @de
equivalent EN: Niederflurwagen (de)
equivalent EN: rolling-road wagon @en
equivalent EN: rolling-road wagon (en)
definition: Wagon spécialement conçu pour permettre l'accès direct des camions.
in scheme: Transports et mobilité
in scheme: concept-SD-transports-et-mobilite-transport-ferroviaire
in scheme: concepts
notation: EQUI547

wagon squelette
type: ConceptConcept
type: Concept
creator: Commission d'enrichissement de la langue française, FranceTerme
date parution JO: 2007-06-10
deconseille ou frequent: spine wagon
equivalent EN: «spine» wagon @en
equivalent EN: «spine» wagon (en)
definition: Wagon à châssis nu, conçu pour le transport intermodal.
in scheme: Transports et mobilité
in scheme: concept-SD-transports-et-mobilite-transport-ferroviaire
in scheme: concepts
notation: EQUI548
related: transport intermodal

wagon surbaissé
type: ConceptConcept
type: Concept
creator: Commission d'enrichissement de la langue française, FranceTerme
date parution JO: 2007-06-10
equivalent EN: Tiefladewagen @de
equivalent EN: Tiefladewagen (de)
equivalent EN: low-floor wagon @en
equivalent EN: low-floor wagon (en)
definition: Wagon dont la hauteur du plancher a été fortement réduite pour permettre le transport d'objets volumineux, tels que ceux destinés au transport intermodal.
in scheme: Transports et mobilité
in scheme: concept-SD-transports-et-mobilite-transport-ferroviaire
in scheme: concepts
notation: EQUI549
related: transport intermodal

connaissement abrégé
type: ConceptConcept
type: Concept
creator: Commission d'enrichissement de la langue française, FranceTerme
source: révision de l'arrêté du 23 septembre 1987
date parution JO: 2000-09-22
equivalent EN: short form @en
equivalent EN: short form (en)
definition: Version simplifiée de connaissement qui ne comporte que les conditions particulières et renvoie aux conditions générales du transporteur maritime.
in scheme: Transports et mobilité
in scheme: concept-SD-transports-et-mobilite-transport-maritime
in scheme: concepts
notation: EQUI55

poste d'aiguillage informatisé
type: ConceptConcept
type: Concept
creator: Commission d'enrichissement de la langue française, FranceTerme
abbreviation: PAI
abbreviation: SSI @en
date parution JO: 2007-06-10
equivalent EN: SSI @en
equivalent EN: SSI (en)
equivalent EN: solid state interlocking @en
equivalent EN: solid state interlocking (en)
in scheme: Transports et mobilité
in scheme: concept-SD-transports-et-mobilite-transport-ferroviaire
in scheme: concepts
notation: EQUI550

profil tarifaire
type: ConceptConcept
type: Concept
creator: Commission d'enrichissement de la langue française, FranceTerme
date parution JO: 2007-06-10
equivalent EN: profile @en
equivalent EN: profile (en)
forme abregee: profil, n.m.
in scheme: Économie et gestion d'entreprise
in scheme: Transports et mobilité
in scheme: concepts
notation: EQUI551

additif
type: ConceptConcept
type: Concept
creator: Commission d'enrichissement de la langue française, FranceTerme
date parution JO: 2007-07-22
equivalent EN: additive agent (US) @en
equivalent EN: additive agent (en-US)
equivalent EN: dope (GB) @en
equivalent EN: dope (en-GB)
part of speech: nom masculin
definition: Constituant secondaire, incorporé à faible dose dans un matériau ou un produit pour en modifier l'une des propriétés.
in scheme: Habitat et construction
in scheme: concept-SD-habitat-et-construction-materiaux-de-construction
in scheme: concepts
notation: EQUI552
note: Les pigments et les agents de mouture sont des exemples d'additifs.

adjuvant
type: ConceptConcept
type: Concept
creator: Commission d'enrichissement de la langue française, FranceTerme
date parution JO: 2007-07-22
deconseille ou frequent: additive
deconseille ou frequent: admixture
equivalent EN: additive (GB) @en
equivalent EN: additive (en-GB)
equivalent EN: admixture (US) @en
equivalent EN: admixture (en-US)
part of speech: nom masculin
definition: Tout additif introduit dans un mortier ou un béton.
in scheme: Habitat et construction
in scheme: concept-SD-habitat-et-construction-materiaux-de-construction
in scheme: concepts
notation: EQUI553
note: Les cendres volantes et les fumées de silice sont des exemples d'adjuvants du béton.

âme
type: ConceptConcept
type: Concept
creator: Commission d'enrichissement de la langue française, FranceTerme
abbreviation: core @en
date parution JO: 2007-07-22
equivalent EN: core @en
equivalent EN: core (en)
equivalent EN: core wire @en
equivalent EN: core wire (en)
equivalent EN: king wire @en
equivalent EN: king wire (en)
part of speech: nom féminin
definition: Élément central d'un câble ou d'un toron, constitué par un fil unique ou plusieurs fils torsadés.
in scheme: Habitat et construction
in scheme: concepts
notation: EQUI554

âme
type: ConceptConcept
type: Concept
creator: Commission d'enrichissement de la langue française, FranceTerme
date parution JO: 2007-07-22
equivalent EN: web plate @en
equivalent EN: web plate (en)
part of speech: nom féminin
definition: Partie centrale d'un profilé.
in scheme: Habitat et construction
in scheme: concepts
notation: EQUI555

âme
type: ConceptConcept
type: Concept
creator: Commission d'enrichissement de la langue française, FranceTerme
abbreviation: web @en
date parution JO: 2007-07-22
equivalent EN: girder web @en
equivalent EN: girder web (en)
equivalent EN: web @en
equivalent EN: web (en)
equivalent EN: web of the girder @en
equivalent EN: web of the girder (en)
part of speech: nom féminin
definition: Élément d'une poutre reliant la membrure supérieure et la membrure inférieure.
in scheme: Habitat et construction
in scheme: concepts
notation: EQUI556

appareil d'appui
type: ConceptConcept
type: Concept
creator: Commission d'enrichissement de la langue française, FranceTerme
abbreviation: bearing @en
date parution JO: 2007-07-22
equivalent EN: bearing @en
equivalent EN: bearing (en)
equivalent EN: bearing device @en
equivalent EN: bearing device (en)
definition: Dispositif placé entre une structure et un appui, qui permet les déplacements de la structure (rotations ou translations) en faisant supporter par l'appui les efforts verticaux ou obliques.
in scheme: Habitat et construction
in scheme: concepts
notation: EQUI557
note: Dans le cas d'un pont, les appareils d'appui transmettent aux piles et aux culées les charges exercées par le tablier de l'ouvrage.

arase
type: ConceptConcept
type: Concept
creator: Commission d'enrichissement de la langue française, FranceTerme
date parution JO: 2007-07-22
equivalent EN: level surface @en
equivalent EN: level surface (en)
part of speech: nom féminin
definition: Partie supérieure d'un terrassement, avant les dernières opérations de nivellement.
in scheme: Habitat et construction
in scheme: concepts
notation: EQUI558

arase
type: ConceptConcept
type: Concept
creator: Commission d'enrichissement de la langue française, FranceTerme
date parution JO: 2007-07-22
equivalent EN: course @en
equivalent EN: course (en)
part of speech: nom féminin
definition: Hauteur atteinte par la tête des pieux d'une fondation, après que ceux-ci ont été recépés.
in scheme: Habitat et construction
in scheme: concepts
notation: EQUI559

contingent
type: ConceptConcept
type: Concept
creator: Commission d'enrichissement de la langue française, FranceTerme
source: révision de l'arrêté du 30 juin 1992
date parution JO: 2000-09-22
equivalent EN: allotment @en
equivalent EN: allotment (en)
part of speech: nom masculin
definition: Capacité d'hébergement ou de transport attribuée par un prestataire à un tiers.
in scheme: Tourisme
in scheme: concepts
notation: EQUI56
note: Le terme « allotement » ne doit pas être employé.

armature
type: ConceptConcept
type: Concept
creator: Commission d'enrichissement de la langue française, FranceTerme
abbreviation: re-bar @en
date parution JO: 2007-07-22
equivalent EN: re-bar @en
equivalent EN: re-bar (en)
equivalent EN: reinforcement bar @en
equivalent EN: reinforcement bar (en)
part of speech: nom féminin
definition: Barre ou fil incorporé dans un ouvrage en béton pour améliorer la résistance à la traction ou, éventuellement, à la compression ou au cisaillement.
in scheme: Habitat et construction
in scheme: concept-SD-habitat-et-construction-materiaux-de-construction
in scheme: concepts
notation: EQUI560
related: cisaillement

armature d'attente
type: ConceptConcept
type: Concept
creator: Commission d'enrichissement de la langue française, FranceTerme
date parution JO: 2007-07-22
equivalent EN: projecting reinforcement @en
equivalent EN: projecting reinforcement (en)
equivalent EN: starter @en
equivalent EN: starter (en)
forme abregee: attente, n.f.
definition: Armature qu'on laisse dépasser d'un élément en béton, en vue d'assurer la liaison avec un autre élément, coulé ultérieurement.
in scheme: Habitat et construction
in scheme: concept-SD-habitat-et-construction-materiaux-de-construction
in scheme: concepts
notation: EQUI561

armaturier
type: ConceptConcept
type: Concept
creator: Commission d'enrichissement de la langue française, FranceTerme
abbreviation: reinforcement manufacturer @en
date parution JO: 2007-07-22
equivalent EN: reinforcement cage manufacturer @en
equivalent EN: reinforcement cage manufacturer (en)
equivalent EN: reinforcement manufacturer @en
equivalent EN: reinforcement manufacturer (en)
part of speech: nom masculin
definition: Industriel spécialisé dans la fabrication de systèmes d'armatures.
in scheme: Habitat et construction
in scheme: concept-SD-habitat-et-construction-materiaux-de-construction
in scheme: concepts
notation: EQUI562

autocontrainte
type: ConceptConcept
type: Concept
creator: Commission d'enrichissement de la langue française, FranceTerme
abbreviation: self stressing @en
date parution JO: 2007-07-22
equivalent EN: self stressing @en
equivalent EN: self stressing (en)
equivalent EN: self-induced stressing @en
equivalent EN: self-induced stressing (en)
part of speech: nom féminin
definition: État de contrainte interne d'une structure, dont la déformation sous l'effet d'un agent extérieur est partiellement ou totalement empêchée.
in scheme: Habitat et construction
in scheme: concepts
notation: EQUI563
note: Il se produit par exemple une autocontrainte dans une poutre droite dont la longueur, du fait du blocage de ses extrémités, reste constante alors que la température s'élève.

avant-bec
type: ConceptConcept
type: Concept
creator: Commission d'enrichissement de la langue française, FranceTerme
date parution JO: 2007-07-22
equivalent EN: launching nose @en
equivalent EN: launching nose (en)
part of speech: nom masculin
definition: Dispositif provisoire, constitué d'une ou de plusieurs poutres légères installées à l'avant du tablier d'un pont pour faciliter son déplacement horizontal jusqu'à sa position définitive.
in scheme: Habitat et construction
in scheme: concepts
notation: EQUI564

avant-bec
type: ConceptConcept
type: Concept
creator: Commission d'enrichissement de la langue française, FranceTerme
date parution JO: 2007-07-22
deconseille ou frequent: arrière-bec
equivalent EN: upstream cutwater @en
equivalent EN: upstream cutwater (en)
part of speech: nom masculin
definition: Partie avancée d'une pile de pont, en forme d'éperon, située face à l'amont, et destinée à protéger l'ouvrage du courant.
in scheme: Habitat et construction
in scheme: concepts
notation: EQUI565
note: Le terme « avant-bec » s'oppose au terme « arrière-bec ».

barrette
type: ConceptConcept
type: Concept
creator: Commission d'enrichissement de la langue française, FranceTerme
date parution JO: 2007-07-22
equivalent EN: batten plate @en
equivalent EN: batten plate (en)
equivalent EN: stay plate @en
equivalent EN: stay plate (en)
part of speech: nom féminin
definition: Élément métallique servant à rendre solidaires deux profilés parallèles.
in scheme: Habitat et construction
in scheme: concept-SD-habitat-et-construction-materiaux-de-construction
in scheme: concepts
notation: EQUI566

barrette
type: ConceptConcept
type: Concept
creator: Commission d'enrichissement de la langue française, FranceTerme
date parution JO: 2007-07-22
equivalent EN: concrete wall unit @en
equivalent EN: concrete wall unit (en)
part of speech: nom féminin
definition: Paroi moulée de petite dimension.
in scheme: Habitat et construction
in scheme: concepts
notation: EQUI567
note: Les barrettes sont utilisées en particulier comme éléments de fondation d'immeubles lorsque le sol a une faible capacité portante.
related: paroi moulée

béton armé continu
type: ConceptConcept
type: Concept
creator: Commission d'enrichissement de la langue française, FranceTerme
abbreviation: BAC
abbreviation: CRC @en
date parution JO: 2007-07-22
equivalent EN: CRC @en
equivalent EN: CRC (en)
equivalent EN: continuously reinforced concrete @en
equivalent EN: continuously reinforced concrete (en)
definition: Matériau utilisé pour le revêtement des chaussées, dans lequel le béton et les armatures sont mis en œuvre sans joint.
in scheme: Habitat et construction
in scheme: concept-SD-habitat-et-construction-materiaux-de-construction
in scheme: concepts
notation: EQUI568
related: concept-genie-civil-et-construction

béton autonivelant
type: ConceptConcept
type: Concept
creator: Commission d'enrichissement de la langue française, FranceTerme
abbreviation: BAN
date parution JO: 2007-07-22
equivalent EN: self-leveling concrete @en
equivalent EN: self-leveling concrete (en)
equivalent EN: self-levelling concrete @en
equivalent EN: self-levelling concrete (en)
definition: Béton autoplaçant qui permet d'obtenir une surface horizontale plane sans qu'un régalage soit nécessaire.
in scheme: Habitat et construction
in scheme: concept-SD-habitat-et-construction-materiaux-de-construction
in scheme: concepts
notation: EQUI569
related: béton autoplaçant

covoiturage
type: ConceptConcept
type: Concept
creator: Commission d'enrichissement de la langue française, FranceTerme
source: révision de l'arrêté du 18 juillet 1989
date parution JO: 2000-09-22
deconseille ou frequent: car pooling
deconseille ou frequent: carpool
deconseille ou frequent: carpooling
equivalent EN: car pool @en
equivalent EN: car pool (en)
part of speech: nom masculin
in scheme: Transports et mobilité
in scheme: concept-SD-transports-et-mobilite-transport-routier
in scheme: concepts
notation: EQUI57
preferred label: car pool @en
related: partage de véhicule
related: voiturage en solo

béton autoplaçant
type: ConceptConcept
type: Concept
creator: Commission d'enrichissement de la langue française, FranceTerme
abbreviation: BAP
abbreviation: SCC @en
date parution JO: 2007-07-22
equivalent EN: SCC @en
equivalent EN: SCC (en)
equivalent EN: self-compacting concrete @en
equivalent EN: self-compacting concrete (en)
equivalent EN: self-consolidating concrete @en
equivalent EN: self-consolidating concrete (en)
equivalent EN: self-placing concrete @en
equivalent EN: self-placing concrete (en)
definition: Béton très fluide, mis en place par gravité, sans nécessiter de vibration.
in scheme: Habitat et construction
in scheme: concept-SD-habitat-et-construction-materiaux-de-construction
in scheme: concepts
notation: EQUI570
related: béton autonivelant

béton précontraint
type: ConceptConcept
type: Concept
creator: Commission d'enrichissement de la langue française, FranceTerme
abbreviation: BP
date parution JO: 2007-07-22
equivalent EN: prestressed concrete @en
equivalent EN: prestressed concrete (en)
definition: Béton soumis à un effort permanent de compression au moyen d'armatures mises en tension avant toute application de charges.
in scheme: Habitat et construction
in scheme: concept-SD-habitat-et-construction-materiaux-de-construction
in scheme: concepts
notation: EQUI571
note: Cette compression permanente est destinée à compenser les tractions résultant de l'application de charges sur le béton.

bouclier
type: ConceptConcept
type: Concept
creator: Commission d'enrichissement de la langue française, FranceTerme
date parution JO: 2007-07-22
equivalent EN: shield @en
equivalent EN: shield (en)
part of speech: nom masculin
definition: Système de protection mobile pour les opérations de construction en sous-sol d'une galerie ou d'un tunnel.
in scheme: Habitat et construction
in scheme: concepts
notation: EQUI572

bracon
type: ConceptConcept
type: Concept
creator: Commission d'enrichissement de la langue française, FranceTerme
date parution JO: 2007-07-22
equivalent EN: diagonal strut @en
equivalent EN: diagonal strut (en)
equivalent EN: small brace @en
equivalent EN: small brace (en)
equivalent EN: small strut @en
equivalent EN: small strut (en)
part of speech: nom masculin
definition: Étai installé obliquement.
in scheme: Habitat et construction
in scheme: concept-SD-habitat-et-construction-materiaux-de-construction
in scheme: concepts
notation: EQUI573
note: Les bracons servent par exemple à soutenir un balcon ou une dalle de pont en encorbellement.

cadre
type: ConceptConcept
type: Concept
creator: Commission d'enrichissement de la langue française, FranceTerme
date parution JO: 2007-07-22
equivalent EN: stirrup @en
equivalent EN: stirrup (en)
equivalent EN: tie @en
equivalent EN: tie (en)
part of speech: nom masculin
definition: Armature pour béton armé de forme rectangulaire.
in scheme: Habitat et construction
in scheme: concept-SD-habitat-et-construction-materiaux-de-construction
in scheme: concepts
notation: EQUI574

cadre
type: ConceptConcept
type: Concept
creator: Commission d'enrichissement de la langue française, FranceTerme
date parution JO: 2007-07-22
equivalent EN: frame @en
equivalent EN: frame (en)
part of speech: nom masculin
definition: Ossature formée par des poteaux rigidement assemblés à des poutres.
in scheme: Habitat et construction
in scheme: concepts
notation: EQUI575

cage d'armatures
type: ConceptConcept
type: Concept
creator: Commission d'enrichissement de la langue française, FranceTerme
date parution JO: 2007-07-22
equivalent EN: reinforcement cage @en
equivalent EN: reinforcement cage (en)
equivalent EN: reinforcing cage @en
equivalent EN: reinforcing cage (en)
definition: Ensemble d'armatures constituant tout ou partie du ferraillage d'un élément en béton armé ou précontraint.
in scheme: Habitat et construction
in scheme: concept-SD-habitat-et-construction-materiaux-de-construction
in scheme: concepts
notation: EQUI576

cale d'espacement
type: ConceptConcept
type: Concept
creator: Commission d'enrichissement de la langue française, FranceTerme
date parution JO: 2007-07-22
equivalent EN: spacer @en
equivalent EN: spacer (en)
forme abregee: cale, n.f.
definition: Objet placé entre deux armatures, ou entre une armature et un coffrage, pour maintenir leur espacement pendant la mise en place du béton.
in scheme: Habitat et construction
in scheme: concepts
notation: EQUI577

camarteau
type: ConceptConcept
type: Concept
creator: Commission d'enrichissement de la langue française, FranceTerme
date parution JO: 2007-07-22
equivalent EN: stack @en
equivalent EN: stack (en)
part of speech: nom masculin
definition: Empilement de pièces de bois, de métal ou de béton, disposées en couches croisées pour servir de support temporaire à une construction ou à un engin de chantier.
in scheme: Habitat et construction
in scheme: concepts
notation: EQUI578
note: Un camarteau peut servir, par exemple, d'appareil d'appui provisoire au tablier d'un pont en construction.

canar
type: ConceptConcept
type: Concept
creator: Commission d'enrichissement de la langue française, FranceTerme
abbreviation: duct @en
date parution JO: 2007-07-22
equivalent EN: duct @en
equivalent EN: duct (en)
equivalent EN: ventilation duct @en
equivalent EN: ventilation duct (en)
part of speech: nom masculin
alternative label: buse d'aérage
definition: Conduite d'aspiration ou de refoulement de l'air installée dans une galerie souterraine ou un tunnel.
in scheme: Habitat et construction
in scheme: concepts
notation: EQUI579

cuisinette
type: ConceptConcept
type: Concept
creator: Commission d'enrichissement de la langue française, FranceTerme
source: révision de l'arrêté du 17 février 1986
date parution JO: 2000-09-22
equivalent EN: kitchenette @en
equivalent EN: kitchenette (en)
part of speech: nom féminin
definition: Petite partie d'une pièce aménagée à usage de cuisine.
in scheme: Habitat et construction
in scheme: concepts
notation: EQUI58
note: Les dispositions adoptées sont très diverses, notamment alcôve, placard, renfoncement le long d'une cloison.

chapeau
type: ConceptConcept
type: Concept
creator: Commission d'enrichissement de la langue française, FranceTerme
date parution JO: 2007-07-22
equivalent EN: top bar @en
equivalent EN: top bar (en)
part of speech: nom masculin
definition: Armature supérieure placée dans les zones d'appui d'une poutre ou d'une dalle en béton armé.
in scheme: Habitat et construction
in scheme: concept-SD-habitat-et-construction-materiaux-de-construction
in scheme: concepts
notation: EQUI580

chevêtre
type: ConceptConcept
type: Concept
creator: Commission d'enrichissement de la langue française, FranceTerme
abbreviation: trimmer @en
date parution JO: 2007-07-22
equivalent EN: crosshead @en
equivalent EN: crosshead (en)
equivalent EN: trimmer @en
equivalent EN: trimmer (en)
equivalent EN: trimmer beam @en
equivalent EN: trimmer beam (en)
part of speech: nom masculin
definition: Élément horizontal coiffant un ou plusieurs poteaux et servant à l'appui du tablier d'un pont.
in scheme: Habitat et construction
in scheme: concepts
notation: EQUI581

cisaillement
type: ConceptConcept
type: Concept
creator: Commission d'enrichissement de la langue française, FranceTerme
date parution JO: 2007-07-22
equivalent EN: shear @en
equivalent EN: shear (en)
part of speech: nom masculin
definition: État de contrainte interne d'une structure, dans lequel chaque partie a tendance, sous l'effet de forces de sens contraire, à glisser par rapport à la partie voisine.
in scheme: Habitat et construction
in scheme: concepts
notation: EQUI582
related: armature

clavette
type: ConceptConcept
type: Concept
creator: Commission d'enrichissement de la langue française, FranceTerme
date parution JO: 2007-07-22
equivalent EN: key @en
equivalent EN: key (en)
part of speech: nom féminin
definition: Pièce en acier servant à bloquer un fil ou un câble de précontrainte après sa mise en tension.
in scheme: Habitat et construction
in scheme: concept-SD-habitat-et-construction-materiaux-de-construction
in scheme: concepts
notation: EQUI583

clouage de sol
type: ConceptConcept
type: Concept
creator: Commission d'enrichissement de la langue française, FranceTerme
abbreviation: nailing @en
date parution JO: 2007-07-22
equivalent EN: ground nailing @en
equivalent EN: ground nailing (en)
equivalent EN: nailing @en
equivalent EN: nailing (en)
equivalent EN: soil nailing @en
equivalent EN: soil nailing (en)
forme abregee: clouage, n.m.
definition: Technique de soutènement des terres consistant à introduire dans le sol des barres de bois ou de métal.
in scheme: Habitat et construction
in scheme: concepts
notation: EQUI584

cloutage
type: ConceptConcept
type: Concept
creator: Commission d'enrichissement de la langue française, FranceTerme
abbreviation: chipping @en
date parution JO: 2007-07-22
deconseille ou frequent: chipping
deconseille ou frequent: gritting
equivalent EN: chipping @en
equivalent EN: chipping (en)
equivalent EN: embedment of chipping @en
equivalent EN: embedment of chipping (en)
equivalent EN: gritting (GB) @en
equivalent EN: gritting (en-GB)
part of speech: nom masculin
definition: Technique consistant à incorporer par compactage des gravillons dans le revêtement bitumineux d'une chaussée, afin de la rendre moins glissante.
in scheme: Habitat et construction
in scheme: concepts
notation: EQUI585

coffrage glissant
type: ConceptConcept
type: Concept
creator: Commission d'enrichissement de la langue française, FranceTerme
abbreviation: sliding form @en
abbreviation: slip form @en
date parution JO: 2007-07-22
equivalent EN: sliding form @en
equivalent EN: sliding form (en)
equivalent EN: sliding formwork @en
equivalent EN: sliding formwork (en)
equivalent EN: slip form @en
equivalent EN: slip form (en)
equivalent EN: slip formwork @en
equivalent EN: slip formwork (en)
definition: Moule que l'on fait glisser le long de la paroi d'un ouvrage en béton au fur et à mesure de sa construction, afin de le couler en continu.
in scheme: Habitat et construction
in scheme: concepts
notation: EQUI586
note: On emploie des coffrages glissants pour réaliser, par exemple, des piles de grande hauteur, des tours pour les relais de télécommunication, des murets de sécurité entre les chaussées routières.

colonne ballastée
type: ConceptConcept
type: Concept
creator: Commission d'enrichissement de la langue française, FranceTerme
abbreviation: compacted column @en
date parution JO: 2007-07-22
equivalent EN: compacted column @en
equivalent EN: compacted column (en)
equivalent EN: gravel compacted column @en
equivalent EN: gravel compacted column (en)
definition: Cavité forée dans un sol argileux puis remplie de graviers ou de cailloux pour améliorer la capacité portante du sol.
in scheme: Habitat et construction
in scheme: concepts
notation: EQUI587

connecteur
type: ConceptConcept
type: Concept
creator: Commission d'enrichissement de la langue française, FranceTerme
abbreviation: connector @en
date parution JO: 2007-07-22
equivalent EN: connector @en
equivalent EN: connector (en)
equivalent EN: shear connector @en
equivalent EN: shear connector (en)
part of speech: nom masculin
definition: Pièce métallique solidarisant un élément de béton et un élément métallique dans un ouvrage associant l'acier et le béton.
in scheme: Habitat et construction
in scheme: concept-SD-habitat-et-construction-materiaux-de-construction
in scheme: concepts
notation: EQUI588

contreflèche
type: ConceptConcept
type: Concept
creator: Commission d'enrichissement de la langue française, FranceTerme
date parution JO: 2007-07-22
equivalent EN: camber @en
equivalent EN: camber (en)
part of speech: nom féminin
definition: Courbure donnée à une poutre lors de sa fabrication, en vue de compenser la déformation due à la charge qu'elle devra porter.
in scheme: Habitat et construction
in scheme: concepts
notation: EQUI589

décoration urbaine
type: ConceptConcept
type: Concept
creator: Commission d'enrichissement de la langue française, FranceTerme
source: révision de l'arrêté du 17 février 1986
date parution JO: 2000-09-22
equivalent EN: urban design @en
equivalent EN: urban design (en)
definition: Art de la conception et de l'aménagement du mobilier urbain et de la signalétique des espaces collectifs.
in scheme: Aménagement et urbanisme
in scheme: concepts
notation: EQUI59
note: Le terme « design urbain » ne doit pas être employé.

contreventement
type: ConceptConcept
type: Concept
creator: Commission d'enrichissement de la langue française, FranceTerme
date parution JO: 2007-07-22
equivalent EN: bracing @en
equivalent EN: bracing (en)
part of speech: nom masculin
definition: Élément de structure assurant la résistance d'une construction à des forces qui s'exercent horizontalement et sont dues notamment au vent, aux chocs et aux secousses sismiques.
in scheme: Habitat et construction
in scheme: concepts
notation: EQUI590
note: On utilise aussi le terme « contreventement » pour désigner l'action qui permet d'assurer cette résistance.

convoyeur à vis
type: ConceptConcept
type: Concept
creator: Commission d'enrichissement de la langue française, FranceTerme
date parution JO: 2007-07-22
equivalent EN: screw conveyor @en
equivalent EN: screw conveyor (en)
definition: Appareil de manutention dans lequel un produit tel que le ciment ou la chaux est entraîné, avec un débit régulier, par une vis sans fin tournant dans un carter.
in scheme: Habitat et construction
in scheme: concept-SD-habitat-et-construction-engins
in scheme: concepts
notation: EQUI591

dameur
type: ConceptConcept
type: Concept
creator: Commission d'enrichissement de la langue française, FranceTerme
date parution JO: 2007-07-22
equivalent EN: earth rammer @en
equivalent EN: earth rammer (en)
equivalent EN: tamper @en
equivalent EN: tamper (en)
part of speech: nom masculin
definition: Lame verticale installée sur un engin mobile de travaux routiers, dont le mouvement de haut en bas contribue au bon étalement d'une couche de chaussée.
in scheme: Habitat et construction
in scheme: concept-SD-habitat-et-construction-engins
in scheme: concepts
notation: EQUI592

décapeuse
type: ConceptConcept
type: Concept
creator: Commission d'enrichissement de la langue française, FranceTerme
date parution JO: 2007-07-22
equivalent EN: scraper @en
equivalent EN: scraper (en)
part of speech: nom féminin
alternative label: décapeur
definition: Engin de terrassement assurant l'extraction, le transport, l'épandage et la mise en dépôt des terres.
in scheme: Habitat et construction
in scheme: concept-SD-habitat-et-construction-engins
in scheme: concepts
notation: EQUI593

entraîneur d'air
type: ConceptConcept
type: Concept
creator: Commission d'enrichissement de la langue française, FranceTerme
date parution JO: 2007-07-22
equivalent EN: air-entraining agent @en
equivalent EN: air-entraining agent (en)
definition: Adjuvant introduit dans le béton d'une chaussée pour y emprisonner des bulles d'air et améliorer ainsi sa résistance au gel en freinant la circulation interne de l'eau.
in scheme: Habitat et construction
in scheme: concept-SD-habitat-et-construction-materiaux-de-construction
in scheme: concepts
notation: EQUI594

extracteur
type: ConceptConcept
type: Concept
creator: Commission d'enrichissement de la langue française, FranceTerme
date parution JO: 2007-07-22
deconseille ou frequent: extractor
equivalent EN: extractor (US) @en
equivalent EN: extractor (en-US)
equivalent EN: feeder @en
equivalent EN: feeder (en)
part of speech: nom masculin
definition: Appareil assurant, avec un débit régulier, la sortie des matériaux d'une trémie ou d'un silo.
in scheme: Habitat et construction
in scheme: concept-SD-habitat-et-construction-engins
in scheme: concepts
notation: EQUI595

mur en aile
type: ConceptConcept
type: Concept
creator: Commission d'enrichissement de la langue française, FranceTerme
abbreviation: wingwall @en
date parution JO: 2007-07-22
equivalent EN: wing wall @en
equivalent EN: wing wall (en)
equivalent EN: wingwall @en
equivalent EN: wingwall (en)
definition: Prolongement, parallèlement à l'axe de la voie franchie par un pont, du mur sur lequel repose l'extrémité du tablier de ce pont.
in scheme: Habitat et construction
in scheme: concepts
notation: EQUI596

paroi berlinoise
type: ConceptConcept
type: Concept
creator: Commission d'enrichissement de la langue française, FranceTerme
date parution JO: 2007-07-22
equivalent EN: Berlin wall @en
equivalent EN: Berlin wall (en)
equivalent EN: interpile sheeting @en
equivalent EN: interpile sheeting (en)
equivalent EN: soldier pile wall @en
equivalent EN: soldier pile wall (en)
forme abregee: berlinoise, n.f.
definition: Ouvrage de soutènement, constitué de profilés métalliques que l'on descend dans des forages et de planches ou de panneaux métalliques, mis en place horizontalement au fur et à mesure de la progression de l'excavation.
in scheme: Habitat et construction
in scheme: concepts
notation: EQUI597

paroi moulée
type: ConceptConcept
type: Concept
creator: Commission d'enrichissement de la langue française, FranceTerme
date parution JO: 2007-07-22
equivalent EN: diaphragm wall @en
equivalent EN: diaphragm wall (en)
definition: Mur construit en injectant du béton dans une fouille étroite et profonde, préalablement remplie d'une boue argileuse destinée à en maintenir les parois, et dans laquelle on immerge des cages ou des treillis d'armatures.
in scheme: Habitat et construction
in scheme: concepts
notation: EQUI598
related: barrette

plancher-champignon
type: ConceptConcept
type: Concept
creator: Commission d'enrichissement de la langue française, FranceTerme
date parution JO: 2007-07-22
equivalent EN: mushroom floor @en
equivalent EN: mushroom floor (en)
part of speech: nom masculin
definition: Plancher constitué d'une dalle en béton reposant sur des poteaux évasés à leur sommet.
in scheme: Habitat et construction
in scheme: concepts
notation: EQUI599

gerbeur
type: ConceptConcept
type: Concept
creator: Commission d'enrichissement de la langue française, FranceTerme
date parution JO: 1997-12-02
deconseille ou frequent: autogrue
deconseille ou frequent: grue à conteneur
deconseille ou frequent: stockeur
equivalent EN: reachstacker @en
equivalent EN: reachstacker (en)
equivalent EN: stacker @en
equivalent EN: stacker (en)
equivalent EN: superstacker @en
equivalent EN: superstacker (en)
part of speech: nom masculin
definition: Engin de levage autonome, monté sur pneumatiques, destiné à charger, décharger, déplacer ou gerber des conteneurs et des caisses mobiles.
in scheme: Transports et mobilité
in scheme: concepts
notation: EQUI6
note: Les engins dénommés « autogrues », « stockeurs », « grue à conteneur » sont des types de gerbeurs.

défaillant, -e
type: ConceptConcept
type: Concept
creator: Commission d'enrichissement de la langue française, FranceTerme
source: révision de l'arrêté du 27 mai 1992
date parution JO: 2000-09-22
equivalent EN: no-show @en
equivalent EN: no-show (en)
part of speech: adjectif
definition: Se dit d'un voyageur qui n'utilise pas la réservation effectuée en sa faveur.
in scheme: Tourisme
in scheme: Transports et mobilité
in scheme: concepts
notation: EQUI60
related: défaillance du voyageur

pont-cadre
type: ConceptConcept
type: Concept
creator: Commission d'enrichissement de la langue française, FranceTerme
date parution JO: 2007-07-22
deconseille ou frequent: pont-portique
equivalent EN: rigid-framed bridge @en
equivalent EN: rigid-framed bridge (en)
forme abregee: cadre, n.m.
part of speech: nom masculin
definition: Pont en béton, généralement de faibles dimensions, dont le tablier, les piédroits et le radier forment une structure d'un seul bloc.
in scheme: Habitat et construction
in scheme: concepts
notation: EQUI600
note: En l'absence de radier, le pont est appelé « pont-portique ».

poutre-caisson
type: ConceptConcept
type: Concept
creator: Commission d'enrichissement de la langue française, FranceTerme
date parution JO: 2007-07-22
equivalent EN: box beam @en
equivalent EN: box beam (en)
equivalent EN: box girder @en
equivalent EN: box girder (en) [pour le métal]
part of speech: nom féminin
definition: Poutre de section creuse qui, comme un caisson, peut être munie de cloisons internes.
in scheme: Habitat et construction
in scheme: concepts
notation: EQUI601

béton banché
type: ConceptConcept
type: Concept
creator: Commission d'enrichissement de la langue française, FranceTerme
date parution JO: 2007-07-22
equivalent EN: shuttered concrete @en
equivalent EN: shuttered concrete (en)
equivalent EN: walled concrete @en
equivalent EN: walled concrete (en)
in scheme: Habitat et construction
in scheme: concept-SD-habitat-et-construction-materiaux-de-construction
in scheme: concepts
notation: EQUI602

calepinage
type: ConceptConcept
type: Concept
creator: Commission d'enrichissement de la langue française, FranceTerme
abbreviation: lay-out @en
abbreviation: layout @en
date parution JO: 2007-07-22
equivalent EN: lay out @en
equivalent EN: lay out (en)
equivalent EN: lay-out @en
equivalent EN: lay-out (en)
equivalent EN: layout @en
equivalent EN: layout (en)
part of speech: nom masculin
in scheme: Habitat et construction
in scheme: concept-SD-habitat-et-construction-architecture
in scheme: concepts
notation: EQUI603

autoroute de la mer
type: ConceptConcept
type: Concept
creator: Commission d'enrichissement de la langue française, FranceTerme
abbreviation: ADM
date parution JO: 2009-06-06
equivalent EN: Meeresautobahn @de
equivalent EN: Meeresautobahn (de)
equivalent EN: motorway of the seas @en
equivalent EN: motorway of the seas (en)
definition: Acheminement maritime à cadence rapide de véhicules routiers par des navires rouliers, proposé en remplacement d'acheminements terrestres ; par extension, la route maritime la plus fréquemment empruntée entre les ports reliés.
in scheme: Transports et mobilité
in scheme: concept-SD-transports-et-mobilite-transport-de-marchandises
in scheme: concept-SD-transports-et-mobilite-transport-maritime
in scheme: concepts
notation: EQUI605
note: L'autoroute de la mer est un mode d'exploitation particulier du merroutage.
related: merroutage

autoroute ferroviaire
type: ConceptConcept
type: Concept
creator: Commission d'enrichissement de la langue française, FranceTerme
date parution JO: 2009-06-06
equivalent EN: rollende Landstrasse @de
equivalent EN: rollende Landstrasse (de)
equivalent EN: rolling highway @en
equivalent EN: rolling highway (en)
equivalent EN: rolling road @en
equivalent EN: rolling road (en)
definition: Acheminement ferroviaire à cadence rapide de véhicules routiers par des trains spéciaux ; par extension, l'itinéraire emprunté lors de cet acheminement.
in scheme: Transports et mobilité
in scheme: concept-SD-transports-et-mobilite-transport-de-marchandises
in scheme: concept-SD-transports-et-mobilite-transport-terrestre
in scheme: concepts
notation: EQUI606
note: 1. Les véhicules routiers accèdent aux wagons par roulage.
note: 2. L'autoroute ferroviaire est un mode d'exploitation particulier du ferroutage.
related: ferroutage

contrôle privé
type: ConceptConcept
type: Concept
creator: Commission d'enrichissement de la langue française, FranceTerme
abbreviation: CP
date parution JO: 2009-06-06
equivalent EN: vetting @en
equivalent EN: vetting (en)
definition: Opération d'initiative privée par laquelle un affréteur s'assure qu'un navire pétrolier, gazier ou chimiquier proposé à l'affrètement satisfait aux normes officielles et aux exigences définies par la profession en matière de sécurité et de protection de l'environnement.
in scheme: Transports et mobilité
in scheme: concept-SD-transports-et-mobilite-transport-maritime
in scheme: concepts
notation: EQUI607

croisiériste
type: ConceptConcept
type: Concept
creator: Commission d'enrichissement de la langue française, FranceTerme
date parution JO: 2009-06-06
equivalent EN: cruise operator @en
equivalent EN: cruise operator (en)
part of speech: nom
alternative label: organisateur, -trice de croisières
definition: Personne morale ou physique qui organise des croisières sur des navires lui appartenant ou non.
in scheme: Tourisme
in scheme: concepts
notation: EQUI608
note: Le terme « croisiériste » désigne aussi une personne participant à une croisière.

dispositif de séparation du trafic
type: ConceptConcept
type: Concept
creator: Commission d'enrichissement de la langue française, FranceTerme
abbreviation: DST
abbreviation: TSS @en
date parution JO: 2009-06-06
deconseille ou frequent: rail
equivalent EN: TSS @en
equivalent EN: TSS (en)
equivalent EN: traffic separation scheme @en
equivalent EN: traffic separation scheme (en)
definition: Mode d'organisation règlementée du trafic maritime visant à séparer des flux opposés de navigation par la mise en place de voies de circulation.
in scheme: Transports et mobilité
in scheme: concept-SD-transports-et-mobilite-transport-maritime
in scheme: concepts
notation: EQUI609
note: Dans le langage courant, on utilise le terme « rail » pour désigner tantôt l'ensemble du dispositif (on parle ainsi du « rail d'Ouessant »), tantôt chacune des voies de circulation (la voie allant vers le nord-ouest de la Manche est ainsi appelée « rail montant »).
related: voie de circulation

kiosque de piscine
type: ConceptConcept
type: Concept
creator: Commission d'enrichissement de la langue française, FranceTerme
date parution JO: 2009-06-06
deconseille ou frequent: pool house
equivalent EN: poolhouse @en
equivalent EN: poolhouse (en)
alternative label: pavillon de piscine
definition: Pavillon d'agrément ou local utilitaire situé aux abords d'une piscine.
in scheme: Habitat et construction
in scheme: Loisirs
in scheme: concepts
notation: EQUI610

lettre de garantie à l'arrivée
type: ConceptConcept
type: Concept
creator: Commission d'enrichissement de la langue française, FranceTerme
abbreviation: LOI @en
date parution JO: 2009-06-06
equivalent EN: LOI @en
equivalent EN: LOI (en)
equivalent EN: guarantee for missing bill @en
equivalent EN: guarantee for missing bill (en)
equivalent EN: letter of guarantee @en
equivalent EN: letter of guarantee (en)
equivalent EN: letter of indemnity @en
equivalent EN: letter of indemnity (en)
forme abregee: lettre de garantie
definition: Document permettant à l'acheteur de prendre livraison de la marchandise sans remise du connaissement original au transporteur.
in scheme: Transports et mobilité
in scheme: concept-SD-transports-et-mobilite-transport-de-marchandises
in scheme: concept-SD-transports-et-mobilite-transport-maritime
in scheme: concepts
notation: EQUI611
note: La lettre de garantie est un engagement formel, généralement cautionné par une banque, signé par le destinataire et visant à garantir le transporteur maritime contre toute réclamation dont il pourrait faire l'objet de la part du porteur régulier du connaissement.

merroutage
type: ConceptConcept
type: Concept
creator: Commission d'enrichissement de la langue française, FranceTerme
date parution JO: 2009-06-06
equivalent EN: sea-road transport @en
equivalent EN: sea-road transport (en)
part of speech: nom masculin
definition: Transport intermodal de marchandises, utilisant des véhicules routiers acheminés sur des navires rouliers.
in scheme: Transports et mobilité
in scheme: concept-SD-transports-et-mobilite-transport-de-marchandises
in scheme: concept-SD-transports-et-mobilite-transport-maritime
in scheme: concepts
notation: EQUI612
related: transport intermodal
related: autoroute de la mer

minimoto
type: ConceptConcept
type: Concept
creator: Commission d'enrichissement de la langue française, FranceTerme
date parution JO: 2009-06-06
equivalent EN: pocket bike @en
equivalent EN: pocket bike (en)
part of speech: nom féminin
alternative label: moto de poche
definition: Moto de taille réduite, utilisée à des fins ludiques ou sportives.
in scheme: Loisirs
in scheme: Motocycle
in scheme: concepts
notation: EQUI613

motorodéo
type: ConceptConcept
type: Concept
creator: Commission d'enrichissement de la langue française, FranceTerme
date parution JO: 2009-06-06
equivalent EN: stunt @en
equivalent EN: stunt (en)
part of speech: nom masculin
definition: Enchaînement de figures acrobatiques à moto.
in scheme: Motocycle
in scheme: Sports
in scheme: concepts
notation: EQUI614
related: concept-SPOR264

partage de code
type: ConceptConcept
type: Concept
creator: Commission d'enrichissement de la langue française, FranceTerme
date parution JO: 2009-06-06
equivalent EN: code share @en
equivalent EN: code share (en)
equivalent EN: code sharing @en
equivalent EN: code sharing (en)
definition: Commercialisation partagée d'un vol entre la compagnie aérienne qui assure ce vol sous son propre indicatif technique, communément appelé « code », et une autre compagnie aérienne.
in scheme: Transports et mobilité
in scheme: concept-SD-transports-et-mobilite-transport-aerien
in scheme: concepts
notation: EQUI615
note: En général, un vol en partage de code est désigné par chacune des compagnies sous son propre identifiant commercial, bien que le vol n'ait qu'un seul code au sens de la navigation aérienne. C'est pourquoi il convient d'éviter d'utiliser le mot « code » au pluriel.

pavillon-club
type: ConceptConcept
type: Concept
creator: Commission d'enrichissement de la langue française, FranceTerme
abbreviation: clubhouse @en
date parution JO: 2009-06-06
deconseille ou frequent: foyer
equivalent EN: club house @en
equivalent EN: club house (en)
equivalent EN: clubhouse @en
equivalent EN: clubhouse (en)
forme abregee: club, n.m.
part of speech: nom masculin
definition: Bâtiment offrant divers services aux membres d'un club sportif ou d'une résidence de vacances ainsi qu'à leurs invités.
in scheme: Sports
in scheme: Tourisme
in scheme: concepts
notation: EQUI616
note: Dans le domaine des sports, on trouve aussi le terme « foyer ».
scope note: Cette publication annule et remplace celle du terme « foyer » au Journal officiel du 22 septembre 2000.

quad
type: ConceptConcept
type: Concept
creator: Commission d'enrichissement de la langue française, FranceTerme
abbreviation: ATC @en
abbreviation: ATV @en
date parution JO: 2009-06-06
equivalent EN: ATC @en
equivalent EN: ATC (en)
equivalent EN: ATV @en
equivalent EN: ATV (en)
equivalent EN: all-terrain cycle @en
equivalent EN: all-terrain cycle (en)
equivalent EN: all-terrain vehicle @en
equivalent EN: all-terrain vehicle (en)
equivalent EN: four wheelers (US) @en
equivalent EN: four wheelers (en-US)
equivalent EN: quad bike (GB) @en
equivalent EN: quad bike (en-GB)
equivalent EN: quad cycle (GB) @en
equivalent EN: quad cycle (en-GB)
part of speech: nom masculin
definition: Véhicule à moteur tout terrain, non carrossé et doté de quatre roues à larges pneus, d'une selle et d'un guidon.
in scheme: Loisirs
in scheme: Motocycle
in scheme: concepts
notation: EQUI617

repositionnement
type: ConceptConcept
type: Concept
creator: Commission d'enrichissement de la langue française, FranceTerme
date parution JO: 2009-06-06
equivalent EN: shifting @en
equivalent EN: shifting (en)
part of speech: nom masculin
definition: Modification de la position d'une unité de charge, tels des conteneurs ou des caisses, à bord d'un même navire.
in scheme: Transports et mobilité
in scheme: concept-SD-transports-et-mobilite-transport-de-marchandises
in scheme: concept-SD-transports-et-mobilite-transport-maritime
in scheme: concepts
notation: EQUI618

repositionnement
type: ConceptConcept
type: Concept
creator: Commission d'enrichissement de la langue française, FranceTerme
date parution JO: 2009-06-06
deconseille ou frequent: changement de poste
deconseille ou frequent: changement de poste à quai
equivalent EN: shifting @en
equivalent EN: shifting (en)
part of speech: nom masculin
definition: Déplacement d'un navire le long d'un même quai, ou d'un quai à l'autre d'un port.
in scheme: Transports et mobilité
in scheme: concept-SD-transports-et-mobilite-transport-maritime
in scheme: concepts
notation: EQUI619
note: On emploie aussi le terme « changement de poste (à quai) ».

dépotage
type: ConceptConcept
type: Concept
creator: Commission d'enrichissement de la langue française, FranceTerme
source: révision de l'arrêté du 18 décembre 1990
date parution JO: 2000-09-22
equivalent EN: stripping @en
equivalent EN: stripping (en)
part of speech: nom masculin
definition: Déchargement de marchandises pulvérulentes, liquides ou gazeuses, d'un véhicule de transport.
in scheme: Transports et mobilité
in scheme: concepts
notation: EQUI62
related: dépotage
related: empotage

voie de circulation
type: ConceptConcept
type: Concept
creator: Commission d'enrichissement de la langue française, FranceTerme
date parution JO: 2009-06-06
equivalent EN: taxiway @en
equivalent EN: taxiway (en)
definition: Voie spécialement aménagée sur un aérodrome pour la circulation au sol des aéronefs.
in scheme: Transports et mobilité
in scheme: concept-SD-transports-et-mobilite-transport-aerien
in scheme: concepts
notation: EQUI620

voie de circulation
type: ConceptConcept
type: Concept
creator: Commission d'enrichissement de la langue française, FranceTerme
date parution JO: 2009-06-06
equivalent EN: traffic lane @en
equivalent EN: traffic lane (en)
definition: Couloir maritime dans lequel a été établie une circulation à sens unique des navires.
in scheme: Transports et mobilité
in scheme: concept-SD-transports-et-mobilite-transport-maritime
in scheme: concepts
notation: EQUI621
related: dispositif de séparation du trafic

voiturette
type: ConceptConcept
type: Concept
creator: Commission d'enrichissement de la langue française, FranceTerme
date parution JO: 2009-06-06
equivalent EN: cart @en
equivalent EN: cart (en) [golf]
part of speech: nom féminin
definition: Petite voiture carrossée pouvant être conduite sans permis et dont la vitesse est limitée lors de la construction.
in scheme: Automobile
in scheme: Transports et mobilité
in scheme: concepts
notation: EQUI622
note: Le terme « voiturette » désigne aussi des véhicules servant à se déplacer sur les parcours de golf, dans les gares et les aérogares, ainsi que dans les sites touristiques.
scope note: Cette publication annule et remplace celle du Journal officiel du 22 septembre 2000.

accidentologie
type: ConceptConcept
type: Concept
creator: Commission d'enrichissement de la langue française, FranceTerme
date parution JO: 2011-06-09
equivalent EN: accidentology @en
equivalent EN: accidentology (en)
part of speech: nom féminin
definition: Étude des accidents, notamment de la circulation routière, de leurs causes, de leurs conséquences et de leur prévention.
in scheme: Statistique
in scheme: concepts
notation: EQUI623
related: accidentalité

accidentologue
type: ConceptConcept
type: Concept
creator: Commission d'enrichissement de la langue française, FranceTerme
date parution JO: 2011-06-09
deconseille ou frequent: accidentologiste
equivalent EN: accidentologist @en
equivalent EN: accidentologist (en)
part of speech: nom
definition: Personne qui consacre tout ou partie de son activité professionnelle à l'accidentologie.
in scheme: Statistique
in scheme: concepts
notation: EQUI624
related: accidentalité

accidentalité
type: ConceptConcept
type: Concept
creator: Commission d'enrichissement de la langue française, FranceTerme
date parution JO: 2011-06-09
equivalent EN: accidentality @en
equivalent EN: accidentality (en)
part of speech: nom féminin
definition: Ensemble des statistiques qui caractérise les accidents relatifs à une population donnée durant une période déterminée, en fonction de variables d'exposition au risque.
in scheme: Statistique
in scheme: concepts
notation: EQUI625
note: 1. Les statistiques peuvent porter notamment sur les circonstances, la fréquence et la gravité des accidents.
note: 2. Dans le domaine des transports, les variables d'exposition au risque peuvent comprendre les caractéristiques de la population considérée (âge, sexe, etc.), le mode de transport choisi ainsi que les infrastructures et les parcours.
related: accidentologie
related: accidentologue

partage de véhicule
type: ConceptConcept
type: Concept
creator: Commission d'enrichissement de la langue française, FranceTerme
date parution JO: 2011-06-09
deconseille ou frequent: autopartage
deconseille ou frequent: vélopartage
equivalent EN: car sharing @en
equivalent EN: car sharing (en)
equivalent EN: car-club (GB) @en
equivalent EN: car-club (en-GB)
equivalent EN: carsharing @en
equivalent EN: carsharing (en)
definition: Service mettant des véhicules à la disposition d'utilisateurs successifs, selon une procédure simplifiée de location.
in scheme: Transports et mobilité
in scheme: concept-SD-transports-et-mobilite-transport-terrestre
in scheme: concepts
notation: EQUI626
note: 1. Les véhicules pour lesquels ce type de service est proposé sont dénommés « véhicules partagés ».
note: 2. Dans le cas de véhicules automobiles faisant l'objet d'une procédure de libre-service automatisée, on parle d'« autopartage ».
related: économie de l'usage
related: véhicule partagé
related: covoiturage
related: sans station
scope note: Cette publication annule et remplace celle du Journal officiel du 21 octobre 2004.

podotactile
type: ConceptConcept
type: Concept
creator: Commission d'enrichissement de la langue française, FranceTerme
abbreviation: TGSI @en
date parution JO: 2011-06-09
deconseille ou frequent: BEV
deconseille ou frequent: bande d'éveil à la vigilance
deconseille ou frequent: bande podotactile
deconseille ou frequent: dispositif podotactile
equivalent EN: TGSI @en
equivalent EN: TGSI (en)
equivalent EN: tactile ground surface indicator @en
equivalent EN: tactile ground surface indicator (en)
equivalent EN: tactile paving @en
equivalent EN: tactile paving (en)
equivalent EN: tactile tiles @en
equivalent EN: tactile tiles (en)
part of speech: adjectif
definition: Se dit d'une bande ou d'un dispositif comportant des protubérances ou des reliefs réguliers perceptibles par les pieds, qui est destiné à signaler des obstacles ou à matérialiser des itinéraires et des emplacements, en particulier pour des aveugles ou des malvoyants.
in scheme: Aménagement et urbanisme
in scheme: Transports et mobilité
in scheme: concepts
notation: EQUI627
note: 1. Les dispositifs podotactiles équipent notamment les passages pour piétons et les quais de métro.
note: 2. Certains de ces dispositifs sont appelés « bandes d'éveil à la vigilance » (BEV).

desserte cadencée
type: ConceptConcept
type: Concept
creator: Commission d'enrichissement de la langue française, FranceTerme
date parution JO: 2011-06-09
equivalent EN: Taktfahrplan @de
equivalent EN: Taktfahrplan (de)
definition: Exploitation par cadencement d'une ligne régulière de transports.
in scheme: Transports et mobilité
in scheme: concepts
notation: EQUI629
related: cadencement

dépoter
type: ConceptConcept
type: Concept
creator: Commission d'enrichissement de la langue française, FranceTerme
source: révision de l'arrêté du 18 décembre 1990
date parution JO: 2000-09-22
deconseille ou frequent: strip
deconseille ou frequent: to strip
equivalent EN: strip (to) @en
equivalent EN: strip (to) (en)
part of speech: verbe
definition: Décharger des marchandises pulvérulentes, liquides ou gazeuses, d'un véhicule de transport.
in scheme: Transports et mobilité
in scheme: concepts
notation: EQUI63
related: dépoter
related: empoter

délestage
type: ConceptConcept
type: Concept
creator: Commission d'enrichissement de la langue française, FranceTerme
abbreviation: jettisoning @en
date parution JO: 2011-06-09
equivalent EN: fuel dumping @en
equivalent EN: fuel dumping (en)
equivalent EN: fuel jettisoning @en
equivalent EN: fuel jettisoning (en)
equivalent EN: jettisoning @en
equivalent EN: jettisoning (en)
part of speech: nom masculin
alternative label: largage de carburant
definition: Vidange en vol d'une partie du carburant.
in scheme: Aéronautique
in scheme: Transports et mobilité
in scheme: concept-SD-aeronautique-transport-aerien
in scheme: concept-SD-transports-et-mobilite-transport-aerien
in scheme: concepts
notation: EQUI631
note: Le délestage est notamment utilisé en cas d'atterrissage d'urgence, peu après le décollage, afin d'abaisser la masse de l'aéronef en dessous de la masse maximale prescrite à l'atterrissage.

système GSM du rail
type: ConceptConcept
type: Concept
creator: Commission d'enrichissement de la langue française, FranceTerme
abbreviation: GSM-R @en
date parution JO: 2011-06-09
equivalent EN: GSM-R @en
equivalent EN: GSM-R (en)
equivalent EN: global system for mobile communications - railways @en
equivalent EN: global system for mobile communications - railways (en)
equivalent EN: global system for mobile communications for railways @en
equivalent EN: global system for mobile communications for railways (en)
definition: Système GSM propre aux applications informatiques et aux communications ferroviaires, qui permet aux conducteurs des trains, aux responsables de la circulation et aux agents d'entretien des infrastructures de communiquer entre eux, individuellement ou en groupe.
in scheme: Télécommunications
in scheme: Transports et mobilité
in scheme: concept-SD-telecommunications-transport-ferroviaire
in scheme: concept-SD-transports-et-mobilite-transport-ferroviaire
in scheme: concepts
notation: EQUI632
related: concept-TELE423

société de matériel ferroviaire
type: ConceptConcept
type: Concept
creator: Commission d'enrichissement de la langue française, FranceTerme
abbreviation: ROSCO @en
abbreviation: SMF
date parution JO: 2011-06-09
equivalent EN: ROSCO @en
equivalent EN: ROSCO (en)
equivalent EN: rolling stock leasing company @en
equivalent EN: rolling stock leasing company (en)
equivalent EN: rolling stock operating company @en
equivalent EN: rolling stock operating company (en)
definition: Société de location et de gestion de matériel ferroviaire roulant.
in scheme: Transports et mobilité
in scheme: concept-SD-transports-et-mobilite-transport-ferroviaire
in scheme: concepts
notation: EQUI633

véloroute
type: ConceptConcept
type: Concept
creator: Commission d'enrichissement de la langue française, FranceTerme
date parution JO: 2011-06-09
deconseille ou frequent: vélo route
equivalent EN: cycle route @en
equivalent EN: cycle route (en)
equivalent EN: segregated cycle facilities @en
equivalent EN: segregated cycle facilities (en)
part of speech: nom féminin
broader: concept-motocycle-et-cycle
definition: Ensemble de voies vertes et de routes à faible circulation constituant un itinéraire destiné aux cyclistes et assurant la continuité de leur trajet sur de longues distances, dans des conditions de sécurité satisfaisantes.
in scheme: Cycle
in scheme: Transports et mobilité
in scheme: concepts
notation: EQUI635
related: voie verte
related: relais-vélo

auto-embarquement
type: ConceptConcept
type: Concept
creator: Commission d'enrichissement de la langue française, FranceTerme
date parution JO: 2010-06-20
deconseille ou frequent: smartboarding
deconseille ou frequent: speedboarding
equivalent EN: automated biometric boarding @en
equivalent EN: automated biometric boarding (en)
equivalent EN: automated boarding process @en
equivalent EN: automated boarding process (en)
equivalent EN: self-service boarding @en
equivalent EN: self-service boarding (en)
part of speech: nom masculin
definition: Procédure automatisée permettant au client d'une compagnie aérienne d'embarquer de façon plus autonome à bord d'un aéronef, après vérification de son identité par reconnaissance de ses empreintes biométriques.
in scheme: Transports et mobilité
in scheme: concept-SD-transports-et-mobilite-transport-aerien
in scheme: concepts
notation: EQUI636
note: L'emploi de « smartboarding » et de « speedboarding », qui sont des noms de marque, est à proscrire.

assiette
type: ConceptConcept
type: Concept
creator: Commission d'enrichissement de la langue française, FranceTerme
date parution JO: 2010-07-04
equivalent EN: pitch @en
equivalent EN: pitch (en)
part of speech: nom féminin
definition: Angle que fait l'axe longitudinal d'un aéronef avec le plan horizontal.
in scheme: Aéronautique
in scheme: concepts
notation: EQUI637
related: équilibrage
related: compensation
scope note: Cette publication annule et remplace celle du Journal officiel du 22 septembre 2000.

enregistreur de données de route
type: ConceptConcept
type: Concept
creator: Commission d'enrichissement de la langue française, FranceTerme
abbreviation: EDR
date parution JO: 2010-07-04
equivalent EN: EDR @en
equivalent EN: EDR (en)
equivalent EN: event data recorder @en
equivalent EN: event data recorder (en)
definition: Dispositif embarqué, destiné à enregistrer en continu et à restituer, notamment en cas d'accident, des données relatives à un véhicule et à sa conduite.
in scheme: Transports et mobilité
in scheme: concept-SD-transports-et-mobilite-securite
in scheme: concept-SD-transports-et-mobilite-transport-routier
in scheme: concepts
notation: EQUI638

géonavigateur
type: ConceptConcept
type: Concept
creator: Commission d'enrichissement de la langue française, FranceTerme
date parution JO: 2010-07-04
deconseille ou frequent: GPS
deconseille ou frequent: système de navigation embarqué
equivalent EN: automobile navigation system @en
equivalent EN: automobile navigation system (en)
equivalent EN: car navigation system @en
equivalent EN: car navigation system (en)
equivalent EN: vehicle navigation system @en
equivalent EN: vehicle navigation system (en)
forme abregee: navigateur, n.m.
part of speech: nom masculin
definition: Système d'aide au déplacement individuel ou à la conduite de véhicules, qui utilise les indications de géolocalisation par satellite pour permettre le repérage et proposer un ou plusieurs itinéraires.
in scheme: Transports et mobilité
in scheme: concepts
notation: EQUI639
note: 1. Dans le langage courant, le sigle anglais « GPS », qui désigne le système américain Global Positioning System, fournisseur de données de l'appareil indiquant seulement la position du véhicule, est utilisé à tort pour désigner le géonavigateur.
note: 2. On trouve aussi le terme « système de navigation embarqué », qui désigne plus précisément les systèmes d'aide à la conduite de véhicules.
related: géonavigateur participatif
related: système d'infodivertissement
related: concept-SPAT1350
related: concept-SPAT1351

dérapeur
type: ConceptConcept
type: Concept
creator: Commission d'enrichissement de la langue française, FranceTerme
source: révision de l'arrêté du 18 décembre 1990
date parution JO: 2000-09-22
equivalent EN: skid-car @en
equivalent EN: skid-car (en)
part of speech: nom masculin
definition: Dispositif fixé sous un véhicule d'essai afin de provoquer artificiellement un dérapage.
in scheme: Automobile
in scheme: Transports et mobilité
in scheme: concepts
notation: EQUI64

prise de décision collaborative
type: ConceptConcept
type: Concept
creator: Commission d'enrichissement de la langue française, FranceTerme
abbreviation: CDM @en
abbreviation: PDC
date parution JO: 2010-07-04
equivalent EN: CDM @en
equivalent EN: CDM (en)
equivalent EN: collaborative decision making @en
equivalent EN: collaborative decision making (en)
definition: Prise de décision intervenant dans la gestion du trafic aérien, qui résulte du partage d'informations et d'échanges continus entre tous les acteurs concernés.
in scheme: Transports et mobilité
in scheme: concept-SD-transports-et-mobilite-transport-aerien
in scheme: concepts
notation: EQUI640
note: Les informations échangées concernent la situation actuelle et les prévisions de vol, les besoins des décideurs, les contraintes qu'ils doivent prendre en compte et les solutions qu'ils envisagent.

transbus
type: ConceptConcept
type: Concept
creator: Commission d'enrichissement de la langue française, FranceTerme
date parution JO: 2010-07-04
deconseille ou frequent: BHLS
deconseille ou frequent: BHNS
deconseille ou frequent: BRT
deconseille ou frequent: TCSP
deconseille ou frequent: bus rapid transit
deconseille ou frequent: bus with high level of service
deconseille ou frequent: bus à haut niveau de service
deconseille ou frequent: busway
deconseille ou frequent: transport en commun en site propre
part of speech: nom masculin
definition: Système de transport collectif qui recourt à des autobus circulant sur des voies aménagées ou règlementées, et qui permet d'assurer une haute qualité de service ; par extension, chacun des autobus affectés à ce type de transport.
in scheme: Transports et mobilité
in scheme: concepts
notation: EQUI641
note: 1. Le transbus peut être un mode de transport en commun en site propre (TCSP).
note: 2. On trouve aussi, dans le langage professionnel, le terme « bus à haut niveau de service, BHNS » (en anglais : bus with high level of service, BHLS [GB], bus rapid transit, BRT [EU]).
note: 3. L'emploi du terme « busway », qui est un nom de marque, est à proscrire.

vedette de croisière
type: ConceptConcept
type: Concept
creator: Commission d'enrichissement de la langue française, FranceTerme
date parution JO: 2010-07-04
equivalent EN: Kabinenkreuzer @de
equivalent EN: Kabinenkreuzer (de)
equivalent EN: cabin cruiser @en
equivalent EN: cabin cruiser (en)
alternative label: vedette habitable
definition: Bateau à moteur, de longueur généralement inférieure à 15 mètres, équipé de couchettes et destiné à des sorties ou à de courtes croisières en mer ou dans les eaux intérieures.
in scheme: Tourisme
in scheme: Transports et mobilité
in scheme: concept-SD-tourisme-plaisance
in scheme: concept-SD-transports-et-mobilite-plaisance
in scheme: concepts
notation: EQUI642

zone de friche
type: ConceptConcept
type: Concept
creator: Commission d'enrichissement de la langue française, FranceTerme
date parution JO: 2010-07-04
equivalent EN: Brachfläche @de
equivalent EN: Brachfläche (de)
equivalent EN: Brachland @de
equivalent EN: Brachland (de)
equivalent EN: brownfield @en
equivalent EN: brownfield (en)
forme abregee: friche, n.f.
definition: Ensemble de terrains laissés à l'abandon, sur lesquels peuvent subsister des installations ou des dépôts liés à des activités passées, et qui sont susceptibles de présenter des risques de pollution.
in scheme: Aménagement et urbanisme
in scheme: Environnement
in scheme: concepts
notation: EQUI643
note: Selon la nature des activités antérieures, le type de zone de friche peut être précisé, et l'on parle alors de friche industrielle, urbaine, ou portuaire.
related: friche industrielle
related: friche urbaine
related: zone verte

zone verte
type: ConceptConcept
type: Concept
creator: Commission d'enrichissement de la langue française, FranceTerme
date parution JO: 2010-07-04
equivalent EN: greenfield @en
equivalent EN: greenfield (en)
definition: Ensemble de terrains non construits et non pollués qui peuvent être soit préservés en l'état et déclarés non constructibles, soit transformés sans réhabilitation préalable en zone d'habitat, d'activités ou de loisirs.
in scheme: Aménagement et urbanisme
in scheme: Environnement
in scheme: concepts
notation: EQUI644
related: zone de friche

système d'identification automatique
type: ConceptConcept
type: Concept
creator: Commission d'enrichissement de la langue française, FranceTerme
abbreviation: AIS @en
date parution JO: 2010-07-04
equivalent EN: AIS @en
equivalent EN: AIS (en)
equivalent EN: automatic identification system @en
equivalent EN: automatic identification system (en)
definition: Système d'échange automatisé de messages radioélectriques qui permet aux navires et aux stations côtières de surveillance du trafic de connaître l'identité, le statut, la position et la route des navires se trouvant dans une zone de navigation.
in scheme: Transports et mobilité
in scheme: concept-SD-transports-et-mobilite-transport-maritime
in scheme: concepts
notation: EQUI646
note: Ce système permet d'une part de rendre plus sûre la navigation, notamment les manœuvres anti-abordage, d'autre part de suivre avec précision le trafic maritime, selon les navires et les marchandises transportées, surtout dans les zones fréquentées.

voie verte
type: ConceptConcept
type: Concept
creator: Commission d'enrichissement de la langue française, FranceTerme
date parution JO: 2011-06-09
equivalent EN: greenway @en
equivalent EN: greenway (en)
definition: Chaussée en site propre réservée à la circulation des véhicules non motorisés, des piétons ou des cavaliers.
in scheme: Cycle
in scheme: Transports et mobilité
in scheme: concepts
notation: EQUI647
related: véloroute

créneau
type: ConceptConcept
type: Concept
creator: Commission d'enrichissement de la langue française, FranceTerme
date parution JO: 2013-12-21
equivalent EN: slot @en
equivalent EN: slot (en)
part of speech: nom masculin
definition: Emplacement destiné à recevoir un conteneur sur un porte-conteneurs.
in scheme: Transports et mobilité
in scheme: concept-SD-transports-et-mobilite-transport-maritime
in scheme: concepts
notation: EQUI648
note: Les créneaux font généralement l’objet d’accords entre les armements qui les proposent à la location aux opérateurs du commerce international.
related: accord de créneaux

accord de créneaux
type: ConceptConcept
type: Concept
creator: Commission d'enrichissement de la langue française, FranceTerme
date parution JO: 2013-12-21
equivalent EN: slot agreement @en
equivalent EN: slot agreement (en)
definition: Accord passé entre armements pour vendre ou échanger des créneaux, qui favorise le développement et la gestion de lignes maritimes régulières de porte-conteneurs.
in scheme: Transports et mobilité
in scheme: concept-SD-transports-et-mobilite-transport-maritime
in scheme: concepts
notation: EQUI649
related: créneau

détail d'exécution
type: ConceptConcept
type: Concept
creator: Commission d'enrichissement de la langue française, FranceTerme
source: révision de l'arrêté du 17 février 1986
date parution JO: 2000-09-22
equivalent EN: execution detail @en
equivalent EN: execution detail (en)
equivalent EN: inset @en
equivalent EN: inset (en) [Source : Avis du 16 décembre 1998.]
definition: Document graphique représentant, généralement en vraie ou demi-grandeur, une fraction d'un ouvrage complexe.
in scheme: Habitat et construction
in scheme: concept-SD-habitat-et-construction-architecture
in scheme: concepts
notation: EQUI65

conteneur pour palettes
type: ConceptConcept
type: Concept
creator: Commission d'enrichissement de la langue française, FranceTerme
date parution JO: 2013-12-21
deconseille ou frequent: conteneur à palettes
deconseille ou frequent: conteneur-palettes
deconseille ou frequent: pallet wide container
equivalent EN: palletwide container @en
equivalent EN: palletwide container (en)
definition: Conteneur dont les dimensions et l’aménagement permettent le transport sans perte de place de palettes normalisées.
in scheme: Transports et mobilité
in scheme: concept-SD-transports-et-mobilite-transport-maritime
in scheme: concepts
notation: EQUI650

conteneur frigorifique
type: ConceptConcept
type: Concept
creator: Commission d'enrichissement de la langue française, FranceTerme
date parution JO: 2013-12-21
equivalent EN: reefer @en
equivalent EN: reefer (en)
equivalent EN: refrigerated container @en
equivalent EN: refrigerated container (en)
alternative label: conteneur réfrigéré
definition: Conteneur équipé d’un dispositif de régulation de la température, qui est principalement destiné au transport de denrées alimentaires périssables.
in scheme: Transports et mobilité
in scheme: concept-SD-transports-et-mobilite-transport-maritime
in scheme: concepts
notation: EQUI651
note: Un conteneur frigorifique nécessite la présence d’une alimentation électrique.

contrat à terme de fret maritime
type: ConceptConcept
type: Concept
creator: Commission d'enrichissement de la langue française, FranceTerme
abbreviation: FFA @en
date parution JO: 2013-12-21
equivalent EN: FFA @en
equivalent EN: FFA (en)
equivalent EN: forward freight agreement @en
equivalent EN: forward freight agreement (en)
definition: Contrat par lequel une partie s’engage fermement, moyennant un dépôt de garantie, à acheter ou à vendre une certaine capacité de fret maritime, à une date fixée et à un prix convenu.
in scheme: Finance
in scheme: Transports et mobilité
in scheme: concept-SD-finance-transport-maritime
in scheme: concept-SD-transports-et-mobilite-transport-maritime
in scheme: concepts
notation: EQUI652
note: Les contrats à terme de fret maritime s’échangent sur un marché financier spécifique.

port d'éclatement
type: ConceptConcept
type: Concept
creator: Commission d'enrichissement de la langue française, FranceTerme
date parution JO: 2013-12-21
equivalent EN: hub @en
equivalent EN: hub (en)
alternative label: port pivot
definition: Port dans lequel des conteneurs acheminés par des navires principaux repartent vers d’autres ports après avoir été chargés sur des navires collecteurs.
in scheme: Transports et mobilité
in scheme: concept-SD-transports-et-mobilite-transport-maritime
in scheme: concepts
notation: EQUI653
related: pôle
related: navire collecteur
related: navire principal
related: trafic d'éclatement

trafic d'éclatement
type: ConceptConcept
type: Concept
creator: Commission d'enrichissement de la langue française, FranceTerme
date parution JO: 2013-12-21
equivalent EN: feedering @en
equivalent EN: feedering (en)
definition: Trafic des navires collecteurs dans un port d’éclatement.
in scheme: Transports et mobilité
in scheme: concept-SD-transports-et-mobilite-transport-maritime
in scheme: concepts
notation: EQUI654
related: navire collecteur
related: port d'éclatement

propulseur omnidirectionnel
type: ConceptConcept
type: Concept
creator: Commission d'enrichissement de la langue française, FranceTerme
abbreviation: POD
date parution JO: 2013-12-21
equivalent EN: pod @en
equivalent EN: pod (en)
alternative label: propulseur en nacelle
definition: Système de propulsion qui est installé dans une nacelle orientable suspendue sous la coque d’un navire par un bras rigide pivotant.
in scheme: Marine
in scheme: concept-SD-marine-construction-navale
in scheme: concepts
notation: EQUI655

substance nocive ou potentiellement dangereuse
type: ConceptConcept
type: Concept
creator: Commission d'enrichissement de la langue française, FranceTerme
abbreviation: HNS @en
abbreviation: SNPD
date parution JO: 2013-12-21
equivalent EN: HNS @en
equivalent EN: HNS (en)
equivalent EN: hazardous and noxious substances @en
equivalent EN: hazardous and noxious substances (en)
definition: Substance susceptible, lors de son transport par voie de mer, de provoquer des incendies, des explosions ou une pollution du milieu marin par suite d’un accident ou d’un déversement.
in scheme: Transports et mobilité
in scheme: concept-SD-transports-et-mobilite-transport-maritime
in scheme: concepts
notation: EQUI656

cabrage non commandé
type: ConceptConcept
type: Concept
creator: Commission d'enrichissement de la langue française, FranceTerme
date parution JO: 2013-12-21
deconseille ou frequent: autocabrage
deconseille ou frequent: cabrage intempestif
equivalent EN: pitch-up @en
equivalent EN: pitch-up (en)
definition: Cabrage d’un avion non provoqué par le pilote, qui peut se produire sous le seul effet de forces aérodynamiques et dans certaines plages de vitesse.
in scheme: Aéronautique
in scheme: Défense
in scheme: concepts
notation: EQUI657
scope note: Cette publication annule et remplace celle du terme « autocabrage » au Journal officiel du 22 septembre 2000.

délestage
type: ConceptConcept
type: Concept
creator: Commission d'enrichissement de la langue française, FranceTerme
date parution JO: 2013-12-21
equivalent EN: temporary flight suspension @en
equivalent EN: temporary flight suspension (en)
equivalent EN: temporary suspension of flights @en
equivalent EN: temporary suspension of flights (en)
part of speech: nom masculin
definition: Suspension temporaire d’un ou de plusieurs vols réguliers, notamment en vue de décongestionner le trafic aérien.
in scheme: Transports et mobilité
in scheme: concept-SD-transports-et-mobilite-transport-aerien
in scheme: concepts
notation: EQUI658
scope note: Cette publication annule et remplace celle du Journal officiel du 22 septembre 2000.

distribution à programme variable
type: ConceptConcept
type: Concept
creator: Commission d'enrichissement de la langue française, FranceTerme
source: révision de l'arrêté du 18 décembre 1990
date parution JO: 2000-09-22
equivalent EN: variable valve timing @en
equivalent EN: variable valve timing (en)
definition: Mode de distribution des gaz permettant de faire varier l'instant d'ouverture et de fermeture des différentes soupapes.
in scheme: Automobile
in scheme: Transports et mobilité
in scheme: concepts
notation: EQUI66

multimédia de bord
type: ConceptConcept
type: Concept
creator: Commission d'enrichissement de la langue française, FranceTerme
abbreviation: IFE @en
abbreviation: IFES @en
date parution JO: 2013-12-21
deconseille ou frequent: divertissement en vol
equivalent EN: IFE @en
equivalent EN: IFE (en)
equivalent EN: IFE system @en
equivalent EN: IFE system (en)
equivalent EN: IFES @en
equivalent EN: IFES (en)
equivalent EN: in-flight entertainment @en
equivalent EN: in-flight entertainment (en)
equivalent EN: in-flight entertainment system @en
equivalent EN: in-flight entertainment system (en)
definition: Dispositif multimédia destiné à informer et à divertir les passagers à bord d’un avion.
in scheme: Audiovisuel
in scheme: Transports et mobilité
in scheme: concept-SD-audiovisuel-transport-aerien
in scheme: concept-SD-transports-et-mobilite-transport-aerien
in scheme: concepts
notation: EQUI661
related: système d'infodivertissement

mécanique des fluides numérique
type: ConceptConcept
type: Concept
creator: Commission d'enrichissement de la langue française, FranceTerme
abbreviation: CFD @en
date parution JO: 2013-12-21
deconseille ou frequent: mécanique des fluides informatisée
equivalent EN: CFD @en
equivalent EN: CFD (en)
equivalent EN: computational fluid dynamics @en
equivalent EN: computational fluid dynamics (en)
definition: Simulation sur ordinateur des écoulements de fluides intervenant notamment dans la conception aérodynamique ou hydrodynamique des structures, des véhicules terrestres, des navires et des aéronefs.
in scheme: Mathématiques
in scheme: Physique
in scheme: concept-SD-mathematiques-mathematiques-appliquees
in scheme: concept-SD-physique-mathematiques-appliquees
in scheme: concepts
notation: EQUI662

qualité de navigation requise
type: ConceptConcept
type: Concept
creator: Commission d'enrichissement de la langue française, FranceTerme
abbreviation: RNP @en
date parution JO: 2013-12-21
equivalent EN: RNP @en
equivalent EN: RNP (en)
equivalent EN: required navigation performance @en
equivalent EN: required navigation performance (en)
definition: Niveau de précision de navigation exigé pour qu’un aéronef puisse évoluer, grâce à un système de positionnement satellitaire, dans un espace aérien défini.
in scheme: Aéronautique
in scheme: Transports et mobilité
in scheme: concept-SD-aeronautique-transport-aerien
in scheme: concept-SD-transports-et-mobilite-transport-aerien
in scheme: concepts
notation: EQUI663
note: La qualité de navigation est caractérisée notamment par la précision latérale de navigation de l’aéronef attendue durant le temps de vol, généralement exprimée en milles marins.

ravitaillement en vol
type: ConceptConcept
type: Concept
creator: Commission d'enrichissement de la langue française, FranceTerme
abbreviation: AAR @en
abbreviation: IFR @en
date parution JO: 2013-12-21
deconseille ou frequent: aerial refuelling
deconseille ou frequent: air refuelling
deconseille ou frequent: air-to-air refuelling
deconseille ou frequent: in-flight refuelling
equivalent EN: AAR @en
equivalent EN: AAR (en)
equivalent EN: IFR @en
equivalent EN: IFR (en)
equivalent EN: aerial refueling @en
equivalent EN: aerial refueling (en)
equivalent EN: aerial tanking @en
equivalent EN: aerial tanking (en)
equivalent EN: air refueling @en
equivalent EN: air refueling (en)
equivalent EN: air-to-air refueling @en
equivalent EN: air-to-air refueling (en)
equivalent EN: in-flight refueling @en
equivalent EN: in-flight refueling (en)
definition: Réapprovisionnement en carburant d’aéronefs effectué par un avion ravitailleur pendant le vol.
in scheme: Aéronautique
in scheme: Défense
in scheme: concepts
notation: EQUI664

réacteur à réducteur
type: ConceptConcept
type: Concept
creator: Commission d'enrichissement de la langue française, FranceTerme
abbreviation: GTF @en
date parution JO: 2013-12-21
equivalent EN: GTF @en
equivalent EN: GTF (en)
equivalent EN: geared turbofan @en
equivalent EN: geared turbofan (en)
definition: Moteur à réaction doté d’un réducteur de la vitesse de rotation de la turbosoufflante, qui permet de diminuer la consommation de carburant et le niveau sonore.
in scheme: Aéronautique
in scheme: concepts
notation: EQUI665
note: Le réacteur à réducteur équipe en particulier les avions commerciaux.

reconstitution de trajectoire
type: ConceptConcept
type: Concept
creator: Commission d'enrichissement de la langue française, FranceTerme
date parution JO: 2013-12-21
definition: Établissement rétrospectif des positions successives et de la vitesse d’un aéronef par l’exploitation de paramètres enregistrés en vol ou au sol.
in scheme: Aéronautique
in scheme: Transports et mobilité
in scheme: concept-SD-aeronautique-transport-aerien
in scheme: concept-SD-transports-et-mobilite-transport-aerien
in scheme: concepts
notation: EQUI666

suremport
type: ConceptConcept
type: Concept
creator: Commission d'enrichissement de la langue française, FranceTerme
date parution JO: 2013-12-21
deconseille ou frequent: fuel tankering
equivalent EN: additional tankering @en
equivalent EN: additional tankering (en)
part of speech: nom masculin
definition: Emport de carburant qui permet à un aéronef de gagner une destination donnée et d’effectuer un parcours ultérieur sans nouveau ravitaillement.
in scheme: Transports et mobilité
in scheme: concept-SD-transports-et-mobilite-transport-aerien
in scheme: concepts
notation: EQUI667
note: Le suremport peut être utilisé pour des raisons techniques (par exemple le manque de carburant approprié à l’aéroport de destination) ou, le plus souvent, économiques, afin de tenir compte notamment des différences de prix entre les aéroports.

cadencement
type: ConceptConcept
type: Concept
creator: Commission d'enrichissement de la langue française, FranceTerme
date parution JO: 2013-12-21
equivalent EN: Taktfahrplan @de
equivalent EN: Taktfahrplan (de)
part of speech: nom masculin
definition: Organisation de la desserte d’une ligne ou d’un réseau de transports selon un rythme régulier, fréquent et facilement mémorisable ; par extension, fréquence de cette desserte.
in scheme: Transports et mobilité
in scheme: concepts
notation: EQUI668
related: navette
related: desserte cadencée

habilitation
type: ConceptConcept
type: Concept
creator: Commission d'enrichissement de la langue française, FranceTerme
date parution JO: 2013-12-21
equivalent EN: empowerment @en
equivalent EN: empowerment (en)
part of speech: nom féminin
definition: Action de conférer à un groupe de personnes ou d’organismes la compétence pour participer à l’élaboration de projets ou de décisions publics.
in scheme: Aménagement et urbanisme
in scheme: Politique
in scheme: concepts
notation: EQUI669
related: principe de participation

divers en vrac
type: ConceptConcept
type: Concept
creator: Commission d'enrichissement de la langue française, FranceTerme
source: révision de l'arrêté du 23 septembre 1987
date parution JO: 2000-09-22
deconseille ou frequent: divers-vrac
equivalent EN: break bulk @en
equivalent EN: break bulk (en)
definition: Cargaison composée de colis divers non constitués en unités de charge.
in scheme: Transports et mobilité
in scheme: concepts
notation: EQUI67
note: On trouve aussi, elliptiquement, « divers-vrac » (langage professionnel).

dissociation
type: ConceptConcept
type: Concept
creator: Commission d'enrichissement de la langue française, FranceTerme
date parution JO: 2013-12-21
equivalent EN: unbundling @en
equivalent EN: unbundling (en)
part of speech: nom féminin
definition: Séparation, au sein d’un réseau de chemin de fer, de l’activité de transport et de la gestion de l’infrastructure.
in scheme: Transports et mobilité
in scheme: concept-SD-transports-et-mobilite-transport-ferroviaire
in scheme: concepts
notation: EQUI671
note: La dissociation permet au gestionnaire de l’infrastructure de transports d’étendre l’accès au réseau à plusieurs opérateurs ferroviaires.

massification
type: ConceptConcept
type: Concept
creator: Commission d'enrichissement de la langue française, FranceTerme
date parution JO: 2013-12-21
equivalent EN: freight consolidation @en
equivalent EN: freight consolidation (en)
equivalent EN: freight pool consolidation @en
equivalent EN: freight pool consolidation (en)
equivalent EN: pool freight consolidation @en
equivalent EN: pool freight consolidation (en)
part of speech: nom féminin
definition: Organisation de l’acheminement du fret associant une mutualisation des moyens de transport à un groupage réalisé par un commissionnaire de transport, le transporteur lui-même ou les expéditeurs.
in scheme: Transports et mobilité
in scheme: concepts
notation: EQUI672
related: groupage

portique imageur
type: ConceptConcept
type: Concept
creator: Commission d'enrichissement de la langue française, FranceTerme
date parution JO: 2013-12-21
deconseille ou frequent: body scanner
deconseille ou frequent: scanner corporel
equivalent EN: AIT machine @en
equivalent EN: AIT machine (en)
equivalent EN: advanced imaging technology machine @en
equivalent EN: advanced imaging technology machine (en)
equivalent EN: full-body scanner @en
equivalent EN: full-body scanner (en)
equivalent EN: imaging portal @en
equivalent EN: imaging portal (en)
forme abregee: imageur, n.m.
definition: Dispositif de contrôle de sûreté qui permet de visualiser les objets qu’une personne porte sur elle.
in scheme: Transports et mobilité
in scheme: concepts
notation: EQUI673
note: Le terme « scanner corporel » (en anglais : body scanner), qui désigne une technique d’imagerie médicale, est impropre dans ce sens.

tunnel de détection
type: ConceptConcept
type: Concept
creator: Commission d'enrichissement de la langue française, FranceTerme
date parution JO: 2013-12-21
equivalent EN: HBS machine @en
equivalent EN: HBS machine (en)
equivalent EN: HBS system @en
equivalent EN: HBS system (en)
equivalent EN: hold baggage screening machine @en
equivalent EN: hold baggage screening machine (en)
equivalent EN: hold baggage screening system @en
equivalent EN: hold baggage screening system (en)
definition: Scanner à rayons X équipant un poste de contrôle, qui permet d’inspecter des bagages en faisant apparaître leur contenu sur un écran.
in scheme: Transports et mobilité
in scheme: concepts
notation: EQUI674
note: Le tunnel de détection est muni d’un tapis roulant.

transbordement direct
type: ConceptConcept
type: Concept
creator: Commission d'enrichissement de la langue française, FranceTerme
date parution JO: 2013-12-21
deconseille ou frequent: crossdocking
deconseille ou frequent: passage à quai
equivalent EN: cross-docking @en
equivalent EN: cross-docking (en)
definition: Opération de transfert de marchandises d’un véhicule à un autre, sans stockage intermédiaire.
in scheme: Transports et mobilité
in scheme: concept-SD-transports-et-mobilite-transport-de-marchandises
in scheme: concepts
notation: EQUI676
scope note: Cette publication annule et remplace celle du terme « passage à quai » publié au Journal officiel du 26 octobre 2006.

mobilité durable
type: ConceptConcept
type: Concept
creator: Commission d'enrichissement de la langue française, FranceTerme
date parution JO: 2013-12-21
deconseille ou frequent: écomobilité
equivalent EN: sustainable mobility @en
equivalent EN: sustainable mobility (en)
definition: Recours à des modes de déplacement compatibles avec les objectifs du développement durable.
in scheme: Environnement
in scheme: Transports et mobilité
in scheme: concepts
notation: EQUI677
note: On trouve aussi le terme « écomobilité ».
related: développement durable
related: électromobilité
related: altermobilité

cyclotaxi
type: ConceptConcept
type: Concept
creator: Commission d'enrichissement de la langue française, FranceTerme
date parution JO: 2013-12-21
equivalent EN: rickshaw @en
equivalent EN: rickshaw (en)
part of speech: nom masculin
alternative label: cyclopousse
broader: concept-motocycle-et-cycle
definition: Véhicule léger tricycle ou quadricycle destiné au transport d’un ou de deux passagers et, le cas échéant, de leurs bagages.
in scheme: Cycle
in scheme: Transports et mobilité
in scheme: concepts
notation: EQUI679

duc-d'Albe
type: ConceptConcept
type: Concept
creator: Commission d'enrichissement de la langue française, FranceTerme
source: révision de l'arrêté du 17 février 1986
date parution JO: 2000-09-22
equivalent EN: dolphin @en
equivalent EN: dolphin (en)
part of speech: nom masculin
definition: Pieu ou faisceau de pieux émergeant et destiné à l'amarrage ou à l'évitement des bateaux.
in scheme: Habitat et construction
in scheme: concepts
notation: EQUI68

vélo à pignon fixe
type: ConceptConcept
type: Concept
creator: Commission d'enrichissement de la langue française, FranceTerme
date parution JO: 2013-12-21
deconseille ou frequent: fixie
equivalent EN: fixed-gear bicycle @en
equivalent EN: fixed-gear bicycle (en)
equivalent EN: fixed-gear bike @en
equivalent EN: fixed-gear bike (en)
equivalent EN: fixed-wheel bike @en
equivalent EN: fixed-wheel bike (en)
equivalent EN: fixie bike @en
equivalent EN: fixie bike (en)
forme abregee: pignon fixe
in scheme: Cycle
in scheme: concepts
notation: EQUI680

relais-vélo
type: ConceptConcept
type: Concept
creator: Commission d'enrichissement de la langue française, FranceTerme
date parution JO: 2013-12-21
deconseille ou frequent: bike and ride facilities
deconseille ou frequent: relais-vélos
equivalent EN: bike & ride facilities @en
equivalent EN: bike & ride facilities (en)
part of speech: nom masculin
definition: Ensemble de services situés sur un itinéraire régulièrement fréquenté par des cyclistes, qui peuvent comprendre un parc de stationnement ainsi que des moyens de réparation, de location, de gardiennage.
in scheme: Cycle
in scheme: Transports et mobilité
in scheme: concepts
notation: EQUI682
note: Les relais-vélos sont souvent situés à proximité des véloroutes ou des stations de transport en commun.
related: véloroute

reconstitution de route
type: ConceptConcept
type: Concept
creator: Commission d'enrichissement de la langue française, FranceTerme
date parution JO: 2013-12-21
equivalent EN: back tracking @en
equivalent EN: back tracking (en)
definition: Établissement rétrospectif des positions successives et des vitesses d’un ou de plusieurs navires susceptibles d’avoir été impliqués dans un évènement de mer.
in scheme: Transports et mobilité
in scheme: concept-SD-transports-et-mobilite-transport-maritime
in scheme: concepts
notation: EQUI684
scope note: Cette publication annule et remplace celle du Journal officiel du 4 juillet 2010.

immobilisation au sol
type: ConceptConcept
type: Concept
creator: Commission d'enrichissement de la langue française, FranceTerme
date parution JO: 2015-01-16
equivalent EN: grounding @en
equivalent EN: grounding (en)
alternative label: interdiction de vol
definition: Interdiction formelle signifiée à un aéronef de quitter un aéroport.
in scheme: Aéronautique
in scheme: Transports et mobilité
in scheme: concept-SD-aeronautique-transport-aerien
in scheme: concept-SD-transports-et-mobilite-transport-aerien
in scheme: concepts
notation: EQUI686
note: L’immobilisation au sol est décidée notamment lorsqu’il apparaît qu’un aéronef ne respecte pas les normes de sécurité.

artificialisation des sols
type: ConceptConcept
type: Concept
creator: Commission d'enrichissement de la langue française, FranceTerme
date parution JO: 2015-01-16
deconseille ou frequent: sol artificialisé
deconseille ou frequent: surface artificialisée
equivalent EN: land take @en
equivalent EN: land take (en)
definition: Transformation d’un sol à caractère naturel ou agricole par des actions d’aménagement, pouvant entraîner son imperméabilisation totale ou partielle.
in scheme: Aménagement et urbanisme
in scheme: Environnement
in scheme: concepts
notation: EQUI688
related: étalement urbain
related: mitage
related: imperméabilisation des sols
related: périurbanisation

imperméabilisation des sols
type: ConceptConcept
type: Concept
creator: Commission d'enrichissement de la langue française, FranceTerme
date parution JO: 2015-01-16
equivalent EN: soil sealing @en
equivalent EN: soil sealing (en)
in scheme: Aménagement et urbanisme
in scheme: Environnement
in scheme: concepts
notation: EQUI689
related: artificialisation des sols

duplex
type: ConceptConcept
type: Concept
creator: Commission d'enrichissement de la langue française, FranceTerme
source: révision de l'arrêté du 17 février 1986
date parution JO: 2000-09-22
equivalent EN: maisonnette @en
equivalent EN: maisonnette (en)
part of speech: nom masculin
definition: Logement s'étendant sur deux niveaux à l'intérieur d'un bâtiment collectif.
in scheme: Habitat et construction
in scheme: concepts
notation: EQUI69

canyon urbain
type: ConceptConcept
type: Concept
creator: Commission d'enrichissement de la langue française, FranceTerme
abbreviation: urban street canyon @en
date parution JO: 2015-01-16
equivalent EN: street canyon @en
equivalent EN: street canyon (en)
equivalent EN: urban canyon @en
equivalent EN: urban canyon (en)
equivalent EN: urban street canyon @en
equivalent EN: urban street canyon (en)
definition: Voie urbaine dont l’encaissement entre des bâtiments provoque des difficultés en matière d’environnement ou de radiocommunication.
in scheme: Aménagement et urbanisme
in scheme: concepts
notation: EQUI690
note: Un canyon urbain peut notamment créer de forts courants d’air ou entraîner une concentration de polluants.

urbanisme participatif
type: ConceptConcept
type: Concept
creator: Commission d'enrichissement de la langue française, FranceTerme
date parution JO: 2015-01-16
equivalent EN: fabrique urbaine
alternative label: fabrique urbaine
broader: concept-urbanisme
definition: Travail collectif associant, dans la mise en œuvre d’un projet urbain, les concepteurs, les usagers de la ville, des chercheurs de différentes disciplines et divers acteurs publics ou privés.
in scheme: Aménagement et urbanisme
in scheme: concepts
notation: EQUI692
related: concept-ville-connectee

périurbanisation
type: ConceptConcept
type: Concept
creator: Commission d'enrichissement de la langue française, FranceTerme
date parution JO: 2015-01-16
equivalent EN: peri-urbanization @en
equivalent EN: peri-urbanization (en)
equivalent EN: suburbanization @en
equivalent EN: suburbanization (en)
part of speech: nom féminin
definition: Extension de l’urbanisation à la périphérie d’un espace urbain.
in scheme: Aménagement et urbanisme
in scheme: Environnement
in scheme: concepts
notation: EQUI694
related: étalement urbain
related: artificialisation des sols

littoralisation
type: ConceptConcept
type: Concept
creator: Commission d'enrichissement de la langue française, FranceTerme
date parution JO: 2019-10-16
deconseille ou frequent: urbanisation côtière
part of speech: nom féminin
definition: Processus de concentration le long des littoraux de la population, des activités et des aménagements qui leur sont associés, dû à l’attractivité économique et résidentielle de ces zones.
in scheme: Aménagement et urbanisme
in scheme: Environnement
in scheme: concepts
notation: EQUI696

rurbanisation
type: ConceptConcept
type: Concept
creator: Commission d'enrichissement de la langue française, FranceTerme
date parution JO: 2015-01-16
equivalent EN: rurbanization @en
equivalent EN: rurbanization (en)
part of speech: nom féminin
definition: Processus d’urbanisation progressive d’un territoire rural autour de noyaux d’habitat traditionnels, caractérisé par l’installation de populations dont l’activité principale est liée à la ville.
in scheme: Aménagement et urbanisme
in scheme: Environnement
in scheme: concepts
notation: EQUI697
related: étalement urbain

roulage-décollage
type: ConceptConcept
type: Concept
creator: Commission d'enrichissement de la langue française, FranceTerme
date parution JO: 1997-12-02
equivalent EN: rolling take-off @en
equivalent EN: rolling take-off (en)
part of speech: nom masculin
definition: Pour un avion, le fait de ne pas marquer de temps d'arrêt entre le roulage sur la voie de circulation et le décollage.
in scheme: Transports et mobilité
in scheme: concept-SD-transports-et-mobilite-transport-aerien
in scheme: concepts
notation: EQUI7

échangeur thermique intermédiaire
type: ConceptConcept
type: Concept
creator: Commission d'enrichissement de la langue française, FranceTerme
source: révision de l'arrêté du 21 septembre 1993
abbreviation: ETI
date parution JO: 2000-09-22
equivalent EN: intercooler @en
equivalent EN: intercooler (en)
alternative label: refroidisseur
definition: Radiateur situé entre le système de suralimentation et le moteur, destiné à diminuer la température de l'air qui entre dans le moteur.
in scheme: Automobile
in scheme: Transports et mobilité
in scheme: concepts
notation: EQUI70

immobilisation au port
type: ConceptConcept
type: Concept
creator: Commission d'enrichissement de la langue française, FranceTerme
date parution JO: 2015-01-16
equivalent EN: detention @en
equivalent EN: detention (en)
definition: Interdiction formelle signifiée à un navire de quitter un port.
in scheme: Transports et mobilité
in scheme: concept-SD-transports-et-mobilite-transport-maritime
in scheme: concepts
notation: EQUI701
note: L’immobilisation au port est décidée notamment lorsqu’il apparaît que les normes de sécurité ou de protection de l’environnement ne sont pas respectées.

report modal
type: ConceptConcept
type: Concept
creator: Commission d'enrichissement de la langue française, FranceTerme
date parution JO: 2015-01-16
equivalent EN: modal shift @en
equivalent EN: modal shift (en)
alternative label: transfert modal
definition: Report du trafic de passagers ou de fret d’un mode de transport, généralement la route, vers un autre mode plus respectueux de l’environnement.
in scheme: Environnement
in scheme: Transports et mobilité
in scheme: concepts
notation: EQUI702

cartographie dynamique
type: ConceptConcept
type: Concept
creator: Commission d'enrichissement de la langue française, FranceTerme
date parution JO: 2015-01-16
deconseille ou frequent: cartodynamique
deconseille ou frequent: cartographie intelligente
deconseille ou frequent: smart mapping
equivalent EN: dynamic mapping @en
equivalent EN: dynamic mapping (en)
definition: Technique qui permet de créer et de mettre à jour des cartes en temps réel grâce à des bases de données distantes ou à des capteurs.
in scheme: Transports et mobilité
in scheme: concepts
notation: EQUI703
note: La cartographie dynamique trouve notamment des applications dans les domaines de la circulation routière, de la météorologie et de la prévention de la pollution.

soufflante non carénée
type: ConceptConcept
type: Concept
creator: Commission d'enrichissement de la langue française, FranceTerme
date parution JO: 2017-07-06
equivalent EN: UDF engine @en
equivalent EN: UDF engine (en)
equivalent EN: open rotor @en
equivalent EN: open rotor (en)
equivalent EN: propfan @en
equivalent EN: propfan (en)
equivalent EN: unducted fan engine @en
equivalent EN: unducted fan engine (en)
definition: Soufflante placée à l’extérieur du carénage du moteur d’un aéronef ; par extension, moteur comportant une soufflante de ce type.
in scheme: Aéronautique
in scheme: concepts
notation: EQUI708
note: L’absence de carénage de la soufflante permet d’améliorer les performances du moteur d’un aéronef.
related: soufflante
related: soufflante carénée

géométrage
type: ConceptConcept
type: Concept
creator: Commission d'enrichissement de la langue française, FranceTerme
date parution JO: 2017-07-06
deconseille ou frequent: EQUI13
equivalent EN: surveying @en
equivalent EN: surveying (en)
part of speech: nom masculin
definition: Ensemble des opérations, telles que l’arpentage, le bornage et le cadastrage, qui sont effectuées par un géomètre.
in scheme: Aménagement et urbanisme
in scheme: concepts
notation: EQUI709

écran antibruit
type: ConceptConcept
type: Concept
creator: Commission d'enrichissement de la langue française, FranceTerme
source: révision de l'arrêté du 27 mai 1992
date parution JO: 2000-09-22
definition: Dispositif de protection contre les nuisances sonores, destiné à diminuer la gêne des riverains.
in scheme: Aménagement et urbanisme
in scheme: Transports et mobilité
in scheme: concepts
notation: EQUI71

écoéclairage
type: ConceptConcept
type: Concept
creator: Commission d'enrichissement de la langue française, FranceTerme
date parution JO: 2019-01-29
deconseille ou frequent: relampage
deconseille ou frequent: rééclairage
equivalent EN: relamping @en
equivalent EN: relamping (en)
part of speech: nom masculin
definition: Optimisation d’un système d’éclairage collectif en matière d’économie d’énergie, de sécurité ou de réduction de la pollution lumineuse.
in scheme: Aménagement et urbanisme
in scheme: Énergie
in scheme: concepts
notation: EQUI711
note: L’écoéclairage est assuré notamment par le remplacement de l’ensemble des ampoules par des ampoules à basse consommation telles que les diodes électroluminescentes.
related: diode électroluminescente

rénovation urbaine
type: ConceptConcept
type: Concept
creator: Commission d'enrichissement de la langue française, FranceTerme
date parution JO: 2019-01-29
equivalent EN: urban regeneration @en
equivalent EN: urban regeneration (en)
definition: Ensemble coordonné d’opérations d’aménagement d’un quartier considéré comme dégradé ou de conception obsolète, comportant la démolition et la reconstruction d’immeubles, ainsi que la réhabilitation et la construction de logements et d’équipements collectifs, et la transformation d’espaces publics.
in scheme: Aménagement et urbanisme
in scheme: concepts
notation: EQUI713
related: renouvellement urbain

soufflante
type: ConceptConcept
type: Concept
creator: Commission d'enrichissement de la langue française, FranceTerme
date parution JO: 2017-07-06
equivalent EN: fan @en
equivalent EN: fan (en)
part of speech: nom féminin
definition: Roue de compresseur à basse pression d’un réacteur à double flux, généralement utilisée comme premier étage de compression et entraînée par une turbine.
in scheme: Aéronautique
in scheme: concepts
notation: EQUI714
note: Une soufflante permet d’améliorer les performances du moteur d’un aéronef.
related: réacteur à double flux
related: soufflante non carénée
related: soufflante carénée
scope note: Cette publication annule et remplace celle du Journal officiel du 22 septembre 2000.

soufflante carénée
type: ConceptConcept
type: Concept
creator: Commission d'enrichissement de la langue française, FranceTerme
date parution JO: 2017-07-06
equivalent EN: ducted fan @en
equivalent EN: ducted fan (en)
equivalent EN: ducted fan engine @en
equivalent EN: ducted fan engine (en)
alternative label: soufflante canalisée
definition: Soufflante placée à l’intérieur du carénage annulaire du moteur d’un aéronef ; par extension, moteur comportant une soufflante de ce type.
in scheme: Aéronautique
in scheme: concepts
notation: EQUI716
related: soufflante non carénée
related: soufflante
scope note: Cette publication annule et remplace celle du terme « soufflante canalisée » au Journal officiel du 22 septembre 2000.

enregistreur de vol
type: ConceptConcept
type: Concept
creator: Commission d'enrichissement de la langue française, FranceTerme
date parution JO: 2017-07-06
deconseille ou frequent: boîte noire
equivalent EN: flight recorder @en
equivalent EN: flight recorder (en)
definition: Appareil embarqué à bord d’un aéronef, qui enregistre automatiquement des éléments sonores ou des paramètres du vol.
in scheme: Aéronautique
in scheme: Transports et mobilité
in scheme: concept-SD-aeronautique-transport-aerien
in scheme: concept-SD-transports-et-mobilite-transport-aerien
in scheme: concepts
notation: EQUI717
note: 1. Les données recueillies par les enregistreurs de vol sont utilisées pour l’analyse des accidents et des incidents.
note: 2. L’enregistreur de données de vol et l’enregistreur phonique sont des enregistreurs de vol.
note: 3. On trouve aussi le terme « boîte noire ».
related: enregistreur de données de vol
related: enregistreur phonique
scope note: Cette publication annule et remplace celles des termes « enregistreur de vol » et « enregistreur d’accident » au Journal officiel du 22 septembre 2000.

enregistreur de données de vol
type: ConceptConcept
type: Concept
creator: Commission d'enrichissement de la langue française, FranceTerme
abbreviation: EDV
date parution JO: 2017-07-06
equivalent EN: FDR @en
equivalent EN: FDR (en)
equivalent EN: flight data recorder @en
equivalent EN: flight data recorder (en)
definition: Appareil embarqué à bord d’un aéronef, qui enregistre les données essentielles du vol, telles que la trajectoire, la vitesse et les paramètres du moteur.
in scheme: Aéronautique
in scheme: Transports et mobilité
in scheme: concept-SD-aeronautique-transport-aerien
in scheme: concept-SD-transports-et-mobilite-transport-aerien
in scheme: concepts
notation: EQUI718
note: L’enregistreur de données de vol est un enregistreur de vol.
related: enregistreur de vol
related: enregistreur phonique

enregistreur phonique
type: ConceptConcept
type: Concept
creator: Commission d'enrichissement de la langue française, FranceTerme
abbreviation: EP
date parution JO: 2017-07-06
deconseille ou frequent: enregistreur de voix
equivalent EN: CVR @en
equivalent EN: CVR (en)
equivalent EN: cockpit voice recorder @en
equivalent EN: cockpit voice recorder (en)
definition: Appareil embarqué à bord d’un aéronef, qui enregistre les conversations et le bruit ambiant dans le poste de pilotage.
in scheme: Aéronautique
in scheme: Transports et mobilité
in scheme: concept-SD-aeronautique-transport-aerien
in scheme: concept-SD-transports-et-mobilite-transport-aerien
in scheme: concepts
notation: EQUI719
note: L’enregistreur phonique est un enregistreur de vol.
related: enregistreur de vol
related: enregistreur de données de vol
scope note: Cette publication annule et remplace celle du Journal officiel du 16 janvier 2015.

écran antiéblouissement
type: ConceptConcept
type: Concept
creator: Commission d'enrichissement de la langue française, FranceTerme
source: révision de l'arrêté du 27 mai 1992
date parution JO: 2000-09-22
deconseille ou frequent: antiéblouissant
definition: Dispositif placé au sol et destiné à éviter l'éblouissement dû aux projecteurs des véhicules circulant en sens inverse.
in scheme: Transports et mobilité
in scheme: concept-SD-transports-et-mobilite-transport-routier
in scheme: concepts
notation: EQUI72
note: Pour désigner un dispositif modifiant la lumière émise par des projecteurs, on emploie comme substantif, le terme « antiéblouissant ».

cyclabilité
type: ConceptConcept
type: Concept
creator: Commission d'enrichissement de la langue française, FranceTerme
date parution JO: 2017-07-06
equivalent EN: cyclability @en
equivalent EN: cyclability (en)
part of speech: nom féminin
definition: Qualité d’une voie ou d’un ensemble de voies aménagés pour faciliter et sécuriser les déplacements à vélo.
in scheme: Aménagement et urbanisme
in scheme: Transports et mobilité
in scheme: concepts
notation: EQUI721

mixité fonctionnelle
type: ConceptConcept
type: Concept
creator: Commission d'enrichissement de la langue française, FranceTerme
date parution JO: 2017-07-06
equivalent EN: mixed-use development @en
equivalent EN: mixed-use development (en)
alternative label: multifonctionnalité
definition: Caractéristique d’un ensemble urbain, tels un quartier, une commune ou un ensemble de communes, qui allie des fonctions diversifiées, notamment résidentielles, commerciales, culturelles, administratives, industrielles.
in scheme: Aménagement et urbanisme
in scheme: concepts
notation: EQUI722
related: monofonctionnalité
related: renouvellement urbain

monofonctionnalité
type: ConceptConcept
type: Concept
creator: Commission d'enrichissement de la langue française, FranceTerme
date parution JO: 2017-07-06
part of speech: nom féminin
definition: Spécialisation d’usage d’un ensemble urbain.
in scheme: Aménagement et urbanisme
in scheme: concepts
notation: EQUI723
related: mixité fonctionnelle

renouvellement urbain
type: ConceptConcept
type: Concept
creator: Commission d'enrichissement de la langue française, FranceTerme
date parution JO: 2019-01-29
equivalent EN: urban renewal @en
equivalent EN: urban renewal (en)
definition: Ensemble coordonné d’opérations de transformation de la ville qui visent à adapter celle-ci à de nouveaux usages.
in scheme: Aménagement et urbanisme
in scheme: concepts
notation: EQUI724
note: Le renouvellement urbain concerne plusieurs fonctions urbaines. Il peut favoriser la mixité sociale ou fonctionnelle grâce à des modifications de l’habitat et des services, notamment dans les domaines de l’éducation, de l’emploi, de la santé et de la sécurité.
related: rénovation urbaine
related: mixité fonctionnelle

convoi semi-automatisé de camions
type: ConceptConcept
type: Concept
creator: Commission d'enrichissement de la langue française, FranceTerme
date parution JO: 2019-01-29
deconseille ou frequent: convoi automatisé
deconseille ou frequent: convoi autonome
equivalent EN: platooning @en
equivalent EN: platooning (en)
equivalent EN: truck platooning @en
equivalent EN: truck platooning (en)
equivalent EN: truck platooning system @en
equivalent EN: truck platooning system (en)
definition: Ensemble roulant de camions solidarisés par un système d’asservissement électronique, sans lien physique, dont seul le camion de tête est piloté par un conducteur.
in scheme: Transports et mobilité
in scheme: concept-SD-transports-et-mobilite-transport-routier
in scheme: concepts
notation: EQUI726
note: 1. Le système d’asservissement électronique permet à chaque camion du convoi de suivre à une distance adéquate le camion qui le précède.
note: 2. Un convoi semi-automatisé de camions peut améliorer la fluidité du trafic du fait de sa longueur réduite, diminuer la consommation d’énergie grâce à une traînée aérodynamique limitée, et accroître la sécurité de circulation des camions, les ordres de freinage étant simultanés.

administrateur, -trice de bâti immobilier modélisé
type: ConceptConcept
type: Concept
creator: Commission d'enrichissement de la langue française, FranceTerme
date parution JO: 2019-01-29
deconseille ou frequent: administrateur BIM
deconseille ou frequent: administratrice BIM
deconseille ou frequent: gestionnaire BIM
deconseille ou frequent: manager BIM
equivalent EN: BIM manager @en
equivalent EN: BIM manager (en)
forme abregee: administrateur, -trice de BIM
forme abregee: administrateur, -trice de bâti modélisé
forme abregee: gestionnaire de BIM
forme abregee: gestionnaire de bâti modélisé
alternative label: gestionnaire de bâti immobilier modélisé
in scheme: Habitat et construction
in scheme: Informatique
in scheme: concept-SD-habitat-et-construction-architecture
in scheme: concept-SD-informatique-architecture
in scheme: concepts
notation: EQUI727
related: bâti immobilier modélisé

bâti immobilier modélisé
type: ConceptConcept
type: Concept
creator: Commission d'enrichissement de la langue française, FranceTerme
abbreviation: BIM
date parution JO: 2019-01-29
equivalent EN: BIM @en
equivalent EN: BIM (en)
equivalent EN: building information management @en
equivalent EN: building information management (en) [exploitation]
equivalent EN: building information model @en
equivalent EN: building information model (en) [maquette]
equivalent EN: building information modeling @en
equivalent EN: building information modeling (en) [exploitation]
equivalent EN: building information modelling @en
equivalent EN: building information modelling (en) [exploitation]
forme abregee: bâti modélisé
definition: Maquette numérique d’un ouvrage immobilier qui permet de mettre en commun et d’actualiser les données géométriques et techniques durant les phases de conception, de construction et d’utilisation, voire de démolition.
in scheme: Habitat et construction
in scheme: Informatique
in scheme: concept-SD-habitat-et-construction-architecture
in scheme: concept-SD-informatique-architecture
in scheme: concepts
notation: EQUI728
note: Le bâti immobilier modélisé peut aussi être utilisé pour les infrastructures et dans l’urbanisme.
related: administrateur, -trice de bâti immobilier modélisé

écocalculateur
type: ConceptConcept
type: Concept
creator: Commission d'enrichissement de la langue française, FranceTerme
date parution JO: 2019-01-29
deconseille ou frequent: écocomparateur
equivalent EN: ecocalculator @en
equivalent EN: ecocalculator (en)
part of speech: nom masculin
definition: Outil numérique qui permet d’estimer, pour un service donné, la quantité de gaz à effet de serre et la quantité de polluants émises.
in scheme: Environnement
in scheme: Transports et mobilité
in scheme: concepts
notation: EQUI729
note: 1. La quantité de gaz à effet de serre émise est généralement mesurée par son équivalent en dioxyde de carbone.
note: 2. L’écocalculateur est notamment utilisé dans les transports pour comparer les options correspondant à un trajet et à un mode de transport donnés : on peut alors parler d’« écocomparateur ».
related: équivalent en dioxyde de carbone
related: écocomparateur de projet

écrasement
type: ConceptConcept
type: Concept
creator: Commission d'enrichissement de la langue française, FranceTerme
source: révision de l'arrêté du 21 septembre 1993
date parution JO: 2000-09-22
equivalent EN: crash @en
equivalent EN: crash (en)
part of speech: nom masculin
definition: Le fait de s'écraser.
in scheme: Transports et mobilité
in scheme: concept-SD-transports-et-mobilite-transport-aerien
in scheme: concepts
notation: EQUI73
related: écraser (s')

écocomparateur de projet
type: ConceptConcept
type: Concept
creator: Commission d'enrichissement de la langue française, FranceTerme
date parution JO: 2019-01-29
definition: Outil numérique permettant de comparer, pour un projet donné, les effets en matière d’énergie et d’environnement des différentes options possibles.
in scheme: Environnement
in scheme: Transports et mobilité
in scheme: concepts
notation: EQUI730
note: Dans les transports, l’écocomparateur de projet permet l’analyse comparative des modes de transport et des tracés de l’infrastructure. Pour la construction et l’usage de l’infrastructure, les critères de comparaison concernent notamment l’emprise au sol, l’économie des ressources naturelles, la consommation d’énergie, les émissions de gaz à effet de serre et de polluants, le bruit émis, ainsi que les effets sur la biodiversité et les paysages.
related: écocalculateur

bâtiment intelligent
type: ConceptConcept
type: Concept
creator: Commission d'enrichissement de la langue française, FranceTerme
date parution JO: 2019-01-29
deconseille ou frequent: maison intelligente
equivalent EN: integrated building @en
equivalent EN: integrated building (en)
equivalent EN: intelligent building @en
equivalent EN: intelligent building (en)
equivalent EN: smart building @en
equivalent EN: smart building (en)
equivalent EN: smart home @en
equivalent EN: smart home (en) [maison individuelle]
definition: Bâtiment équipé de systèmes qui lui permettent de s’adapter automatiquement à ses conditions d’utilisation et à son environnement, et qui peuvent, en outre, être télécommandés.
in scheme: Habitat et construction
in scheme: Télécommunications
in scheme: concepts
notation: EQUI731
note: Dans un bâtiment intelligent, l’éclairage et le chauffage sont des exemples de paramètres ajustables automatiquement en fonction des conditions météorologiques ou de l’utilisation des locaux.
related: immotique

compteur connecté
type: ConceptConcept
type: Concept
creator: Commission d'enrichissement de la langue française, FranceTerme
date parution JO: 2019-01-29
deconseille ou frequent: compteur intelligent
deconseille ou frequent: compteur interactif
equivalent EN: smart meter @en
equivalent EN: smart meter (en)
alternative label: compteur communicant
definition: Compteur installé chez le consommateur, qui transmet en temps réel aux réseaux les informations sur la consommation d’énergie ou de fluides, et qui permet d’une part aux fournisseurs d’adapter l’alimentation des équipements et d’établir les relevés, d’autre part au consommateur d’optimiser sa consommation.
in scheme: Habitat et construction
in scheme: Télécommunications
in scheme: concepts
notation: EQUI732
note: 1. L’énergie est généralement électrique ou thermique ; les fluides sont principalement l’eau, le gaz et le fioul.
note: 2. On trouve aussi les termes « compteur intelligent » et « compteur interactif ».
related: compteur électrique connecté
related: concept-TELE538

immotique
type: ConceptConcept
type: Concept
creator: Commission d'enrichissement de la langue française, FranceTerme
date parution JO: 2019-01-29
deconseille ou frequent: building automation
deconseille ou frequent: domotique
deconseille ou frequent: immotics
equivalent EN: building automation system @en
equivalent EN: building automation system (en)
equivalent EN: facility robotics @en
equivalent EN: facility robotics (en)
part of speech: nom féminin
definition: Ensemble de systèmes automatiques faisant notamment appel à l’électronique, à l’informatique et aux télécommunications, qui sert à la gestion des équipements dans un immeuble ou un groupe d’immeubles, d’habitations ou de bureaux.
in scheme: Habitat et construction
in scheme: Télécommunications
in scheme: concepts
notation: EQUI733
note: 1. L’immotique peut également être utilisée pour des sites industriels, des centres commerciaux et des parcs de stationnement.
note: 2. Le terme « immotique » est également utilisé comme adjectif.
related: bâtiment intelligent
related: gestion immotique globale
related: gestion immotique monofonctionnelle
related: concept-TELE559

éclairage public autonome
type: ConceptConcept
type: Concept
creator: Commission d'enrichissement de la langue française, FranceTerme
date parution JO: 2019-01-29
definition: Mode d’éclairage public alimenté, dans des conditions normales, par sa propre source d’énergie.
in scheme: Aménagement et urbanisme
in scheme: Énergie
in scheme: concepts
notation: EQUI734
note: 1. L’éclairage public autonome est assuré par exemple par des lampadaires équipés de panneaux solaires ou d’une éolienne.
note: 2. L’éclairage public autonome dispose souvent d’une alimentation de secours fournie par un réseau électrique.

bâtiment autonome
type: ConceptConcept
type: Concept
creator: Commission d'enrichissement de la langue française, FranceTerme
date parution JO: 2019-01-29
equivalent EN: self-sufficient building @en
equivalent EN: self-sufficient building (en)
equivalent EN: standalone building @en
equivalent EN: standalone building (en)
definition: Bâtiment conçu de manière à fournir lui-même l’énergie ou l’eau qui sont nécessaires à son fonctionnement.
in scheme: Énergie
in scheme: Habitat et construction
in scheme: concepts
notation: EQUI735
note: 1. Le bâtiment autonome recourt notamment à des sources d’énergie renouvelables ou à la récupération des eaux de pluie.
note: 2. Le bâtiment autonome dispose souvent d’une alimentation de secours fournie par des réseaux extérieurs.
related: bâtiment bioclimatique

compteur électrique connecté
type: ConceptConcept
type: Concept
creator: Commission d'enrichissement de la langue française, FranceTerme
date parution JO: 2019-01-29
deconseille ou frequent: compteur électrique intelligent
deconseille ou frequent: compteur électrique interactif
deconseille ou frequent: linky
equivalent EN: smart electric meter @en
equivalent EN: smart electric meter (en)
equivalent EN: smart meter @en
equivalent EN: smart meter (en)
equivalent EN: smart power meter @en
equivalent EN: smart power meter (en)
alternative label: compteur électrique communicant
definition: Compteur installé chez le consommateur, qui transmet en temps réel au réseau les informations sur la consommation électrique, et qui permet d’une part aux fournisseurs d’adapter l’alimentation des équipements et d’établir les relevés, d’autre part au consommateur d’optimiser sa consommation.
in scheme: Habitat et construction
in scheme: Télécommunications
in scheme: concepts
notation: EQUI737
note: On trouve aussi les termes « compteur électrique intelligent » et « compteur électrique interactif ».
related: réseau électrique intelligent
related: compteur connecté
related: concept-TELE538
related: concept-TELE558
scope note: Cette publication annule et remplace celle du terme « compteur électrique interactif » au Journal officiel du 12 septembre 2012.

sans station
type: ConceptConcept
type: Concept
creator: Commission d'enrichissement de la langue française, FranceTerme
date parution JO: 2020-05-21
deconseille ou frequent: free floating
deconseille ou frequent: sans attache
deconseille ou frequent: sans borne
deconseille ou frequent: voiture sans station
deconseille ou frequent: vélo sans station
equivalent EN: free-floating @en
equivalent EN: free-floating (en)
part of speech: locution adjectivale
definition: Se dit d’un partage de véhicule qui permet à l’utilisateur d’emprunter un véhicule là où il est disponible et de le restituer à tout emplacement autorisé ; par extension, se dit du véhicule lui-même.
in scheme: Transports et mobilité
in scheme: concepts
notation: EQUI739
note: On parle, par exemple, de « vélo sans station » ou de « voiture sans station ».
related: partage de véhicule

écraser (s')
type: ConceptConcept
type: Concept
creator: Commission d'enrichissement de la langue française, FranceTerme
source: révision de l'arrêté du 21 septembre 1993
date parution JO: 2000-09-22
deconseille ou frequent: crasher
deconseille ou frequent: s'écraser
deconseille ou frequent: se crasher
deconseille ou frequent: to crash
equivalent EN: crash @en
equivalent EN: crash (en)
part of speech: verbe
definition: Pour un aéronef, entrer en contact brutalement avec le sol lors d'un atterrissage, d'un amerrissage non maîtrisé ou d'un décollage interrompu.
in scheme: Transports et mobilité
in scheme: concept-SD-transports-et-mobilite-transport-aerien
in scheme: concepts
notation: EQUI74
note: 1. S'écraser au sol ; s'écraser en mer. Exemple : À la suite d'une collision, les deux avions se sont écrasés en mer.
note: 2. L'expression « se crasher » ne doit pas être utilisée en français.
related: écrasement

navigation ralentie
type: ConceptConcept
type: Concept
creator: Commission d'enrichissement de la langue française, FranceTerme
date parution JO: 2020-05-21
deconseille ou frequent: navigation à vitesse réduite
deconseille ou frequent: slow-steaming
deconseille ou frequent: éconavigation
equivalent EN: slow steaming @en
equivalent EN: slow steaming (en)
definition: Navigation à vitesse volontairement réduite qui permet de diminuer la consommation d’énergie et, par conséquent, les coûts et les émissions de polluants et de gaz à effet de serre.
in scheme: Transports et mobilité
in scheme: concept-SD-transports-et-mobilite-transport-maritime
in scheme: concepts
notation: EQUI740
note: On trouve aussi le terme « éconavigation », qui n’est pas recommandé dans ce sens.

gestion immotique globale
type: ConceptConcept
type: Concept
creator: Commission d'enrichissement de la langue française, FranceTerme
abbreviation: GIG
abbreviation: GTB
date parution JO: 2021-06-08
deconseille ou frequent: building automation
deconseille ou frequent: centralised building technical management
deconseille ou frequent: centralized building technical management
deconseille ou frequent: home automation
equivalent EN: BMS @en
equivalent EN: BMS (en)
equivalent EN: building management system @en
equivalent EN: building management system (en)
alternative label: gestion technique de bâtiments
definition: Utilisation de l’immotique pour gérer l’ensemble des équipements et des fonctions techniques installés dans un immeuble ou un groupe d’immeubles.
in scheme: Habitat et construction
in scheme: Télécommunications
in scheme: concepts
notation: EQUI741
note: Les équipements et les fonctions techniques concernent notamment l’alimentation électrique, le chauffage, la climatisation, la ventilation, les ascenseurs, les alarmes d’incendie, la vidéosurveillance, l’éclairage.
related: immotique
related: gestion immotique monofonctionnelle

vélobus
type: ConceptConcept
type: Concept
creator: Commission d'enrichissement de la langue française, FranceTerme
date parution JO: 2020-05-21
deconseille ou frequent: caracycle
deconseille ou frequent: caracycles
deconseille ou frequent: cyclobus
deconseille ou frequent: vélo-bus
part of speech: nom masculin
definition: Mode de déplacement collectif d’enfants à vélo qui sont conduits par des adultes sur un trajet et selon un horaire de passage déterminés.
in scheme: Éducation
in scheme: Transports et mobilité
in scheme: concepts
notation: EQUI742
related: pédibus

pédibus
type: ConceptConcept
type: Concept
creator: Commission d'enrichissement de la langue française, FranceTerme
date parution JO: 2020-05-21
deconseille ou frequent: carapattes
equivalent EN: WSB @en
equivalent EN: WSB (en)
equivalent EN: walking bus @en
equivalent EN: walking bus (en)
equivalent EN: walking school bus @en
equivalent EN: walking school bus (en)
part of speech: nom masculin
alternative label: bus pédestre
definition: Mode de déplacement collectif à pied d’enfants qui sont conduits par des adultes sur un trajet et selon un horaire de passage déterminés.
in scheme: Éducation
in scheme: Transports et mobilité
in scheme: concepts
notation: EQUI743
related: vélobus

compte de mobilité
type: ConceptConcept
type: Concept
creator: Commission d'enrichissement de la langue française, FranceTerme
date parution JO: 2020-05-21
deconseille ou frequent: account based ticketing
deconseille ou frequent: compte mobilité
equivalent EN: ABT @en
equivalent EN: ABT (en)
equivalent EN: account-based ticketing @en
equivalent EN: account-based ticketing (en)
alternative label: mobicompte
definition: Compte rattaché à un service centralisé qui, par la seule identification d’un voyageur préinscrit, enregistre ses déplacements urbains quels que soient les modes de transport qu’il utilise et lui facture périodiquement sa consommation.
in scheme: Transports et mobilité
in scheme: concepts
notation: EQUI744
note: 1. Le compte de mobilité favorise le transport multimodal.
note: 2. Le compte de mobilité peut intégrer, outre les frais de déplacement, les frais de stationnement ou de recharge électrique d’un véhicule personnel.
note: 3. On trouve aussi, dans l’usage, le terme « compte mobilité ».
related: transport multimodal
related: mobilité par association de services

densification parcellaire
type: ConceptConcept
type: Concept
creator: Commission d'enrichissement de la langue française, FranceTerme
date parution JO: 2020-05-21
deconseille ou frequent: BIMBY
deconseille ou frequent: build in my backyard
alternative label: densification douce
definition: Politique d’aménagement qui consiste à encourager les propriétaires de terrains bâtis à créer de nouveaux logements grâce à la division de leur parcelle ou à la surélévation de leur maison.
in scheme: Aménagement et urbanisme
in scheme: concepts
notation: EQUI745
note: 1. La densification parcellaire permet de limiter l’étalement urbain.
note: 2. L’emploi du terme BIMBY (build in my backyard), qui n’a pas d’usage en anglais, est à proscrire.
related: étalement urbain

éclairage public interactif
type: ConceptConcept
type: Concept
creator: Commission d'enrichissement de la langue française, FranceTerme
date parution JO: 2020-05-21
deconseille ou frequent: éclairage intelligent
deconseille ou frequent: éclairage interactif
equivalent EN: smart lighting @en
equivalent EN: smart lighting (en)
definition: Éclairage public dont l’intensité s’adapte à la luminosité naturelle ou au niveau de fréquentation du lieu pour réduire la consommation d’énergie et la pollution lumineuse.
in scheme: Aménagement et urbanisme
in scheme: Énergie
in scheme: concepts
notation: EQUI746
related: ville intelligente
related: concept-TELE540

ville intelligente
type: ConceptConcept
type: Concept
creator: Commission d'enrichissement de la langue française, FranceTerme
date parution JO: 2020-05-21
deconseille ou frequent: smart cité
deconseille ou frequent: smart ville
deconseille ou frequent: ville connectée
deconseille ou frequent: ville digitale
deconseille ou frequent: ville numérique
equivalent EN: connected city @en
equivalent EN: connected city (en)
equivalent EN: digital city @en
equivalent EN: digital city (en)
equivalent EN: smart city @en
equivalent EN: smart city (en)
alternative label: ville interactive
definition: Ville dans laquelle les acteurs publics et privés s’appuient sur les technologies de l’information et de la communication et sur l’échange de données pour favoriser la circulation de l’information et pour améliorer la gestion de la ville, ainsi que la qualité de vie des habitants et leur participation à la vie collective.
in scheme: Aménagement et urbanisme
in scheme: Télécommunications
in scheme: concepts
notation: EQUI747
note: La gestion de la ville concerne notamment les services et réseaux urbains, ainsi que l’environnement.
related: écocité
related: éclairage public interactif

électromobilité
type: ConceptConcept
type: Concept
creator: Commission d'enrichissement de la langue française, FranceTerme
date parution JO: 2021-06-08
deconseille ou frequent: e-mobilité
deconseille ou frequent: électro-mobilité
equivalent EN: e-mobility @en
equivalent EN: e-mobility (en)
equivalent EN: electro mobility @en
equivalent EN: electro mobility (en)
equivalent EN: electromobility @en
equivalent EN: electromobility (en)
part of speech: nom féminin
alternative label: mobilité électrique
definition: Recours à des modes de transport de personnes ou de marchandises utilisant des véhicules mus exclusivement ou partiellement par une source d’énergie électrique.
in scheme: Énergie
in scheme: Transports et mobilité
in scheme: concepts
notation: EQUI748
note: 1. L’électromobilité peut concerner des transports collectifs alimentés par une caténaire ou un rail.
note: 2. Dans le cas d’une source d’énergie électrique embarquée, l’électromobilité peut nécessiter des infrastructures spécifiques d’alimentation et de recharge, par exemple de batteries ou de réservoirs d’hydrogène.
related: véhicule à motorisation hybride complète
related: véhicule à motorisation hybride rechargeable
related: véhicule à émission zéro
related: mobilité durable

micromobilité urbaine
type: ConceptConcept
type: Concept
creator: Commission d'enrichissement de la langue française, FranceTerme
date parution JO: 2021-06-08
deconseille ou frequent: micro-mobilité urbaine
definition: Recours à des engins légers de déplacement personnel pour effectuer de courts trajets en ville.
in scheme: Cycle
in scheme: Transports et mobilité
in scheme: concepts
notation: EQUI749

élévation
type: ConceptConcept
type: Concept
creator: Commission d'enrichissement de la langue française, FranceTerme
source: révision de l'arrêté du 17 février 1986
date parution JO: 2000-09-22
equivalent EN: elevation @en
equivalent EN: elevation (en)
part of speech: nom féminin
alternative label: dessin de façade
definition: Projection orthogonale sur un plan vertical parallèle à une face des parties extérieures d'un ouvrage ou d'une partie d'ouvrage.
in scheme: Habitat et construction
in scheme: concept-SD-habitat-et-construction-architecture
in scheme: concepts
notation: EQUI75

gyroplanche
type: ConceptConcept
type: Concept
creator: Commission d'enrichissement de la langue française, FranceTerme
date parution JO: 2021-06-08
deconseille ou frequent: gyro-planche
equivalent EN: gyroboard @en
equivalent EN: gyroboard (en)
equivalent EN: hoverboard @en
equivalent EN: hoverboard (en)
part of speech: nom féminin
alternative label: planche gyroscopique
definition: Engin léger de déplacement personnel à moteur électrique, qui est constitué d’une plateforme transversale autostabilisée par effet gyroscopique et placée entre deux roues, sur laquelle l’utilisateur se tient debout, et qui se pilote par des mouvements du corps.
in scheme: Cycle
in scheme: Transports et mobilité
in scheme: concepts
notation: EQUI751
note: La gyroplanche se distingue du gyropode par l’absence de guidon.
related: gyropode
related: gyroroue

gyroroue
type: ConceptConcept
type: Concept
creator: Commission d'enrichissement de la langue française, FranceTerme
date parution JO: 2021-06-08
deconseille ou frequent: gyro-roue
deconseille ou frequent: mono-roue
equivalent EN: gyrowheel @en
equivalent EN: gyrowheel (en)
equivalent EN: solo wheel @en
equivalent EN: solo wheel (en)
part of speech: nom féminin
alternative label: monoroue
definition: Engin léger de déplacement personnel à moteur électrique, qui est constitué d’une roue autostabilisée par effet gyroscopique et placée entre deux repose-pieds escamotables sur lesquels l’utilisateur se tient debout, et qui se pilote par des mouvements du corps.
in scheme: Cycle
in scheme: Transports et mobilité
in scheme: concepts
notation: EQUI752
related: gyropode
related: gyroplanche

vélo-cargo
type: ConceptConcept
type: Concept
creator: Commission d'enrichissement de la langue française, FranceTerme
date parution JO: 2021-06-08
deconseille ou frequent: biporteur
deconseille ou frequent: triporteur
deconseille ou frequent: vélo cargo
equivalent EN: cargo bike @en
equivalent EN: cargo bike (en)
equivalent EN: longtail cargo bike @en
equivalent EN: longtail cargo bike (en)
part of speech: nom masculin
definition: Cycle à deux ou trois roues, dont le châssis est conçu pour recevoir une caisse ou une plateforme permettant le transport de charges, voire d’enfants.
in scheme: Cycle
in scheme: Transports et mobilité
in scheme: concepts
notation: EQUI753

sas pour vélos
type: ConceptConcept
type: Concept
creator: Commission d'enrichissement de la langue française, FranceTerme
date parution JO: 2021-06-08
deconseille ou frequent: sas cycliste
deconseille ou frequent: sas cyclistes
deconseille ou frequent: sas pour cycliste
deconseille ou frequent: sas pour vélo
deconseille ou frequent: sas vélo
deconseille ou frequent: sas vélos
alternative label: sas pour cyclistes
definition: Zone réservée aux cyclistes à un carrefour à feux tricolores, qui est marquée au sol devant la ligne d’arrêt des véhicules motorisés.
in scheme: Cycle
in scheme: Transports et mobilité
in scheme: concepts
notation: EQUI754
note: 1. Le sas pour vélos permet aux cyclistes de se placer bien en vue des véhicules motorisés, de démarrer en toute sécurité et de ne pas respirer directement les gaz d’échappement. Il évite en particulier qu’un vélo se trouve dans l’angle mort d’un poids-lourd.
note: 2. On trouve aussi le terme « sas vélo », qui n’est pas recommandé.

vélo-école
type: ConceptConcept
type: Concept
creator: Commission d'enrichissement de la langue française, FranceTerme
date parution JO: 2021-06-08
part of speech: nom féminin
definition: Structure d’enseignement où l’on apprend à circuler à vélo sur la voie publique en respectant le code de la route et à connaître les principaux risques associés à cette pratique.
in scheme: Cycle
in scheme: Transports et mobilité
in scheme: concepts
notation: EQUI755

gestion immotique monofonctionnelle
type: ConceptConcept
type: Concept
creator: Commission d'enrichissement de la langue française, FranceTerme
abbreviation: GIM
abbreviation: GTC
date parution JO: 2021-06-08
equivalent EN: CTM @en
equivalent EN: CTM (en)
equivalent EN: centralised technical management @en
equivalent EN: centralised technical management (en)
equivalent EN: centralized technical management @en
equivalent EN: centralized technical management (en)
alternative label: gestion technique centralisée
definition: Utilisation de l’immotique pour gérer un type particulier d’équipement ou de fonction technique installé dans un immeuble ou un groupe d’immeubles.
in scheme: Habitat et construction
in scheme: Télécommunications
in scheme: concepts
notation: EQUI756
note: La gestion immotique monofonctionnelle peut par exemple s’appliquer à l’ensemble des ascenseurs d’un immeuble.
related: immotique
related: gestion immotique globale

dépotage
type: ConceptConcept
type: Concept
creator: Commission d'enrichissement de la langue française, FranceTerme
source: révision de l'arrêté du 18 décembre 1990
date parution JO: 2000-09-22
equivalent EN: stripping @en
equivalent EN: stripping (en)
part of speech: nom masculin
definition: Déchargement des marchandises d'un conteneur ou d'une caisse mobile.
in scheme: Transports et mobilité
in scheme: concepts
notation: EQUI757
related: dépotage
related: empotage

dépoter
type: ConceptConcept
type: Concept
creator: Commission d'enrichissement de la langue française, FranceTerme
source: révision de l'arrêté du 18 décembre 1990
date parution JO: 2000-09-22
deconseille ou frequent: strip
deconseille ou frequent: to strip
equivalent EN: strip (to) @en
equivalent EN: strip (to) (en)
part of speech: verbe
definition: Décharger des marchandises d'un conteneur ou d'une caisse mobile.
in scheme: Transports et mobilité
in scheme: concepts
notation: EQUI758
related: dépoter
related: empoter

empotage
type: ConceptConcept
type: Concept
creator: Commission d'enrichissement de la langue française, FranceTerme
source: révision de l'arrêté du 18 décembre 1990
date parution JO: 2000-09-22
equivalent EN: strip @en
equivalent EN: strip (en)
part of speech: nom masculin
definition: Chargement de marchandises dans un conteneur, une caisse mobile ou une citerne.
in scheme: Transports et mobilité
in scheme: concepts
notation: EQUI759
related: dépotage
related: empotage

empotage
type: ConceptConcept
type: Concept
creator: Commission d'enrichissement de la langue française, FranceTerme
source: révision de l'arrêté du 18 décembre 1990
date parution JO: 2000-09-22
equivalent EN: strip @en
equivalent EN: strip (en)
part of speech: nom masculin
definition: Chargement de marchandises pulvérulentes, liquides ou gazeuses, dans un véhicule de transport.
in scheme: Transports et mobilité
in scheme: concepts
notation: EQUI76
related: dépotage
related: empotage

empoter
type: ConceptConcept
type: Concept
creator: Commission d'enrichissement de la langue française, FranceTerme
source: révision de l'arrêté du 18 décembre 1990
date parution JO: 2000-09-22
deconseille ou frequent: strip
deconseille ou frequent: to strip
equivalent EN: strip (to) @en
equivalent EN: strip (to) (en)
part of speech: verbe
definition: Charger des marchandises dans un conteneur, une caisse mobile ou une citerne.
in scheme: Transports et mobilité
in scheme: concepts
notation: EQUI760
related: dépoter
related: empoter

autocaravanier, -ière
type: ConceptConcept
type: Concept
creator: Commission d'enrichissement de la langue française, FranceTerme
source: révision de l'arrêté du 30 juin 1992
date parution JO: 2000-09-22
equivalent EN: caravaner @en
equivalent EN: caravaner (en)
equivalent EN: caravanner @en
equivalent EN: caravanner (en)
equivalent EN: trailerist @en
equivalent EN: trailerist (en)
part of speech: nom
definition: Personne pratiquant le tourisme en autocaravane.
in scheme: Automobile
in scheme: Tourisme
in scheme: concepts
notation: EQUI761
note: On peut admettre l'usage adjectival du nom « autocaravanier ».
related: autocaravane
related: autocaravanier, -ière

caravanier, -ière
type: ConceptConcept
type: Concept
creator: Commission d'enrichissement de la langue française, FranceTerme
source: révision de l'arrêté du 30 juin 1992
date parution JO: 2000-09-22
equivalent EN: camper (US) @en
equivalent EN: camper (en-US)
equivalent EN: caravaner (GB) @en
equivalent EN: caravaner (en-GB)
equivalent EN: caravanner (GB) @en
equivalent EN: caravanner (en-GB)
part of speech: nom
definition: Personne pratiquant le tourisme en caravane.
in scheme: Automobile
in scheme: Tourisme
in scheme: concepts
notation: EQUI762
note: On peut admettre l'usage adjectival du terme « caravanier ».
related: caravanier, -ière

altermobilité
type: ConceptConcept
type: Concept
creator: Commission d'enrichissement de la langue française, FranceTerme
date parution JO: 2022-07-14
deconseille ou frequent: altermobilisme
deconseille ou frequent: altermobiliste
part of speech: nom féminin
definition: Forme de mobilité privilégiée par les personnes qui renoncent à l’utilisation individuelle d’une voiture particulière au profit de la mobilité durable.
in scheme: Transports et mobilité
in scheme: concepts
notation: EQUI763
note: L’utilisation des transports collectifs, le covoiturage, la pratique du vélo ou la marche relèvent de l’altermobilité.
related: mobilité durable
related: voiturage en solo

voiturage en solo
type: ConceptConcept
type: Concept
creator: Commission d'enrichissement de la langue française, FranceTerme
date parution JO: 2022-07-14
deconseille ou frequent: auto solo
deconseille ou frequent: autosolisme
deconseille ou frequent: autosolo
deconseille ou frequent: solo voiturage
deconseille ou frequent: solovoiturage
deconseille ou frequent: voiture solo
part of speech: locution nominale masculine
alternative label: monovoiturage
definition: Utilisation d’une voiture particulière par son seul conducteur.
in scheme: Automobile
in scheme: Transports et mobilité
in scheme: concepts
notation: EQUI764
note: On trouve aussi le terme « autosolisme », qui est déconseillé.
related: covoiturage
related: altermobilité

navette autonome
type: ConceptConcept
type: Concept
creator: Commission d'enrichissement de la langue française, FranceTerme
date parution JO: 2022-07-14
deconseille ou frequent: navette automatique
deconseille ou frequent: personal automated transport
deconseille ou frequent: personal rapid transit
deconseille ou frequent: podcar
deconseille ou frequent: prt
deconseille ou frequent: taxi robot
part of speech: locution nominale féminine
definition: Véhicule autonome transportant des passagers entre les stations d’un circuit prédéterminé.
in scheme: Transports et mobilité
in scheme: concepts
notation: EQUI765
note: 1. On trouve aussi le terme « navette automatique », qui n’est pas recommandé.
note: 2. Les navettes autonomes concernent généralement des trajets de courte distance.
note: 3. La navette autonome se distingue du taxi sans chauffeur par la prédétermination de son circuit.
related: véhicule autonome
related: conduite autonome
related: taxi sans chauffeur
scope note: Cette publication annule celle du terme « taxi robot » au Journal officiel du 21 décembre 2013.

ajustement de position
type: ConceptConcept
type: Concept
creator: Commission d'enrichissement de la langue française, FranceTerme
date parution JO: 2022-07-14
deconseille ou frequent: cartospondance
deconseille ou frequent: corrélation cartographique
deconseille ou frequent: mapmatching
deconseille ou frequent: mise en correspondance de cartes
equivalent EN: map matching @en
equivalent EN: map matching (en)
part of speech: locution nominale masculine
definition: Correction de la projection cartographique de la position géolocalisée d’un véhicule terrestre pour qu’elle coïncide avec la représentation de l’infrastructure qu’il emprunte.
in scheme: Transports et mobilité
in scheme: concept-SD-transports-et-mobilite-cartographie
in scheme: concepts
notation: EQUI766
note: 1. L’ajustement de position permet d’éviter que l’imprécision des coordonnées géolocalisées ne laisse croire que le véhicule a quitté l’infrastructure.
note: 2. L’ajustement de position est notamment utilisé pour le guidage d’itinéraire de véhicules routiers ou pour le suivi de la progression de bus, de cars ou de trains.
related: raccordement cartographique

raccordement cartographique
type: ConceptConcept
type: Concept
creator: Commission d'enrichissement de la langue française, FranceTerme
date parution JO: 2022-07-14
deconseille ou frequent: ajustement cartographique
deconseille ou frequent: corrélation cartographique
deconseille ou frequent: mapmatching
deconseille ou frequent: mise en correspondance de cartes
deconseille ou frequent: raccords de cartes
equivalent EN: map matching @en
equivalent EN: map matching (en)
part of speech: locution nominale masculine
alternative label: ajustement cartographique
definition: Raccordement de deux cartes par mise en coïncidence de certains points géographiques communs.
in scheme: Aménagement et urbanisme
in scheme: concept-SD-amenagement-et-urbanisme-cartographie
in scheme: concepts
notation: EQUI767
related: ajustement de position

mobilité par association de services
type: ConceptConcept
type: Concept
creator: Commission d'enrichissement de la langue française, FranceTerme
abbreviation: MAS
date parution JO: 2022-07-14
deconseille ou frequent: mobilité servicielle
equivalent EN: MaaS @en
equivalent EN: MaaS (en)
equivalent EN: mobility as a service @en
equivalent EN: mobility as a service (en)
part of speech: locution nominale féminine
definition: Offre globale de services de mobilité, accessible au moyen d’une application pour mobile multifonction, qui, moyennant un abonnement, propose à l’utilisateur, en fonction de ses préférences, un choix d’itinéraires pouvant combiner transports publics et individuels, et permet la réservation et le paiement des services de transport correspondants.
in scheme: Transports et mobilité
in scheme: concepts
notation: EQUI768
note: 1. La mobilité par association de services peut combiner différents modes de transport parmi ceux disponibles, tels que les transports en commun, le taxi, la voiture de transport avec chauffeur, le covoiturage, l’autopartage, le vélo ou la trottinette électrique.
note: 2. La mobilité par association de services n’est possible que si elle est convenue avec les différents opérateurs de transport.
related: transport multimodal
related: compte de mobilité

vertiport
type: ConceptConcept
type: Concept
creator: Commission d'enrichissement de la langue française, FranceTerme
date parution JO: 2022-07-14
deconseille ou frequent: héliport
equivalent EN: vertiport @en
equivalent EN: vertiport (en)
part of speech: nom masculin
definition: Site aménagé pour le décollage et l’atterrissage verticaux d’aéronefs et équipé pour offrir des services d’accueil des passagers et de réception du fret.
in scheme: Transports et mobilité
in scheme: concepts
notation: EQUI769
note: Un vertiport peut être aménagé pour différents types d’aéronefs tels que des hélicoptères ou des drones.
scope note: Cette publication annule et remplace celle du terme « héligare » au Journal officiel du 22 septembre 2000.

empoter
type: ConceptConcept
type: Concept
creator: Commission d'enrichissement de la langue française, FranceTerme
source: révision de l'arrêté du 18 décembre 1990
date parution JO: 2000-09-22
deconseille ou frequent: strip
deconseille ou frequent: to strip
equivalent EN: strip (to) @en
equivalent EN: strip (to) (en)
part of speech: verbe
definition: Charger des marchandises pulvérulentes, liquides ou gazeuses, dans un véhicule de transport.
in scheme: Transports et mobilité
in scheme: concepts
notation: EQUI77
related: dépoter
related: empoter

vidéoverbalisation
type: ConceptConcept
type: Concept
creator: Commission d'enrichissement de la langue française, FranceTerme
date parution JO: 2022-07-14
deconseille ou frequent: vidéo-verbalisation
part of speech: nom féminin
definition: Verbalisation d’un véhicule immatriculé dont l’infraction routière a été constatée au moyen d’un enregistrement vidéo.
in scheme: Transports et mobilité
in scheme: concepts
notation: EQUI770

épandeuse
type: ConceptConcept
type: Concept
creator: Commission d'enrichissement de la langue française, FranceTerme
source: révision de l'arrêté du 17 février 1986
date parution JO: 2000-09-22
equivalent EN: spreader @en
equivalent EN: spreader (en)
part of speech: nom féminin
definition: Engin automoteur ou dispositif adaptable qui, en se déplaçant, répand et répartit régulièrement des matériaux solides, liquides ou pâteux.
in scheme: Habitat et construction
in scheme: concept-SD-habitat-et-construction-engins
in scheme: concepts
notation: EQUI78
related: gravillonneuse

équipements intégrés
type: ConceptConcept
type: Concept
creator: Commission d'enrichissement de la langue française, FranceTerme
source: révision de l'arrêté du 17 février 1986
date parution JO: 2000-09-22
equivalent EN: integrated services @en
equivalent EN: integrated services (en)
equivalent EN: integrated systems @en
equivalent EN: integrated systems (en)
definition: Regroupement spatial d'équipements divers avec une gestion coordonnée, une recherche de polyvalence des locaux, et une tentative d'intégration fonctionnelle et architecturale.
in scheme: Aménagement et urbanisme
in scheme: Habitat et construction
in scheme: concepts
notation: EQUI79

accroupissement
type: ConceptConcept
type: Concept
creator: Commission d'enrichissement de la langue française, FranceTerme
source: révision de l'arrêté du 23 septembre 1987
date parution JO: 2000-09-22
equivalent EN: squat @en
equivalent EN: squat (en)
part of speech: nom masculin
definition: Changement de l'assiette du navire par enfoncement de l'arrière, dû à son déplacement dans l'eau.
in scheme: Transports et mobilité
in scheme: concept-SD-transports-et-mobilite-transport-maritime
in scheme: concepts
notation: EQUI8

escalier mécanique
type: ConceptConcept
type: Concept
creator: Commission d'enrichissement de la langue française, FranceTerme
source: révision de l'arrêté du 17 février 1986
date parution JO: 2000-09-22
equivalent EN: escalator @en
equivalent EN: escalator (en)
alternative label: escalateur
alternative label: escalier roulant
definition: Installation comprenant une chaîne de marches entraînée mécaniquement, destinée au transport des personnes dans une direction ascendante ou descendante.
in scheme: Habitat et construction
in scheme: concepts
notation: EQUI80

essai de choc
type: ConceptConcept
type: Concept
creator: Commission d'enrichissement de la langue française, FranceTerme
source: révision de l'arrêté du 27 mai 1992
date parution JO: 2000-09-22
equivalent EN: crash test @en
equivalent EN: crash test (en)
definition: Essai consistant à réaliser, dans une configuration donnée, un choc de véhicule(s) pour en apprécier le comportement global ou partiel, notamment du point de vue de la sécurité.
in scheme: Automobile
in scheme: Transports et mobilité
in scheme: concepts
notation: EQUI81

fines
type: ConceptConcept
type: Concept
creator: Commission d'enrichissement de la langue française, FranceTerme
source: révision de l'arrêté du 17 février 1986
date parution JO: 2000-09-22
deconseille ou frequent: fillers
equivalent EN: filler @en
equivalent EN: filler (en)
part of speech: nom féminin pluriel
definition: Granulat composé d'éléments de très petites dimensions utilisé soit comme charge de remplissage pour augmenter la compacité notamment d'un béton, d'un sol, soit comme constituant de certains liants hydrauliques.
in scheme: Habitat et construction
in scheme: concept-SD-habitat-et-construction-materiaux-de-construction
in scheme: concepts
notation: EQUI82
note: Dans le second cas, le terme « fillers » est également utilisé.

finisseur
type: ConceptConcept
type: Concept
creator: Commission d'enrichissement de la langue française, FranceTerme
source: révision de l'arrêté du 17 février 1986
date parution JO: 2000-09-22
equivalent EN: finisher @en
equivalent EN: finisher (en)
part of speech: nom masculin
definition: Engin routier qui, recevant les matériaux prêts à l'emploi, les répand, les nivelle, les dame et les lisse, livrant après son passage un revêtement fini.
in scheme: Habitat et construction
in scheme: concept-SD-habitat-et-construction-engins
in scheme: concepts
notation: EQUI83

fluide caloporteur
type: ConceptConcept
type: Concept
creator: Commission d'enrichissement de la langue française, FranceTerme
source: révision de l'arrêté du 17 février 1986
date parution JO: 2000-09-22
equivalent EN: coolant @en
equivalent EN: coolant (en)
equivalent EN: heat transfer fluid @en
equivalent EN: heat transfer fluid (en)
definition: Fluide en mouvement qui reçoit de la chaleur en un point de son circuit et en cède en un autre point.
in scheme: Énergie
in scheme: Habitat et construction
in scheme: concepts
notation: EQUI84
related: capteur solaire

gerbage
type: ConceptConcept
type: Concept
creator: Commission d'enrichissement de la langue française, FranceTerme
source: révision de l'arrêté du 21 septembre 1993
date parution JO: 2000-09-22
deconseille ou frequent: double empilage
deconseille ou frequent: double gerbage
equivalent EN: stacking @en
equivalent EN: stacking (en)
part of speech: nom masculin
alternative label: empilage
definition: Opération consistant à superposer des conteneurs sur des wagons construits à cet effet en vue de leur transport sur des lignes où le gabarit en hauteur est suffisamment dégagé ; résultat de cette opération.
in scheme: Transports et mobilité
in scheme: concept-SD-transports-et-mobilite-transport-ferroviaire
in scheme: concepts
notation: EQUI85
note: 1. Les termes « double empilage » et « double gerbage » sont à éviter.
note: 2. Dans l'usage, on parlera plutôt de « gerbage de palettes » et d'« empilage de conteneurs ».
related: concept-SPAT1391

gerber
type: ConceptConcept
type: Concept
creator: Commission d'enrichissement de la langue française, FranceTerme
source: révision de l'arrêté du 21 septembre 1993
date parution JO: 2000-09-22
deconseille ou frequent: to stack
equivalent EN: stack @en
equivalent EN: stack (en)
part of speech: verbe
alternative label: empiler
definition: Superposer des conteneurs sur des wagons construits à cet effet en vue de leur transport sur des lignes où le gabarit en hauteur est suffisamment dégagé.
in scheme: Transports et mobilité
in scheme: concept-SD-transports-et-mobilite-transport-ferroviaire
in scheme: concepts
notation: EQUI86

gicleur d'incendie
type: ConceptConcept
type: Concept
creator: Commission d'enrichissement de la langue française, FranceTerme
source: révision de l'arrêté du 17 février 1986
abbreviation: sprinkler @en
date parution JO: 2000-09-22
equivalent EN: sprinkler @en
equivalent EN: sprinkler (en)
equivalent EN: sprinkler head @en
equivalent EN: sprinkler head (en)
forme abregee: gicleur, n.m.
definition: Dispositif fixe, généralement sensible à la chaleur, conçu pour réagir à une température prédéterminée en libérant un flux d'eau réparti uniformément au niveau du sol.
in scheme: Habitat et construction
in scheme: concepts
notation: EQUI87
note: D'autres facteurs de détection, tels que la teneur en CO2, sont aussi utilisés.

gravillonneuse
type: ConceptConcept
type: Concept
creator: Commission d'enrichissement de la langue française, FranceTerme
source: révision de l'arrêté du 17 février 1986
date parution JO: 2000-09-22
equivalent EN: grit spreader @en
equivalent EN: grit spreader (en)
part of speech: nom féminin
definition: Épandeuse destinée à distribuer les gravillons sur les chantiers.
in scheme: Habitat et construction
in scheme: concept-SD-habitat-et-construction-engins
in scheme: concepts
notation: EQUI88
related: épandeuse

groupage
type: ConceptConcept
type: Concept
creator: Commission d'enrichissement de la langue française, FranceTerme
source: révision de l'arrêté du 18 juillet 1989
date parution JO: 2000-09-22
equivalent EN: consolidation @en
equivalent EN: consolidation (en)
part of speech: nom masculin
definition: Action consistant à réunir les envois de marchandises en provenance de plusieurs expéditeurs ou à l'adresse de plusieurs destinataires, et à organiser et faire exécuter l'acheminement du lot ainsi constitué par un transporteur.
in scheme: Transports et mobilité
in scheme: concepts
notation: EQUI89
related: massification

acheminement par le chargeur
type: ConceptConcept
type: Concept
creator: Commission d'enrichissement de la langue française, FranceTerme
source: révision de l'arrêté du 23 septembre 1987
date parution JO: 2000-09-22
equivalent EN: merchant haulage @en
equivalent EN: merchant haulage (en)
definition: Acheminement intérieur assuré en dehors du contrat de transport maritime.
in scheme: Transports et mobilité
in scheme: concept-SD-transports-et-mobilite-transport-maritime
in scheme: concepts
notation: EQUI9

héligare
type: ConceptConcept
type: Concept
creator: Commission d'enrichissement de la langue française, FranceTerme
source: révision de l'arrêté du 18 juillet 1989
date parution JO: 2000-09-22
equivalent EN: helicopter station @en
equivalent EN: helicopter station (en)
equivalent EN: heliport @en
equivalent EN: heliport (en)
part of speech: nom féminin
definition: Gare destinée aux passagers d'hélicoptères.
in scheme: Transports et mobilité
in scheme: concept-SD-transports-et-mobilite-transport-aerien
in scheme: concepts
notation: EQUI90

hélisurface
type: ConceptConcept
type: Concept
creator: Commission d'enrichissement de la langue française, FranceTerme
source: révision de l'arrêté du 18 juillet 1989
date parution JO: 2000-09-22
equivalent EN: helicopter airstrip @en
equivalent EN: helicopter airstrip (en)
part of speech: nom féminin
definition: Emplacement utilisé par des hélicoptères à titre temporaire pour atterrir et décoller.
in scheme: Transports et mobilité
in scheme: concept-SD-transports-et-mobilite-transport-aerien
in scheme: concepts
notation: EQUI91

hors normes
type: ConceptConcept
type: Concept
creator: Commission d'enrichissement de la langue française, FranceTerme
source: révision de l'arrêté du 18 décembre 1990
date parution JO: 2000-09-22
deconseille ou frequent: hors cotes
equivalent EN: high cube @en
equivalent EN: high cube (en)
part of speech: locution adjectivale
definition: Se dit d'un conteneur dont les dimensions extérieures dépassent les normes internationales.
in scheme: Transports et mobilité
in scheme: concepts
notation: EQUI92
note: On dit aussi « hors cotes ».

kiosque
type: ConceptConcept
type: Concept
creator: Commission d'enrichissement de la langue française, FranceTerme
source: révision de l'arrêté du 30 juin 1992
date parution JO: 2000-09-22
equivalent EN: scramble @en
equivalent EN: scramble (en)
part of speech: nom masculin
definition: Présentoir, à l'origine circulaire, destiné à la restauration en libre-service.
in scheme: Restauration
in scheme: Tourisme
in scheme: concepts
notation: EQUI93

maniabilité
type: ConceptConcept
type: Concept
creator: Commission d'enrichissement de la langue française, FranceTerme
source: révision de l'arrêté du 17 février 1986
date parution JO: 2000-09-22
deconseille ou frequent: workabilité
equivalent EN: workability @en
equivalent EN: workability (en)
part of speech: nom féminin
definition: Degré de plasticité et de facilité de mise en œuvre du béton frais.
in scheme: Habitat et construction
in scheme: concept-SD-habitat-et-construction-materiaux-de-construction
in scheme: concepts
notation: EQUI94
note: Le terme « workabilité » ne doit pas être employé en français.

matériau alvéolaire
type: ConceptConcept
type: Concept
creator: Commission d'enrichissement de la langue française, FranceTerme
source: révision de l'arrêté du 17 février 1986
date parution JO: 2000-09-22
equivalent EN: foam material @en
equivalent EN: foam material (en)
alternative label: mousse
definition: Matériau dont la matière solide renferme un grand nombre de cavités de petites dimensions et régulièrement réparties.
in scheme: Habitat et construction
in scheme: concept-SD-habitat-et-construction-materiaux-de-construction
in scheme: concepts
notation: EQUI95
note: Ces matériaux sont en général de bons isolants thermiques.
related: isolant thermique

matériau fibreux
type: ConceptConcept
type: Concept
creator: Commission d'enrichissement de la langue française, FranceTerme
source: révision de l'arrêté du 17 février 1986
date parution JO: 2000-09-22
deconseille ou frequent: fibre-like material
equivalent EN: fiber-like material @en
equivalent EN: fiber-like material (en)
definition: Matériau dont la matière solide est constituée de fibres plus ou moins enchevêtrées les unes aux autres par un liant.
in scheme: Habitat et construction
in scheme: concept-SD-habitat-et-construction-materiaux-de-construction
in scheme: concepts
notation: EQUI96
note: Ces matériaux sont en général de bons isolants thermiques.
related: isolant thermique

monospace
type: ConceptConcept
type: Concept
creator: Commission d'enrichissement de la langue française, FranceTerme
source: révision de l'arrêté du 18 décembre 1990
abbreviation: MPV @en
date parution JO: 2000-09-22
equivalent EN: MPV @en
equivalent EN: MPV (en)
equivalent EN: minivan @en
equivalent EN: minivan (en)
equivalent EN: multi-purpose vehicle @en
equivalent EN: multi-purpose vehicle (en)
equivalent EN: people carrier @en
equivalent EN: people carrier (en)
part of speech: nom masculin
definition: Voiture, généralement monocorps, dont l'espace utile commun aux passagers et aux bagages est modulable.
in scheme: Automobile
in scheme: Transports et mobilité
in scheme: concepts
notation: EQUI97
note: Le terme « monospace » est la contraction de « mono-espace ».

moteur à allumage par étincelles
type: ConceptConcept
type: Concept
creator: Commission d'enrichissement de la langue française, FranceTerme
source: révision de l'arrêté du 18 décembre 1990
date parution JO: 2000-09-22
equivalent EN: Otto-Motor @en
equivalent EN: Otto-Motor (en)
equivalent EN: spark ignition engine @en
equivalent EN: spark ignition engine (en)
forme abregee: moteur à étincelles
definition: Moteur à allumage commandé fonctionnant suivant le cycle de Beau de Rochas.
in scheme: Moteur thermique
in scheme: Transports et mobilité
in scheme: concepts
notation: EQUI98
note: Il s'agit d'un terme générique pour désigner, par opposition au moteur Diesel, des moteurs fonctionnant à l'essence, à l'alcool, aux gaz de pétrole liquéfiés, etc.

motobasculeur
type: ConceptConcept
type: Concept
creator: Commission d'enrichissement de la langue française, FranceTerme
source: révision de l'arrêté du 17 février 1986
date parution JO: 2000-09-22
equivalent EN: dumper @en
equivalent EN: dumper (en)
part of speech: nom masculin
definition: Benne basculante automotrice de petite capacité.
in scheme: Habitat et construction
in scheme: concept-SD-habitat-et-construction-engins
in scheme: concepts
notation: EQUI99

reformage
type: ConceptConcept
type: Concept
creator: Commission d'enrichissement de la langue française, FranceTerme
date parution JO: 2021-01-30
deconseille ou frequent: dihydrogène
deconseille ou frequent: hydrogène
equivalent EN: catalytic reforming @en
equivalent EN: catalytic reforming (en)
equivalent EN: reforming @en
equivalent EN: reforming (en)
part of speech: nom masculin
definition: Procédé catalytique qui permet, à partir de composés hydrocarbonés mélangés à de l’air ou à de la vapeur d’eau, de produire un gaz riche en hydrogène.
in scheme: Chimie
in scheme: Pétrole et gaz
in scheme: concepts
notation: HYDR1
note: 1. Le reformage est utilisé en raffinage en vue d’obtenir une essence ayant une teneur en hydrocarbures aromatiques supérieure, et ainsi un indice d’octane plus élevé.
note: 2. On emploie couramment le terme « hydrogène » au lieu de la dénomination scientifique « dihydrogène ».
related: hydrogène d'origine biologique
related: hydrogène d'origine fossile
related: vaporeformage
related: reformeur
scope note: Cette publication annule et remplace celles du Journal officiel du 22 septembre 2000 et du 24 avril 2010.

hydrogène à faible empreinte carbone
type: ConceptConcept
type: Concept
creator: Commission d'enrichissement de la langue française, FranceTerme
date parution JO: 2021-01-30
deconseille ou frequent: H2 bas-carbone
deconseille ou frequent: H2 bleu
deconseille ou frequent: H2 décarboné
deconseille ou frequent: H2 sobre en carbone
deconseille ou frequent: H2 à faible empreinte carbone
deconseille ou frequent: blue H2
deconseille ou frequent: decarbonated H2
deconseille ou frequent: decarbonised H2
deconseille ou frequent: decarbonised hydrogen
deconseille ou frequent: decarbonized H2
deconseille ou frequent: decarbonized hydrogen
deconseille ou frequent: dihydrogène
deconseille ou frequent: hydrogène
deconseille ou frequent: hydrogène bas-carbone
deconseille ou frequent: hydrogène bleu
deconseille ou frequent: hydrogène décarboné
deconseille ou frequent: hydrogène sobre en carbone
deconseille ou frequent: low carbon H2
deconseille ou frequent: low carbon hydrogen
equivalent EN: blue hydrogen @en
equivalent EN: blue hydrogen (en)
equivalent EN: decarbonated hydrogen @en
equivalent EN: decarbonated hydrogen (en)
definition: Hydrogène dont le processus de production entraîne de faibles émissions de dioxyde de carbone ou, dans le cas d’émissions plus importantes, s’accompagne d’un captage qui les compense en grande partie.
in scheme: Énergie
in scheme: Environnement
in scheme: concepts
notation: HYDR10
note: 1. On trouve aussi le terme « hydrogène décarboné », qui est ambigu, l’adjectif « décarboné » ne s’appliquant pas à l’hydrogène mais faisant référence à son processus de production, ainsi que le terme « hydrogène bleu », qui est déconseillé.
note: 2. On emploie couramment le terme « hydrogène » au lieu de la dénomination scientifique « dihydrogène ».
related: captage et stockage du CO
related: faible émission de gaz à effet de serre (à)
related: décarbonation
related: empreinte en gaz à effet de serre
related: hydrogène d'origine renouvelable
related: hydrogène d'origine biologique
related: hydrogène d'origine fossile
related: concept-PETR406

hydrogène d'origine renouvelable
type: ConceptConcept
type: Concept
creator: Commission d'enrichissement de la langue française, FranceTerme
date parution JO: 2021-01-30
deconseille ou frequent: H2 d'origine renouvelable
deconseille ou frequent: H2 d'origine renouvelable sobre en carbone
deconseille ou frequent: H2 d'origine renouvelable à faible empreinte carbone
deconseille ou frequent: H2 renouvelable
deconseille ou frequent: H2 vert
deconseille ou frequent: dihydrogène
deconseille ou frequent: green H2
deconseille ou frequent: hydrogène
deconseille ou frequent: hydrogène d'origine renouvelable sobre en carbone
deconseille ou frequent: hydrogène d'origine renouvelable à faible empreinte carbone
deconseille ou frequent: hydrogène renouvelable
deconseille ou frequent: hydrogène vert
deconseille ou frequent: renewable H2
equivalent EN: green hydrogen @en
equivalent EN: green hydrogen (en)
equivalent EN: renewable hydrogen @en
equivalent EN: renewable hydrogen (en)
definition: Hydrogène produit à partir de sources d’énergie renouvelables.
in scheme: Énergie
in scheme: Environnement
in scheme: concepts
notation: HYDR11
note: 1. L’hydrogène d’origine renouvelable peut être de l’hydrogène à faible empreinte carbone.
note: 2. On trouve aussi les termes « hydrogène vert » et « hydrogène renouvelable », qui sont déconseillés.
note: 3. On emploie couramment le terme « hydrogène » au lieu de la dénomination scientifique « dihydrogène ».
related: hydrogène à faible empreinte carbone
related: hydrogène d'origine biologique
related: décomposition thermique de la biomasse
related: concept-PETR406

hydrogène d'origine biologique
type: ConceptConcept
type: Concept
creator: Commission d'enrichissement de la langue française, FranceTerme
date parution JO: 2021-01-30
deconseille ou frequent: H2 bio
deconseille ou frequent: H2 d'origine biologique
deconseille ou frequent: H2 d'origine biologique sobre en carbone
deconseille ou frequent: H2 d'origine biologique à faible empreinte carbone
deconseille ou frequent: bio H2
deconseille ou frequent: bio hydrogen
deconseille ou frequent: bio hydrogène
deconseille ou frequent: bioH2
deconseille ou frequent: dihydrogène
deconseille ou frequent: hydrogène
deconseille ou frequent: hydrogène bio
deconseille ou frequent: hydrogène d'origine biologique sobre en carbone
deconseille ou frequent: hydrogène d'origine biologique à faible empreinte carbone
equivalent EN: biohydrogen @en
equivalent EN: biohydrogen (en)
alternative label: biohydrogène
definition: Hydrogène d’origine renouvelable produit à partir de biomasse, par méthanisation et reformage ou par décomposition thermique.
in scheme: Énergie
in scheme: Environnement
in scheme: concepts
notation: HYDR12
note: L’hydrogène d’origine biologique peut être de l’hydrogène à faible empreinte carbone.
related: méthanisation
related: reformage
related: hydrogène à faible empreinte carbone
related: hydrogène d'origine renouvelable
related: décomposition thermique de la biomasse

hydrogène d'origine fossile
type: ConceptConcept
type: Concept
creator: Commission d'enrichissement de la langue française, FranceTerme
date parution JO: 2021-01-30
deconseille ou frequent: H2 d'origine fossile
deconseille ou frequent: H2 d'origine fossile à faible empreinte carbone
deconseille ou frequent: H2 d’origine fossile sobre en carbone
deconseille ou frequent: H2 gris
deconseille ou frequent: dihydrogène
deconseille ou frequent: grey H2
deconseille ou frequent: hydrogène
deconseille ou frequent: hydrogène d'origine fossile à faible empreinte carbone
deconseille ou frequent: hydrogène d’origine fossile sobre en carbone
deconseille ou frequent: hydrogène fossile
deconseille ou frequent: hydrogène gris
equivalent EN: grey hydrogen @en
equivalent EN: grey hydrogen (en)
definition: Hydrogène produit par reformage d’hydrocarbures fossiles.
in scheme: Énergie
in scheme: Pétrole et gaz
in scheme: concepts
notation: HYDR13
note: 1. L’hydrogène d’origine fossile peut être de l’hydrogène à faible empreinte carbone.
note: 2. On trouve aussi le terme « hydrogène gris », qui est déconseillé.
note: 3. On emploie couramment le terme « hydrogène » au lieu de la dénomination scientifique « dihydrogène ».
related: reformage
related: hydrogène à faible empreinte carbone
related: concept-PETR406

hydrogène sous-produit
type: ConceptConcept
type: Concept
creator: Commission d'enrichissement de la langue française, FranceTerme
date parution JO: 2021-01-30
deconseille ou frequent: H2 by-product
deconseille ou frequent: H2 coproduit
deconseille ou frequent: H2 de récupération
deconseille ou frequent: H2 fatal
deconseille ou frequent: H2 récupérable
deconseille ou frequent: H2 secondaire
deconseille ou frequent: H2 sous produit
deconseille ou frequent: H2 sous-produit
deconseille ou frequent: by-product H2
deconseille ou frequent: dihydrogène
deconseille ou frequent: hydrogène
deconseille ou frequent: hydrogène coproduit
deconseille ou frequent: hydrogène de récupération
deconseille ou frequent: hydrogène fatal
deconseille ou frequent: hydrogène récupérable
deconseille ou frequent: hydrogène secondaire
deconseille ou frequent: hydrogène sous produit
deconseille ou frequent: énergie de récupération
deconseille ou frequent: énergie fatale
deconseille ou frequent: énergies fatales
equivalent EN: by-product hydrogen @en
equivalent EN: by-product hydrogen (en)
equivalent EN: hydrogen by-product @en
equivalent EN: hydrogen by-product (en)
definition: Hydrogène produit lors d’un processus industriel dont la fonction principale n’est pas d’obtenir cet hydrogène.
in scheme: Chimie
in scheme: Énergie
in scheme: concepts
notation: HYDR14
note: 1. L’hydrogène sous-produit peut être valorisé ; on parle alors d’« hydrogène de récupération ».
note: 2. On trouve aussi, dans le langage professionnel, le terme « hydrogène coproduit », ainsi que le terme « hydrogène fatal », qui n’est pas recommandé.
note: 3. On emploie couramment le terme « hydrogène » au lieu de la dénomination scientifique « dihydrogène ».

stockage souterrain de l'hydrogène
type: ConceptConcept
type: Concept
creator: Commission d'enrichissement de la langue française, FranceTerme
date parution JO: 2021-01-30
deconseille ou frequent: H2 mass storage
deconseille ou frequent: dihydrogène
deconseille ou frequent: hydrogène
deconseille ou frequent: stockage de masse de l'H2
deconseille ou frequent: stockage de masse de l'hydrogène
deconseille ou frequent: stockage géologique de l'H2
deconseille ou frequent: stockage géologique de l'hydrogène
deconseille ou frequent: stockage souterrain de l'H2
equivalent EN: hydrogen mass storage @en
equivalent EN: hydrogen mass storage (en)
definition: Stockage, en grande quantité et sous une forme comprimée, d’hydrogène à l’état gazeux dans des cavités souterraines naturelles ou artificielles.
in scheme: Énergie
in scheme: Pétrole et gaz
in scheme: concepts
notation: HYDR15
note: 1. Le stockage souterrain de l’hydrogène permet d’ajuster dans le temps la production d’énergie à sa consommation, notamment lorsque l’énergie est produite à partir d’une source d’énergie renouvelable intermittente.
note: 2. On emploie couramment le terme « hydrogène » au lieu de la dénomination scientifique « dihydrogène ».
related: stockage de l'hydrogène dans un solide
related: production d'hydrogène par électrolyse de l'eau

réservoir d'hydrogène gazeux
type: ConceptConcept
type: Concept
creator: Commission d'enrichissement de la langue française, FranceTerme
date parution JO: 2021-01-30
deconseille ou frequent: H2 high pressure tank
deconseille ou frequent: H2 high pressure vessel
deconseille ou frequent: dihydrogène
deconseille ou frequent: hydrogène
deconseille ou frequent: réservoir d'H2 gazeux
equivalent EN: hydrogen high pressure tank @en
equivalent EN: hydrogen high pressure tank (en)
equivalent EN: hydrogen high pressure vessel @en
equivalent EN: hydrogen high pressure vessel (en)
definition: Réservoir qui permet de stocker de l’hydrogène à l’état gazeux à haute pression et à température ambiante.
in scheme: Énergie
in scheme: Transports et mobilité
in scheme: concepts
notation: HYDR17
note: 1. Un réservoir d’hydrogène gazeux est généralement constitué d’une enveloppe étanche autour de laquelle sont enroulées des fibres de carbone assurant la résistance à la pression.
note: 2. Un réservoir d’hydrogène gazeux peut être embarqué dans un véhicule.
note: 3. On emploie couramment le terme « hydrogène » au lieu de la dénomination scientifique « dihydrogène ».
related: réservoir d'hydrogène liquéfié
related: station de distribution d'hydrogène
related: véhicule à hydrogène
related: stockage de l'hydrogène dans un solide

réservoir d'hydrogène liquéfié
type: ConceptConcept
type: Concept
creator: Commission d'enrichissement de la langue française, FranceTerme
date parution JO: 2021-01-30
deconseille ou frequent: cryogenic H2 fuel tank
deconseille ou frequent: dihydrogène
deconseille ou frequent: hydrogène
deconseille ou frequent: réservoir d'H2 liquide
deconseille ou frequent: réservoir d'H2 liquéfié
deconseille ou frequent: réservoir d'hydrogène liquide
equivalent EN: cryogenic hydrogen fuel tank @en
equivalent EN: cryogenic hydrogen fuel tank (en)
definition: Réservoir cryostatique qui permet de stocker de l’hydrogène à l’état liquide refroidi et maintenu à la température de -253 °C.
in scheme: Énergie
in scheme: Pétrole et gaz
in scheme: concepts
notation: HYDR18
note: 1. Le stockage de l’hydrogène à l’état liquide est notamment employé dans des applications industrielles comme la propulsion spatiale.
note: 2. On emploie couramment le terme « hydrogène » au lieu de la dénomination scientifique « dihydrogène ».
related: réservoir d'hydrogène gazeux
related: véhicule à hydrogène
related: stockage de l'hydrogène dans un solide

station de distribution d'hydrogène
type: ConceptConcept
type: Concept
creator: Commission d'enrichissement de la langue française, FranceTerme
date parution JO: 2021-01-30
deconseille ou frequent: H2 filling station
deconseille ou frequent: H2 fueling station
deconseille ou frequent: H2 refilling station
deconseille ou frequent: H2 refueling station
deconseille ou frequent: H2 station
deconseille ou frequent: dihydrogène
deconseille ou frequent: hydrogène
deconseille ou frequent: station H2
deconseille ou frequent: station d'H2
deconseille ou frequent: station d'hydrogène
deconseille ou frequent: station de distribution d'H2
deconseille ou frequent: station de recharge
deconseille ou frequent: station de recharge d'H2
deconseille ou frequent: station de recharge d'hydrogène
deconseille ou frequent: station hydrogène
equivalent EN: HRS @en
equivalent EN: HRS (en)
equivalent EN: hydrogen filling station @en
equivalent EN: hydrogen filling station (en)
equivalent EN: hydrogen fueling station @en
equivalent EN: hydrogen fueling station (en)
equivalent EN: hydrogen refilling station @en
equivalent EN: hydrogen refilling station (en)
equivalent EN: hydrogen refueling station @en
equivalent EN: hydrogen refueling station (en)
equivalent EN: hydrogen station @en
equivalent EN: hydrogen station (en)
forme abregee: station hydrogène
definition: Station-service permettant d’effectuer le ravitaillement des véhicules à hydrogène.
in scheme: Énergie
in scheme: Transports et mobilité
in scheme: concepts
notation: HYDR19
note: 1. L’hydrogène est soit acheminé jusqu’à la station, soit produit localement par électrolyse.
note: 2. On trouve aussi, dans l’usage, le terme « station de recharge d’hydrogène », qui est déconseillé.
note: 3. On emploie couramment le terme « hydrogène » au lieu de la dénomination scientifique « dihydrogène ».
related: réservoir d'hydrogène gazeux
related: véhicule à hydrogène

vaporeformage
type: ConceptConcept
type: Concept
creator: Commission d'enrichissement de la langue française, FranceTerme
date parution JO: 2021-01-30
deconseille ou frequent: dihydrogène
deconseille ou frequent: hydrogène
equivalent EN: steam reforming @en
equivalent EN: steam reforming (en)
part of speech: nom masculin
alternative label: reformage à la vapeur
definition: Reformage qui s’effectue à haute température et en présence de vapeur d’eau.
in scheme: Chimie
in scheme: Pétrole et gaz
in scheme: concepts
notation: HYDR2
related: reformage
related: vaporeformeur
scope note: Cette publication annule et remplace celle du terme « reformage à la vapeur » au Journal officiel du 12 janvier 1999.

injection d'hydrogène
type: ConceptConcept
type: Concept
creator: Commission d'enrichissement de la langue française, FranceTerme
date parution JO: 2021-01-30
deconseille ou frequent: H2 injection into gas grid
deconseille ou frequent: H2 into gas grid
deconseille ou frequent: dihydrogène
deconseille ou frequent: hydrogen injection into gas grid
deconseille ou frequent: hydrogen into gas grid
deconseille ou frequent: hydrogène
deconseille ou frequent: hythane
deconseille ou frequent: injection d'H2
definition: Introduction d’une faible quantité d’hydrogène dans un réseau de distribution de gaz naturel.
in scheme: Énergie
in scheme: Pétrole et gaz
in scheme: concepts
notation: HYDR20
note: 1. La quantité d’hydrogène injectée dans un réseau de distribution de gaz naturel peut varier de 6 à 20 %.
note: 2. L’injection d’hydrogène permet, pour la production d’une quantité de chaleur donnée, de diminuer le rejet de dioxyde de carbone lors de la combustion du mélange.
note: 3. On emploie couramment le terme « hydrogène » au lieu de la dénomination scientifique « dihydrogène ».
related: production d'hydrogène par électrolyse de l'eau

électrolyse alcaline de l'eau
type: ConceptConcept
type: Concept
creator: Commission d'enrichissement de la langue française, FranceTerme
date parution JO: 2021-01-30
deconseille ou frequent: dihydrogène
deconseille ou frequent: hydrogène
equivalent EN: alkaline electrolysis @en
equivalent EN: alkaline electrolysis (en)
definition: Décomposition de l’eau obtenue par électrolyse d’une solution aqueuse alcaline.
in scheme: Chimie
in scheme: Énergie
in scheme: concepts
notation: HYDR21
note: L’électrolyse alcaline de l’eau s’effectue généralement avec une solution aqueuse d’hydroxyde de potassium.
related: cellule d'électrolyse
related: décomposition de l'eau

électrolyse de l'eau à membrane échangeuse de protons
type: ConceptConcept
type: Concept
creator: Commission d'enrichissement de la langue française, FranceTerme
date parution JO: 2021-01-30
deconseille ou frequent: dihydrogène
deconseille ou frequent: hydrogène
deconseille ou frequent: électrolyse MEP
deconseille ou frequent: électrolyse PEM
equivalent EN: PEM electrolysis @en
equivalent EN: PEM electrolysis (en)
equivalent EN: polymer electrolyte membrane electrolysis @en
equivalent EN: polymer electrolyte membrane electrolysis (en)
equivalent EN: proton exchange membrane electrolysis @en
equivalent EN: proton exchange membrane electrolysis (en)
forme abregee: électrolyse à MEP
definition: Décomposition de l’eau par électrolyse en milieu acide, effectuée dans une cellule dont les deux compartiments sont séparés par une membrane polymère conductrice de protons.
in scheme: Chimie
in scheme: Énergie
in scheme: concepts
notation: HYDR22
related: cellule d'électrolyse
related: décomposition de l'eau

électrolyse de la vapeur d'eau à haute température
type: ConceptConcept
type: Concept
creator: Commission d'enrichissement de la langue française, FranceTerme
date parution JO: 2021-01-30
deconseille ou frequent: EHT
deconseille ou frequent: dihydrogène
deconseille ou frequent: hydrogène
deconseille ou frequent: électrolyse haute température
equivalent EN: SOE @en
equivalent EN: SOE (en)
equivalent EN: high temperature electrolysis @en
equivalent EN: high temperature electrolysis (en)
equivalent EN: solid oxide electrolysis @en
equivalent EN: solid oxide electrolysis (en)
forme abregee: électrolyse à haute température
definition: Décomposition de la vapeur d’eau par électrolyse, effectuée à haute température dans une cellule dont les deux compartiments sont séparés par une membrane en oxyde céramique conductrice d’anions oxydes.
in scheme: Chimie
in scheme: Énergie
in scheme: concepts
notation: HYDR23
note: 1. Les anions oxydes assurant la conductivité des membranes en oxyde céramique sont des atomes d’oxygène ayant capté deux électrons O2-.
note: 2. L’électrolyse de la vapeur d’eau à haute température s’effectue généralement avec une membrane d’oxyde de zirconium dopée à l’yttrium, qui, portée à une température de l’ordre de 800 °C, devient conductrice d’anions oxydes.
related: cellule d'électrolyse
related: décomposition de l'eau

pile à combustible à hydrogène
type: ConceptConcept
type: Concept
creator: Commission d'enrichissement de la langue française, FranceTerme
date parution JO: 2021-01-30
deconseille ou frequent: H2 fuel cell
deconseille ou frequent: PAC à H2
deconseille ou frequent: dihydrogène
deconseille ou frequent: dioxygène
deconseille ou frequent: hydrogène
deconseille ou frequent: pile à H2
deconseille ou frequent: pile à combustible H2
deconseille ou frequent: pile à combustible à H2
equivalent EN: hydrogen fuel cell @en
equivalent EN: hydrogen fuel cell (en)
forme abregee: PAC à hydrogène
forme abregee: pile à hydrogène
definition: Cellule électrochimique qui produit de l’électricité par oxydation de l’hydrogène à l’anode et par réduction de l’oxygène à la cathode.
in scheme: Chimie
in scheme: Énergie
in scheme: concepts
notation: HYDR24
note: 1. La pile à combustible à hydrogène fonctionne selon un processus inverse de la décomposition de l’eau par électrolyse.
note: 2. La pile à combustible à hydrogène est principalement utilisée pour alimenter un moteur électrique en remplacement d’accumulateurs.
note: 3. On emploie couramment les termes « hydrogène » et « oxygène » au lieu des dénominations scientifiques « dihydrogène » et « dioxygène ».
related: cellule électrochimique
related: pile à combustible à hydrogène alcaline
related: pile à combustible à hydrogène à membrane échangeuse d'anions
related: pile à combustible à hydrogène à membrane échangeuse de protons
related: pile à combustible à hydrogène à oxyde céramique
related: véhicule à hydrogène
related: décomposition de l'eau

pile à combustible à hydrogène alcaline
type: ConceptConcept
type: Concept
creator: Commission d'enrichissement de la langue française, FranceTerme
date parution JO: 2021-01-30
deconseille ou frequent: dihydrogène
deconseille ou frequent: hydrogène
deconseille ou frequent: pile à H2 alcaline
deconseille ou frequent: pile à combustible à H2 alcaline
equivalent EN: AFC @en
equivalent EN: AFC (en)
equivalent EN: alkaline fuel cell @en
equivalent EN: alkaline fuel cell (en)
forme abregee: PAC alcaline
forme abregee: pile à hydrogène alcaline
definition: Pile à combustible à hydrogène dont l’électrolyte est une solution aqueuse alcaline.
in scheme: Chimie
in scheme: Énergie
in scheme: concepts
notation: HYDR25
note: 1. La pile à combustible à hydrogène alcaline utilise généralement une solution aqueuse d’hydroxyde de potassium.
note: 2. La pile à combustible à hydrogène alcaline est principalement utilisée dans le domaine spatial.
related: pile à combustible à hydrogène
related: pile à combustible à hydrogène à membrane échangeuse d'anions
related: pile à combustible à hydrogène à membrane échangeuse de protons
related: pile à combustible à hydrogène à oxyde céramique

pile à combustible à hydrogène à membrane échangeuse d'anions
type: ConceptConcept
type: Concept
creator: Commission d'enrichissement de la langue française, FranceTerme
date parution JO: 2021-01-30
deconseille ou frequent: dihydrogène
deconseille ou frequent: hydrogène
deconseille ou frequent: pile à H2 à membrane échangeuse d'anions
deconseille ou frequent: pile à combustible à H2 à membrane échangeuse d'anions
equivalent EN: AAEMFC @en
equivalent EN: AAEMFC (en)
equivalent EN: AEMFC @en
equivalent EN: AEMFC (en)
equivalent EN: APEFC @en
equivalent EN: APEFC (en)
equivalent EN: alkaline anion exchange membrane fuel cell @en
equivalent EN: alkaline anion exchange membrane fuel cell (en)
equivalent EN: alkaline polymer electrolyte fuel cell @en
equivalent EN: alkaline polymer electrolyte fuel cell (en)
equivalent EN: anion exchange membrane fuel cell @en
equivalent EN: anion exchange membrane fuel cell (en)
forme abregee: PAC à membrane échangeuse d'anions
forme abregee: pile à hydrogène à membrane échangeuse d'anions
definition: Pile à combustible à hydrogène dont les deux compartiments sont séparés par une membrane polymère conductrice d’anions hydroxydes.
in scheme: Chimie
in scheme: Énergie
in scheme: concepts
notation: HYDR26
related: pile à combustible à hydrogène
related: pile à combustible à hydrogène alcaline
related: pile à combustible à hydrogène à membrane échangeuse de protons
related: pile à combustible à hydrogène à oxyde céramique

pile à combustible à hydrogène à membrane échangeuse de protons
type: ConceptConcept
type: Concept
creator: Commission d'enrichissement de la langue française, FranceTerme
date parution JO: 2021-01-30
deconseille ou frequent: dihydrogène
deconseille ou frequent: hydrogène
deconseille ou frequent: pile à H2 à membrane échangeuse de protons
deconseille ou frequent: pile à combustible à H2 à membrane échangeuse de protons
equivalent EN: PEMFC @en
equivalent EN: PEMFC (en)
equivalent EN: proton exchange membrane fuel cell @en
equivalent EN: proton exchange membrane fuel cell (en)
forme abregee: PAC à membrane échangeuse de protons
forme abregee: pile à MEP
forme abregee: pile à hydrogène à membrane échangeuse de protons
definition: Pile à combustible à hydrogène dont les deux compartiments sont séparés par une membrane polymère conductrice de protons.
in scheme: Chimie
in scheme: Énergie
in scheme: concepts
notation: HYDR27
related: pile à combustible à hydrogène
related: pile à combustible à hydrogène alcaline
related: pile à combustible à hydrogène à membrane échangeuse d'anions
related: pile à combustible à hydrogène à oxyde céramique

pile à combustible à hydrogène à oxyde céramique
type: ConceptConcept
type: Concept
creator: Commission d'enrichissement de la langue française, FranceTerme
date parution JO: 2021-01-30
deconseille ou frequent: dihydrogène
deconseille ou frequent: hydrogène
deconseille ou frequent: pile SOFC
deconseille ou frequent: pile à H2 à oxyde céramique
deconseille ou frequent: pile à combustible à H2 à oxyde céramique
deconseille ou frequent: pile à combustible à oxyde solide
deconseille ou frequent: pile à oxide solide
deconseille ou frequent: solid oxide fuel cell
equivalent EN: SOFC @en
equivalent EN: SOFC (en)
equivalent EN: solid oxide fuel cell @en
equivalent EN: solid oxide fuel cell (en)
forme abregee: PAC à oxyde céramique
forme abregee: pile à hydrogène à oxyde céramique
definition: Pile à combustible à hydrogène fonctionnant à haute température, dont les deux compartiments sont séparés par une membrane en oxyde céramique conductrice d’anions oxydes.
in scheme: Chimie
in scheme: Énergie
in scheme: concepts
notation: HYDR28
note: 1. Les anions oxydes assurant la conductivité des membranes en oxyde céramique sont des atomes d’oxygène ayant capté deux électrons O2-.
note: 2. Certains types de pile à combustible à hydrogène à oxyde céramique utilisent du gaz naturel qui, introduit à l’anode, subit un reformage produisant localement de l’hydrogène.
note: 3. On trouve aussi le terme « pile à combustible à oxyde solide ».
note: 4. On emploie couramment le terme « hydrogène » au lieu de la dénomination scientifique « dihydrogène ».
related: pile à combustible à hydrogène
related: pile à combustible à hydrogène alcaline
related: pile à combustible à hydrogène à membrane échangeuse d'anions
related: pile à combustible à hydrogène à membrane échangeuse de protons

véhicule à hydrogène
type: ConceptConcept
type: Concept
creator: Commission d'enrichissement de la langue française, FranceTerme
date parution JO: 2021-01-30
deconseille ou frequent: H2 vehicle
deconseille ou frequent: bus à H2
deconseille ou frequent: bus à hydrogène
deconseille ou frequent: camion à H2
deconseille ou frequent: camion à hydrogène
deconseille ou frequent: dihydrogène
deconseille ou frequent: hydrogène
deconseille ou frequent: train à H2
deconseille ou frequent: train à hydrogène
deconseille ou frequent: voiture à H2
deconseille ou frequent: voiture à hydrogène
deconseille ou frequent: véhicule à H2
deconseille ou frequent: véhicule électrique à H2
equivalent EN: FCEV @en
equivalent EN: FCEV (en)
equivalent EN: fuel cell electric vehicle @en
equivalent EN: fuel cell electric vehicle (en)
equivalent EN: hydrogen vehicle @en
equivalent EN: hydrogen vehicle (en)
definition: Véhicule électrique dont l’énergie est produite par une pile à combustible embarquée alimentée par un réservoir d’hydrogène.
in scheme: Énergie
in scheme: Transports et mobilité
in scheme: concepts
notation: HYDR29
related: réservoir d'hydrogène gazeux
related: réservoir d'hydrogène liquéfié
related: station de distribution d'hydrogène
related: pile à combustible à hydrogène

reformeur
type: ConceptConcept
type: Concept
creator: Commission d'enrichissement de la langue française, FranceTerme
date parution JO: 2021-01-30
deconseille ou frequent: dihydrogène
deconseille ou frequent: hydrogène
equivalent EN: reformer @en
equivalent EN: reformer (en)
part of speech: nom masculin
alternative label: unité de reformage
definition: Installation dans laquelle on procède au reformage.
in scheme: Chimie
in scheme: Pétrole et gaz
in scheme: concepts
notation: HYDR3
related: reformage
related: vaporeformeur
scope note: Cette publication annule et remplace celles des termes « reformeur » et « unité de reformage » au Journal officiel des 22 septembre 2000 et 24 avril 2010.

stockage de l'hydrogène dans un solide
type: ConceptConcept
type: Concept
creator: Commission d'enrichissement de la langue française, FranceTerme
date parution JO: 2021-01-30
deconseille ou frequent: H2 solide
deconseille ou frequent: dihydrogène
deconseille ou frequent: hydrogène
deconseille ou frequent: hydrogène solide
deconseille ou frequent: solid H2 storage
deconseille ou frequent: stockage de l'H2 dans un solide
deconseille ou frequent: stockage de l'H2 solide
deconseille ou frequent: stockage de l'hydrogène solide
deconseille ou frequent: stockage solide de l'H2
deconseille ou frequent: stockage solide de l'hydrogène
equivalent EN: solid hydrogen storage @en
equivalent EN: solid hydrogen storage (en)
definition: Stockage réversible de l’hydrogène, qui est incorporé dans un matériau solide poreux par réaction chimique, notamment par formation d’un hydrure, ou par sorption.
in scheme: Chimie
in scheme: Énergie
in scheme: concepts
notation: HYDR30
note: 1. On trouve aussi les termes « stockage de l’hydrogène solide » et « stockage solide de l’hydrogène », qui sont déconseillés.
note: 2. On emploie couramment le terme « hydrogène » au lieu de la dénomination scientifique « dihydrogène ».
related: sorption
related: stockage souterrain de l'hydrogène
related: réservoir d'hydrogène gazeux
related: réservoir d'hydrogène liquéfié

vaporeformeur
type: ConceptConcept
type: Concept
creator: Commission d'enrichissement de la langue française, FranceTerme
date parution JO: 2021-01-30
deconseille ou frequent: dihydrogène
deconseille ou frequent: hydrogène
equivalent EN: steam reformer @en
equivalent EN: steam reformer (en)
part of speech: nom masculin
alternative label: reformeur à la vapeur
definition: Installation dans laquelle on procède au vaporeformage.
in scheme: Chimie
in scheme: Pétrole et gaz
in scheme: concepts
notation: HYDR4
related: vaporeformage
related: reformeur
scope note: Cette publication annule et remplace celle du terme « reformeur à vapeur » au Journal officiel du 12 janvier 1999.

production d'hydrogène par électrolyse de l'eau
type: ConceptConcept
type: Concept
creator: Commission d'enrichissement de la langue française, FranceTerme
date parution JO: 2021-01-30
deconseille ou frequent: H2 par électrolyse de l'eau
deconseille ou frequent: conversion de l'électricité en H2
deconseille ou frequent: conversion de l'électricité en gaz
deconseille ou frequent: dihydrogène
deconseille ou frequent: hydrogène
deconseille ou frequent: hydrogène par électrolyse de l'eau
deconseille ou frequent: power to gas
deconseille ou frequent: power to x
deconseille ou frequent: power-to-H2
deconseille ou frequent: production d'H2 par électrolyse de l'eau
deconseille ou frequent: transformation de l'électricité en gaz
equivalent EN: P2G @en
equivalent EN: P2G (en)
equivalent EN: P2H @en
equivalent EN: P2H (en)
equivalent EN: P2H2 @en
equivalent EN: P2H2 (en)
equivalent EN: PTG @en
equivalent EN: PTG (en)
equivalent EN: power-to-gas @en
equivalent EN: power-to-gas (en)
equivalent EN: power-to-hydrogen @en
equivalent EN: power-to-hydrogen (en)
alternative label: conversion de l'électricité en hydrogène
definition: Conversion, par électrolyse de l’eau, d’une énergie électrique en une énergie chimique sous forme d’hydrogène.
in scheme: Chimie
in scheme: Énergie
in scheme: concepts
notation: HYDR5
note: 1. L’hydrogène ainsi obtenu peut être utilisé en l’état, stocké, ou combiné avec du dioxyde de carbone pour produire du méthane par méthanation.
note: 2. On emploie couramment le terme « hydrogène » au lieu de la dénomination scientifique « dihydrogène ».
related: méthanation
related: stockage souterrain de l'hydrogène
related: injection d'hydrogène
related: décomposition de l'eau
scope note: Cette publication annule et remplace celle du terme « transformation de l’électricité en gaz » au Journal officiel du 19 septembre 2018.

décomposition de l'eau
type: ConceptConcept
type: Concept
creator: Commission d'enrichissement de la langue française, FranceTerme
date parution JO: 2021-01-30
deconseille ou frequent: craquage de l'eau
deconseille ou frequent: dihydrogène
deconseille ou frequent: dioxygène
deconseille ou frequent: hydrogène
deconseille ou frequent: scission de l'eau
equivalent EN: water splitting @en
equivalent EN: water splitting (en)
definition: Dissociation de l’eau en hydrogène et en oxygène, qui peut être obtenue par thermolyse, électrolyse, photolyse, photoélectrolyse ou radiolyse.
in scheme: Chimie
in scheme: concepts
notation: HYDR6
note: 1. On trouve aussi les termes « scission de l’eau » et « craquage de l’eau », qui ne sont pas recommandés.
note: 2. On emploie couramment les termes « hydrogène » et « oxygène » au lieu des dénominations scientifiques « dihydrogène » et « dioxygène ».
related: photolyse
related: thermolyse
related: électrolyse alcaline de l'eau
related: électrolyse de l'eau à membrane échangeuse de protons
related: électrolyse de la vapeur d'eau à haute température
related: pile à combustible à hydrogène
related: production d'hydrogène par électrolyse de l'eau
related: décomposition thermique de la biomasse
related: photoélectrolyse de l'eau

décomposition thermique de la biomasse
type: ConceptConcept
type: Concept
creator: Commission d'enrichissement de la langue française, FranceTerme
date parution JO: 2021-01-30
deconseille ou frequent: conversion thermochimique de la biomasse
deconseille ou frequent: dihydrogène
deconseille ou frequent: hydrogène
definition: Thermolyse anaérobie de la biomasse à haute température.
in scheme: Chimie
in scheme: Énergie
in scheme: concepts
notation: HYDR7
note: 1. La décomposition thermique de la biomasse lignocellulosique peut être suivie d’une réaction à la vapeur d’eau, ce qui permet de produire de l’hydrogène d’origine renouvelable.
note: 2. On trouve aussi le terme « conversion thermochimique de la biomasse ».
related: thermolyse
related: hydrogène d'origine renouvelable
related: hydrogène d'origine biologique
related: décomposition de l'eau

photoélectrolyse de l'eau
type: ConceptConcept
type: Concept
creator: Commission d'enrichissement de la langue française, FranceTerme
date parution JO: 2021-01-30
deconseille ou frequent: dihydrogène
deconseille ou frequent: hydrogène
deconseille ou frequent: photo-électrolyse de l'eau
equivalent EN: water photoelectrolysis @en
equivalent EN: water photoelectrolysis (en)
definition: Décomposition de l’eau par électrolyse, dans laquelle l’énergie est fournie par les photons absorbés par l’anode semiconductrice immergée dans l’électrolyte, l’hydrogène étant produit à la cathode.
in scheme: Chimie
in scheme: Énergie
in scheme: concepts
notation: HYDR8
note: 1. Dans la photoélectrolyse de l’eau, l’anode semiconductrice est généralement à base de dioxyde de titane.
note: 2. On emploie couramment le terme « hydrogène » au lieu de la dénomination scientifique « dihydrogène ».
related: décomposition de l'eau

réseau informatique
type: ConceptConcept
type: Concept
creator: Commission d'enrichissement de la langue française, FranceTerme
date parution JO: 1998-10-10
equivalent EN: computer network @en
equivalent EN: computer network (en)
forme abregee: réseau, n.m.
definition: Ensemble des moyens matériels et logiciels mis en œuvre pour assurer les communications entre ordinateurs, stations de travail et terminaux informatiques.
in scheme: Informatique
in scheme: concepts
notation: INFO1
note: Tout ou partie de ces matériels peuvent être considérés comme faisant partie du réseau.

connexité
type: ConceptConcept
type: Concept
creator: Commission d'enrichissement de la langue française, FranceTerme
date parution JO: 1998-10-10
deconseille ou frequent: connectivité
equivalent EN: connectivity @en
equivalent EN: connectivity (en)
part of speech: nom féminin
definition: Propriété d'un réseau de téléinformatique dans lequel il est toujours possible de relier directement ou indirectement deux équipements quelconques.
in scheme: Informatique
in scheme: concepts
notation: INFO10
note: 1. Le terme « connectivité » est déconseillé.
note: 2. Ce sens de connexité est emprunté aux mathématiques. On dit d'un graphe qu'il est « connexe » s'il existe au moins un chemin entre deux nœuds quelconques.

circuit intégré prédiffusé programmable
type: ConceptConcept
type: Concept
creator: Commission d'enrichissement de la langue française, FranceTerme
source: révision de l'arrêté du 29 avril 1992
abbreviation: FPGA @en
date parution JO: 2000-09-22
equivalent EN: FPGA @en
equivalent EN: FPGA (en)
equivalent EN: field programmable gate array @en
equivalent EN: field programmable gate array (en)
forme abregee: prédiffusé programmable
definition: Réseau logique programmable électriquement chez le client final.
in scheme: Électronique
in scheme: concept-SD-electronique-composants-electroniques
in scheme: concepts
notation: INFO100

circuit intégré semi-personnalisé
type: ConceptConcept
type: Concept
creator: Commission d'enrichissement de la langue française, FranceTerme
source: révision de l'arrêté du 29 avril 1992
date parution JO: 2000-09-22
deconseille ou frequent: circuit semi-personnalisé
deconseille ou frequent: semi-personnalisé
equivalent EN: semi-custom circuit @en
equivalent EN: semi-custom circuit (en)
definition: Circuit intégré dont la conception est fondée sur l'utilisation de blocs prédéfinis ou préconstruits.
in scheme: Électronique
in scheme: concept-SD-electronique-composants-electroniques
in scheme: concepts
notation: INFO101
note: 1. La notion de « circuit semi-personnalisé » peut s'appliquer à un circuit précaractérisé ou à un circuit prédiffusé.
note: 2. Les termes « circuit semi-personnalisé » ou « semi-personnalisé » sont, dans l'usage, les formes abrégées de « circuit intégré semi-personnalisé ».
note: 3. L'expression « circuit semi-custom » est à éviter en français.

circuit intégré sur mesure
type: ConceptConcept
type: Concept
creator: Commission d'enrichissement de la langue française, FranceTerme
source: révision de l'arrêté du 29 avril 1992
date parution JO: 2000-09-22
deconseille ou frequent: circuit à la demande
equivalent EN: full custom circuit @en
equivalent EN: full custom circuit (en)
alternative label: circuit intégré à la demande
definition: Circuit intégré dont l'ensemble des caractéristiques est conçu pour répondre à une demande déterminée.
in scheme: Électronique
in scheme: concept-SD-electronique-composants-electroniques
in scheme: concepts
notation: INFO104
note: 1. Dans l'usage, on parle souvent de « circuit à la demande ».
note: 2. Le terme « circuit full custom » est à éviter en français.

clicher
type: ConceptConcept
type: Concept
creator: Commission d'enrichissement de la langue française, FranceTerme
source: révision de l'arrêté du 30 mars 1987
date parution JO: 2000-09-22
deconseille ou frequent: to dump
equivalent EN: dump @en
equivalent EN: dump (en)
part of speech: verbe
definition: Recopier le contenu, à un instant déterminé, de tout ou partie d'une mémoire sur un autre support.
in scheme: Informatique
in scheme: concepts
notation: INFO105
note: Par extension, le nom correspondant pourrait être « cliché » ou « cliché-mémoire ».

codet
type: ConceptConcept
type: Concept
creator: Commission d'enrichissement de la langue française, FranceTerme
source: révision de l'arrêté du 30 mars 1987
date parution JO: 2000-09-22
equivalent EN: code element @en
equivalent EN: code element (en)
part of speech: nom masculin
definition: Groupe d'éléments représentant, selon un code, une donnée élémentaire.
in scheme: Informatique
in scheme: concepts
notation: INFO106
note: Le terme « codet » est destiné à remplacer des expressions telles que « combinaison de code » ou « mot de code ». Le terme « code » désigne en effet l'ensemble des règles de représentation des données élémentaires par des codets. Par exemple, selon le code Morse, les caractères et différentes fonctions sont représentés par des codets qui sont des groupes de points et de traits.

conception
type: ConceptConcept
type: Concept
creator: Commission d'enrichissement de la langue française, FranceTerme
source: révision de l'arrêté du 29 avril 1992
date parution JO: 2000-09-22
equivalent EN: design @en
equivalent EN: design (en)
part of speech: nom féminin
definition: Ensemble des études préliminaires à la fabrication d'un produit.
in scheme: Électronique
in scheme: concept-SD-electronique-composants-electroniques
in scheme: concepts
notation: INFO107

convertisseur analogique-numérique
type: ConceptConcept
type: Concept
creator: Commission d'enrichissement de la langue française, FranceTerme
source: révision de l'arrêté du 14 septembre 1990
abbreviation: ADC @en
abbreviation: CAN
date parution JO: 2000-09-22
deconseille ou frequent: analog-to-digital converter
deconseille ou frequent: analogue-to-digital converter
equivalent EN: ADC (GB) @en
equivalent EN: ADC (US) @en
equivalent EN: ADC (en-GB)
equivalent EN: ADC (en-US)
equivalent EN: analog-to-digital converter (US) @en
equivalent EN: analog-to-digital converter (en-US)
equivalent EN: analogue-to-digital converter (GB) @en
equivalent EN: analogue-to-digital converter (en-GB)
forme abregee: convertisseur A/N
definition: Dispositif électronique qui permet de convertir un signal analogique en un signal numérique.
in scheme: Électronique
in scheme: concept-SD-electronique-composants-electroniques
in scheme: concepts
notation: INFO108

débogage
type: ConceptConcept
type: Concept
creator: Commission d'enrichissement de la langue française, FranceTerme
source: révision de l'arrêté du 30 novembre 1983
date parution JO: 2000-09-22
equivalent EN: debugging @en
equivalent EN: debugging (en)
part of speech: nom masculin
definition: Action d'éliminer les bogues.
in scheme: Informatique
in scheme: concepts
notation: INFO109
related: déboguer
related: bogue

coprocesseur
type: ConceptConcept
type: Concept
creator: Commission d'enrichissement de la langue française, FranceTerme
date parution JO: 1998-10-10
equivalent EN: coprocessor @en
equivalent EN: coprocessor (en)
part of speech: nom masculin
definition: Processeur complémentaire d'un processeur principal destiné à rendre plus efficace l'exécution d'un jeu particulier d'instructions.
in scheme: Informatique
in scheme: concepts
notation: INFO11
related: processeur

déboguer
type: ConceptConcept
type: Concept
creator: Commission d'enrichissement de la langue française, FranceTerme
source: révision de l'arrêté du 30 novembre 1983
date parution JO: 2000-09-22
deconseille ou frequent: to debug
equivalent EN: debug @en
equivalent EN: debug (en)
part of speech: verbe
definition: Éliminer les bogues.
in scheme: Informatique
in scheme: concepts
notation: INFO110
related: débogage
related: bogue

débogueur
type: ConceptConcept
type: Concept
creator: Commission d'enrichissement de la langue française, FranceTerme
source: révision de l'arrêté du 30 novembre 1983
date parution JO: 2000-09-22
equivalent EN: debugger @en
equivalent EN: debugger (en)
part of speech: nom masculin
definition: Programme d'aide à l'élimination des bogues.
in scheme: Informatique
in scheme: concepts
notation: INFO111
related: bogue

défaillance
type: ConceptConcept
type: Concept
creator: Commission d'enrichissement de la langue française, FranceTerme
source: révision de l'arrêté du 19 février 1993
date parution JO: 2000-09-22
equivalent EN: failure @en
equivalent EN: failure (en)
part of speech: nom féminin
definition: Cessation de l'aptitude d'une unité fonctionnelle à accomplir une fonction requise.
in scheme: Informatique
in scheme: concepts
notation: INFO112
note: 1. Une défaillance est un passage d'un état à un autre, par opposition à une panne qui est un état.
note: 2. On entend par « unité fonctionnelle » soit un système complet, soit l'un quelconque de ses éléments (logiciel ou matériel).

descripteur
type: ConceptConcept
type: Concept
creator: Commission d'enrichissement de la langue française, FranceTerme
source: révision de l'arrêté du 30 novembre 1983
date parution JO: 2000-09-22
equivalent EN: descriptor @en
equivalent EN: descriptor (en)
part of speech: nom masculin
definition: Mot ou locution destiné à caractériser les informations contenues dans un document pour faciliter les recherches documentaires.
in scheme: Informatique
in scheme: concepts
notation: INFO113
note: Les descripteurs renvoient le plus souvent à des références et des codifications.

déverminage
type: ConceptConcept
type: Concept
creator: Commission d'enrichissement de la langue française, FranceTerme
source: révision de l'arrêté du 14 septembre 1990
date parution JO: 2000-09-22
equivalent EN: burn-in @en
equivalent EN: burn-in (en)
part of speech: nom masculin
definition: Séquences de contraintes thermiques, ou climatiques, ou électriques, ou mécaniques, ayant pour but d'éliminer les défauts de jeunesse dans une production donnée de composants électroniques.
in scheme: Électronique
in scheme: concept-SD-electronique-composants-electroniques
in scheme: concepts
notation: INFO114

dévideur
type: ConceptConcept
type: Concept
creator: Commission d'enrichissement de la langue française, FranceTerme
source: révision de l'arrêté du 30 mars 1987
date parution JO: 2000-09-22
equivalent EN: streamer @en
equivalent EN: streamer (en)
part of speech: nom masculin
definition: Dérouleur de bande magnétique destiné à la sauvegarde des informations contenues dans un disque.
in scheme: Informatique
in scheme: concepts
notation: INFO115

diffusion
type: ConceptConcept
type: Concept
creator: Commission d'enrichissement de la langue française, FranceTerme
source: révision de l'arrêté du 29 avril 1992
date parution JO: 2000-09-22
equivalent EN: diffusion @en
equivalent EN: diffusion (en)
part of speech: nom féminin
definition: Opération qui consiste à doper un semiconducteur positivement ou négativement par exposition des tranches du semiconducteur à des gaz dopants à température élevée.
in scheme: Électronique
in scheme: concept-SD-electronique-composants-electroniques
in scheme: concepts
notation: INFO116

disque optique
type: ConceptConcept
type: Concept
creator: Commission d'enrichissement de la langue française, FranceTerme
source: révision de l'arrêté du 22 décembre 1981
date parution JO: 2000-09-22
equivalent EN: optical disk @en
equivalent EN: optical disk (en)
definition: Disque sur lequel sont enregistrées des données lisibles par un procédé optique.
in scheme: Informatique
in scheme: concepts
notation: INFO117

donnée
type: ConceptConcept
type: Concept
creator: Commission d'enrichissement de la langue française, FranceTerme
source: révision de l'arrêté du 22 décembre 1981
date parution JO: 2000-09-22
equivalent EN: data @en
equivalent EN: data (en)
part of speech: nom féminin
definition: Représentation d'une information sous une forme conventionnelle destinée à faciliter son traitement.
in scheme: Informatique
in scheme: Télécommunications
in scheme: concepts
narrower: mégadonnées
narrower: concept-SPAT137
notation: INFO118
related: traitement automatique de données
related: directeur, -trice des données
related: concept-INFO961
related: concept-INFO981

crènelage
type: ConceptConcept
type: Concept
creator: Commission d'enrichissement de la langue française, FranceTerme
date parution JO: 1998-10-10
equivalent EN: aliasing @en
equivalent EN: aliasing (en)
part of speech: nom masculin
definition: Effet visuel indésirable provoqué par l'insuffisance de la définition d'une image ou par un filtrage inadéquat des contours d'objets, et qui prend habituellement la forme de dentelures et de contours brisés.
in scheme: Informatique
in scheme: concepts
notation: INFO12
related: anticrènelage

écran tactile
type: ConceptConcept
type: Concept
creator: Commission d'enrichissement de la langue française, FranceTerme
source: révision de l'arrêté du 30 mars 1987
date parution JO: 2000-09-22
deconseille ou frequent: touchscreen
equivalent EN: touch screen @en
equivalent EN: touch screen (en)
definition: Écran muni d'un dispositif qui permet de sélectionner certaines de ses zones par contact.
in scheme: Informatique
in scheme: concepts
notation: INFO121
related: tablette
related: concept-interface-homme-machine
related: concept-interface-utilisateur

écriture directe
type: ConceptConcept
type: Concept
creator: Commission d'enrichissement de la langue française, FranceTerme
source: révision de l'arrêté du 29 avril 1992
date parution JO: 2000-09-22
equivalent EN: direct writing @en
equivalent EN: direct writing (en)
definition: Opération qui consiste, à partir des données fournies par les outils de conception, à tracer directement le dessin du circuit sur une tranche de matériau semiconducteur avec, par exemple, un faisceau d'électrons ou un laser.
in scheme: Électronique
in scheme: concept-SD-electronique-composants-electroniques
in scheme: concepts
notation: INFO122

éditeur
type: ConceptConcept
type: Concept
creator: Commission d'enrichissement de la langue française, FranceTerme
source: révision de l'arrêté du 30 mars 1987
date parution JO: 2000-09-22
equivalent EN: editor @en
equivalent EN: editor (en)
part of speech: nom masculin
definition: Programme qui permet, à partir d'un écran, d'introduire des données textuelles ou graphiques ou d'en modifier la disposition.
in scheme: Informatique
in scheme: concepts
notation: INFO123

épitaxie
type: ConceptConcept
type: Concept
creator: Commission d'enrichissement de la langue française, FranceTerme
source: révision de l'arrêté du 29 avril 1992
date parution JO: 2000-09-22
equivalent EN: epitaxy @en
equivalent EN: epitaxy (en)
part of speech: nom féminin
definition: Opération qui consiste à faire croître une couche de matériau semiconducteur sur un substrat, cette couche ayant la même orientation cristalline que le substrat.
in scheme: Électronique
in scheme: concept-SD-electronique-composants-electroniques
in scheme: concepts
notation: INFO125

fixage de puce
type: ConceptConcept
type: Concept
creator: Commission d'enrichissement de la langue française, FranceTerme
source: révision de l'arrêté du 14 septembre 1990
date parution JO: 2000-09-22
deconseille ou frequent: report de puce
equivalent EN: die bond @en
equivalent EN: die bond (en)
equivalent EN: die bonding @en
equivalent EN: die bonding (en)
definition: Opération de soudage ou de collage de puces sur un substrat.
in scheme: Électronique
in scheme: concept-SD-electronique-composants-electroniques
in scheme: concepts
notation: INFO126
note: Dans cette acception, on dit aussi « report de puce ».

fonderie de silicium
type: ConceptConcept
type: Concept
creator: Commission d'enrichissement de la langue française, FranceTerme
source: révision de l'arrêté du 29 avril 1992
date parution JO: 2000-09-22
equivalent EN: silicon foundry @en
equivalent EN: silicon foundry (en)
definition: Entreprise qui fabrique des circuits intégrés généralement à base de silicium, à partir de masques établis par des concepteurs.
in scheme: Électronique
in scheme: concept-SD-electronique-composants-electroniques
in scheme: concepts
notation: INFO127

fondeur de silicium
type: ConceptConcept
type: Concept
creator: Commission d'enrichissement de la langue française, FranceTerme
source: révision de l'arrêté du 29 avril 1992
date parution JO: 2000-09-22
equivalent EN: silicon founder @en
equivalent EN: silicon founder (en)
definition: Fabricant de circuits intégrés généralement à base de silicium, qui met ses lignes de production à la disposition des utilisateurs.
in scheme: Électronique
in scheme: concept-SD-electronique-composants-electroniques
in scheme: concepts
notation: INFO128

format
type: ConceptConcept
type: Concept
creator: Commission d'enrichissement de la langue française, FranceTerme
source: révision de l'arrêté du 30 novembre 1983
date parution JO: 2000-09-22
equivalent EN: format @en
equivalent EN: format (en)
part of speech: nom masculin
definition: Agencement structuré d'un support de données ; par extension, disposition des données elles-mêmes.
in scheme: Informatique
in scheme: concepts
notation: INFO129

échange de données informatisé
type: ConceptConcept
type: Concept
creator: Commission d'enrichissement de la langue française, FranceTerme
abbreviation: EDI
date parution JO: 1998-10-10
equivalent EN: EDI @en
equivalent EN: EDI (en)
equivalent EN: electronic data interchange @en
equivalent EN: electronic data interchange (en)
definition: Transfert, entre systèmes d'information, de données structurées directement émises et traitées par des applications informatiques selon des procédures normalisées.
in scheme: Informatique
in scheme: concepts
notation: INFO13

formatage d'une disquette
type: ConceptConcept
type: Concept
creator: Commission d'enrichissement de la langue française, FranceTerme
source: révision de l'arrêté du 30 novembre 1983
date parution JO: 2000-09-22
equivalent EN: diskette formatting @en
equivalent EN: diskette formatting (en)
forme abregee: formatage, n.m.
definition: Action de formater une disquette.
in scheme: Informatique
in scheme: concepts
notation: INFO130

formater
type: ConceptConcept
type: Concept
creator: Commission d'enrichissement de la langue française, FranceTerme
source: révision de l'arrêté du 30 novembre 1983
date parution JO: 2000-09-22
deconseille ou frequent: to format
equivalent EN: format @en
equivalent EN: format (en)
part of speech: verbe
definition: Structurer un support de données ou des données selon un format.
in scheme: Informatique
in scheme: concepts
notation: INFO131

forme
type: ConceptConcept
type: Concept
creator: Commission d'enrichissement de la langue française, FranceTerme
source: révision de l'arrêté du 27 juin 1989
date parution JO: 2000-09-22
equivalent EN: pattern @en
equivalent EN: pattern (en)
part of speech: nom féminin
definition: Ensemble de caractéristiques retenues pour représenter une entité en fonction du problème à résoudre.
in scheme: Informatique
in scheme: concepts
notation: INFO132
note: Cette entité peut être une figure géométrique, une image, un son, un signal, un texte, etc.

fusionner
type: ConceptConcept
type: Concept
creator: Commission d'enrichissement de la langue française, FranceTerme
source: révision de l'arrêté du 30 mars 1987
date parution JO: 2000-09-22
deconseille ou frequent: to merge
equivalent EN: merge @en
equivalent EN: merge (en)
part of speech: verbe
definition: Réunir en un seul ensemble les éléments de plusieurs ensembles rangés suivant les mêmes critères.
in scheme: Informatique
in scheme: concepts
notation: INFO133

générateur de dessin de masques
type: ConceptConcept
type: Concept
creator: Commission d'enrichissement de la langue française, FranceTerme
source: révision de l'arrêté du 29 avril 1992
abbreviation: GDM
date parution JO: 2000-09-22
equivalent EN: mask pattern generator @en
equivalent EN: mask pattern generator (en)
definition: Équipement qui permet d'exposer une résine photosensible sur une plaque de verre afin de réaliser des masques.
in scheme: Électronique
in scheme: concept-SD-electronique-composants-electroniques
in scheme: concepts
notation: INFO134
related: masque

génération de séquences de test
type: ConceptConcept
type: Concept
creator: Commission d'enrichissement de la langue française, FranceTerme
source: révision de l'arrêté du 29 avril 1992
abbreviation: GST
abbreviation: TPG @en
date parution JO: 2000-09-22
equivalent EN: TPG @en
equivalent EN: TPG (en)
equivalent EN: test pattern generation @en
equivalent EN: test pattern generation (en)
definition: Opération automatisée qui consiste à créer les séquences de tests permettant de vérifier le bon fonctionnement d'un circuit.
in scheme: Électronique
in scheme: concept-SD-electronique-composants-electroniques
in scheme: concepts
notation: INFO135
note: En général, les générateurs de séquences de test vérifient que chacun des nœuds du circuit sera observable en vue de mettre au point une séquence de tests dont le cheminement à travers le circuit active tous ses nœuds et permet de propager les fautes jusqu'aux broches de sortie du composant.
related: séquence de test
related: vecteur de test

génie informatique
type: ConceptConcept
type: Concept
creator: Commission d'enrichissement de la langue française, FranceTerme
source: révision de l'arrêté du 22 décembre 1981
date parution JO: 2000-09-22
equivalent EN: computer engineering @en
equivalent EN: computer engineering (en)
definition: Conception, réalisation et validation des systèmes informatiques.
in scheme: Informatique
in scheme: concepts
notation: INFO136

génie logiciel
type: ConceptConcept
type: Concept
creator: Commission d'enrichissement de la langue française, FranceTerme
source: révision de l'arrêté du 30 novembre 1983
date parution JO: 2000-09-22
equivalent EN: software engineering @en
equivalent EN: software engineering (en)
definition: Application systématique des connaissances, des méthodes et des acquis scientifiques et techniques pour la conception, le développement, le test et la documentation de logiciels, afin d'en rationaliser la production, le suivi et la qualité.
in scheme: Informatique
in scheme: concepts
notation: INFO137

grapheur
type: ConceptConcept
type: Concept
creator: Commission d'enrichissement de la langue française, FranceTerme
source: révision de l'arrêté du 30 mars 1987
date parution JO: 2000-09-22
equivalent EN: graphics software @en
equivalent EN: graphics software (en)
part of speech: nom masculin
definition: Logiciel qui permet de représenter des données sous forme de graphiques.
in scheme: Informatique
in scheme: concepts
notation: INFO138
related: tableur

gravure
type: ConceptConcept
type: Concept
creator: Commission d'enrichissement de la langue française, FranceTerme
source: révision de l'arrêté du 29 avril 1992
date parution JO: 2000-09-22
equivalent EN: etching @en
equivalent EN: etching (en)
part of speech: nom féminin
definition: Opération qui consiste à enlever, selon un dessin donné, une couche de matériau sur un substrat.
in scheme: Électronique
in scheme: concept-SD-electronique-composants-electroniques
in scheme: concepts
notation: INFO139
note: La gravure peut être faite par voie chimique (« gravure humide », en anglais : wet etching), électronique (« gravure sèche », en anglais : dry etching), ou électrochimique.

heuristique
type: ConceptConcept
type: Concept
creator: Commission d'enrichissement de la langue française, FranceTerme
source: révision de l'arrêté du 27 juin 1989
date parution JO: 2000-09-22
equivalent EN: heuristics @en
equivalent EN: heuristics (en)
part of speech: nom féminin
definition: Méthode de résolution de problèmes non fondée sur un modèle formel et qui n'aboutit pas nécessairement à une solution.
in scheme: Informatique
in scheme: concepts
notation: INFO140

hydrorésistant
type: ConceptConcept
type: Concept
creator: Commission d'enrichissement de la langue française, FranceTerme
source: révision de l'arrêté du 14 septembre 1990
date parution JO: 2000-09-22
equivalent EN: water resistant @en
equivalent EN: water resistant (en)
part of speech: adjectif
definition: Caractérise un composant ou un élément dont les propriétés en présence d'eau ne s'altèrent que progressivement et selon des conditions déterminées.
in scheme: Électronique
in scheme: concept-SD-electronique-composants-electroniques
in scheme: concepts
notation: INFO141

implanter
type: ConceptConcept
type: Concept
creator: Commission d'enrichissement de la langue française, FranceTerme
source: révision de l'arrêté du 27 juin 1989
date parution JO: 2000-09-22
deconseille ou frequent: to implement
equivalent EN: implement @en
equivalent EN: implement (en)
part of speech: verbe transitif
definition: Installer un logiciel ou un sous-système donné en réalisant les adaptations nécessaires à leur fonctionnement dans un environnement défini.
in scheme: Informatique
in scheme: concepts
notation: INFO142
related: implémenter

interactif, -ive
type: ConceptConcept
type: Concept
creator: Commission d'enrichissement de la langue française, FranceTerme
source: révision de l'arrêté du 22 décembre 1981
date parution JO: 2000-09-22
equivalent EN: interactive @en
equivalent EN: interactive (en)
part of speech: adjectif
definition: Qualifie les matériels, les programmes ou les conditions d'exploitation qui permettent des actions réciproques avec des utilisateurs ou avec des appareils.
definition: Refers to the materials, programmes or operating conditions that allow reciprocal actions with users or devices. @en
in scheme: Informatique
in scheme: concepts
notation: INFO143

invite
type: ConceptConcept
type: Concept
creator: Commission d'enrichissement de la langue française, FranceTerme
source: révision de l'arrêté du 30 mars 1987
date parution JO: 2000-09-22
equivalent EN: prompt @en
equivalent EN: prompt (en)
part of speech: nom féminin
definition: Message visuel ou sonore sollicitant, conformément à une disposition programmée, l'avis ou l'action de l'opérateur.
in scheme: Informatique
in scheme: concepts
notation: INFO144

langage à objets
type: ConceptConcept
type: Concept
creator: Commission d'enrichissement de la langue française, FranceTerme
source: révision de l'arrêté du 19 février 1993
date parution JO: 2000-09-22
deconseille ou frequent: langage orienté objets
deconseille ou frequent: objet
equivalent EN: object-oriented language @en
equivalent EN: object-oriented language (en)
definition: Langage adapté à la programmation par objets.
in scheme: Informatique
in scheme: concepts
notation: INFO145
note: 1. On entend par « objet » une entité constituée d'un ensemble d'informations et de lois de comportement.
note: 2. Le terme « langage orienté objets » est déconseillé.
related: programmation par objets

ligne (en)
type: ConceptConcept
type: Concept
creator: Commission d'enrichissement de la langue française, FranceTerme
source: révision de l'arrêté du 22 décembre 1981
date parution JO: 2000-09-22
deconseille ou frequent: en ligne
equivalent EN: on line @en
equivalent EN: on line (en)
equivalent EN: on-line @en
equivalent EN: on-line (en)
equivalent EN: online @en
equivalent EN: online (en)
part of speech: locution adjectivale
definition: Se dit d'un matériel lorsqu'il fonctionne en relation directe avec un autre.
in scheme: Informatique
in scheme: concepts
notation: INFO146
related: autonome

listage
type: ConceptConcept
type: Concept
creator: Commission d'enrichissement de la langue française, FranceTerme
source: révision de l'arrêté du 22 décembre 1981
date parution JO: 2000-09-22
equivalent EN: listing @en
equivalent EN: listing (en)
part of speech: nom masculin
definition: Action de lister.
in scheme: Informatique
in scheme: concepts
notation: INFO147
related: lister
related: listage

liste d'interconnexions
type: ConceptConcept
type: Concept
creator: Commission d'enrichissement de la langue française, FranceTerme
source: révision de l'arrêté du 29 avril 1992
date parution JO: 2000-09-22
equivalent EN: netlist @en
equivalent EN: netlist (en)
definition: Énumération des connexions entre les différents composants ou blocs fonctionnels d'un circuit.
in scheme: Électronique
in scheme: concept-SD-electronique-composants-electroniques
in scheme: concepts
notation: INFO148

lister
type: ConceptConcept
type: Concept
creator: Commission d'enrichissement de la langue française, FranceTerme
source: révision de l'arrêté du 22 décembre 1981
date parution JO: 2000-09-22
deconseille ou frequent: to list
equivalent EN: list @en
equivalent EN: list (en)
part of speech: verbe
definition: Produire un document en continu à l'aide d'une imprimante d'ordinateur.
in scheme: Informatique
in scheme: concepts
notation: INFO149
related: lister
related: listage

grappe
type: ConceptConcept
type: Concept
creator: Commission d'enrichissement de la langue française, FranceTerme
date parution JO: 1998-10-10
equivalent EN: cluster @en
equivalent EN: cluster (en)
part of speech: nom masculin
definition: Ensemble d'appareils de même type (terminaux, ordinateurs, etc.) rattachés à une même unité de contrôle.
in scheme: Informatique
in scheme: concepts
notation: INFO15

logiciel
type: ConceptConcept
type: Concept
creator: Commission d'enrichissement de la langue française, FranceTerme
source: révision de l'arrêté du 22 décembre 1981
date parution JO: 2000-09-22
equivalent EN: software @en
equivalent EN: software (en)
part of speech: nom masculin
definition: Ensemble des programmes, procédés et règles, et éventuellement de la documentation, relatifs au fonctionnement d'un ensemble de traitement de données.
definition: Set of programmes, procedures and rules, and possibly documents, related to the functionning of a set of data processing. @en
in scheme: Informatique
in scheme: concepts
notation: INFO150

logiciel à contribution
type: ConceptConcept
type: Concept
creator: Commission d'enrichissement de la langue française, FranceTerme
source: révision de l'arrêté du 19 février 1993
date parution JO: 2000-09-22
equivalent EN: shareware @en
equivalent EN: shareware (en)
definition: Logiciel mis à la disposition du public par son auteur, moyennant le versement d'une contribution en cas d'utilisation effective.
in scheme: Informatique
in scheme: concepts
notation: INFO151

logiciel de groupe de travail
type: ConceptConcept
type: Concept
creator: Commission d'enrichissement de la langue française, FranceTerme
source: révision de l'arrêté du 19 février 1993
date parution JO: 2000-09-22
equivalent EN: groupware @en
equivalent EN: groupware (en)
forme abregee: logiciel de groupe
definition: Logiciel permettant à un groupe d'utilisateurs de travailler en collaboration sur un même projet sans être nécessairement réunis.
in scheme: Informatique
in scheme: concepts
notation: INFO152

logiciel de vérification de schéma
type: ConceptConcept
type: Concept
creator: Commission d'enrichissement de la langue française, FranceTerme
source: révision de l'arrêté du 29 avril 1992
abbreviation: LVS
date parution JO: 2000-09-22
equivalent EN: LVS @en
equivalent EN: LVS (en)
equivalent EN: layout versus schematic @en
equivalent EN: layout versus schematic (en)
definition: Logiciel permettant de comparer la topologie d'un circuit par rapport au schéma d'origine et de vérifier la continuité électrique.
in scheme: Électronique
in scheme: concept-SD-electronique-composants-electroniques
in scheme: concepts
notation: INFO153

macrocellule
type: ConceptConcept
type: Concept
creator: Commission d'enrichissement de la langue française, FranceTerme
source: révision de l'arrêté du 29 avril 1992
date parution JO: 2000-09-22
equivalent EN: megacell @en
equivalent EN: megacell (en)
part of speech: nom féminin
definition: Cellule regroupant tous les éléments d'une fonction complexe spécifique, tels que mémoire ou microprocesseur.
in scheme: Électronique
in scheme: concept-SD-electronique-composants-electroniques
in scheme: concepts
notation: INFO154

macroordinateur
type: ConceptConcept
type: Concept
creator: Commission d'enrichissement de la langue française, FranceTerme
source: révision de l'arrêté du 19 février 1993
date parution JO: 2000-09-22
equivalent EN: mainframe @en
equivalent EN: mainframe (en)
part of speech: nom masculin
definition: Ordinateur central de grande puissance possédant des mémoires de taille importante, et apte à exécuter des opérations mettant en œuvre de nombreux périphériques.
in scheme: Informatique
in scheme: concepts
notation: INFO155
note: Le terme « macroordinateur » recouvre notamment des notions telles que celles de grand système, gros ordinateur, grand serveur, ordinateur hôte, système central, etc.

manche à balai
type: ConceptConcept
type: Concept
creator: Commission d'enrichissement de la langue française, FranceTerme
source: révision de l'arrêté du 30 novembre 1983
date parution JO: 2000-09-22
deconseille ou frequent: poignée
equivalent EN: joystick @en
equivalent EN: joystick (en)
forme abregee: manche, n.m.
definition: Dispositif de commande à plusieurs degrés de liberté servant à déplacer le curseur d'un écran de visualisation.
in scheme: Informatique
in scheme: concepts
notation: INFO156
note: On trouve aussi, dans une acception voisine, le terme « poignée ».

maquette
type: ConceptConcept
type: Concept
creator: Commission d'enrichissement de la langue française, FranceTerme
source: révision de l'arrêté du 14 septembre 1990
date parution JO: 2000-09-22
equivalent EN: breadboard @en
equivalent EN: breadboard (en)
part of speech: nom féminin
definition: Réalisation sous forme de montage expérimental d'un circuit électronique destiné à l'intégration.
in scheme: Électronique
in scheme: concept-SD-electronique-composants-electroniques
in scheme: concepts
notation: INFO157

marquage
type: ConceptConcept
type: Concept
creator: Commission d'enrichissement de la langue française, FranceTerme
source: révision de l'arrêté du 30 mars 1987
date parution JO: 2000-09-22
equivalent EN: highlighting @en
equivalent EN: highlighting (en)
part of speech: nom masculin
definition: Action de faire ressortir un élément graphique ou une partie de texte par modification de ses attributs visuels.
in scheme: Informatique
in scheme: concepts
notation: INFO158
related: surbrillance

masque
type: ConceptConcept
type: Concept
creator: Commission d'enrichissement de la langue française, FranceTerme
source: révision de l'arrêté du 29 avril 1992
date parution JO: 2000-09-22
equivalent EN: mask @en
equivalent EN: mask (en)
part of speech: nom masculin
definition: Plaque de verre ou de métal permettant d'imprimer un motif sur un substrat.
in scheme: Électronique
in scheme: concept-SD-electronique-composants-electroniques
in scheme: concepts
notation: INFO159
note: Le masque de verre permet d'insoler un matériau photosensible avant une phase de gravure. Le masque de métal permet de déposer un métal par évaporation.
related: générateur de dessin de masques
related: substrat

groupe
type: ConceptConcept
type: Concept
creator: Commission d'enrichissement de la langue française, FranceTerme
date parution JO: 1998-10-10
equivalent EN: cluster @en
equivalent EN: cluster (en)
part of speech: nom masculin
definition: Ensemble des secteurs constituant une zone logique sur un disque.
in scheme: Informatique
in scheme: concepts
notation: INFO16

matériel
type: ConceptConcept
type: Concept
creator: Commission d'enrichissement de la langue française, FranceTerme
source: révision de l'arrêté du 22 décembre 1981
date parution JO: 2000-09-22
equivalent EN: hardware @en
equivalent EN: hardware (en)
part of speech: nom masculin
definition: Ensemble des éléments physiques employés pour le traitement de données.
in scheme: Informatique
in scheme: concepts
notation: INFO160

mémoire
type: ConceptConcept
type: Concept
creator: Commission d'enrichissement de la langue française, FranceTerme
source: révision de l'arrêté du 22 décembre 1981
date parution JO: 2000-09-22
equivalent EN: storage memory @en
equivalent EN: storage memory (en)
part of speech: nom féminin
definition: Dispositif qui permet d'enregistrer, de conserver et de restituer des données.
in scheme: Informatique
in scheme: concepts
notation: INFO161

mémoire morte
type: ConceptConcept
type: Concept
creator: Commission d'enrichissement de la langue française, FranceTerme
source: révision de l'arrêté du 22 décembre 1981
abbreviation: ROM @en
date parution JO: 2000-09-22
equivalent EN: ROM @en
equivalent EN: ROM (en)
equivalent EN: read-only memory @en
equivalent EN: read-only memory (en)
definition: Mémoire dont le contenu ne peut être modifié en usage normal.
in scheme: Informatique
in scheme: concepts
notation: INFO163
related: mémoire flash

mémoire tampon
type: ConceptConcept
type: Concept
creator: Commission d'enrichissement de la langue française, FranceTerme
source: révision de l'arrêté du 30 novembre 1983
date parution JO: 2000-09-22
equivalent EN: buffer @en
equivalent EN: buffer (en)
forme abregee: tampon, n.m.
definition: Mémoire ou partie de mémoire permettant le stockage temporaire de données entre deux organes ayant des caractéristiques différentes.
in scheme: Informatique
in scheme: concepts
notation: INFO164

mémoire vive
type: ConceptConcept
type: Concept
creator: Commission d'enrichissement de la langue française, FranceTerme
source: révision de l'arrêté du 22 décembre 1981
abbreviation: RAM @en
date parution JO: 2000-09-22
equivalent EN: RAM @en
equivalent EN: RAM (en)
equivalent EN: random-access memory @en
equivalent EN: random-access memory (en)
definition: Mémoire dont le contenu peut être modifié en usage normal.
in scheme: Informatique
in scheme: concepts
notation: INFO165
related: mémoire vive magnétique
related: mémoire flash

mer de portes
type: ConceptConcept
type: Concept
creator: Commission d'enrichissement de la langue française, FranceTerme
source: révision de l'arrêté du 29 avril 1992
date parution JO: 2000-09-22
deconseille ou frequent: océan de portes
equivalent EN: sea of gates @en
equivalent EN: sea of gates (en)
alternative label: mer de silicium
definition: Réseau prédiffusé dans lequel les portes élémentaires sont réparties sur toute la surface de la puce sans utilisation de canaux de routage spécifiques.
in scheme: Électronique
in scheme: concept-SD-electronique-composants-electroniques
in scheme: concepts
notation: INFO166
note: On trouve également dans l'usage le terme « océan de portes ».
related: porte
related: réseau prédiffusé

métallisation
type: ConceptConcept
type: Concept
creator: Commission d'enrichissement de la langue française, FranceTerme
source: révision de l'arrêté du 29 avril 1992
date parution JO: 2000-09-22
deconseille ou frequent: metallisation
deconseille ou frequent: metallization
equivalent EN: metallisation (GB) @en
equivalent EN: metallisation (en-GB)
equivalent EN: metallization (US) @en
equivalent EN: metallization (en-US)
part of speech: nom féminin
definition: Opération qui consiste à déposer une couche métallique sur une tranche de semiconducteur afin de réaliser des interconnexions.
in scheme: Électronique
in scheme: concept-SD-electronique-composants-electroniques
in scheme: concepts
notation: INFO167
related: réseau prédiffusé

microordinateur
type: ConceptConcept
type: Concept
creator: Commission d'enrichissement de la langue française, FranceTerme
source: révision de l'arrêté du 19 février 1993
date parution JO: 2000-09-22
equivalent EN: microcomputer @en
equivalent EN: microcomputer (en)
part of speech: nom masculin
definition: Ordinateur de dimension réduite dont l'unité centrale est constituée d'un ou plusieurs microprocesseurs.
in scheme: Informatique
in scheme: concepts
notation: INFO168
related: microprocesseur

mise à niveau
type: ConceptConcept
type: Concept
creator: Commission d'enrichissement de la langue française, FranceTerme
source: révision de l'arrêté du 19 février 1993
date parution JO: 2000-09-22
equivalent EN: upgrade @en
equivalent EN: upgrade (en)
definition: Actualisation d'un logiciel ou d'un matériel.
in scheme: Informatique
in scheme: concepts
notation: INFO169

icône
type: ConceptConcept
type: Concept
creator: Commission d'enrichissement de la langue française, FranceTerme
date parution JO: 1998-10-10
equivalent EN: icon @en
equivalent EN: icon (en)
part of speech: nom féminin
definition: Sur un écran, symbole graphique qui représente une fonction ou une application logicielle particulière que l'on peut sélectionner et activer au moyen d'un dispositif tel qu'une souris.
in scheme: Informatique
in scheme: concepts
notation: INFO17
note: « Icone », n.m., ne doit pas être utilisé.

mise en boîtier
type: ConceptConcept
type: Concept
creator: Commission d'enrichissement de la langue française, FranceTerme
source: révision de l'arrêté du 29 avril 1992
date parution JO: 2000-09-22
equivalent EN: encapsulation @en
equivalent EN: encapsulation (en)
equivalent EN: packaging @en
equivalent EN: packaging (en)
alternative label: encapsulation
definition: Opération qui consiste à enfermer une ou plusieurs puces dans un boîtier.
in scheme: Électronique
in scheme: concept-SD-electronique-composants-electroniques
in scheme: concepts
notation: INFO170
related: boîtier à puce
related: encapsulation sur tranche

mode dialogué
type: ConceptConcept
type: Concept
creator: Commission d'enrichissement de la langue française, FranceTerme
source: révision de l'arrêté du 22 décembre 1981
date parution JO: 2000-09-22
equivalent EN: conversational mode @en
equivalent EN: conversational mode (en)
alternative label: mode interactif
definition: Mode de traitement de données permettant un échange entre un système informatique et un utilisateur.
in scheme: Informatique
in scheme: concepts
notation: INFO171

moteur d'inférence
type: ConceptConcept
type: Concept
creator: Commission d'enrichissement de la langue française, FranceTerme
source: révision de l'arrêté du 27 juin 1989
date parution JO: 2000-09-22
equivalent EN: inference engine @en
equivalent EN: inference engine (en)
definition: Partie d'un système expert qui effectue la sélection et l'application des règles en vue de la résolution d'un problème donné.
in scheme: Informatique
in scheme: concepts
notation: INFO172
related: système expert
related: concept-INFO949

multitraitement
type: ConceptConcept
type: Concept
creator: Commission d'enrichissement de la langue française, FranceTerme
source: révision de l'arrêté du 22 décembre 1981
date parution JO: 2000-09-22
equivalent EN: multiprocessing @en
equivalent EN: multiprocessing (en)
part of speech: nom masculin
definition: Mode de fonctionnement d'un ordinateur selon lequel plusieurs processeurs ayant accès à des mémoires communes peuvent opérer en parallèle sur des programmes différents.
in scheme: Informatique
in scheme: concepts
notation: INFO173
related: multitâche

numérique
type: ConceptConcept
type: Concept
creator: Commission d'enrichissement de la langue française, FranceTerme
source: révision de l'arrêté du 22 décembre 1981
date parution JO: 2000-09-22
deconseille ou frequent: analogique
equivalent EN: digital @en
equivalent EN: digital (en)
equivalent EN: numeric @en
equivalent EN: numeric (en)
equivalent EN: numerical @en
equivalent EN: numerical (en)
part of speech: adjectif
definition: It refers, as opposed to "analog", to the discrete representation of data or physical quantities by means of characters (often numbers); it also refers to the systems, devices or processes using this means of representation. @en
definition: Se dit, par opposition à « analogique », de la représentation discrète de données ou de grandeurs physiques au moyen de caractères (des chiffres généralement) ; se dit aussi des systèmes, dispositifs ou procédés employant ce mode de représentation.
in scheme: Informatique
in scheme: concepts
notation: INFO174
note: En français, l'adjectif « digital » signifie « relatif aux doigts » et ne doit pas être utilisé dans le sens de « numérique ».
preferred label: digital @en
related: concept-INFO964
related: concept-TELE84
related: concept-transformation-numerique

numériser
type: ConceptConcept
type: Concept
creator: Commission d'enrichissement de la langue française, FranceTerme
source: révision de l'arrêté du 30 mars 1987
date parution JO: 2000-09-22
deconseille ou frequent: to digitize
equivalent EN: digitize @en
equivalent EN: digitize (en)
part of speech: verbe
definition: Représenter un signal (caractère, image, impulsion, etc.) sous forme numérique.
in scheme: Informatique
in scheme: concepts
notation: INFO175
note: Termes dérivés : numérisation, numériseur.
related: numériseur

numéro d'urgence
type: ConceptConcept
type: Concept
creator: Commission d'enrichissement de la langue française, FranceTerme
source: révision de l'arrêté du 19 février 1993
date parution JO: 2000-09-22
equivalent EN: hot line @en
equivalent EN: hot line (en)
equivalent EN: hotline @en
equivalent EN: hotline (en)
definition: Numéro d'appel qui permet le recours immédiat à un service d'assistance spécialisée.
in scheme: Informatique
in scheme: Télécommunications
in scheme: concepts
notation: INFO176
related: centre d'assistance

ordinateur
type: ConceptConcept
type: Concept
creator: Commission d'enrichissement de la langue française, FranceTerme
source: révision de l'arrêté du 30 novembre 1983
date parution JO: 2000-09-22
equivalent EN: computer @en
equivalent EN: computer (en)
part of speech: nom masculin
broader: concept-technologies-de-l'information-et-de-la-communication
definition: Équipement informatique de traitement automatique de données comprenant les organes nécessaires à son fonctionnement autonome.
in scheme: Informatique
in scheme: concepts
notation: INFO177
related: tablette
related: concept-interface-homme-machine
related: concept-interface-utilisateur

panne
type: ConceptConcept
type: Concept
creator: Commission d'enrichissement de la langue française, FranceTerme
source: révision de l'arrêté du 19 février 1993
date parution JO: 2000-09-22
equivalent EN: fault @en
equivalent EN: fault (en)
part of speech: nom féminin
definition: État anormal d'une unité fonctionnelle la mettant dans l'impossibilité d'accomplir une fonction requise.
in scheme: Informatique
in scheme: concepts
notation: INFO178
note: Le terme anglais fault désigne aussi une anomalie, condition anormale diminuant ou supprimant l'aptitude d'une entité fonctionnelle à accomplir une fonction requise.

pastillage
type: ConceptConcept
type: Concept
creator: Commission d'enrichissement de la langue française, FranceTerme
source: révision de l'arrêté du 14 septembre 1990
abbreviation: COB process @en
date parution JO: 2000-09-22
equivalent EN: COB process @en
equivalent EN: COB process (en)
equivalent EN: chip-on-board process @en
equivalent EN: chip-on-board process (en)
part of speech: nom masculin
definition: Procédé de montage et d'interconnexion d'une puce sur un circuit imprimé.
in scheme: Électronique
in scheme: concept-SD-electronique-composants-electroniques
in scheme: concepts
notation: INFO179

logement
type: ConceptConcept
type: Concept
creator: Commission d'enrichissement de la langue française, FranceTerme
date parution JO: 1998-10-10
equivalent EN: slot @en
equivalent EN: slot (en)
part of speech: nom masculin
definition: Emplacement muni d'un connecteur qui permet l'insertion d'un élément électronique amovible dans un ordinateur.
in scheme: Informatique
in scheme: concepts
notation: INFO18

pilote de périphérique
type: ConceptConcept
type: Concept
creator: Commission d'enrichissement de la langue française, FranceTerme
source: révision de l'arrêté du 19 février 1993
date parution JO: 2000-09-22
equivalent EN: driver @en
equivalent EN: driver (en)
definition: Programme de gestion des échanges avec un périphérique.
in scheme: Informatique
in scheme: concepts
notation: INFO180

placement
type: ConceptConcept
type: Concept
creator: Commission d'enrichissement de la langue française, FranceTerme
source: révision de l'arrêté du 29 avril 1992
date parution JO: 2000-09-22
equivalent EN: placement @en
equivalent EN: placement (en)
part of speech: nom masculin
definition: Opération de la phase d'étude qui consiste à définir l'emplacement de chaque élément d'un circuit.
in scheme: Électronique
in scheme: concept-SD-electronique-composants-electroniques
in scheme: concepts
notation: INFO182

plan de masse
type: ConceptConcept
type: Concept
creator: Commission d'enrichissement de la langue française, FranceTerme
source: révision de l'arrêté du 29 avril 1992
date parution JO: 2000-09-22
equivalent EN: floorplan @en
equivalent EN: floorplan (en)
definition: Représentation de l'implantation physique des blocs fonctionnels constituant un circuit.
in scheme: Électronique
in scheme: concept-SD-electronique-composants-electroniques
in scheme: concepts
notation: INFO183

plot de contact
type: ConceptConcept
type: Concept
creator: Commission d'enrichissement de la langue française, FranceTerme
source: révision de l'arrêté du 14 septembre 1990
date parution JO: 2000-09-22
equivalent EN: bump contact @en
equivalent EN: bump contact (en)
forme abregee: plot, n.m.
definition: Contact en relief à la surface d'une puce, utilisé pour établir une liaison électrique avec des circuits extérieurs.
in scheme: Électronique
in scheme: concepts
notation: INFO184

pointeur
type: ConceptConcept
type: Concept
creator: Commission d'enrichissement de la langue française, FranceTerme
source: révision de l'arrêté du 30 novembre 1983
date parution JO: 2000-09-22
equivalent EN: pointer @en
equivalent EN: pointer (en)
part of speech: nom masculin
definition: Donnée permettant de retrouver l'adresse d'un groupe de données.
in scheme: Informatique
in scheme: concepts
notation: INFO185

ponteuse
type: ConceptConcept
type: Concept
creator: Commission d'enrichissement de la langue française, FranceTerme
source: révision de l'arrêté du 14 septembre 1990
date parution JO: 2000-09-22
equivalent EN: wire bonder @en
equivalent EN: wire bonder (en)
part of speech: nom féminin
alternative label: microsoudeuse de fils
definition: Machine de soudage de fils d'interconnexion entre puces et substrat ou entre puces.
in scheme: Électronique
in scheme: concept-SD-electronique-composants-electroniques
in scheme: concepts
notation: INFO186
related: microsoudeuse de puces

porte
type: ConceptConcept
type: Concept
creator: Commission d'enrichissement de la langue française, FranceTerme
source: révision de l'arrêté du 29 avril 1992
date parution JO: 2000-09-22
equivalent EN: gate @en
equivalent EN: gate (en)
part of speech: nom féminin
definition: Unité de base d'une fonction logique combinatoire.
in scheme: Électronique
in scheme: concept-SD-electronique-composants-electroniques
in scheme: concepts
notation: INFO187
related: mer de portes
related: réseau logique programmable

processeur
type: ConceptConcept
type: Concept
creator: Commission d'enrichissement de la langue française, FranceTerme
source: révision de l'arrêté du 22 décembre 1981
date parution JO: 2000-09-22
equivalent EN: processor @en
equivalent EN: processor (en)
part of speech: nom masculin
definition: Organe destiné, dans un ordinateur ou dans une autre machine, à interpréter et à exécuter des instructions ; par extension, ensemble de programmes permettant d'exécuter sur un ordinateur des programmes écrits dans un certain langage.
in scheme: Informatique
in scheme: concepts
notation: INFO188
related: coprocesseur
related: processeur vectoriel
related: multiprocesseur
related: microprocesseur

processeur vectoriel
type: ConceptConcept
type: Concept
creator: Commission d'enrichissement de la langue française, FranceTerme
source: révision de l'arrêté du 30 mars 1987
date parution JO: 2000-09-22
equivalent EN: array processor @en
equivalent EN: array processor (en)
definition: Processeur conçu pour appliquer simultanément le même traitement à des éléments homologues de tableaux de données.
in scheme: Informatique
in scheme: concepts
notation: INFO189
related: processeur

moteur d'exécution
type: ConceptConcept
type: Concept
creator: Commission d'enrichissement de la langue française, FranceTerme
date parution JO: 1998-10-10
equivalent EN: runtime software @en
equivalent EN: runtime software (en)
definition: Sous-ensemble dérivé d'un logiciel et limité à l'exécution de certaines applications, elles-mêmes développées avec le logiciel complet.
in scheme: Informatique
in scheme: concepts
notation: INFO19

progiciel
type: ConceptConcept
type: Concept
creator: Commission d'enrichissement de la langue française, FranceTerme
source: révision de l'arrêté du 22 décembre 1981
date parution JO: 2000-09-22
equivalent EN: package @en
equivalent EN: package (en)
part of speech: nom masculin
definition: Ensemble complet et documenté de programmes conçu pour être fourni à plusieurs utilisateurs, en vue d'une même application ou d'une même fonction.
in scheme: Informatique
in scheme: concepts
notation: INFO190

programmation par objets
type: ConceptConcept
type: Concept
creator: Commission d'enrichissement de la langue française, FranceTerme
source: révision de l'arrêté du 19 février 1993
date parution JO: 2000-09-22
deconseille ou frequent: objet
equivalent EN: object-oriented programming @en
equivalent EN: object-oriented programming (en)
definition: Mode de programmation dans lequel les données et les procédures qui s'appliquent sont regroupées en entités appelées « objets ».
in scheme: Informatique
in scheme: concepts
notation: INFO191
note: On entend par « objet » une entité constituée d'un ensemble d'informations et de lois de comportement.
related: langage à objets

puce
type: ConceptConcept
type: Concept
creator: Commission d'enrichissement de la langue française, FranceTerme
source: révision de l'arrêté du 14 septembre 1990
date parution JO: 2000-09-22
equivalent EN: chip @en
equivalent EN: chip (en)
equivalent EN: die @en
equivalent EN: die (en)
part of speech: nom féminin
alternative label: microplaquette
definition: Composant électronique monolithique non encapsulé.
in scheme: Électronique
in scheme: concept-SD-electronique-composants-electroniques
in scheme: concepts
notation: INFO192
note: Le terme « microplaquette » est également utilisé comme synonyme de « puce ».
related: puce-système

relancer
type: ConceptConcept
type: Concept
creator: Commission d'enrichissement de la langue française, FranceTerme
source: révision de l'arrêté du 30 novembre 1983
date parution JO: 2000-09-22
deconseille ou frequent: to restart
equivalent EN: restart @en
equivalent EN: restart (en)
part of speech: verbe
definition: Remettre en marche un système informatique après retour à un état de référence.
in scheme: Informatique
in scheme: concepts
notation: INFO193

répertoire
type: ConceptConcept
type: Concept
creator: Commission d'enrichissement de la langue française, FranceTerme
source: révision de l'arrêté du 30 mars 1987
date parution JO: 2000-09-22
equivalent EN: directory @en
equivalent EN: directory (en)
part of speech: nom masculin
definition: Liste d'identificateurs, classés selon des arguments appropriés, permettant l'accès aux informations qu'ils désignent.
in scheme: Informatique
in scheme: concepts
notation: INFO194

réseau
type: ConceptConcept
type: Concept
creator: Commission d'enrichissement de la langue française, FranceTerme
source: révision de l'arrêté du 14 septembre 1990
date parution JO: 2000-09-22
equivalent EN: array @en
equivalent EN: array (en)
part of speech: nom masculin
definition: Circuit intégré conçu à partir de microstructures élémentaires organisées le plus souvent en matrice.
in scheme: Électronique
in scheme: concept-SD-electronique-composants-electroniques
in scheme: concepts
notation: INFO195

réseau local
type: ConceptConcept
type: Concept
creator: Commission d'enrichissement de la langue française, FranceTerme
source: révision de l'arrêté du 30 mars 1987
abbreviation: LAN @en
date parution JO: 2000-09-22
equivalent EN: LAN @en
equivalent EN: LAN (en)
equivalent EN: local area network @en
equivalent EN: local area network (en)
definition: Ensemble connexe, à caractère privatif, de moyens de communication établi sur un site restreint, pourvu de règles de gestion du trafic et permettant des échanges internes d'informations de toute nature, notamment sous forme de données, sons, images, etc.
in scheme: Informatique
in scheme: concepts
notation: INFO196
note: Le réseau local, ainsi défini en informatique, ne doit pas être confondu avec la notion de réseau local de raccordement, utilisée dans les télécommunications.
related: concept-TELE376

réseau logique programmable
type: ConceptConcept
type: Concept
creator: Commission d'enrichissement de la langue française, FranceTerme
source: révision de l'arrêté du 29 avril 1992
abbreviation: PLA @en
abbreviation: PLD @en
date parution JO: 2000-09-22
equivalent EN: PLA @en
equivalent EN: PLA (en)
equivalent EN: PLD @en
equivalent EN: PLD (en)
equivalent EN: programmable logic array @en
equivalent EN: programmable logic array (en)
equivalent EN: programmable logic device @en
equivalent EN: programmable logic device (en)
definition: Réseau de portes aux connexions matérialisées par des points d'interconnexion pouvant être ouverts par fusion ou court-circuités par apport de métal.
in scheme: Électronique
in scheme: concept-SD-electronique-composants-electroniques
in scheme: concepts
notation: INFO197
related: porte

réseau prédiffusé
type: ConceptConcept
type: Concept
creator: Commission d'enrichissement de la langue française, FranceTerme
source: révision de l'arrêté du 29 avril 1992
date parution JO: 2000-09-22
deconseille ou frequent: réseau de portes
equivalent EN: gate array @en
equivalent EN: gate array (en)
definition: Réseau ou matrice de portes non interconnectées dont la fabrication a été arrêtée avant métallisation pour permettre la personnalisation du circuit.
in scheme: Électronique
in scheme: concept-SD-electronique-composants-electroniques
in scheme: concepts
notation: INFO198
note: Dans cette acception, on dit aussi « réseau de portes ».
related: mer de portes
related: métallisation

restaurer
type: ConceptConcept
type: Concept
creator: Commission d'enrichissement de la langue française, FranceTerme
source: révision de l'arrêté du 30 novembre 1983
date parution JO: 2000-09-22
deconseille ou frequent: to reset
deconseille ou frequent: to restore
equivalent EN: reset @en
equivalent EN: reset (en)
equivalent EN: restore @en
equivalent EN: restore (en)
part of speech: verbe transitif
definition: Remettre dans un état de référence un système informatique ou une application.
in scheme: Informatique
in scheme: concepts
notation: INFO199

multiprocesseur
type: ConceptConcept
type: Concept
creator: Commission d'enrichissement de la langue française, FranceTerme
date parution JO: 1998-10-10
equivalent EN: multiprocessor @en
equivalent EN: multiprocessor (en)
part of speech: nom masculin
definition: Ordinateur possédant plusieurs processeurs principaux.
in scheme: Informatique
in scheme: concepts
notation: INFO20
related: processeur

révision
type: ConceptConcept
type: Concept
creator: Commission d'enrichissement de la langue française, FranceTerme
source: révision de l'arrêté du 30 mars 1987
date parution JO: 2000-09-22
equivalent EN: release @en
equivalent EN: release (en)
part of speech: nom féminin
definition: Logiciel comportant des corrections par rapport à l'état précédent.
in scheme: Informatique
in scheme: concepts
notation: INFO200
related: version

robotique
type: ConceptConcept
type: Concept
creator: Commission d'enrichissement de la langue française, FranceTerme
source: révision de l'arrêté du 22 décembre 1981
date parution JO: 2000-09-22
equivalent EN: robotics @en
equivalent EN: robotics (en)
part of speech: nom féminin
definition: Ensemble des études et des techniques de conception et de mise en œuvre des robots effectuant des tâches déterminées en s'adaptant à leur environnement.
in scheme: Informatique
in scheme: concepts
notation: INFO201

routage
type: ConceptConcept
type: Concept
creator: Commission d'enrichissement de la langue française, FranceTerme
source: révision de l'arrêté du 29 avril 1992
date parution JO: 2000-09-22
equivalent EN: routing @en
equivalent EN: routing (en)
part of speech: nom masculin
definition: Opération qui consiste à définir les interconnexions entre les éléments d'un circuit au niveau de sa topologie.
in scheme: Électronique
in scheme: concept-SD-electronique-composants-electroniques
in scheme: concepts
notation: INFO202
related: topologie

routeur
type: ConceptConcept
type: Concept
creator: Commission d'enrichissement de la langue française, FranceTerme
source: révision de l'arrêté du 29 avril 1992
date parution JO: 2000-09-22
equivalent EN: router @en
equivalent EN: router (en)
part of speech: nom masculin
definition: Dispositif situé en un nœud d'un réseau de données qui détermine, pour chaque trame, paquet ou cellule, la route à suivre dans le réseau.
in scheme: Télécommunications
in scheme: concept-SD-telecommunications-reseaux
in scheme: concept-SD-telecommunications-services
in scheme: concepts
notation: INFO203
related: concept-TELE376
related: concept-TELE61

saisie de schéma
type: ConceptConcept
type: Concept
creator: Commission d'enrichissement de la langue française, FranceTerme
source: révision de l'arrêté du 29 avril 1992
date parution JO: 2000-09-22
equivalent EN: schematic capture @en
equivalent EN: schematic capture (en)
definition: Opération permettant de définir la fonction d'un circuit au moyen de représentations symboliques affichées à l'écran.
in scheme: Électronique
in scheme: concept-SD-electronique-composants-electroniques
in scheme: concepts
notation: INFO204

salle blanche
type: ConceptConcept
type: Concept
creator: Commission d'enrichissement de la langue française, FranceTerme
source: révision de l'arrêté du 14 septembre 1990
date parution JO: 2000-09-22
equivalent EN: clean room @en
equivalent EN: clean room (en)
alternative label: salle propre
definition: Salle conçue pour maintenir les taux de poussières et éventuellement d'autres agents contaminants, la température et l'hygrométrie à des niveaux spécifiés de façon à pouvoir y réaliser des opérations sensibles à ces facteurs.
in scheme: Électronique
in scheme: concept-SD-electronique-composants-electroniques
in scheme: concepts
notation: INFO205
related: concept-SPAT1636

secours (de)
type: ConceptConcept
type: Concept
creator: Commission d'enrichissement de la langue française, FranceTerme
source: révision de l'arrêté du 22 décembre 1981
date parution JO: 2000-09-22
deconseille ou frequent: de secours
deconseille ou frequent: secours
equivalent EN: back-up @en
equivalent EN: back-up (en)
equivalent EN: backup @en
equivalent EN: backup (en)
part of speech: locution adjectivale
definition: Qualifie les procédures et les matériels destinés à être utilisés dans certains cas d'anomalie de fonctionnement.
in scheme: Informatique
in scheme: concepts
notation: INFO206

secours informatique
type: ConceptConcept
type: Concept
creator: Commission d'enrichissement de la langue française, FranceTerme
source: révision de l'arrêté du 19 février 1993
date parution JO: 2000-09-22
equivalent EN: back-up @en
equivalent EN: back-up (en)
equivalent EN: backup @en
equivalent EN: backup (en)
definition: Ensemble des services permettant d'assurer la surveillance et la continuité des travaux des centres informatiques afin d'en prévenir ou d'en pallier les interruptions accidentelles.
in scheme: Informatique
in scheme: concepts
notation: INFO207

séquence de test
type: ConceptConcept
type: Concept
creator: Commission d'enrichissement de la langue française, FranceTerme
source: révision de l'arrêté du 29 avril 1992
date parution JO: 2000-09-22
deconseille ou frequent: pattern de test
equivalent EN: test pattern @en
equivalent EN: test pattern (en)
definition: Ensemble des vecteurs de test permettant de stimuler un circuit afin de tester son comportement fonctionnel.
in scheme: Électronique
in scheme: concept-SD-electronique-composants-electroniques
in scheme: concepts
notation: INFO208
note: Le terme « pattern de test » est à éviter en français.
related: génération de séquences de test
related: testeur

simulateur analogique
type: ConceptConcept
type: Concept
creator: Commission d'enrichissement de la langue française, FranceTerme
source: révision de l'arrêté du 29 avril 1992
date parution JO: 2000-09-22
deconseille ou frequent: analog simulator
deconseille ou frequent: analogue simulator
equivalent EN: analog simulator (US) @en
equivalent EN: analog simulator (en-US)
equivalent EN: analogue simulator (GB) @en
equivalent EN: analogue simulator (en-GB)
definition: Outil logiciel servant à simuler la fonction à partir de grandeurs d'entrées ou de sorties analogiques.
in scheme: Électronique
in scheme: concept-SD-electronique-composants-electroniques
in scheme: concepts
notation: INFO210

simulateur logique
type: ConceptConcept
type: Concept
creator: Commission d'enrichissement de la langue française, FranceTerme
source: révision de l'arrêté du 29 avril 1992
date parution JO: 2000-09-22
equivalent EN: logic simulator @en
equivalent EN: logic simulator (en)
definition: Outil logiciel permettant de connaître la réponse d'un circuit numérique à des signaux binaires.
in scheme: Électronique
in scheme: concept-SD-electronique-composants-electroniques
in scheme: concepts
notation: INFO211

société de conception
type: ConceptConcept
type: Concept
creator: Commission d'enrichissement de la langue française, FranceTerme
source: révision de l'arrêté du 29 avril 1992
date parution JO: 2000-09-22
equivalent EN: design house @en
equivalent EN: design house (en)
definition: Société spécialisée dont l'activité est celle d'un centre de conception.
in scheme: Électronique
in scheme: concept-SD-electronique-composants-electroniques
in scheme: concepts
notation: INFO212
related: concept-INFO97

souris
type: ConceptConcept
type: Concept
creator: Commission d'enrichissement de la langue française, FranceTerme
source: révision de l'arrêté du 30 mars 1987
date parution JO: 2000-09-22
equivalent EN: mouse @en
equivalent EN: mouse (en)
part of speech: nom féminin
definition: Dispositif de commande tenu à la main, connecté à un ordinateur, et dont le déplacement sur une surface entraîne le déplacement d'un repère sur l'écran.
in scheme: Informatique
in scheme: concepts
notation: INFO213
note: Ce dispositif comporte un ou plusieurs boutons-poussoirs qui permettent de déclencher des opérations en fonction de la position du repère.
related: boule de commande
related: concept-interface-homme-machine
related: concept-interface-utilisateur

substrat
type: ConceptConcept
type: Concept
creator: Commission d'enrichissement de la langue française, FranceTerme
source: révision de l'arrêté du 29 avril 1992
date parution JO: 2000-09-22
equivalent EN: substrate @en
equivalent EN: substrate (en)
part of speech: nom masculin
definition: Matériau sur lequel ou dans lequel sont fabriqués les éléments d'un dispositif ou d'un circuit électronique.
in scheme: Électronique
in scheme: concept-SD-electronique-composants-electroniques
in scheme: concepts
notation: INFO214
note: Un substrat peut être métallique, isolant ou semiconducteur.
related: masque
related: microsoudeuse de puces
related: module multipuce

surbrillance
type: ConceptConcept
type: Concept
creator: Commission d'enrichissement de la langue française, FranceTerme
source: révision de l'arrêté du 30 mars 1987
date parution JO: 2000-09-22
equivalent EN: brightening @en
equivalent EN: brightening (en)
part of speech: nom féminin
definition: Marquage par une luminosité plus grande.
in scheme: Informatique
in scheme: concepts
notation: INFO215
related: marquage

survol
type: ConceptConcept
type: Concept
creator: Commission d'enrichissement de la langue française, FranceTerme
source: révision de l'arrêté du 30 mars 1987
date parution JO: 2000-09-22
equivalent EN: browsing @en
equivalent EN: browsing (en)
part of speech: nom masculin
definition: Exploration rapide sur écran, sans possibilité de modification, du contenu d'une mémoire.
in scheme: Informatique
in scheme: concepts
notation: INFO216

système d'exploitation
type: ConceptConcept
type: Concept
creator: Commission d'enrichissement de la langue française, FranceTerme
source: révision de l'arrêté du 22 décembre 1981
date parution JO: 2000-09-22
equivalent EN: operating system @en
equivalent EN: operating system (en)
definition: Logiciel gérant un ordinateur, indépendant des programmes d'application mais indispensable à leur mise en œuvre.
in scheme: Informatique
in scheme: concepts
notation: INFO217

système de gestion de base de données
type: ConceptConcept
type: Concept
creator: Commission d'enrichissement de la langue française, FranceTerme
source: révision de l'arrêté du 30 novembre 1983
abbreviation: DBMS @en
abbreviation: SGBD
date parution JO: 2000-09-22
equivalent EN: DBMS @en
equivalent EN: DBMS (en)
equivalent EN: data base management system @en
equivalent EN: data base management system (en)
equivalent EN: database management system @en
equivalent EN: database management system (en)
definition: Pour une base de données, logiciel permettant d'introduire les données, de les mettre à jour et d'y accéder.
in scheme: Informatique
in scheme: concepts
notation: INFO218

système exclusif
type: ConceptConcept
type: Concept
creator: Commission d'enrichissement de la langue française, FranceTerme
source: révision de l'arrêté du 19 février 1993
date parution JO: 2000-09-22
deconseille ou frequent: système exclusif constructeur
deconseille ou frequent: système propriétaire
equivalent EN: proprietary system @en
equivalent EN: proprietary system (en)
definition: Système d'exploitation ou architecture conçu pour un matériel ou un ensemble de matériels d'un constructeur donné.
in scheme: Informatique
in scheme: concepts
notation: INFO219
note: 1. On trouve aussi, dans l'usage, le terme « système exclusif constructeur ».
note: 2. Le terme « système propriétaire » est déconseillé.

numériseur
type: ConceptConcept
type: Concept
creator: Commission d'enrichissement de la langue française, FranceTerme
date parution JO: 1998-10-10
equivalent EN: digitizer @en
equivalent EN: digitizer (en)
equivalent EN: scanner @en
equivalent EN: scanner (en)
part of speech: nom masculin
definition: Appareil permettant de transformer un signal analogique en un signal numérique.
in scheme: Informatique
in scheme: concepts
notation: INFO22
note: Un numériseur permet en particulier de transformer des pages de textes et des images en signaux numériques.
related: numériser
related: scanneur

système expert
type: ConceptConcept
type: Concept
creator: Commission d'enrichissement de la langue française, FranceTerme
source: révision de l'arrêté du 19 février 1993
date parution JO: 2000-09-22
equivalent EN: expert system @en
equivalent EN: expert system (en)
definition: Ensemble de logiciels exploitant dans un domaine particulier des connaissances explicites et organisées, pouvant se substituer à un expert humain.
in scheme: Informatique
in scheme: concepts
notation: INFO220
related: moteur d'inférence

tableur
type: ConceptConcept
type: Concept
creator: Commission d'enrichissement de la langue française, FranceTerme
source: révision de l'arrêté du 30 novembre 1983
date parution JO: 2000-09-22
equivalent EN: spreadsheet @en
equivalent EN: spreadsheet (en)
equivalent EN: spreadsheet programme @en
equivalent EN: spreadsheet programme (en)
equivalent EN: spreadsheet software @en
equivalent EN: spreadsheet software (en)
part of speech: nom masculin
definition: Logiciel de création et de manipulation interactives de tableaux numériques.
in scheme: Informatique
in scheme: concepts
notation: INFO221
related: grapheur

téléinformatique
type: ConceptConcept
type: Concept
creator: Commission d'enrichissement de la langue française, FranceTerme
source: révision de l'arrêté du 22 décembre 1981
date parution JO: 2000-09-22
equivalent EN: remote data processing @en
equivalent EN: remote data processing (en)
equivalent EN: telecomputing @en
equivalent EN: telecomputing (en)
equivalent EN: teleinformatics @en
equivalent EN: teleinformatics (en)
part of speech: nom féminin
definition: Exploitation automatisée de systèmes informatiques utilisant des réseaux de télécommunication.
in scheme: Informatique
in scheme: Télécommunications
in scheme: concepts
notation: INFO222

télémaintenance
type: ConceptConcept
type: Concept
creator: Commission d'enrichissement de la langue française, FranceTerme
source: révision de l'arrêté du 19 février 1993
date parution JO: 2000-09-22
equivalent EN: remote maintenance @en
equivalent EN: remote maintenance (en)
part of speech: nom féminin
definition: Maintenance d'une unité fonctionnelle, assurée par télécommunication directe entre cette unité et un centre spécialisé.
in scheme: Informatique
in scheme: concepts
notation: INFO223
related: concept-TELE559

télématique
type: ConceptConcept
type: Concept
creator: Commission d'enrichissement de la langue française, FranceTerme
source: révision de l'arrêté du 22 décembre 1981
date parution JO: 2000-09-22
equivalent EN: telematics @en
equivalent EN: telematics (en)
part of speech: nom féminin
definition: Ensemble des services de nature ou d'origine informatique pouvant être fournis à travers un réseau de télécommunication.
in scheme: Informatique
in scheme: concepts
notation: INFO224

télétraitement
type: ConceptConcept
type: Concept
creator: Commission d'enrichissement de la langue française, FranceTerme
source: révision de l'arrêté du 22 décembre 1981
date parution JO: 2000-09-22
equivalent EN: teleprocessing @en
equivalent EN: teleprocessing (en)
part of speech: nom masculin
definition: Mode de traitement selon lequel les données sont émises ou reçues par des terminaux éloignés de l'ordinateur.
in scheme: Informatique
in scheme: concepts
notation: INFO225
related: télétraitement par lots

télétraitement par lots
type: ConceptConcept
type: Concept
creator: Commission d'enrichissement de la langue française, FranceTerme
source: révision de l'arrêté du 22 décembre 1981
date parution JO: 2000-09-22
equivalent EN: remote batch teleprocessing @en
equivalent EN: remote batch teleprocessing (en)
definition: Télétraitement qui comporte un groupement par lots des programmes à exécuter ou des données à traiter.
in scheme: Informatique
in scheme: concepts
notation: INFO226
related: télétraitement

temps réel
type: ConceptConcept
type: Concept
creator: Commission d'enrichissement de la langue française, FranceTerme
source: révision de l'arrêté du 22 décembre 1981
date parution JO: 2000-09-22
equivalent EN: real time @en
equivalent EN: real time (en)
definition: Mode de traitement qui permet l'admission des données à un instant quelconque et l'obtention immédiate des résultats.
in scheme: Informatique
in scheme: concepts
notation: INFO227
related: concept-TELE557

terminal
type: ConceptConcept
type: Concept
creator: Commission d'enrichissement de la langue française, FranceTerme
source: révision de l'arrêté du 22 décembre 1981
date parution JO: 2000-09-22
equivalent EN: terminal @en
equivalent EN: terminal (en)
part of speech: nom masculin
definition: Appareil permettant l'accès à distance à un système informatique.
in scheme: Informatique
in scheme: concepts
notation: INFO228

test de performance
type: ConceptConcept
type: Concept
creator: Commission d'enrichissement de la langue française, FranceTerme
source: révision de l'arrêté du 30 novembre 1983
date parution JO: 2000-09-22
equivalent EN: benchmark @en
equivalent EN: benchmark (en)
definition: Évaluation des performances d'un système par simulation des conditions réelles d'utilisation, à l'aide de programmes-échantillons.
in scheme: Informatique
in scheme: concepts
notation: INFO229

octet
type: ConceptConcept
type: Concept
creator: Commission d'enrichissement de la langue française, FranceTerme
date parution JO: 1998-10-10
equivalent EN: byte @en
equivalent EN: byte (en)
part of speech: nom masculin
definition: Ensemble ordonné de huit éléments binaires traités comme un tout.
in scheme: Informatique
in scheme: concepts
notation: INFO23
note: 1. Un octet est souvent utilisé pour représenter un caractère alphanumérique.
note: 2. Lorsqu'une grandeur est exprimée en multiples de l'octet, les symboles Ko, Mo et Go représentent respectivement le kilooctet, le mégaoctet et le gigaoctet. Dans ce cas, et contrairement à la norme, on considère généralement que le kilooctet est égal à 210 = 1 024 octets et non 1000 et le mégaoctet à 220 et non 1 000 000.
related: concept-TELE362

test dynamique
type: ConceptConcept
type: Concept
creator: Commission d'enrichissement de la langue française, FranceTerme
source: révision de l'arrêté du 29 avril 1992
date parution JO: 2000-09-22
equivalent EN: dynamic test @en
equivalent EN: dynamic test (en)
definition: Test d'un circuit par lequel les vecteurs de test sont appliqués à un rythme suffisamment rapide pour tenir compte des temps de propagation des signaux à l'intérieur du circuit.
in scheme: Électronique
in scheme: concept-SD-electronique-composants-electroniques
in scheme: concepts
notation: INFO230
related: test statique

test fonctionnel
type: ConceptConcept
type: Concept
creator: Commission d'enrichissement de la langue française, FranceTerme
source: révision de l'arrêté du 29 avril 1992
date parution JO: 2000-09-22
equivalent EN: functional test @en
equivalent EN: functional test (en)
definition: Test destiné à vérifier, pour une spécification donnée, le comportement fonctionnel d'un circuit.
in scheme: Électronique
in scheme: concept-SD-electronique-composants-electroniques
in scheme: concepts
notation: INFO231

test intégré
type: ConceptConcept
type: Concept
creator: Commission d'enrichissement de la langue française, FranceTerme
source: révision de l'arrêté du 29 avril 1992
date parution JO: 2000-09-22
equivalent EN: built-in self test @en
equivalent EN: built-in self test (en)
definition: Test réalisé au moyen de cellules introduites dans un circuit, permettant l'analyse des nœuds d'interconnexion.
in scheme: Électronique
in scheme: concept-SD-electronique-composants-electroniques
in scheme: concepts
notation: INFO232

test statique
type: ConceptConcept
type: Concept
creator: Commission d'enrichissement de la langue française, FranceTerme
source: révision de l'arrêté du 29 avril 1992
date parution JO: 2000-09-22
equivalent EN: static test @en
equivalent EN: static test (en)
definition: Test d'un circuit par lequel les vecteurs de test sont appliqués à un rythme suffisamment lent pour assurer que le circuit a bien atteint un état stable avant l'application du prochain vecteur de test.
in scheme: Électronique
in scheme: concept-SD-electronique-composants-electroniques
in scheme: concepts
notation: INFO233
related: test dynamique

test structurel
type: ConceptConcept
type: Concept
creator: Commission d'enrichissement de la langue française, FranceTerme
source: révision de l'arrêté du 29 avril 1992
date parution JO: 2000-09-22
equivalent EN: structural test @en
equivalent EN: structural test (en)
definition: Test conçu pour vérifier chaque étape du procédé de fabrication d'une tranche de semiconducteur.
in scheme: Électronique
in scheme: concept-SD-electronique-composants-electroniques
in scheme: concepts
notation: INFO234

testeur
type: ConceptConcept
type: Concept
creator: Commission d'enrichissement de la langue française, FranceTerme
source: révision de l'arrêté du 29 avril 1992
date parution JO: 2000-09-22
equivalent EN: tester @en
equivalent EN: tester (en)
part of speech: nom masculin
definition: Équipement qui permet d'appliquer une séquence de tests sur les entrées d'un circuit et qui mesure les états de sorties afin de vérifier leur conformité aux spécifications.
in scheme: Électronique
in scheme: concept-SD-electronique-composants-electroniques
in scheme: concepts
notation: INFO235
related: séquence de test

tolérance aux pannes
type: ConceptConcept
type: Concept
creator: Commission d'enrichissement de la langue française, FranceTerme
source: révision de l'arrêté du 19 février 1993
date parution JO: 2000-09-22
equivalent EN: fault tolerance @en
equivalent EN: fault tolerance (en)
definition: Aptitude d'un système informatique à demeurer fonctionnel malgré certaines pannes de ses constituants.
in scheme: Informatique
in scheme: concepts
notation: INFO236

tolérant aux pannes
type: ConceptConcept
type: Concept
creator: Commission d'enrichissement de la langue française, FranceTerme
source: révision de l'arrêté du 19 février 1993
date parution JO: 2000-09-22
equivalent EN: fault tolerant @en
equivalent EN: fault tolerant (en)
definition: Se dit d'un système informatique apte à demeurer fonctionnel malgré certaines pannes de ses constituants.
in scheme: Informatique
in scheme: concepts
notation: INFO237

topologie
type: ConceptConcept
type: Concept
creator: Commission d'enrichissement de la langue française, FranceTerme
source: révision de l'arrêté du 29 avril 1992
date parution JO: 2000-09-22
equivalent EN: layout @en
equivalent EN: layout (en)
part of speech: nom féminin
definition: Représentation de l'implantation physique d'un circuit obtenue à l'issue des phases de placement et de routage, par opposition à sa fonction électrique définie par un schéma.
in scheme: Électronique
in scheme: concept-SD-electronique-composants-electroniques
in scheme: concepts
notation: INFO238
related: routage
related: bloc de propriété intellectuelle

traducteur de test
type: ConceptConcept
type: Concept
creator: Commission d'enrichissement de la langue française, FranceTerme
source: révision de l'arrêté du 29 avril 1992
date parution JO: 2000-09-22
deconseille ou frequent: post-processeur de test
equivalent EN: test postprocessor @en
equivalent EN: test postprocessor (en)
definition: Logiciel qui convertit automatiquement les vecteurs de test définis lors de la conception du circuit en commandes utilisables par le testeur.
in scheme: Électronique
in scheme: concept-SD-electronique-composants-electroniques
in scheme: concepts
notation: INFO239
note: On trouve parfois « post-processeur de test ».
related: testeur
related: vecteur de test

permutation
type: ConceptConcept
type: Concept
creator: Commission d'enrichissement de la langue française, FranceTerme
date parution JO: 1998-10-10
equivalent EN: swap @en
equivalent EN: swap (en)
part of speech: nom féminin
definition: Processus consistant à échanger le contenu d'une zone de mémoire principale avec le contenu d'une zone de mémoire auxiliaire.
in scheme: Informatique
in scheme: concepts
notation: INFO24

traitement automatique de données
type: ConceptConcept
type: Concept
creator: Commission d'enrichissement de la langue française, FranceTerme
source: révision de l'arrêté du 22 décembre 1981
abbreviation: ADP @en
date parution JO: 2000-09-22
deconseille ou frequent: traitement automatique de l'information
equivalent EN: ADP @en
equivalent EN: ADP (en)
equivalent EN: automatic data processing @en
equivalent EN: automatic data processing (en)
definition: Ensemble des opérations réalisées par des moyens automatiques, relatif à la collecte, l'enregistrement, l'élaboration, la modification, la conservation, la destruction, l'édition de données et, d'une façon générale, leur exploitation.
in scheme: Informatique
in scheme: concepts
notation: INFO240
note: Dans l'usage courant, l'expression « traitement automatique de l'information » est également employée.
related: mégadonnées
related: donnée

traitement par lots
type: ConceptConcept
type: Concept
creator: Commission d'enrichissement de la langue française, FranceTerme
source: révision de l'arrêté du 22 décembre 1981
date parution JO: 2000-09-22
equivalent EN: batch processing @en
equivalent EN: batch processing (en)
definition: Mode de traitement des données suivant lequel les programmes à exécuter ou les données à traiter sont groupés en lots.
in scheme: Informatique
in scheme: concepts
notation: INFO241

unité arithmétique logique
type: ConceptConcept
type: Concept
creator: Commission d'enrichissement de la langue française, FranceTerme
source: révision de l'arrêté du 14 septembre 1990
abbreviation: ALU @en
abbreviation: UAL
date parution JO: 2000-09-22
equivalent EN: ALU @en
equivalent EN: ALU (en)
equivalent EN: arithmetic logic unit @en
equivalent EN: arithmetic logic unit (en)
definition: Ensemble de circuits électroniques connectés logiquement de façon à réaliser, sous l'action de commandes élémentaires, les opérations arithmétiques ou logiques pour lesquelles cet ensemble a été conçu.
in scheme: Électronique
in scheme: concept-SD-electronique-composants-electroniques
in scheme: concepts
notation: INFO242

unité de fabrication finale
type: ConceptConcept
type: Concept
creator: Commission d'enrichissement de la langue française, FranceTerme
source: révision de l'arrêté du 14 septembre 1990
abbreviation: back-end @en
date parution JO: 2000-09-22
equivalent EN: back-end @en
equivalent EN: back-end (en)
equivalent EN: back-end line @en
equivalent EN: back-end line (en)
forme abregee: unité finale
definition: Ensemble d'opérations de fabrication faisant suite à celles de l'unité de fabrication initiale et se terminant, suivant les fabricants, à la découpe des puces ou au test final après montage.
in scheme: Électronique
in scheme: concept-SD-electronique-composants-electroniques
in scheme: concepts
notation: INFO243
related: unité de fabrication initiale

unité de fabrication initiale
type: ConceptConcept
type: Concept
creator: Commission d'enrichissement de la langue française, FranceTerme
source: révision de l'arrêté du 14 septembre 1990
abbreviation: front-end @en
date parution JO: 2000-09-22
deconseille ou frequent: centre de diffusion
equivalent EN: front-end @en
equivalent EN: front-end (en)
equivalent EN: front-end line @en
equivalent EN: front-end line (en)
forme abregee: unité initiale
definition: Ensemble d'opérations de fabrication débutant avec la première étape du traitement de la plaquette de semiconducteurs et se terminant, suivant les fabricants, avant ou après les étapes de métallisation.
in scheme: Électronique
in scheme: concept-SD-electronique-composants-electroniques
in scheme: concepts
notation: INFO244
note: Le terme « centre de diffusion » est également utilisé dans la profession.
related: unité de fabrication finale

vecteur de test
type: ConceptConcept
type: Concept
creator: Commission d'enrichissement de la langue française, FranceTerme
source: révision de l'arrêté du 29 avril 1992
date parution JO: 2000-09-22
equivalent EN: test vector @en
equivalent EN: test vector (en)
definition: Ensemble de signaux appliqués aux entrées d'un circuit en vue de provoquer une réponse.
in scheme: Électronique
in scheme: concept-SD-electronique-composants-electroniques
in scheme: concepts
notation: INFO245
related: génération de séquences de test
related: traducteur de test

vérificateur de prototype
type: ConceptConcept
type: Concept
creator: Commission d'enrichissement de la langue française, FranceTerme
source: révision de l'arrêté du 29 avril 1992
date parution JO: 2000-09-22
equivalent EN: bench tester @en
equivalent EN: bench tester (en)
alternative label: testeur de prototype
definition: Équipement de test manuel utilisé pour vérifier la fonctionnalité d'un prototype.
in scheme: Électronique
in scheme: concept-SD-electronique-composants-electroniques
in scheme: concepts
notation: INFO246
note: Ce type d'équipement permet également l'analyse de défaillances, l'évaluation et la caractérisation des circuits intégrés.

vérification des règles de conception
type: ConceptConcept
type: Concept
creator: Commission d'enrichissement de la langue française, FranceTerme
source: révision de l'arrêté du 29 avril 1992
abbreviation: VRC
date parution JO: 2000-09-22
equivalent EN: DRC/ERC @en
equivalent EN: DRC/ERC (en)
definition: Vérification effectuée par logiciel des règles de dessin et des règles d'interconnexion.
in scheme: Électronique
in scheme: concept-SD-electronique-composants-electroniques
in scheme: concepts
notation: INFO247
related: vérification des règles de dessin
related: vérification de la conformité aux règles d'interconnexion

vérification des règles de dessin
type: ConceptConcept
type: Concept
creator: Commission d'enrichissement de la langue française, FranceTerme
source: révision de l'arrêté du 29 avril 1992
abbreviation: DRC @en
abbreviation: VRD
date parution JO: 2000-09-22
equivalent EN: DRC @en
equivalent EN: DRC (en)
equivalent EN: design rule checking @en
equivalent EN: design rule checking (en)
definition: Vérification effectuée par logiciel des dimensions géométriques d'un circuit imposées par sa technologie de fabrication.
in scheme: Électronique
in scheme: concept-SD-electronique-composants-electroniques
in scheme: concepts
notation: INFO248
related: vérification des règles de conception

visualiser
type: ConceptConcept
type: Concept
creator: Commission d'enrichissement de la langue française, FranceTerme
source: révision de l'arrêté du 30 novembre 1983
date parution JO: 2000-09-22
deconseille ou frequent: to display
equivalent EN: display @en
equivalent EN: display (en)
part of speech: verbe
definition: Inscrire les résultats d'un traitement sur un écran de visualisation.
in scheme: Tous domaines
in scheme: concepts
notation: INFO249
related: concept-SPAT9

raccourci au clavier
type: ConceptConcept
type: Concept
creator: Commission d'enrichissement de la langue française, FranceTerme
date parution JO: 1998-10-10
equivalent EN: hot key @en
equivalent EN: hot key (en)
forme abregee: raccourci clavier
definition: Touche ou combinaison de touches du clavier qui peut se substituer à une séquence de commandes plus complexes.
in scheme: Informatique
in scheme: concepts
notation: INFO25

réamorcer
type: ConceptConcept
type: Concept
creator: Commission d'enrichissement de la langue française, FranceTerme
date parution JO: 1998-10-10
deconseille ou frequent: to reboot
equivalent EN: reboot @en
equivalent EN: reboot (en)
part of speech: verbe
definition: Provoquer de nouveau l'exécution de l'amorce.
in scheme: Informatique
in scheme: concepts
notation: INFO26
related: amorcer
related: amorce

référentiel
type: ConceptConcept
type: Concept
creator: Commission d'enrichissement de la langue française, FranceTerme
date parution JO: 1998-10-10
equivalent EN: repository @en
equivalent EN: repository (en)
part of speech: nom masculin
definition: Ensemble structuré d'informations utilisé pour l'exécution d'un logiciel et constituant un cadre commun à plusieurs applications.
in scheme: Informatique
in scheme: concepts
notation: INFO27

réinitialiser
type: ConceptConcept
type: Concept
creator: Commission d'enrichissement de la langue française, FranceTerme
date parution JO: 1998-10-10
deconseille ou frequent: to reset
equivalent EN: reset @en
equivalent EN: reset (en)
part of speech: verbe
definition: Remettre un système informatique ou une application dans son état initial.
in scheme: Informatique
in scheme: concepts
notation: INFO28

scanneur
type: ConceptConcept
type: Concept
creator: Commission d'enrichissement de la langue française, FranceTerme
date parution JO: 1998-10-10
equivalent EN: scanner @en
equivalent EN: scanner (en)
part of speech: nom masculin
definition: Numériseur à balayage pouvant inclure un traitement de l'information numérisée.
in scheme: Informatique
in scheme: concepts
notation: INFO29
related: numériseur

scrutation
type: ConceptConcept
type: Concept
creator: Commission d'enrichissement de la langue française, FranceTerme
date parution JO: 1998-10-10
deconseille ou frequent: invitation à émettre
equivalent EN: polling @en
equivalent EN: polling (en)
part of speech: nom féminin
definition: Examen répété de l'état d'un ou plusieurs éléments d'un système pour y détecter un changement éventuel.
in scheme: Informatique
in scheme: concepts
notation: INFO3
related: concept-TELE49

documentation intégrée (à)
type: ConceptConcept
type: Concept
creator: Commission d'enrichissement de la langue française, FranceTerme
date parution JO: 1998-10-10
deconseille ou frequent: à documentation intégrée
equivalent EN: self-documented @en
equivalent EN: self-documented (en)
definition: Qualifie une réalisation informatique dont la documentation, incorporée au programme, peut être consultée directement sur écran.
in scheme: Informatique
in scheme: concepts
notation: INFO30

configurer
type: ConceptConcept
type: Concept
creator: Commission d'enrichissement de la langue française, FranceTerme
date parution JO: 1998-10-10
deconseille ou frequent: to configure
equivalent EN: configure @en
equivalent EN: configure (en)
part of speech: verbe
definition: Définir les sous-ensembles constituant un matériel, un logiciel, ou agir sur leurs paramètres pour en assurer la mise en œuvre.
in scheme: Informatique
in scheme: concepts
notation: INFO31

anticrènelage
type: ConceptConcept
type: Concept
creator: Commission d'enrichissement de la langue française, FranceTerme
date parution JO: 1998-10-10
equivalent EN: antialiasing @en
equivalent EN: antialiasing (en)
part of speech: nom masculin
definition: Prévention du crènelage par un procédé qui consiste à lisser les lignes et les contours d'une image.
in scheme: Informatique
in scheme: concepts
notation: INFO32
related: crènelage

administrateur, -trice de site, de serveur
type: ConceptConcept
type: Concept
creator: Commission d'enrichissement de la langue française, FranceTerme
date parution JO: 1999-03-16
deconseille ou frequent: administrateur de serveur
deconseille ou frequent: administrateur de site
deconseille ou frequent: administratrice de serveur
deconseille ou frequent: administratrice de site
equivalent EN: webmaster @en
equivalent EN: webmaster (en)
definition: Personne chargée de la maintenance et du suivi d'un site ou d'un serveur sur la toile.
in scheme: Informatique
in scheme: Télécommunications
in scheme: concept-SD-informatique-internet
in scheme: concept-SD-telecommunications-internet
in scheme: concepts
notation: INFO33
related: toile

agenda électronique
type: ConceptConcept
type: Concept
creator: Commission d'enrichissement de la langue française, FranceTerme
date parution JO: 1998-10-10
deconseille ou frequent: organiseur
equivalent EN: organizer @en
equivalent EN: organizer (en)
definition: Logiciel pour la gestion de données personnelles telles que rendez-vous, adresses, etc. ; par extension, ordinateur de poche remplissant essentiellement cette fonction.
in scheme: Informatique
in scheme: concepts
notation: INFO34
note: On rencontre parfois aussi, moins bien, « organiseur ».
related: ordinateur de poche

article de forum
type: ConceptConcept
type: Concept
creator: Commission d'enrichissement de la langue française, FranceTerme
date parution JO: 1999-03-16
equivalent EN: news article @en
equivalent EN: news article (en)
equivalent EN: news item @en
equivalent EN: news item (en)
equivalent EN: news posting @en
equivalent EN: news posting (en)
alternative label: contribution
definition: Document similaire à un message électronique, destiné à alimenter un ou plusieurs forums.
in scheme: Informatique
in scheme: Télécommunications
in scheme: concept-SD-informatique-internet
in scheme: concept-SD-telecommunications-internet
in scheme: concepts
notation: INFO35
related: fil de la discussion
related: forum

cadre
type: ConceptConcept
type: Concept
creator: Commission d'enrichissement de la langue française, FranceTerme
date parution JO: 1999-03-16
equivalent EN: frame @en
equivalent EN: frame (en)
part of speech: nom masculin
definition: Sous-fenêtre de la fenêtre principale d'un logiciel de navigation, qui peut afficher un document différent de ceux affichés dans les autres sous-fenêtres.
in scheme: Informatique
in scheme: concept-SD-informatique-internet
in scheme: concepts
notation: INFO36
related: fenêtre
related: logiciel de navigation

disque numérique polyvalent
type: ConceptConcept
type: Concept
creator: Commission d'enrichissement de la langue française, FranceTerme
abbreviation: DVD @en
date parution JO: 1999-03-16
equivalent EN: DVD @en
equivalent EN: DVD (en)
equivalent EN: digital versatile disk @en
equivalent EN: digital versatile disk (en)
definition: Disque numérique optique de grande capacité, à usages divers (audio, vidéo, multimédia, mémoire vive, mémoire morte).
in scheme: Audiovisuel
in scheme: Informatique
in scheme: concepts
notation: INFO38
note: La capacité des disques numériques polyvalents est supérieure à celle des cédéroms et nécessite des lecteurs appropriés.
related: disque vidéo à durée déterminée
related: concept-INFO96

fenêtre
type: ConceptConcept
type: Concept
creator: Commission d'enrichissement de la langue française, FranceTerme
date parution JO: 1999-03-16
equivalent EN: window @en
equivalent EN: window (en)
part of speech: nom féminin
definition: Partie rectangulaire de l'écran d'un ordinateur à l'intérieur de laquelle sont affichées les informations relatives à une activité déterminée.
in scheme: Informatique
in scheme: concepts
notation: INFO39
note: Plusieurs fenêtres peuvent être ouvertes simultanément ; elles peuvent être juxtaposées ou se recouvrir totalement ou partiellement.
related: cadre

amorcer
type: ConceptConcept
type: Concept
creator: Commission d'enrichissement de la langue française, FranceTerme
date parution JO: 1998-10-10
deconseille ou frequent: to boot
equivalent EN: boot @en
equivalent EN: boot (en)
part of speech: verbe
definition: Mettre en marche un ordinateur en provoquant l'exécution de l'amorce.
in scheme: Informatique
in scheme: concepts
notation: INFO4
related: réamorcer
related: amorce

fil de la discussion
type: ConceptConcept
type: Concept
creator: Commission d'enrichissement de la langue française, FranceTerme
date parution JO: 1999-03-16
equivalent EN: thread @en
equivalent EN: thread (en)
forme abregee: fil, n.m.
definition: Dans les échanges au sein d'un forum ou entre utilisateurs du courrier électronique, enchaînement des commentaires à un article donné.
in scheme: Informatique
in scheme: Télécommunications
in scheme: concept-SD-informatique-internet
in scheme: concept-SD-telecommunications-internet
in scheme: concepts
notation: INFO40
related: article de forum
related: forum
related: microblogue

fouineur
type: ConceptConcept
type: Concept
creator: Commission d'enrichissement de la langue française, FranceTerme
date parution JO: 1999-03-16
deconseille ou frequent: bidouilleur
equivalent EN: hacker @en
equivalent EN: hacker (en)
part of speech: nom masculin
definition: Personne passionnée d'informatique qui, par jeu, curiosité, défi personnel ou par souci de notoriété, sonde, au hasard plutôt qu'à l'aide de manuels techniques, les possibilités matérielles et logicielles des systèmes informatiques afin de pouvoir éventuellement s'y immiscer.
in scheme: Informatique
in scheme: concept-SD-informatique-internet
in scheme: concepts
notation: INFO42
related: pirate

frimousse
type: ConceptConcept
type: Concept
creator: Commission d'enrichissement de la langue française, FranceTerme
date parution JO: 1999-03-16
deconseille ou frequent: binette
deconseille ou frequent: émoji
equivalent EN: emoticon @en
equivalent EN: emoticon (en)
equivalent EN: smiley @en
equivalent EN: smiley (en)
part of speech: nom féminin
definition: Dans un message, association facétieuse de quelques caractères typographiques qui évoquent un visage expressif.
in scheme: Informatique
in scheme: concept-SD-informatique-internet
in scheme: concepts
notation: INFO43
note: 1. Les deux frimousses les plus connues sont : - ) pour la bonne humeur et : - ( pour le dépit, où les deux points représentent les yeux, le trait représente le nez et les parenthèses la bouche.
note: 2. Le terme « binette » est recommandé au Québec. « Frimousse » doit être préféré à « binette ».

glisser-déposer
type: ConceptConcept
type: Concept
creator: Commission d'enrichissement de la langue française, FranceTerme
date parution JO: 1999-03-16
equivalent EN: drag and drop @en
equivalent EN: drag and drop (en)
part of speech: nom masculin
definition: Action par laquelle l'utilisateur sélectionne un objet à l'écran, le déplace jusqu'à une autre position, puis le lâche pour déclencher une action sur cet objet.
in scheme: Informatique
in scheme: concept-SD-informatique-internet
in scheme: concepts
notation: INFO44

hypertexte
type: ConceptConcept
type: Concept
creator: Commission d'enrichissement de la langue française, FranceTerme
date parution JO: 1999-03-16
equivalent EN: hypertext @en
equivalent EN: hypertext (en)
part of speech: nom masculin
definition: Système de renvois permettant de passer directement d'une partie d'un document à une autre, ou d'un document à d'autres documents choisis comme pertinents par l'auteur.
in scheme: Informatique
in scheme: concept-SD-informatique-internet
in scheme: concepts
notation: INFO45
related: hypertextuel
related: ancre
related: rétrolien
related: toile

hypertextuel
type: ConceptConcept
type: Concept
creator: Commission d'enrichissement de la langue française, FranceTerme
date parution JO: 1999-03-16
equivalent EN: hypertext @en
equivalent EN: hypertext (en)
part of speech: adjectif
definition: Relatif à l'hypertexte.
in scheme: Informatique
in scheme: concept-SD-informatique-internet
in scheme: concepts
notation: INFO46
related: piège à clics
related: hypertexte
related: logiciel de navigation
related: ancre
related: référencement abusif

signet
type: ConceptConcept
type: Concept
creator: Commission d'enrichissement de la langue française, FranceTerme
date parution JO: 1999-03-16
equivalent EN: bookmark @en
equivalent EN: bookmark (en)
part of speech: nom masculin
definition: Moyen d'accéder rapidement à une adresse universelle préalablement stockée en mémoire par l'utilisateur.
in scheme: Informatique
in scheme: concept-SD-informatique-internet
in scheme: concepts
notation: INFO48
related: adresse universelle

bloc
type: ConceptConcept
type: Concept
creator: Commission d'enrichissement de la langue française, FranceTerme
date parution JO: 1998-10-10
equivalent EN: block @en
equivalent EN: block (en)
part of speech: nom masculin
definition: Groupe de données enregistré ou transmis globalement pour des motifs techniques indépendamment de leur contenu.
in scheme: Informatique
in scheme: concepts
notation: INFO5
related: chaîne de blocs

amorce
type: ConceptConcept
type: Concept
creator: Commission d'enrichissement de la langue française, FranceTerme
date parution JO: 1998-10-10
equivalent EN: boot @en
equivalent EN: boot (en)
part of speech: nom féminin
definition: Programme nécessaire à la mise en marche d'un ordinateur, et exécuté à chaque mise sous tension ou réinitialisation.
in scheme: Informatique
in scheme: concepts
notation: INFO51
related: polymorphisme de l'ADN révélé par amplification aléatoire
related: origine de réplication
related: réamorcer
related: amorcer

boîtier
type: ConceptConcept
type: Concept
creator: Commission d'enrichissement de la langue française, FranceTerme
date parution JO: 2002-03-26
equivalent EN: package @en
equivalent EN: package (en)
part of speech: nom masculin
definition: Enveloppe protégeant un ou plusieurs composants et comportant des traversées pour le raccordement à l'extérieur.
in scheme: Électronique
in scheme: concept-SD-electronique-composants-electroniques
in scheme: concepts
notation: INFO516
related: boîtier-système

broche de raccordement
type: ConceptConcept
type: Concept
creator: Commission d'enrichissement de la langue française, FranceTerme
abbreviation: pin @en
date parution JO: 2002-03-26
equivalent EN: lead @en
equivalent EN: lead (en)
equivalent EN: package pin @en
equivalent EN: package pin (en)
equivalent EN: pin @en
equivalent EN: pin (en)
alternative label: patte de sortie
definition: Pièce métallique mécaniquement solidaire d'un boîtier, d'un circuit imprimé ou d'un composant, destiné à en assurer la connexion électrique et éventuellement la fixation.
in scheme: Électronique
in scheme: concept-SD-electronique-composants-electroniques
in scheme: concepts
notation: INFO517
related: pas
related: concept-INFO975

bus
type: ConceptConcept
type: Concept
creator: Commission d'enrichissement de la langue française, FranceTerme
date parution JO: 2002-03-26
deconseille ou frequent: omnibus
equivalent EN: bus @en
equivalent EN: bus (en)
part of speech: nom masculin
definition: Dispositif non bouclé reliant plusieurs composants, sous-ensembles ou matériels pour permettre entre eux l'apport d'énergie et la circulation d'informations.
in scheme: Électronique
in scheme: concept-SD-electronique-composants-electroniques
in scheme: concepts
notation: INFO518
note: « Bus » est l'abréviation de « omnibus » pour désigner un équipement qui remplit une même fonction pour plusieurs composants.

câblage
type: ConceptConcept
type: Concept
creator: Commission d'enrichissement de la langue française, FranceTerme
date parution JO: 2002-03-26
equivalent EN: wiring @en
equivalent EN: wiring (en)
part of speech: nom masculin
definition: Opération qui consiste à réaliser des connexions entre les divers éléments d'un composant, sous-ensemble ou matériel ; l'ensemble de ces connexions.
in scheme: Électronique
in scheme: concept-SD-electronique-composants-electroniques
in scheme: concepts
notation: INFO519
note: Les connexions peuvent être, par exemple, électriques ou optiques.

témoin de connexion
type: ConceptConcept
type: Concept
creator: Commission d'enrichissement de la langue française, FranceTerme
date parution JO: 1999-03-16
deconseille ou frequent: mouchard
equivalent EN: cookie @en
equivalent EN: cookie (en)
forme abregee: témoin, n.m.
definition: Appliquette envoyée par un serveur de la toile à un utilisateur, parfois à l'insu de celui-ci, au cours d'une connexion afin de caractériser cet utilisateur ; par extension, information que l'appliquette peut enregistrer sur le disque de l'utilisateur et à laquelle le serveur peut accéder ultérieurement.
in scheme: Informatique
in scheme: concept-SD-informatique-internet
in scheme: concepts
notation: INFO52
note: Dans cette acception, on dit aussi « mouchard » (n.m.).
related: appliquette
related: toile

carte électronique
type: ConceptConcept
type: Concept
creator: Commission d'enrichissement de la langue française, FranceTerme
abbreviation: board @en
date parution JO: 2002-03-26
equivalent EN: board @en
equivalent EN: board (en)
equivalent EN: electronic board @en
equivalent EN: electronic board (en)
definition: Circuit imprimé nu équipé de composants.
in scheme: Électronique
in scheme: concept-SD-electronique-composants-electroniques
in scheme: concepts
notation: INFO520
related: circuit imprimé nu

carte fille
type: ConceptConcept
type: Concept
creator: Commission d'enrichissement de la langue française, FranceTerme
date parution JO: 2002-03-26
equivalent EN: daughter board @en
equivalent EN: daughter board (en)
equivalent EN: daughter card @en
equivalent EN: daughter card (en)
equivalent EN: daughterboard @en
equivalent EN: daughterboard (en)
equivalent EN: daughtercard @en
equivalent EN: daughtercard (en)
definition: Carte électronique enfichée sur une autre carte, en général la carte mère.
in scheme: Électronique
in scheme: concept-SD-electronique-composants-electroniques
in scheme: concepts
notation: INFO521
related: carte mère

carte mère
type: ConceptConcept
type: Concept
creator: Commission d'enrichissement de la langue française, FranceTerme
date parution JO: 2002-03-26
equivalent EN: mother board @en
equivalent EN: mother board (en)
equivalent EN: mother card @en
equivalent EN: mother card (en)
equivalent EN: motherboard @en
equivalent EN: motherboard (en)
equivalent EN: mothercard @en
equivalent EN: mothercard (en)
definition: Carte électronique qui sert de support aux composants principaux d'un ensemble électronique et éventuellement aux cartes filles.
in scheme: Électronique
in scheme: concept-SD-electronique-composants-electroniques
in scheme: concepts
notation: INFO522
related: carte fille

circuit à configurations multiples
type: ConceptConcept
type: Concept
creator: Commission d'enrichissement de la langue française, FranceTerme
date parution JO: 2002-03-26
equivalent EN: reconfigurable circuit @en
equivalent EN: reconfigurable circuit (en)
alternative label: circuit reconfigurable
definition: Circuit logique intégré pouvant réaliser des fonctions différentes selon les demandes successives de l'utilisateur.
in scheme: Électronique
in scheme: concept-SD-electronique-composants-electroniques
in scheme: concepts
notation: INFO523

circuit imprimé nu
type: ConceptConcept
type: Concept
creator: Commission d'enrichissement de la langue française, FranceTerme
abbreviation: PCB @en
date parution JO: 2002-03-26
deconseille ou frequent: carte électronique
deconseille ou frequent: circuit imprimé
equivalent EN: PCB @en
equivalent EN: PCB (en)
equivalent EN: printed circuit board @en
equivalent EN: printed circuit board (en)
definition: Ensemble constitué d'un support isolant et de conducteurs métalliques plats destinés à assurer des liaisons électriques entre des composants électroniques qui seront disposés à la surface du support.
in scheme: Électronique
in scheme: concept-SD-electronique-composants-electroniques
in scheme: concepts
notation: INFO524
note: 1. Il existe de multiples types de circuits imprimés : simple face, double face, ou multicouches, le support pouvant être rigide ou souple, plan ou en trois dimensions. Lorsqu'il est équipé de ses composants, un circuit imprimé nu est appelé « carte électronique ».
note: 2. Le terme « circuit imprimé » seul peut être utilisé lorsqu'il n'y a pas d'ambiguïté.
related: carte électronique
related: plage d'accueil

circuit intégré hybride
type: ConceptConcept
type: Concept
creator: Commission d'enrichissement de la langue française, FranceTerme
abbreviation: HIC @en
date parution JO: 2002-03-26
equivalent EN: HIC @en
equivalent EN: HIC (en)
equivalent EN: hybrid integrated circuit @en
equivalent EN: hybrid integrated circuit (en)
forme abregee: circuit hybride
definition: Circuit intégré constitué d'une combinaison d'au moins deux composants intégrés ou discrets.
in scheme: Électronique
in scheme: concept-SD-electronique-composants-electroniques
in scheme: concepts
notation: INFO525

composant discret
type: ConceptConcept
type: Concept
creator: Commission d'enrichissement de la langue française, FranceTerme
date parution JO: 2002-03-26
deconseille ou frequent: diode
deconseille ou frequent: résistance
deconseille ou frequent: transistor
equivalent EN: discrete component @en
equivalent EN: discrete component (en)
definition: Composant électronique élémentaire.
in scheme: Électronique
in scheme: concept-SD-electronique-composants-electroniques
in scheme: concepts
notation: INFO526
note: Exemples : diode, transistor, résistance, etc.

fond de panier
type: ConceptConcept
type: Concept
creator: Commission d'enrichissement de la langue française, FranceTerme
date parution JO: 2002-03-26
equivalent EN: back panel @en
equivalent EN: back panel (en)
equivalent EN: backplane @en
equivalent EN: backplane (en)
definition: Ensemble généralement placé au fond d'un équipement électronique et constitué de connecteurs reliés par un câblage interne, dans lesquels on peut enficher des cartes électroniques.
in scheme: Électronique
in scheme: concept-SD-electronique-composants-electroniques
in scheme: concepts
notation: INFO527
note: Le câblage interne peut être réalisé par un circuit imprimé.

jeu de puces
type: ConceptConcept
type: Concept
creator: Commission d'enrichissement de la langue française, FranceTerme
date parution JO: 2002-03-26
equivalent EN: chipset @en
equivalent EN: chipset (en)
definition: Ensemble de composants de base d'un équipement électronique (téléviseur, microordinateur, téléphone portable, etc.) assurant un certain nombre de fonctions de l'équipement considéré.
in scheme: Électronique
in scheme: concept-SD-electronique-composants-electroniques
in scheme: concepts
notation: INFO528
note: Dans un microordinateur, le jeu de puces assure l'essentiel des fonctions, à l'exception de celles du processeur principal et éventuellement des mémoires vives.

mémoire vive dynamique
type: ConceptConcept
type: Concept
creator: Commission d'enrichissement de la langue française, FranceTerme
abbreviation: DRAM @en
abbreviation: dynamic RAM @en
date parution JO: 2002-03-26
equivalent EN: DRAM @en
equivalent EN: DRAM (en)
equivalent EN: dynamic RAM @en
equivalent EN: dynamic RAM (en)
equivalent EN: dynamic random-access memory @en
equivalent EN: dynamic random-access memory (en)
definition: Mémoire vive dans laquelle les états binaires correspondent à la présence ou à l'absence de charges électriques qu'il est nécessaire de régénérer périodiquement.
in scheme: Informatique
in scheme: concepts
notation: INFO529
related: mémoire vive statique

visionneur
type: ConceptConcept
type: Concept
creator: Commission d'enrichissement de la langue française, FranceTerme
date parution JO: 1999-03-16
equivalent EN: viewer @en
equivalent EN: viewer (en)
part of speech: nom masculin
definition: Logiciel permettant d'afficher un document sans disposer du logiciel qui a servi à le produire.
in scheme: Informatique
in scheme: concept-SD-informatique-internet
in scheme: concepts
notation: INFO53
related: concept-interface-utilisateur

montage en surface
type: ConceptConcept
type: Concept
creator: Commission d'enrichissement de la langue française, FranceTerme
abbreviation: SMT @en
date parution JO: 2002-03-26
equivalent EN: SMT @en
equivalent EN: SMT (en)
equivalent EN: surface mount technology @en
equivalent EN: surface mount technology (en)
equivalent EN: surface mounting @en
equivalent EN: surface mounting (en)
definition: Technique de montage de composants consistant à braser ou coller les composants sur un support non percé qui comporte des conducteurs métalliques déposés à sa surface.
in scheme: Électronique
in scheme: concept-SD-electronique-composants-electroniques
in scheme: concepts
notation: INFO530

pas
type: ConceptConcept
type: Concept
creator: Commission d'enrichissement de la langue française, FranceTerme
date parution JO: 2002-03-26
equivalent EN: pitch @en
equivalent EN: pitch (en)
equivalent EN: spacing @en
equivalent EN: spacing (en)
part of speech: nom masculin
definition: Distance séparant deux lignes d'interconnexion voisines dans un circuit intégré ou sur un circuit imprimé nu.
in scheme: Électronique
in scheme: concept-SD-electronique-composants-electroniques
in scheme: concepts
notation: INFO531
note: Plus précisément, cette distance est celle qui sépare les axes centraux des lignes.
related: broche de raccordement
related: concept-INFO975

pastille
type: ConceptConcept
type: Concept
creator: Commission d'enrichissement de la langue française, FranceTerme
date parution JO: 2002-03-26
equivalent EN: land @en
equivalent EN: land (en)
part of speech: nom féminin
definition: Zone conductrice d'un circuit imprimé, perforée et utilisée entre autres pour la fixation d'un composant.
in scheme: Électronique
in scheme: concept-SD-electronique-composants-electroniques
in scheme: concepts
notation: INFO532
note: La pastille est généralement circulaire et comporte un trou, la plage d'accueil n'en comporte pas forcément.
related: plage d'accueil

plage d'accueil
type: ConceptConcept
type: Concept
creator: Commission d'enrichissement de la langue française, FranceTerme
date parution JO: 2002-03-26
equivalent EN: mounting land @en
equivalent EN: mounting land (en)
equivalent EN: mounting pad @en
equivalent EN: mounting pad (en)
definition: Zone conductrice d'un circuit imprimé nu à laquelle est raccordé un plot de contact d'un composant monté en surface.
in scheme: Électronique
in scheme: concept-SD-electronique-composants-electroniques
in scheme: concepts
notation: INFO533
related: circuit imprimé nu
related: pastille

puce retournée
type: ConceptConcept
type: Concept
creator: Commission d'enrichissement de la langue française, FranceTerme
date parution JO: 2002-03-26
deconseille ou frequent: puce montée face avant
deconseille ou frequent: puce à protubérances
equivalent EN: flip-chip @en
equivalent EN: flip-chip (en)
definition: Puce comportant tous ses contacts sur une seule face, sous forme de billes ou de bossages métalliques, et que l'on retourne pour le brasage sur un support.
in scheme: Électronique
in scheme: concept-SD-electronique-composants-electroniques
in scheme: concepts
notation: INFO534
note: On trouve aussi les termes « puce à protubérances » et « puce montée face avant ».

tranche
type: ConceptConcept
type: Concept
creator: Commission d'enrichissement de la langue française, FranceTerme
date parution JO: 2002-03-26
deconseille ou frequent: plaquette
deconseille ou frequent: rondelle
equivalent EN: slice @en
equivalent EN: slice (en)
equivalent EN: wafer @en
equivalent EN: wafer (en)
part of speech: nom féminin
definition: Disque de faible épaisseur découpé dans un lingot monocristallin de matériau semiconducteur et utilisé comme matériau de base pour réaliser un ou plusieurs circuits ou composants en une seule fois.
in scheme: Électronique
in scheme: concept-SD-electronique-composants-electroniques
in scheme: concepts
notation: INFO535
note: On trouve aussi les termes « plaquette » et « rondelle ».

brasage
type: ConceptConcept
type: Concept
creator: Commission d'enrichissement de la langue française, FranceTerme
date parution JO: 2002-03-26
equivalent EN: brazing @en
equivalent EN: brazing (en)
equivalent EN: soldering @en
equivalent EN: soldering (en)
part of speech: nom masculin
in scheme: Électronique
in scheme: concept-SD-electronique-composants-electroniques
in scheme: concepts
notation: INFO536

concepteur, -trice de circuits
type: ConceptConcept
type: Concept
creator: Commission d'enrichissement de la langue française, FranceTerme
date parution JO: 2002-03-26
equivalent EN: circuit designer @en
equivalent EN: circuit designer (en)
in scheme: Électronique
in scheme: concept-SD-electronique-composants-electroniques
in scheme: concepts
notation: INFO537

réseau logique programmable par l'utilisateur
type: ConceptConcept
type: Concept
creator: Commission d'enrichissement de la langue française, FranceTerme
abbreviation: FPLA @en
date parution JO: 2002-03-26
equivalent EN: FPLA @en
equivalent EN: FPLA (en)
equivalent EN: field programmable logic array @en
equivalent EN: field programmable logic array (en)
in scheme: Électronique
in scheme: concept-SD-electronique-composants-electroniques
in scheme: concepts
notation: INFO538

base de données
type: ConceptConcept
type: Concept
creator: Commission d'enrichissement de la langue française, FranceTerme
source: révision de l'arrêté du 22 décembre 1981
date parution JO: 2000-09-22
equivalent EN: data base @en
equivalent EN: data base (en)
equivalent EN: database @en
equivalent EN: database (en)
in scheme: Informatique
in scheme: concepts
notation: INFO539

logiciel de navigation
type: ConceptConcept
type: Concept
creator: Commission d'enrichissement de la langue française, FranceTerme
date parution JO: 1999-03-16
equivalent EN: browser @en
equivalent EN: browser (en)
alternative label: navigateur
definition: Dans un environnement de type internet, logiciel qui permet à l'utilisateur de rechercher et de consulter des documents et d'exploiter les liens hypertextuels qu'ils comportent.
in scheme: Informatique
in scheme: concept-SD-informatique-internet
in scheme: concepts
notation: INFO54
related: cadre
related: hypertextuel
related: appliquette
related: page d'accueil
related: portail de messagerie
related: concept-INFO974

logiciel de dessin
type: ConceptConcept
type: Concept
creator: Commission d'enrichissement de la langue française, FranceTerme
date parution JO: 1998-10-10
equivalent EN: drawing software @en
equivalent EN: drawing software (en)
in scheme: Informatique
in scheme: concepts
notation: INFO541

police de caractères
type: ConceptConcept
type: Concept
creator: Commission d'enrichissement de la langue française, FranceTerme
date parution JO: 1998-10-10
equivalent EN: font @en
equivalent EN: font (en)
forme abregee: police, n.f.
in scheme: Informatique
in scheme: concepts
notation: INFO543

microprocesseur
type: ConceptConcept
type: Concept
creator: Commission d'enrichissement de la langue française, FranceTerme
source: révision de l'arrêté du 22 décembre 1981
date parution JO: 2000-09-22
equivalent EN: microprocessor @en
equivalent EN: microprocessor (en)
part of speech: nom masculin
in scheme: Informatique
in scheme: concepts
notation: INFO545
related: microordinateur
related: processeur
related: microcontrôleur

liste de signets
type: ConceptConcept
type: Concept
creator: Commission d'enrichissement de la langue française, FranceTerme
date parution JO: 1999-03-16
equivalent EN: hotlist @en
equivalent EN: hotlist (en)
in scheme: Informatique
in scheme: concept-SD-informatique-internet
in scheme: concepts
notation: INFO546

page sur la toile
type: ConceptConcept
type: Concept
creator: Commission d'enrichissement de la langue française, FranceTerme
date parution JO: 1999-03-16
deconseille ou frequent: page web
equivalent EN: web page @en
equivalent EN: web page (en)
equivalent EN: webpage @en
equivalent EN: webpage (en)
in scheme: Informatique
in scheme: Télécommunications
in scheme: concept-SD-informatique-internet
in scheme: concept-SD-telecommunications-internet
in scheme: concepts
notation: INFO547

assemblage
type: ConceptConcept
type: Concept
creator: Commission d'enrichissement de la langue française, FranceTerme
source: révision de l'arrêté du 29 avril 1992
date parution JO: 2000-09-22
equivalent EN: assembly @en
equivalent EN: assembly (en)
part of speech: nom masculin
alternative label: montage
in scheme: Électronique
in scheme: concept-SD-electronique-composants-electroniques
in scheme: concepts
notation: INFO549

appliquette
type: ConceptConcept
type: Concept
creator: Commission d'enrichissement de la langue française, FranceTerme
date parution JO: 1999-03-16
equivalent EN: applet @en
equivalent EN: applet (en)
part of speech: nom féminin
definition: Petite application indépendante du matériel et du logiciel utilisés, qui est téléchargée depuis un serveur de la toile et qui est exécutée localement au sein d'un logiciel de navigation.
in scheme: Informatique
in scheme: concept-SD-informatique-internet
in scheme: concepts
notation: INFO55
note: Les appliquettes sont surtout employées dans le langage de programmation Java.
related: témoin de connexion
related: logiciel de navigation
related: code à octets
related: toile

bloc-notes électronique
type: ConceptConcept
type: Concept
creator: Commission d'enrichissement de la langue française, FranceTerme
source: révision de l'arrêté du 19 février 1993
abbreviation: notebook @en
date parution JO: 2000-09-22
equivalent EN: notebook @en
equivalent EN: notebook (en)
equivalent EN: notebook computer @en
equivalent EN: notebook computer (en)
in scheme: Informatique
in scheme: concepts
notation: INFO551

calculateur
type: ConceptConcept
type: Concept
creator: Commission d'enrichissement de la langue française, FranceTerme
source: révision de l'arrêté du 12 août 1976
date parution JO: 2000-09-22
equivalent EN: computer @en
equivalent EN: computer (en)
part of speech: nom masculin
in scheme: Informatique
in scheme: concepts
notation: INFO552
related: concept-QUAN19

cédérom interactif
type: ConceptConcept
type: Concept
creator: Commission d'enrichissement de la langue française, FranceTerme
source: révision de l'arrêté du 27 août 1992
abbreviation: CD-I @en
date parution JO: 2000-09-22
equivalent EN: CD-I @en
equivalent EN: CD-I (en)
equivalent EN: compact disk-interactive @en
equivalent EN: compact disk-interactive (en)
in scheme: Informatique
in scheme: concepts
notation: INFO553

console de visualisation
type: ConceptConcept
type: Concept
creator: Commission d'enrichissement de la langue française, FranceTerme
source: révision de l'arrêté du 25 septembre 1984
date parution JO: 2000-09-22
equivalent EN: display unit @en
equivalent EN: display unit (en)
in scheme: Informatique
in scheme: concepts
notation: INFO554

défilement
type: ConceptConcept
type: Concept
creator: Commission d'enrichissement de la langue française, FranceTerme
source: révision de l'arrêté du 30 mars 1987
date parution JO: 2000-09-22
equivalent EN: scrolling @en
equivalent EN: scrolling (en)
part of speech: nom masculin
in scheme: Informatique
in scheme: concepts
notation: INFO555

disque compact
type: ConceptConcept
type: Concept
creator: Commission d'enrichissement de la langue française, FranceTerme
source: révision de l'arrêté du 10 octobre 1985
abbreviation: CD @en
date parution JO: 2000-09-22
equivalent EN: CD @en
equivalent EN: CD (en)
equivalent EN: compact disc @en
equivalent EN: compact disc (en)
equivalent EN: compact disk @en
equivalent EN: compact disk (en)
in scheme: Audiovisuel
in scheme: Informatique
in scheme: concepts
notation: INFO556
related: concept-INFO96

disquette
type: ConceptConcept
type: Concept
creator: Commission d'enrichissement de la langue française, FranceTerme
source: révision de l'arrêté du 22 décembre 1981
date parution JO: 2000-09-22
equivalent EN: diskette @en
equivalent EN: diskette (en)
equivalent EN: floppy disk @en
equivalent EN: floppy disk (en)
part of speech: nom féminin
in scheme: Informatique
in scheme: concepts
notation: INFO558

instruction
type: ConceptConcept
type: Concept
creator: Commission d'enrichissement de la langue française, FranceTerme
source: révision de l'arrêté du 22 décembre 1981
date parution JO: 2000-09-22
equivalent EN: instruction @en
equivalent EN: instruction (en)
equivalent EN: statement @en
equivalent EN: statement (en)
part of speech: nom féminin
in scheme: Informatique
in scheme: concepts
notation: INFO559

pirate
type: ConceptConcept
type: Concept
creator: Commission d'enrichissement de la langue française, FranceTerme
date parution JO: 1999-03-16
equivalent EN: cracker @en
equivalent EN: cracker (en)
part of speech: nom masculin
definition: Personne qui contourne ou détruit les protections d'un logiciel, d'un ordinateur ou d'un réseau informatique.
in scheme: Informatique
in scheme: concept-SD-informatique-internet
in scheme: concepts
notation: INFO56
related: cyberactiviste
related: fouineur
related: concept-JURI58

mot clé
type: ConceptConcept
type: Concept
creator: Commission d'enrichissement de la langue française, FranceTerme
source: révision de l'arrêté du 30 décembre 1983
date parution JO: 2000-09-22
equivalent EN: key word @en
equivalent EN: key word (en)
in scheme: Informatique
in scheme: concepts
notation: INFO561
related: indexation personnelle
related: référencement abusif

ordinateur de poche
type: ConceptConcept
type: Concept
creator: Commission d'enrichissement de la langue française, FranceTerme
source: révision de l'arrêté du 19 février 1993
date parution JO: 2000-09-22
equivalent EN: palmtop computer @en
equivalent EN: palmtop computer (en)
equivalent EN: pocket computer @en
equivalent EN: pocket computer (en)
in scheme: Informatique
in scheme: concepts
notation: INFO563
related: agenda électronique
related: assistant électronique de poche

ordinateur individuel
type: ConceptConcept
type: Concept
creator: Commission d'enrichissement de la langue française, FranceTerme
source: révision de l'arrêté du 30 décembre 1983
abbreviation: PC @en
date parution JO: 2000-09-22
equivalent EN: PC @en
equivalent EN: PC (en)
equivalent EN: personal computer @en
equivalent EN: personal computer (en)
in scheme: Informatique
in scheme: concepts
notation: INFO564

ordinateur portable
type: ConceptConcept
type: Concept
creator: Commission d'enrichissement de la langue française, FranceTerme
source: révision de l'arrêté du 19 février 1993
date parution JO: 2000-09-22
deconseille ou frequent: laptop
equivalent EN: lap top computer @en
equivalent EN: lap top computer (en)
equivalent EN: portable computer @en
equivalent EN: portable computer (en)
alternative label: ordinateur portatif
in scheme: Informatique
in scheme: concepts
notation: INFO565

publication assistée par ordinateur
type: ConceptConcept
type: Concept
creator: Commission d'enrichissement de la langue française, FranceTerme
source: révision de l'arrêté du 19 février 1993
abbreviation: PAO
date parution JO: 2000-09-22
equivalent EN: desktop publishing @en
equivalent EN: desktop publishing (en)
in scheme: Informatique
in scheme: concepts
notation: INFO567

tirage
type: ConceptConcept
type: Concept
creator: Commission d'enrichissement de la langue française, FranceTerme
source: révision de l'arrêté du 22 décembre 1981
date parution JO: 2000-09-22
equivalent EN: hard copy @en
equivalent EN: hard copy (en)
part of speech: nom masculin
in scheme: Informatique
in scheme: concepts
notation: INFO568

traitement de texte
type: ConceptConcept
type: Concept
creator: Commission d'enrichissement de la langue française, FranceTerme
source: révision de l'arrêté du 30 mars 1987
date parution JO: 2000-09-22
equivalent EN: text processing @en
equivalent EN: text processing (en)
equivalent EN: word processing @en
equivalent EN: word processing (en)
in scheme: Informatique
in scheme: concepts
notation: INFO569
related: logiciel de traitement de texte

logiciel médiateur
type: ConceptConcept
type: Concept
creator: Commission d'enrichissement de la langue française, FranceTerme
date parution JO: 1999-03-16
deconseille ou frequent: middelware
equivalent EN: middleware @en
equivalent EN: middleware (en)
definition: Logiciel qui permet le fonctionnement de plusieurs ordinateurs en coordination, en attribuant à chacun une tâche spécifique, comme les échanges avec les utilisateurs, l'accès aux bases de données ou aux réseaux.
in scheme: Informatique
in scheme: concepts
notation: INFO57
note: Le terme « logiciel médiateur » désigne aussi un logiciel qui permet de coordonner le fonctionnement de plusieurs logiciels au sein d'un même ordinateur.

version
type: ConceptConcept
type: Concept
creator: Commission d'enrichissement de la langue française, FranceTerme
source: révision de l'arrêté du 30 mars 1987
date parution JO: 2000-09-22
equivalent EN: release @en
equivalent EN: release (en)
part of speech: nom féminin
in scheme: Informatique
in scheme: concepts
notation: INFO570
related: révision

microprogramme
type: ConceptConcept
type: Concept
creator: Commission d'enrichissement de la langue française, FranceTerme
source: révision de l'arrêté du 30 décembre 1983
date parution JO: 2000-09-22
equivalent EN: firmware @en
equivalent EN: firmware (en)
part of speech: nom masculin
in scheme: Informatique
in scheme: concepts
notation: INFO571

conception assistée par ordinateur appliquée à l'électronique
type: ConceptConcept
type: Concept
creator: Commission d'enrichissement de la langue française, FranceTerme
source: révision de l'arrêté du 29 avril 1992
abbreviation: CAOE
abbreviation: ECAD @en
date parution JO: 2000-09-22
equivalent EN: ECAD @en
equivalent EN: ECAD (en)
equivalent EN: electronic computer-aided design @en
equivalent EN: electronic computer-aided design (en)
in scheme: Électronique
in scheme: concept-SD-electronique-composants-electroniques
in scheme: concepts
notation: INFO572

conception pour test
type: ConceptConcept
type: Concept
creator: Commission d'enrichissement de la langue française, FranceTerme
source: révision de l'arrêté du 29 avril 1992
date parution JO: 2000-09-22
equivalent EN: design for testability @en
equivalent EN: design for testability (en)
in scheme: Électronique
in scheme: concept-SD-electronique-composants-electroniques
in scheme: concepts
notation: INFO573

motif
type: ConceptConcept
type: Concept
creator: Commission d'enrichissement de la langue française, FranceTerme
source: révision de l'arrêté du 29 avril 1992
date parution JO: 2000-09-22
equivalent EN: pattern @en
equivalent EN: pattern (en)
part of speech: nom masculin
in scheme: Électronique
in scheme: concept-SD-electronique-composants-electroniques
in scheme: concepts
notation: INFO575

module d'extension
type: ConceptConcept
type: Concept
creator: Commission d'enrichissement de la langue française, FranceTerme
date parution JO: 1999-03-16
deconseille ou frequent: plugin
equivalent EN: plug-in @en
equivalent EN: plug-in (en)
forme abregee: extension, n.f.
definition: Élément logiciel que l'on adjoint à une application pour en étendre les fonctions.
in scheme: Informatique
in scheme: concept-SD-informatique-internet
in scheme: concepts
notation: INFO58
related: concept-INFO949

agent
type: ConceptConcept
type: Concept
creator: Commission d'enrichissement de la langue française, FranceTerme
date parution JO: 2000-09-01
deconseille ou frequent: agent intelligent
equivalent EN: agent @en
equivalent EN: agent (en)
part of speech: nom masculin
definition: Logiciel envoyé sur un réseau pour effectuer une tâche à la place de l'utilisateur et sans son intervention.
in scheme: Informatique
in scheme: concept-SD-informatique-internet
in scheme: concepts
notation: INFO587
note: 1. On utilise, par exemple, les agents pour le filtrage d'informations et la recherche sur l'internet.
note: 2. Un agent est dit « intelligent » lorsqu'il utilise les techniques de l'intelligence artificielle.
related: concept-INFO947
related: concept-INFO948

page d'accueil
type: ConceptConcept
type: Concept
creator: Commission d'enrichissement de la langue française, FranceTerme
date parution JO: 1999-03-16
equivalent EN: home page @en
equivalent EN: home page (en)
equivalent EN: homepage @en
equivalent EN: homepage (en)
definition: Page de présentation d'un site sur la toile.
in scheme: Informatique
in scheme: Télécommunications
in scheme: concept-SD-informatique-internet
in scheme: concept-SD-telecommunications-internet
in scheme: concepts
notation: INFO59
related: logiciel de navigation
related: site
related: adresse universelle
related: toile
related: concept-INFO974

ancre
type: ConceptConcept
type: Concept
creator: Commission d'enrichissement de la langue française, FranceTerme
date parution JO: 2002-12-08
equivalent EN: anchor @en
equivalent EN: anchor (en)
part of speech: nom féminin
alternative label: point d'ancrage
definition: Zone déterminée d'un document servant de départ ou d'arrivée à un lien hypertextuel avec une autre zone de ce document ou avec une zone déterminée d'un autre document.
in scheme: Informatique
in scheme: concept-SD-informatique-internet
in scheme: concepts
notation: INFO595
related: hypertexte
related: hypertextuel

anneau de sites
type: ConceptConcept
type: Concept
creator: Commission d'enrichissement de la langue française, FranceTerme
date parution JO: 2002-12-08
equivalent EN: webring @en
equivalent EN: webring (en)
definition: Ensemble de sites sur la toile, consacrés à des sujets apparentés et ayant entre eux des liens privilégiés.
in scheme: Informatique
in scheme: Télécommunications
in scheme: concept-SD-informatique-internet
in scheme: concept-SD-telecommunications-internet
in scheme: concepts
notation: INFO596

arrobe
type: ConceptConcept
type: Concept
creator: Commission d'enrichissement de la langue française, FranceTerme
date parution JO: 2002-12-08
deconseille ou frequent: @
equivalent EN: at-sign @en
equivalent EN: at-sign (en)
part of speech: nom féminin
alternative label: arobase
definition: Caractère @ fréquemment employé dans les adresses de courrier électronique pour séparer le nom identifiant l'utilisateur de celui du gestionnaire de la messagerie.
in scheme: Informatique
in scheme: Télécommunications
in scheme: concept-SD-informatique-internet
in scheme: concept-SD-telecommunications-internet
in scheme: concepts
notation: INFO597
note: 1. @ est à l'origine le symbole de l'arroba (de l'arabe ar-roub, le « quart »), ancienne unité de capacité et de poids espagnole et portugaise. Ce sigle est également utilisé dans les langues anglo-saxonnes, dans des formules telles que « tant de tel article @ tant l'unité ». Dans ces emplois, il est appelé « a commercial », et son tracé, identique à celui de l'arroba, résulterait de la ligature de l'accent grave avec le « a » de la préposition française « à », autrefois d'usage courant dans le commerce international.
note: 2. Lorsqu'une adresse est fournie oralement, @ se dit « arrobe » alors qu'il se dit at en anglais.

calcul intensif
type: ConceptConcept
type: Concept
creator: Commission d'enrichissement de la langue française, FranceTerme
date parution JO: 1998-10-10
equivalent EN: supercomputing @en
equivalent EN: supercomputing (en)
definition: Ensemble des techniques et des moyens destinés à traiter des applications complexes en faisant appel à des ordinateurs spécialisés dans le traitement rapide de gros volumes de données numériques.
in scheme: Informatique
in scheme: concepts
notation: INFO6
related: concept-QUAN18
related: concept-QUAN19

incendier
type: ConceptConcept
type: Concept
creator: Commission d'enrichissement de la langue française, FranceTerme
date parution JO: 2002-12-08
deconseille ou frequent: to flame
equivalent EN: flame @en
equivalent EN: flame (en)
part of speech: verbe
definition: Adresser à un ou plusieurs internautes un message électronique à caractère agressif ou malveillant.
in scheme: Informatique
in scheme: Télécommunications
in scheme: concept-SD-informatique-internet
in scheme: concept-SD-telecommunications-internet
in scheme: concepts
notation: INFO601
related: message incendiaire
related: bombardement

message incendiaire
type: ConceptConcept
type: Concept
creator: Commission d'enrichissement de la langue française, FranceTerme
date parution JO: 2002-12-08
equivalent EN: flame @en
equivalent EN: flame (en)
definition: Message à caractère agressif ou malveillant adressé à un ou plusieurs internautes sur un réseau.
in scheme: Informatique
in scheme: Télécommunications
in scheme: concept-SD-informatique-internet
in scheme: concept-SD-telecommunications-internet
in scheme: concepts
notation: INFO602
related: incendier
related: bombardement

portail
type: ConceptConcept
type: Concept
creator: Commission d'enrichissement de la langue française, FranceTerme
date parution JO: 2002-12-08
equivalent EN: portal @en
equivalent EN: portal (en)
part of speech: nom masculin
definition: Page d'accueil d'un site de l'internet mettant à la disposition de l'internaute un large ensemble de ressources et services intérieurs et extérieurs au site.
in scheme: Informatique
in scheme: Télécommunications
in scheme: concept-SD-informatique-internet
in scheme: concept-SD-telecommunications-internet
in scheme: concepts
notation: INFO603
note: Par extension, ce terme désigne aussi l'organisme qui fournit une telle page d'accueil.
related: site
related: portail de messagerie

site
type: ConceptConcept
type: Concept
creator: Commission d'enrichissement de la langue française, FranceTerme
date parution JO: 2002-12-08
deconseille ou frequent: site de la toile
deconseille ou frequent: site sur la toile
deconseille ou frequent: site web
equivalent EN: web site @en
equivalent EN: web site (en)
equivalent EN: web-site @en
equivalent EN: web-site (en)
equivalent EN: website @en
equivalent EN: website (en)
part of speech: nom masculin
broader: internet
definition: Ensemble de documents et d'applications placés sous une même autorité et accessibles par la toile à partir d'une même adresse universelle.
in scheme: Informatique
in scheme: Télécommunications
in scheme: concept-SD-informatique-internet
in scheme: concept-SD-telecommunications-internet
in scheme: concepts
notation: INFO612
note: Un site de la toile peut être inclus dans un site plus important.
related: page d'accueil
related: portail
related: adresse universelle
related: blogue

additif
type: ConceptConcept
type: Concept
creator: Commission d'enrichissement de la langue française, FranceTerme
date parution JO: 2003-02-27
deconseille ou frequent: addon
equivalent EN: add-on @en
equivalent EN: add-on (en)
part of speech: nom masculin
definition: Module complémentaire d'un logiciel ou d'un matériel existant, qui lui apporte des améliorations ou des extensions et ne peut fonctionner qu'avec lui.
in scheme: Informatique
in scheme: concepts
notation: INFO613

adressage dispersé
type: ConceptConcept
type: Concept
creator: Commission d'enrichissement de la langue française, FranceTerme
date parution JO: 2003-02-27
equivalent EN: hash code @en
equivalent EN: hash code (en)
equivalent EN: hash coding @en
equivalent EN: hash coding (en)
definition: Technique logicielle de gestion de données faisant appel à une fonction de hachage sur chaque donnée pour calculer l'emplacement où doit être rangée cette donnée.
in scheme: Informatique
in scheme: concepts
notation: INFO614
related: hachage

assistant électronique de poche
type: ConceptConcept
type: Concept
creator: Commission d'enrichissement de la langue française, FranceTerme
abbreviation: ADP
abbreviation: PDA @en
date parution JO: 2003-02-27
equivalent EN: PDA @en
equivalent EN: PDA (en)
equivalent EN: personal digital assistant @en
equivalent EN: personal digital assistant (en)
definition: Ordinateur tenant dans la main, prévu pour la gestion de données personnelles et permettant le traitement de l'information en liaison avec un ordinateur principal, un téléphone mobile, etc.
in scheme: Informatique
in scheme: concepts
notation: INFO615
note: Certains assistants électroniques particulièrement compacts et munis d'un écran tactile sont spécialement destinés à la consultation de l'information.
related: ordinateur de poche

extensibilité
type: ConceptConcept
type: Concept
creator: Commission d'enrichissement de la langue française, FranceTerme
date parution JO: 2003-02-27
equivalent EN: scalability @en
equivalent EN: scalability (en)
part of speech: nom féminin
definition: Aptitude d'un produit ou d'un système à fonctionner correctement, sans perdre ses propriétés essentielles, lors d'un changement d'échelle d'un ou plusieurs paramètres.
in scheme: Informatique
in scheme: Télécommunications
in scheme: concepts
notation: INFO618
note: Un exemple d'extensibilité est l'aptitude d'un serveur ou d'un autocommutateur à répondre, avec la même qualité, à un grand nombre d'accès simultanés comme à un petit nombre, grâce à un ajout planifié de ressources. Un tel système est dit extensible.
related: concept-TELE368

exploration de données
type: ConceptConcept
type: Concept
creator: Commission d'enrichissement de la langue française, FranceTerme
date parution JO: 2003-02-27
equivalent EN: data mining @en
equivalent EN: data mining (en)
equivalent EN: datamining @en
equivalent EN: datamining (en)
definition: Processus de recherche dans un ensemble de données destiné à détecter des corrélations cachées ou des informations nouvelles.
in scheme: Informatique
in scheme: concepts
notation: INFO619
related: expert, -e en mégadonnées

flux de travaux
type: ConceptConcept
type: Concept
creator: Commission d'enrichissement de la langue française, FranceTerme
date parution JO: 2003-02-27
equivalent EN: workflow @en
equivalent EN: workflow (en)
forme abregee: flux, n.m.
definition: Processus industriel ou administratif au cours duquel des tâches, des documents et des informations sont traités successivement, selon des règles prédéfinies, en vue de réaliser un produit ou de fournir un service.
in scheme: Informatique
in scheme: concepts
notation: INFO620
note: Un flux fait généralement l'objet de traitements par programmes informatiques.

hachage
type: ConceptConcept
type: Concept
creator: Commission d'enrichissement de la langue française, FranceTerme
date parution JO: 2003-02-27
equivalent EN: hash code @en
equivalent EN: hash code (en)
part of speech: nom masculin
definition: Opération consistant à déterminer une information de taille fixe et réduite à partir d'une donnée de taille indifférente, de telle façon que deux données quelconques aient une faible probabilité de produire le même résultat ; par extension, résultat de cette opération.
in scheme: Informatique
in scheme: concepts
notation: INFO621
note: Le hachage est utilisé en particulier : pour l'adressage dispersé ; pour la vérification de l'intégrité d'un document lors de sa transmission, le résultat du hachage de ce document, effectué au départ, étant transmis avec lui et vérifié à l'arrivée ; pour la signature électronique d'un document, par exemple en chiffrant le résultat du hachage de ce document au moyen de la clé secrète.
related: adressage dispersé
related: validation de bloc
related: concept-anonymisation-des-donnees

retouche
type: ConceptConcept
type: Concept
creator: Commission d'enrichissement de la langue française, FranceTerme
date parution JO: 2003-02-27
equivalent EN: patch @en
equivalent EN: patch (en)
part of speech: nom féminin
alternative label: correctif
definition: Modification destinée à corriger provisoirement un défaut dans un programme informatique existant, dans l'attente d'une nouvelle version.
in scheme: Informatique
in scheme: concepts
notation: INFO625

logiciel-socle
type: ConceptConcept
type: Concept
creator: Commission d'enrichissement de la langue française, FranceTerme
date parution JO: 2003-02-27
equivalent EN: baseware @en
equivalent EN: baseware (en)
forme abregee: socle, n.m.
part of speech: nom masculin
definition: Logiciel qui prend en charge les particularités matérielles d'un ordinateur ou d'un réseau.
in scheme: Informatique
in scheme: Télécommunications
in scheme: concepts
notation: INFO626

magasin de données
type: ConceptConcept
type: Concept
creator: Commission d'enrichissement de la langue française, FranceTerme
date parution JO: 2003-02-27
equivalent EN: datamart @en
equivalent EN: datamart (en)
definition: Entrepôt de données spécialisé, destiné à ne contenir que les informations élaborées pour un objectif particulier.
in scheme: Informatique
in scheme: concepts
notation: INFO627

morphose
type: ConceptConcept
type: Concept
creator: Commission d'enrichissement de la langue française, FranceTerme
date parution JO: 2003-02-27
equivalent EN: morphing @en
equivalent EN: morphing (en)
part of speech: nom féminin
definition: Transformation progressive d'une image en une autre par traitement informatique.
in scheme: Informatique
in scheme: concepts
notation: INFO628

nommage
type: ConceptConcept
type: Concept
creator: Commission d'enrichissement de la langue française, FranceTerme
date parution JO: 2003-02-27
equivalent EN: naming @en
equivalent EN: naming (en)
part of speech: nom masculin
definition: Attribution de noms identifiant des éléments d'un réseau ou des utilisateurs.
in scheme: Informatique
in scheme: Télécommunications
in scheme: concepts
notation: INFO629
note: Dans l'internet, l'attribution d'un nom de domaine à un organisme utilisateur est une opération de nommage ; exemple : .fr, .com, .gouv.

forum
type: ConceptConcept
type: Concept
creator: Commission d'enrichissement de la langue française, FranceTerme
date parution JO: 2000-09-01
deconseille ou frequent: BBS
deconseille ou frequent: Bulletin Board System
equivalent EN: newsgroup @en
equivalent EN: newsgroup (en)
part of speech: nom masculin
definition: Service permettant discussions et échanges sur un thème donné : chaque utilisateur peut lire à tout moment les interventions de tous les autres et apporter sa propre contribution sous forme d'articles.
in scheme: Informatique
in scheme: Télécommunications
in scheme: concept-SD-informatique-internet
in scheme: concept-SD-telecommunications-internet
in scheme: concepts
notation: INFO634
note: Par extension, on désigne également par ce terme les systèmes de discussion télématiques, qui offrent généralement un service de téléchargement (connus en anglais sous le nom de BBS, bulletin board system).
related: article de forum
related: fil de la discussion
related: modérateur, -trice
related: fureteur, -euse

ordinateur de bureau
type: ConceptConcept
type: Concept
creator: Commission d'enrichissement de la langue française, FranceTerme
source: révision de l'arrêté du 19 février 1993
abbreviation: desktop @en
date parution JO: 2000-09-22
equivalent EN: desktop @en
equivalent EN: desktop (en)
equivalent EN: desktop computer @en
equivalent EN: desktop computer (en)
in scheme: Informatique
in scheme: concepts
notation: INFO635

adresse de courrier électronique
type: ConceptConcept
type: Concept
creator: Commission d'enrichissement de la langue française, FranceTerme
date parution JO: 2003-06-20
equivalent EN: e-mail address @en
equivalent EN: e-mail address (en)
forme abregee: adresse électronique
definition: Libellé permettant l'identification d'un utilisateur de messagerie électronique et l'acheminement des messages qui lui sont destinés.
in scheme: Informatique
in scheme: Télécommunications
in scheme: concepts
notation: INFO637
note: L'adresse électronique est, dans le cas de l'internet, constituée des identifiants de l'utilisateur et du gestionnaire de la messagerie, séparés par le caractère arrobe @. L'identifiant du gestionnaire de la messagerie comprend des désignations éventuelles de sous-domaines, celle d'un domaine, enfin un suffixe correspondant le plus souvent au pays ou au type d'organisme (exemples : .fr, .com).
related: courriel
related: messagerie électronique
scope note: Cette publication annule et remplace celle du Journal officiel du 2 décembre 1997.

courriel
type: ConceptConcept
type: Concept
creator: Commission d'enrichissement de la langue française, FranceTerme
date parution JO: 2003-06-20
deconseille ou frequent: email
deconseille ou frequent: mail
equivalent EN: e-mail @en
equivalent EN: e-mail (en)
equivalent EN: electronic mail @en
equivalent EN: electronic mail (en)
part of speech: nom masculin
alternative label: courrier électronique
alternative label: message électronique
definition: Document informatisé qu'un utilisateur saisit, envoie ou consulte en différé par l'intermédiaire d'un réseau.
in scheme: Informatique
in scheme: Télécommunications
in scheme: concepts
notation: INFO638
note: 1. Un courriel contient le plus souvent un texte auquel peuvent être joints d'autres textes, des images ou des sons.
note: 2. Par extension, le terme « courriel » et son synonyme « courrier électronique » sont employés au sens de « messagerie électronique ».
related: adresse de courrier électronique
related: messagerie électronique

messagerie électronique
type: ConceptConcept
type: Concept
creator: Commission d'enrichissement de la langue française, FranceTerme
date parution JO: 2003-06-20
equivalent EN: e-mail @en
equivalent EN: e-mail (en)
equivalent EN: electronic mail @en
equivalent EN: electronic mail (en)
equivalent EN: electronic messaging @en
equivalent EN: electronic messaging (en)
definition: Service permettant aux utilisateurs habilités de saisir, envoyer ou consulter en différé des courriels.
in scheme: Informatique
in scheme: Télécommunications
in scheme: concepts
notation: INFO641
note: On trouve aussi dans ce sens les termes « courriel » et « courrier électronique ».
related: adresse de courrier électronique
related: courriel
related: Mél.
related: portail de messagerie
scope note: Cette publication annule et remplace celle du Journal officiel du 2 décembre 1997.

Mél.
type: ConceptConcept
type: Concept
creator: Commission d'enrichissement de la langue française, FranceTerme
date parution JO: 2003-06-20
part of speech: symbole
definition: Symbole de « messagerie électronique » qui peut figurer devant l'adresse électronique sur un document (papier à lettres ou carte de visite, par exemple), tout comme Tél. devant le numéro de téléphone.
in scheme: Informatique
in scheme: Télécommunications
in scheme: concepts
notation: INFO650
note: « Mél. » ne doit pas être employé comme substantif.
related: messagerie électronique

vérification de la conformité aux règles d'interconnexion
type: ConceptConcept
type: Concept
creator: Commission d'enrichissement de la langue française, FranceTerme
source: révision de l'arrêté du 12 août 1976
abbreviation: ERC @en
date parution JO: 2000-09-22
equivalent EN: ERC @en
equivalent EN: ERC (en)
equivalent EN: electrical rule checking @en
equivalent EN: electrical rule checking (en)
forme abregee: vérification des règles d'interconnexion
definition: Vérification effectuée par logiciel de la conformité des interconnexions électriques aux règles imposées par la technologie de fabrication.
in scheme: Électronique
in scheme: concept-SD-electronique-composants-electroniques
in scheme: concepts
notation: INFO651
related: vérification des règles de conception

adresse universelle
type: ConceptConcept
type: Concept
creator: Commission d'enrichissement de la langue française, FranceTerme
abbreviation: URL @en
date parution JO: 1999-03-16
equivalent EN: URL @en
equivalent EN: URL (en)
equivalent EN: uniform resource locator @en
equivalent EN: uniform resource locator (en)
equivalent EN: universal resource locator @en
equivalent EN: universal resource locator (en)
alternative label: adresse réticulaire
broader: internet
definition: Dénomination unique à caractère universel qui permet de localiser une ressource ou un document sur l'internet, et qui indique la méthode pour y accéder, le nom du serveur et le chemin à l'intérieur du serveur.
in scheme: Informatique
in scheme: Télécommunications
in scheme: concept-SD-informatique-internet
in scheme: concept-SD-telecommunications-internet
in scheme: concepts
notation: INFO654
note: Par exemple, l'adresse universelle de la page d'accueil de la Délégation générale à la langue française est « http://www.culture.gouv.fr/culture/dglf/accueil.htm ». Elle comprend trois parties : « http » indique la méthode d'accès ; « www.culture.gouv.fr » est le nom du serveur du ministère de la culture et de la communication en France sur la toile ; « culture/dglf/accueil.htm » est le chemin d'accès au document.
related: signet
related: page d'accueil
related: site
related: domaine
related: système d'adressage par domaines
related: internet
related: concept-INFO970
related: concept-INFO971

autoroutes de l'information
type: ConceptConcept
type: Concept
creator: Commission d'enrichissement de la langue française, FranceTerme
date parution JO: 1999-03-16
deconseille ou frequent: inforoute
equivalent EN: Infobahn @de
equivalent EN: Infobahn (de)
equivalent EN: information highway @en
equivalent EN: information highway (en)
equivalent EN: information superhighway @en
equivalent EN: information superhighway (en)
definition: Structure constituée par des moyens de télécommunication et d'informatique interconnectés, qui permet d'offrir à un très grand nombre d'usagers de multiples services, en général à débit élevé, y compris des services audiovisuels.
in scheme: Télécommunications
in scheme: concept-SD-telecommunications-internet
in scheme: concept-SD-telecommunications-reseaux
in scheme: concepts
notation: INFO655
note: On rencontre aussi le terme « inforoute », qui n'est pas recommandé.

concentrateur
type: ConceptConcept
type: Concept
creator: Commission d'enrichissement de la langue française, FranceTerme
date parution JO: 1999-03-16
equivalent EN: hub @en
equivalent EN: hub (en)
part of speech: nom masculin
definition: Dispositif informatique placé au nœud d'un réseau en étoile, qui concentre et distribue les communications de données.
in scheme: Télécommunications
in scheme: concept-SD-telecommunications-internet
in scheme: concept-SD-telecommunications-reseaux
in scheme: concepts
notation: INFO657
note: Un concentrateur n'assure ni routage, ni commutation.
related: concept-TELE87

diffusion systématique sur la toile
type: ConceptConcept
type: Concept
creator: Commission d'enrichissement de la langue française, FranceTerme
date parution JO: 1999-03-16
equivalent EN: netcasting @en
equivalent EN: netcasting (en)
equivalent EN: webcasting @en
equivalent EN: webcasting (en)
forme abregee: diffusion réticulaire
forme abregee: diffusion sur la toile
alternative label: diffusion réticulaire systématique
definition: Envoi systématique de données ou de documents à des utilisateurs de la toile.
in scheme: Informatique
in scheme: Télécommunications
in scheme: concept-SD-informatique-internet
in scheme: concept-SD-telecommunications-internet
in scheme: concepts
notation: INFO658
related: distribution sélective
related: toile

distribution sélective
type: ConceptConcept
type: Concept
creator: Commission d'enrichissement de la langue française, FranceTerme
date parution JO: 1999-03-16
equivalent EN: push technology @en
equivalent EN: push technology (en)
alternative label: diffusion sélective
alternative label: distribution personnalisée
definition: Technique utilisée pour faire bénéficier automatiquement un utilisateur de la toile, à sa demande, d'un envoi de données d'un type choisi.
in scheme: Informatique
in scheme: Télécommunications
in scheme: concept-SD-informatique-internet
in scheme: concept-SD-telecommunications-internet
in scheme: concepts
notation: INFO659
note: La distribution sélective se distingue de la recherche individuelle.
related: diffusion systématique sur la toile
related: recherche individuelle
related: toile

domaine
type: ConceptConcept
type: Concept
creator: Commission d'enrichissement de la langue française, FranceTerme
date parution JO: 1999-03-16
equivalent EN: domain @en
equivalent EN: domain (en)
part of speech: nom masculin
broader: internet
definition: Ensemble d'adresses faisant l'objet d'une gestion commune.
in scheme: Informatique
in scheme: Télécommunications
in scheme: concept-SD-informatique-internet
in scheme: concept-SD-telecommunications-internet
in scheme: concepts
notation: INFO660
related: adresse universelle
related: système d'adressage par domaines
related: dévoiement
related: concept-TELE454

dorsale
type: ConceptConcept
type: Concept
creator: Commission d'enrichissement de la langue française, FranceTerme
date parution JO: 1999-03-16
equivalent EN: backbone @en
equivalent EN: backbone (en)
part of speech: nom féminin
definition: Partie principale d'un réseau de télécommunication ou de téléinformatique, caractérisée par un débit élevé, qui concentre et transporte les flux de données entre des réseaux affluents.
in scheme: Télécommunications
in scheme: concept-SD-telecommunications-internet
in scheme: concept-SD-telecommunications-reseaux
in scheme: concepts
notation: INFO661
related: concept-INFO952

foire aux questions
type: ConceptConcept
type: Concept
creator: Commission d'enrichissement de la langue française, FranceTerme
abbreviation: FAQ
abbreviation: FAQ file @en
date parution JO: 1999-03-16
equivalent EN: FAQ @en
equivalent EN: FAQ (en)
equivalent EN: FAQ file @en
equivalent EN: FAQ file (en)
equivalent EN: frequently asked questions @en
equivalent EN: frequently asked questions (en)
equivalent EN: frequently asked questions file @en
equivalent EN: frequently asked questions file (en)
alternative label: fichier des questions courantes
alternative label: questions courantes
definition: Rubrique présentant par sujets les questions les plus fréquemment posées par les utilisateurs, accompagnées des réponses correspondantes.
in scheme: Informatique
in scheme: Télécommunications
in scheme: concept-SD-informatique-internet
in scheme: concept-SD-telecommunications-internet
in scheme: concepts
notation: INFO663
note: La foire aux questions a, en particulier, pour but de faciliter l'intégration des internautes novices dans un groupe de discussion et de diminuer le nombre des messages diffusés dans le réseau.

fournisseur d'accès
type: ConceptConcept
type: Concept
creator: Commission d'enrichissement de la langue française, FranceTerme
date parution JO: 1999-03-16
equivalent EN: access provider @en
equivalent EN: access provider (en)
definition: Organisme offrant à des clients d'accéder à l'internet, ou, plus généralement, à tout réseau de communication.
in scheme: Télécommunications
in scheme: concept-SD-telecommunications-internet
in scheme: concept-SD-telecommunications-services
in scheme: concepts
notation: INFO664
note: Le fournisseur d'accès peut aussi offrir des services en ligne.
related: concept-TELE366

recherche individuelle
type: ConceptConcept
type: Concept
creator: Commission d'enrichissement de la langue française, FranceTerme
date parution JO: 1999-03-16
equivalent EN: pull technology @en
equivalent EN: pull technology (en)
definition: Technique utilisée sur la toile lorsque l'internaute recherche des données par une démarche active au moyen de son logiciel de navigation, qui lui présentera ensuite le résultat de cette recherche.
in scheme: Informatique
in scheme: Télécommunications
in scheme: concept-SD-informatique-internet
in scheme: concept-SD-telecommunications-internet
in scheme: concepts
notation: INFO665
note: La recherche individuelle se distingue de la distribution sélective.
related: distribution sélective

serveur mandataire
type: ConceptConcept
type: Concept
creator: Commission d'enrichissement de la langue française, FranceTerme
abbreviation: proxy @en
date parution JO: 1999-03-16
equivalent EN: proxy @en
equivalent EN: proxy (en)
equivalent EN: proxy server @en
equivalent EN: proxy server (en)
forme abregee: mandataire, n.m.
definition: Dispositif informatique associé à un serveur et réalisant, pour des applications autorisées, des fonctions de médiation, telles que le stockage des documents les plus fréquemment demandés ou l'établissement de passerelles.
in scheme: Informatique
in scheme: Télécommunications
in scheme: concept-SD-informatique-internet
in scheme: concept-SD-telecommunications-internet
in scheme: concepts
notation: INFO666
related: passerelle
related: serveur

internaute
type: ConceptConcept
type: Concept
creator: Commission d'enrichissement de la langue française, FranceTerme
date parution JO: 1999-03-16
deconseille ou frequent: cybernaute
equivalent EN: cybernaut @en
equivalent EN: cybernaut (en)
part of speech: nom
definition: Utilisateur de l'internet.
in scheme: Informatique
in scheme: Télécommunications
in scheme: concept-SD-informatique-internet
in scheme: concept-SD-telecommunications-internet
in scheme: concepts
notation: INFO667
note: On rencontre aussi le terme « cybernaute ».
related: système d'adressage par domaines
related: internet

système d'adressage par domaines
type: ConceptConcept
type: Concept
creator: Commission d'enrichissement de la langue française, FranceTerme
abbreviation: DNS @en
date parution JO: 1999-03-16
equivalent EN: DNS @en
equivalent EN: DNS (en)
equivalent EN: domain name system @en
equivalent EN: domain name system (en)
forme abregee: adressage par domaines
alternative label: annuaire des domaines
broader: internet
definition: Système de bases de données et de serveurs assurant la correspondance entre les noms de domaine ou de site utilisés par les internautes et les adresses numériques utilisables par les ordinateurs.
in scheme: Informatique
in scheme: Télécommunications
in scheme: concept-SD-informatique-internet
in scheme: concept-SD-telecommunications-internet
in scheme: concepts
notation: INFO669
note: 1. Ce système permet aux internautes d'utiliser, dans la rédaction des adresses, des noms faciles à retenir au lieu de la suite de chiffres du protocole IP.
note: 2. Le nom du serveur sur la toile du ministère de la culture et de la communication est « www.culture.gouv.fr ».
related: adresse universelle
related: domaine
related: internaute
related: internet
related: concept-TELE454
related: concept-TELE455
related: concept-TELE456

intranet
type: ConceptConcept
type: Concept
creator: Commission d'enrichissement de la langue française, FranceTerme
date parution JO: 1999-03-16
equivalent EN: intranet @en
equivalent EN: intranet (en)
part of speech: nom masculin
definition: Réseau de télécommunication et de téléinformatique destiné à l'usage exclusif d'un organisme et utilisant les mêmes protocoles et techniques que l'internet.
in scheme: Informatique
in scheme: Télécommunications
in scheme: concept-SD-informatique-internet
in scheme: concept-SD-telecommunications-internet
in scheme: concepts
notation: INFO670
related: extranet
related: internet

passerelle
type: ConceptConcept
type: Concept
creator: Commission d'enrichissement de la langue française, FranceTerme
date parution JO: 1999-03-16
equivalent EN: gateway @en
equivalent EN: gateway (en)
part of speech: nom féminin
definition: Dispositif destiné à connecter des réseaux de télécommunication ayant des architectures différentes ou des protocoles différents, ou offrant des services différents.
in scheme: Informatique
in scheme: Télécommunications
in scheme: concept-SD-informatique-internet
in scheme: concept-SD-telecommunications-internet
in scheme: concepts
notation: INFO671
note: Une passerelle peut par exemple connecter un réseau local d'entreprise avec un autre réseau local ou un réseau public de données.
related: serveur mandataire
related: concept-TELE342
related: concept-TELE376

microsoudeuse de puces
type: ConceptConcept
type: Concept
creator: Commission d'enrichissement de la langue française, FranceTerme
source: révision de l'arrêté du 14 septembre 1990
date parution JO: 2000-09-22
equivalent EN: die bonder @en
equivalent EN: die bonder (en)
definition: Machine de soudage de puces sur substrat.
in scheme: Électronique
in scheme: concept-SD-electronique-composants-electroniques
in scheme: concepts
notation: INFO677
related: ponteuse
related: substrat

extranet
type: ConceptConcept
type: Concept
creator: Commission d'enrichissement de la langue française, FranceTerme
date parution JO: 1999-03-16
equivalent EN: extranet @en
equivalent EN: extranet (en)
part of speech: nom masculin
definition: Réseau de télécommunication et de téléinformatique constitué d'un intranet étendu pour permettre la communication avec certains organismes extérieurs, par exemple des clients ou des fournisseurs.
in scheme: Informatique
in scheme: Télécommunications
in scheme: concept-SD-informatique-internet
in scheme: concept-SD-telecommunications-internet
in scheme: concepts
notation: INFO678
related: intranet

internet
type: ConceptConcept
type: Concept
creator: Commission d'enrichissement de la langue française, FranceTerme
abbreviation: Internet @en
date parution JO: 1999-03-16
deconseille ou frequent: IP
deconseille ou frequent: ISOC
deconseille ou frequent: Internet Protocol
deconseille ou frequent: Internet Society
equivalent EN: Internet @en
equivalent EN: Internet (en)
equivalent EN: Internet network @en
equivalent EN: Internet network (en)
equivalent EN: Net @en
equivalent EN: Net (en)
part of speech: nom masculin invariable
broader: concept-technologies-de-l'information-et-de-la-communication
definition: Global network which associates telecommunication resources and server and client computers, aimed at exchanging electronic messages, multimedia information and files. @en
definition: Réseau mondial associant des ressources de télécommunication et des ordinateurs serveurs et clients, destiné à l'échange de messages électroniques, d'informations multimédias et de fichiers.
in scheme: Informatique
in scheme: Télécommunications
in scheme: concept-SD-informatique-internet
in scheme: concept-SD-telecommunications-internet
in scheme: concepts
narrower: site
narrower: adresse universelle
narrower: domaine
narrower: système d'adressage par domaines
narrower: concept-TELE457
notation: INFO679
note: L'internet fonctionne en utilisant un protocole commun qui permet l'acheminement de proche en proche de messages découpés en paquets indépendants. L'acheminement est fondé sur le protocole IP (Internet Protocol), spécifié par l'Internet Society (ISOC). L'accès au réseau est ouvert à tout utilisateur ayant obtenu une adresse auprès d'un organisme accrédité. La gestion est décentralisée en réseaux interconnectés.
note: The internet works by the means of a joint protocol which enables the peer-to-peer routing of messages divided up into independent packets. Routing is based on the Internet Protocol (IP), which is specified by the Internet Society (ISOC). Network access is open to any user with an address from an accredited body. Management is decentralised into interconnected networks. @en
related: adresse universelle
related: internaute
related: système d'adressage par domaines
related: intranet
related: toile
related: concept-TELE457
related: concept-economie-numerique

accès
type: ConceptConcept
type: Concept
creator: Commission d'enrichissement de la langue française, FranceTerme
date parution JO: 2000-09-01
equivalent EN: hit @en
equivalent EN: hit (en)
part of speech: nom masculin
definition: Le fait d'engager la consultation d'un document sur un serveur.
in scheme: Informatique
in scheme: Télécommunications
in scheme: concept-SD-informatique-internet
in scheme: concept-SD-telecommunications-internet
in scheme: concepts
notation: INFO68
note: 1. Le nombre d'accès est une mesure de l'audience d'un site ou de la fréquence de consultation d'un document.
note: 2. En anglais, le terme hit a un autre sens dans le domaine des moteurs de recherche.
related: visite

microcontrôleur
type: ConceptConcept
type: Concept
creator: Commission d'enrichissement de la langue française, FranceTerme
source: révision de l'arrêté du 14 septembre 1990
date parution JO: 2000-09-22
equivalent EN: microcontroller @en
equivalent EN: microcontroller (en)
part of speech: nom masculin
definition: Circuit intégré comprenant essentiellement un microprocesseur, ses mémoires, et des éléments personnalisés selon l'application.
in scheme: Électronique
in scheme: concept-SD-electronique-composants-electroniques
in scheme: concepts
notation: INFO680
note: Les microcontrôleurs sont d'usage courant, par exemple dans les périphériques d'ordinateurs, les missiles, l'automobile, la conduite des processus industriels, les appareils domestiques.
related: microprocesseur

simulation
type: ConceptConcept
type: Concept
creator: Commission d'enrichissement de la langue française, FranceTerme
source: révision de l'arrêté du 29 avril 1992
date parution JO: 2000-09-22
equivalent EN: simulation @en
equivalent EN: simulation (en)
in scheme: Électronique
in scheme: concept-SD-electronique-composants-electroniques
in scheme: concepts
notation: INFO681

cocuisson
type: ConceptConcept
type: Concept
creator: Commission d'enrichissement de la langue française, FranceTerme
source: révision de l'arrêté du 14 septembre 1990
date parution JO: 2000-09-22
equivalent EN: cofiring @en
equivalent EN: cofiring (en)
part of speech: nom féminin
definition: Opération de cuisson permettant de réaliser un substrat comprenant plusieurs couches par fusion d'un liant.
in scheme: Électronique
in scheme: concept-SD-electronique-composants-electroniques
in scheme: concepts
notation: INFO683
related: cocuit

cocuit
type: ConceptConcept
type: Concept
creator: Commission d'enrichissement de la langue française, FranceTerme
source: révision de l'arrêté du 14 septembre 1990
date parution JO: 2000-09-22
equivalent EN: cofired @en
equivalent EN: cofired (en)
part of speech: adjectif
definition: Qualifie un produit obtenu par cocuisson.
in scheme: Électronique
in scheme: concept-SD-electronique-composants-electroniques
in scheme: concepts
notation: INFO684
related: cocuisson

cofrittage
type: ConceptConcept
type: Concept
creator: Commission d'enrichissement de la langue française, FranceTerme
source: révision de l'arrêté du 14 septembre 1990
date parution JO: 2000-09-22
equivalent EN: cofiring @en
equivalent EN: cofiring (en)
part of speech: nom masculin
definition: Opération de cuisson permettant de réaliser un substrat comprenant plusieurs couches par agglomération des matériaux utilisés.
in scheme: Électronique
in scheme: concept-SD-electronique-composants-electroniques
in scheme: concepts
notation: INFO685
related: cofritté, -e

cofritté, -e
type: ConceptConcept
type: Concept
creator: Commission d'enrichissement de la langue française, FranceTerme
source: révision de l'arrêté du 14 septembre 1990
date parution JO: 2000-09-22
equivalent EN: cofired @en
equivalent EN: cofired (en)
part of speech: adjectif
definition: Se dit d'un produit obtenu par cofrittage.
in scheme: Électronique
in scheme: concept-SD-electronique-composants-electroniques
in scheme: concepts
notation: INFO686
related: cofrittage

testabilité
type: ConceptConcept
type: Concept
creator: Commission d'enrichissement de la langue française, FranceTerme
source: révision de l'arrêté du 29 avril 1992
date parution JO: 2000-09-22
equivalent EN: testability @en
equivalent EN: testability (en)
part of speech: nom féminin
in scheme: Électronique
in scheme: concept-SD-electronique-composants-electroniques
in scheme: concepts
notation: INFO687

arrosage
type: ConceptConcept
type: Concept
creator: Commission d'enrichissement de la langue française, FranceTerme
date parution JO: 2000-09-01
deconseille ou frequent: spam
deconseille ou frequent: spaming
equivalent EN: spamming @en
equivalent EN: spamming (en)
part of speech: nom masculin
definition: Envoi d'un même message électronique à un très grand nombre de destinataires au risque de les importuner.
in scheme: Informatique
in scheme: Télécommunications
in scheme: concept-SD-informatique-internet
in scheme: concept-SD-telecommunications-internet
in scheme: concepts
notation: INFO69
note: Un exemple est l'envoi de messages publicitaires.
related: modérateur, -trice
related: bombardement
related: concept-TELE401

bombe programmée
type: ConceptConcept
type: Concept
creator: Commission d'enrichissement de la langue française, FranceTerme
date parution JO: 2005-05-20
equivalent EN: logic bomb @en
equivalent EN: logic bomb (en)
forme abregee: bombe, n.f.
alternative label: bombe logique
definition: Logiciel malveillant conçu pour causer des dommages à un système informatique et qui est déclenché lorsque certaines conditions sont réunies.
in scheme: Informatique
in scheme: concept-SD-informatique-internet
in scheme: concepts
notation: INFO690
related: logiciel malveillant
related: ver

canular
type: ConceptConcept
type: Concept
creator: Commission d'enrichissement de la langue française, FranceTerme
date parution JO: 2005-05-20
equivalent EN: hoax @en
equivalent EN: hoax (en)
part of speech: nom masculin
definition: Information fausse transmise par messagerie électronique et incitant les destinataires abusés à effectuer des opérations ou à prendre des initiatives inutiles, voire dommageables.
in scheme: Informatique
in scheme: concept-SD-informatique-internet
in scheme: concepts
notation: INFO691
note: Il peut s'agir d'une fausse alerte aux virus, de fausses chaînes de solidarité ou pétitions, de promesses de cadeaux. Les canulars encombrent les réseaux par la retransmission en chaîne du message et incitent parfois le destinataire à effacer des fichiers indispensables au bon fonctionnement de son ordinateur ou à télécharger un fichier contenant un virus ou un ver.
related: virus
related: ver

cheval de Troie
type: ConceptConcept
type: Concept
creator: Commission d'enrichissement de la langue française, FranceTerme
date parution JO: 2005-05-20
equivalent EN: Trojan horse @en
equivalent EN: Trojan horse (en)
definition: Logiciel apparemment inoffensif, installé ou téléchargé et au sein duquel a été dissimulé un programme malveillant qui peut par exemple permettre la collecte frauduleuse, la falsification ou la destruction de données.
in scheme: Informatique
in scheme: concept-SD-informatique-internet
in scheme: concepts
notation: INFO692
related: logiciel rançonneur

fenêtre d'attente
type: ConceptConcept
type: Concept
creator: Commission d'enrichissement de la langue française, FranceTerme
date parution JO: 2005-05-20
equivalent EN: splash screen @en
equivalent EN: splash screen (en)
definition: Fenêtre qui s'affiche provisoirement sur un écran pendant l'installation d'un logiciel.
in scheme: Informatique
in scheme: concepts
notation: INFO693
note: Cette fenêtre incite l'utilisateur à patienter pendant l'exécution de l'opération tout en lui apportant diverses informations.

logiciel antivirus
type: ConceptConcept
type: Concept
creator: Commission d'enrichissement de la langue française, FranceTerme
date parution JO: 2005-05-20
equivalent EN: antivirus program @en
equivalent EN: antivirus program (en)
equivalent EN: antivirus software @en
equivalent EN: antivirus software (en)
equivalent EN: vaccine program @en
equivalent EN: vaccine program (en)
forme abregee: antivirus, n.m.
definition: Logiciel conçu pour détecter les virus et les vers et, le cas échéant, les éliminer ou suggérer des remèdes.
in scheme: Informatique
in scheme: concept-SD-informatique-internet
in scheme: concepts
notation: INFO694
related: signature de virus
related: virus
related: ver

logiciel malveillant
type: ConceptConcept
type: Concept
creator: Commission d'enrichissement de la langue française, FranceTerme
date parution JO: 2005-05-20
deconseille ou frequent: maliciel
equivalent EN: malicious logic @en
equivalent EN: malicious logic (en)
equivalent EN: malicious software @en
equivalent EN: malicious software (en)
equivalent EN: malware @en
equivalent EN: malware (en)
definition: Ensemble de programmes conçu par un pirate pour être implanté dans un système afin d'y déclencher une opération non autorisée ou d'en perturber le fonctionnement.
in scheme: Informatique
in scheme: concept-SD-informatique-internet
in scheme: concepts
notation: INFO695
note: 1. Exemples : bombe programmée, virus, ver.
note: 2. Les logiciels malveillants peuvent être transmis via l'internet ou un réseau local, ou par des supports tels que les disquettes ou les cédéroms.
related: bombe programmée
related: virus
related: ver
related: logiciel rançonneur
related: concept-INFO978
related: concept-JURI58
related: concept-JURI62
related: concept-JURI67

modérateur, -trice
type: ConceptConcept
type: Concept
creator: Commission d'enrichissement de la langue française, FranceTerme
date parution JO: 2005-05-20
deconseille ou frequent: modératrice
equivalent EN: moderator @en
equivalent EN: moderator (en)
part of speech: nom
definition: Personne qui veille au respect de l'objet et du règlement des échanges de messages électroniques effectués dans un cadre organisé.
in scheme: Informatique
in scheme: concept-SD-informatique-internet
in scheme: concepts
notation: INFO696
note: 1. Le modérateur veille notamment à éviter les arrosages publicitaires et les bombardements, ainsi que les propos qui pourraient constituer des infractions pénales.
note: 2. Dans un fonctionnement en différé, comme pour certains forums ou listes de diffusion, le modérateur examine les articles ou messages reçus des participants et en accepte ou en refuse la diffusion. Dans un fonctionnement en direct, le modérateur agit par des avertissements et par exclusion des contrevenants.
related: forum
related: arrosage
related: bombardement

riper
type: ConceptConcept
type: Concept
creator: Commission d'enrichissement de la langue française, FranceTerme
date parution JO: 2005-05-20
deconseille ou frequent: to rip
equivalent EN: rip @en
equivalent EN: rip (en)
part of speech: verbe transitif
definition: Extraire directement d'un support enregistré des données numériques en vue de les reporter sur un autre support, sans recourir à la conversion analogique intermédiaire habituellement nécessaire.
in scheme: Informatique
in scheme: concepts
notation: INFO697
related: ver

signature de virus
type: ConceptConcept
type: Concept
creator: Commission d'enrichissement de la langue française, FranceTerme
date parution JO: 2005-05-20
equivalent EN: virus signature @en
equivalent EN: virus signature (en)
forme abregee: signature, n.f.
definition: Suite d'éléments binaires commune à chacune des copies d'un virus ou d'un ver particulier, et utilisée par les logiciels antivirus pour détecter leur présence.
in scheme: Informatique
in scheme: concept-SD-informatique-internet
in scheme: concepts
notation: INFO698
related: logiciel antivirus
related: virus
related: ver

virus
type: ConceptConcept
type: Concept
creator: Commission d'enrichissement de la langue française, FranceTerme
date parution JO: 2005-05-20
equivalent EN: virus @en
equivalent EN: virus (en)
part of speech: nom masculin
definition: Logiciel malveillant, généralement de petite taille, qui se transmet par les réseaux ou les supports d'information amovibles, s'implante au sein des programmes en les parasitant, se duplique à l'insu des utilisateurs et produit ses effets dommageables quand le programme infecté est exécuté ou quand survient un évènement donné.
in scheme: Informatique
in scheme: concept-SD-informatique-internet
in scheme: concepts
notation: INFO699
note: Dans le langage courant, les vers sont souvent désignés par le terme « virus ».
related: canular
related: logiciel antivirus
related: logiciel malveillant
related: signature de virus
related: ver

cliquer
type: ConceptConcept
type: Concept
creator: Commission d'enrichissement de la langue française, FranceTerme
date parution JO: 1998-10-10
deconseille ou frequent: bouton-poussoir
deconseille ou frequent: cliquet
deconseille ou frequent: to click
equivalent EN: click @en
equivalent EN: click (en)
part of speech: verbe intransitif
definition: Enfoncer et relâcher le bouton-poussoir (ou cliquet) d'une souris ou d'un dispositif similaire.
in scheme: Informatique
in scheme: concepts
notation: INFO7

balise
type: ConceptConcept
type: Concept
creator: Commission d'enrichissement de la langue française, FranceTerme
date parution JO: 2000-09-01
equivalent EN: tag @en
equivalent EN: tag (en)
part of speech: nom féminin
definition: Dans un langage de description de documents, marque destinée à l'identification, la description ou la mise en forme d'un élément de document.
in scheme: Informatique
in scheme: concept-SD-informatique-internet
in scheme: concepts
notation: INFO70

ver
type: ConceptConcept
type: Concept
creator: Commission d'enrichissement de la langue française, FranceTerme
date parution JO: 2005-05-20
equivalent EN: worm @en
equivalent EN: worm (en)
part of speech: nom masculin
definition: Logiciel malveillant indépendant qui se transmet d'ordinateur à ordinateur par l'internet ou tout autre réseau et perturbe le fonctionnement des systèmes concernés en s'exécutant à l'insu des utilisateurs.
in scheme: Informatique
in scheme: concept-SD-informatique-internet
in scheme: concepts
notation: INFO700
note: 1. Contrairement au virus, le ver ne s'implante pas au sein d'un autre programme.
note: 2. Les vers sont souvent conçus pour saturer les ressources disponibles ou allonger la durée des traitements. Ils peuvent aussi détruire les données d'un ordinateur, perturber le fonctionnement du réseau ou transférer frauduleusement des informations. Un ver peut produire des effets soit immédiatement soit de manière différée (à une date donnée, lors de la survenue d'un évènement ou par déclenchement d'une bombe programmée).
note: 3. Bien qu'ils s'en distinguent, les vers sont parfois appelés « virus ».
related: bombe programmée
related: canular
related: logiciel antivirus
related: logiciel malveillant
related: riper
related: signature de virus
related: virus
related: logiciel rançonneur

antémémoire
type: ConceptConcept
type: Concept
creator: Commission d'enrichissement de la langue française, FranceTerme
date parution JO: 2007-04-20
equivalent EN: cache memory @en
equivalent EN: cache memory (en)
equivalent EN: cache storage @en
equivalent EN: cache storage (en)
part of speech: nom féminin
alternative label: mémoire cache
definition: Mémoire très rapide, intercalée entre le processeur et la mémoire principale, que l'ordinateur consulte avant d'interroger la mémoire principale et qui, fournissant les parties de programme et les données les plus utilisées dans le traitement en cours, permet de réduire la durée de celui-ci.
in scheme: Informatique
in scheme: concepts
notation: INFO703
note: La capacité de l'antémémoire est un des éléments déterminants de la puissance de l'ordinateur.
related: cache
scope note: Cette publication annule et remplace celle des termes « mémoire d'accès rapide » et « antémémoire » au Journal officiel du 22 septembre 2000.

cache
type: ConceptConcept
type: Concept
creator: Commission d'enrichissement de la langue française, FranceTerme
date parution JO: 2007-04-20
deconseille ou frequent: antémémoire
equivalent EN: cache @en
equivalent EN: cache (en)
part of speech: nom masculin
definition: Mémoire ou partie de mémoire dans laquelle sont stockés de façon temporaire les données ou les programmes les plus fréquemment ou les plus récemment utilisés, que l'ordinateur peut interroger afin de réduire les temps de réponse.
in scheme: Informatique
in scheme: concepts
notation: INFO704
note: Parmi les caches les plus utilisés, on trouve les antémémoires ou mémoires caches, les caches situés sur disque, ceux destinés à améliorer les performances des disques eux-mêmes (cache-disque), ainsi que des zones de la mémoire principale qu'occupent certains logiciels.
related: antémémoire
related: cache-disque
related: cache-toile
related: disque dur hybride

cache-disque
type: ConceptConcept
type: Concept
creator: Commission d'enrichissement de la langue française, FranceTerme
date parution JO: 2007-04-20
equivalent EN: disk cache @en
equivalent EN: disk cache (en)
part of speech: nom masculin
definition: Cache, intercalé entre le processeur et le disque, qui évite une lecture sur le disque auquel l'accès serait plus lent.
in scheme: Informatique
in scheme: concepts
notation: INFO705
related: cache

cache-toile
type: ConceptConcept
type: Concept
creator: Commission d'enrichissement de la langue française, FranceTerme
date parution JO: 2007-04-20
deconseille ou frequent: mettre en cache
equivalent EN: web cache @en
equivalent EN: web cache (en)
part of speech: nom masculin
definition: Cache qui contient temporairement une copie des documents consultés récemment et qui permet à l'utilisateur d'en disposer sans qu'il soit nécessaire de procéder à une nouvelle recherche sur la toile.
in scheme: Informatique
in scheme: concepts
notation: INFO706
note: On dit que les documents concernés sont « mis en cache ».
related: cache

centre d'assistance
type: ConceptConcept
type: Concept
creator: Commission d'enrichissement de la langue française, FranceTerme
date parution JO: 2007-04-20
deconseille ou frequent: helpdesk
equivalent EN: help desk @en
equivalent EN: help desk (en)
definition: Service chargé de répondre aux demandes d'assistance émanant des utilisateurs de produits ou de services.
in scheme: Informatique
in scheme: concepts
notation: INFO707
note: Suivant le degré d'urgence et le niveau de difficulté, le centre d'assistance peut apporter une réponse, donner un conseil, transmettre le problème à un spécialiste.
related: numéro d'urgence
related: concept-TELE380

entrepôt de données
type: ConceptConcept
type: Concept
creator: Commission d'enrichissement de la langue française, FranceTerme
date parution JO: 2007-04-20
equivalent EN: data warehouse @en
equivalent EN: data warehouse (en)
definition: Ensemble de données collectées dans une entreprise ou un organisme pour être exploitées par des outils d'aide à la décision.
in scheme: Informatique
in scheme: concepts
notation: INFO708

fournisseur d'applications en ligne
type: ConceptConcept
type: Concept
creator: Commission d'enrichissement de la langue française, FranceTerme
abbreviation: ASP @en
date parution JO: 2007-04-20
equivalent EN: ASP @en
equivalent EN: ASP (en)
equivalent EN: application service provider @en
equivalent EN: application service provider (en)
alternative label: fournisseur de services d'applications
definition: Prestataire qui offre à plusieurs clients la possibilité d'utiliser la même application informatique à travers un réseau de télécommunication afin d'en répartir le coût.
in scheme: Informatique
in scheme: concepts
notation: INFO709

bombardement
type: ConceptConcept
type: Concept
creator: Commission d'enrichissement de la langue française, FranceTerme
date parution JO: 2000-09-01
equivalent EN: bombing @en
equivalent EN: bombing (en)
part of speech: nom masculin
definition: Envoi d'une grande quantité de messages à un destinataire unique dans une intention malveillante.
in scheme: Informatique
in scheme: Télécommunications
in scheme: concept-SD-informatique-internet
in scheme: concept-SD-telecommunications-internet
in scheme: concepts
notation: INFO71
related: incendier
related: message incendiaire
related: arrosage
related: modérateur, -trice

gant numérique
type: ConceptConcept
type: Concept
creator: Commission d'enrichissement de la langue française, FranceTerme
date parution JO: 2007-04-20
equivalent EN: data glove @en
equivalent EN: data glove (en)
definition: Gant muni de capteurs destinés à convertir les mouvements de la main et des doigts en signaux utilisables par un ordinateur pour l'analyse de gestes ou l'action dans un environnement de synthèse.
in scheme: Informatique
in scheme: concepts
notation: INFO710
related: réalité de synthèse

gérance de l'informatique
type: ConceptConcept
type: Concept
creator: Commission d'enrichissement de la langue française, FranceTerme
date parution JO: 2007-04-20
deconseille ou frequent: infogérance
equivalent EN: facilities management @en
equivalent EN: facilities management (en)
definition: Prise en charge contractuelle de tout ou partie de la gestion d'un système d'information d'un organisme par un prestataire extérieur.
in scheme: Informatique
in scheme: concepts
notation: INFO711
note: On trouve aussi, dans le langage professionnel, le terme « infogérance », qui n'est pas recommandé.
related: informatique en nuage
scope note: Cette publication annule et remplace celle du Journal officiel du 10 octobre 1998.

implémenter
type: ConceptConcept
type: Concept
creator: Commission d'enrichissement de la langue française, FranceTerme
date parution JO: 2007-04-20
deconseille ou frequent: to implement
equivalent EN: implement @en
equivalent EN: implement (en)
part of speech: verbe
definition: Effectuer l'ensemble des opérations qui permettent de définir un projet et de le réaliser, de l'analyse du besoin à l'installation et la mise en service du système ou du produit.
in scheme: Informatique
in scheme: concepts
notation: INFO712
related: implanter

interface
type: ConceptConcept
type: Concept
creator: Commission d'enrichissement de la langue française, FranceTerme
date parution JO: 2007-04-20
equivalent EN: interface @en
equivalent EN: interface (en)
part of speech: nom féminin
definition: Limite physique ou théorique entre deux systèmes matériels ou logiciels, entre deux parties d'un système ou entre l'utilisateur et sa machine, où s'appliquent les règles et conventions régissant leur interaction ; par extension, l'ensemble de ces règles et conventions.
in scheme: Informatique
in scheme: Télécommunications
in scheme: concepts
notation: INFO713
note: Les règles et conventions concernent notamment des caractéristiques physiques (mécaniques, électriques, optiques...), des caractéristiques de signaux, des caractéristiques sémantiques ou fonctionnelles, des échanges d'information.
related: interface avec l'utilisateur
related: concept-INFO953
related: concept-INFO960

logiciel de traitement de texte
type: ConceptConcept
type: Concept
creator: Commission d'enrichissement de la langue française, FranceTerme
date parution JO: 2007-04-20
deconseille ou frequent: texteur
equivalent EN: word processor @en
equivalent EN: word processor (en)
forme abregee: traitement de texte
definition: Logiciel permettant de créer, de modifier et de mettre en forme des documents en vue de les conserver, de les transmettre ou de les imprimer.
in scheme: Informatique
in scheme: concepts
notation: INFO714
note: 1. Au sens strict, l'expression « traitement de texte » désigne l'action de créer et de manipuler des documents. Dans l'usage courant, cette expression désigne aussi le logiciel.
note: 3.On trouve parfois, dans le langage professionnel, le terme « texteur », qui n'est pas recommandé.
related: traitement de texte

logiciel éducatif
type: ConceptConcept
type: Concept
creator: Commission d'enrichissement de la langue française, FranceTerme
date parution JO: 2007-04-20
deconseille ou frequent: didacticiel
equivalent EN: educational software @en
equivalent EN: educational software (en)
alternative label: logiciel d'enseignement
definition: Logiciel d'aide à l'acquisition de connaissances ou de compétences.
in scheme: Informatique
in scheme: concepts
notation: INFO715
note: 1. Un logiciel éducatif peut comporter un module de contrôle des connaissances acquises par l'utilisateur.
note: 2. On trouve aussi, dans le langage professionnel, le terme « didacticiel ».
scope note: Cette publication annule et remplace celle des termes « logiciel pédagogique » et « logiciel éducatif » au Journal officiel du 22 septembre 2000.

logiciel gratuit
type: ConceptConcept
type: Concept
creator: Commission d'enrichissement de la langue française, FranceTerme
date parution JO: 2007-04-20
equivalent EN: freeware @en
equivalent EN: freeware (en)
definition: Logiciel que l'auteur met à la disposition des utilisateurs sans exiger de rémunération, mais en conservant l'intégralité de ses droits.
in scheme: Informatique
in scheme: concepts
notation: INFO716

logiciel libre
type: ConceptConcept
type: Concept
creator: Commission d'enrichissement de la langue française, FranceTerme
date parution JO: 2007-04-20
deconseille ou frequent: logiciel open source
deconseille ou frequent: open source
equivalent EN: free software @en
equivalent EN: free software (en)
equivalent EN: open source software @en
equivalent EN: open source software (en)
definition: Logiciel distribué avec l'intégralité de ses programmes-sources, afin que l'ensemble des utilisateurs qui l'emploient, puissent l'enrichir et le redistribuer à leur tour.
in scheme: Informatique
in scheme: concepts
notation: INFO717
note: Un logiciel libre n'est pas nécessairement gratuit et les droits de la chaîne des auteurs sont préservés.

modèle
type: ConceptConcept
type: Concept
creator: Commission d'enrichissement de la langue française, FranceTerme
date parution JO: 2007-04-20
equivalent EN: template @en
equivalent EN: template (en)
definition: Descriptif des propriétés communes à certains objets informatiques, qui peut servir de cadre de référence pour la création d'objets de même nature, notamment des documents.
in scheme: Informatique
in scheme: concepts
notation: INFO718
note: 1. Les éditeurs de logiciels fournissent souvent des modèles pour faciliter l'utilisation de leurs produits, par exemple : un prototype de facture dans un logiciel de traitement de texte, ou bien une déclaration-type d'ajout d'utilisateurs dans un outil de gestion de réseau.
note: 2. Un modèle général peut servir à créer d'autres modèles, répondant à des usages spécifiques.

réalité de synthèse
type: ConceptConcept
type: Concept
creator: Commission d'enrichissement de la langue française, FranceTerme
date parution JO: 2007-04-20
deconseille ou frequent: réalité virtuelle
equivalent EN: virtual reality @en
equivalent EN: virtual reality (en)
definition: Environnement créé à l'aide d'un ordinateur et donnant à l'utilisateur la sensation d'être immergé dans un univers artificiel.
in scheme: Informatique
in scheme: concepts
notation: INFO719
note: 1. La création d'une réalité de synthèse nécessite des dispositifs d'entrée-sortie particuliers tels des gants numériques, un visiocasque, un système de restitution sonore évolué, etc., associés à des logiciels graphiques tridimensionnels.
note: 2. On trouve aussi, dans l'usage courant, l'expression « réalité virtuelle », qui n'est pas recommandée.
related: gant numérique

code à octets
type: ConceptConcept
type: Concept
creator: Commission d'enrichissement de la langue française, FranceTerme
date parution JO: 2000-09-01
equivalent EN: bytecode @en
equivalent EN: bytecode (en)
definition: Ensemble d'instructions indépendant de tout processeur, destiné à être interprété par un logiciel spécialisé.
in scheme: Informatique
in scheme: concept-SD-informatique-internet
in scheme: concepts
notation: INFO72
note: 1. Ce terme désigne, par extension, un programme informatique écrit à l'aide d'un tel ensemble d'instructions.
note: 2. Sur l'internet, les appliquettes distribuées sont fréquemment écrites à l'aide d'un code à octets.
related: appliquette

recherche en texte intégral
type: ConceptConcept
type: Concept
creator: Commission d'enrichissement de la langue française, FranceTerme
date parution JO: 2007-04-20
deconseille ou frequent: full-text
deconseille ou frequent: texte intégral
equivalent EN: full-text search @en
equivalent EN: full-text search (en)
definition: Recherche de mots, de phrases ou d'une chaîne de caractères quelconque dans un ensemble de documents, s'appuyant sur une exploration systématique de la totalité de cet ensemble.
in scheme: Informatique
in scheme: concepts
notation: INFO720
note: La recherche en texte intégral peut s'effectuer aussi bien dans le document original que sur un résumé ou un document dérivé, tel que notice ou table des matières, et elle ne porte pas seulement sur un ensemble restreint de mots clés.

relationnel, -elle
type: ConceptConcept
type: Concept
creator: Commission d'enrichissement de la langue française, FranceTerme
date parution JO: 2007-04-20
equivalent EN: relational @en
equivalent EN: relational (en)
part of speech: adjectif
definition: Se dit d'une base de données construite sur un modèle fondé sur la théorie mathématique des relations.
in scheme: Informatique
in scheme: concepts
notation: INFO721
note: Dans ce modèle, dit « relationnel », les données sont stockées en tables structurées sous une forme qui facilite les manipulations et permet d'éviter la redondance de l'information que l'on rencontre dans des modèles plus anciens.

réseautique
type: ConceptConcept
type: Concept
creator: Commission d'enrichissement de la langue française, FranceTerme
date parution JO: 2007-04-20
equivalent EN: networking @en
equivalent EN: networking (en)
part of speech: nom féminin
definition: Ensemble des activités et des techniques destinées à créer, gérer, exploiter et utiliser des réseaux de télécommunication ou des réseaux d'ordinateurs.
in scheme: Informatique
in scheme: Télécommunications
in scheme: concepts
notation: INFO722
related: concept-TELE515
scope note: Cette publication annule et remplace celle du terme « mise en réseau » au Journal officiel du 10 octobre 1998.

script
type: ConceptConcept
type: Concept
creator: Commission d'enrichissement de la langue française, FranceTerme
abbreviation: macro @en
date parution JO: 2007-04-20
equivalent EN: macro @en
equivalent EN: macro (en)
equivalent EN: macrocommand @en
equivalent EN: macrocommand (en)
equivalent EN: script @en
equivalent EN: script (en)
part of speech: nom masculin
alternative label: macrocommande
definition: Programme constitué d'une suite de commandes dispensant l'utilisateur de les saisir, et permettant d'effectuer une fonction particulière ou de contribuer à l'exécution d'un autre programme.
in scheme: Informatique
in scheme: concepts
notation: INFO723
note: 1. Un script peut être notamment un programme associé à un document décrit à l'aide d'un langage de balisage et destiné à améliorer l'interactivité.
note: 2. Le terme « macrocommande » est souvent abrégé en « macro », n.f.

serveur
type: ConceptConcept
type: Concept
creator: Commission d'enrichissement de la langue française, FranceTerme
date parution JO: 2007-04-20
equivalent EN: server @en
equivalent EN: server (en)
part of speech: nom masculin
definition: Matériel, logiciel ou système informatique destiné à fournir un service déterminé à d'autres systèmes informatiques ou à des utilisateurs connectés sur un réseau.
in scheme: Informatique
in scheme: concepts
notation: INFO724
note: Exemples : serveur de bases de données, serveur d'impression, serveur de messagerie.
related: serveur mandataire
scope note: Cette publication annule et remplace celle du Journal officiel du 16 mars 1999.

surcadencer
type: ConceptConcept
type: Concept
creator: Commission d'enrichissement de la langue française, FranceTerme
date parution JO: 2007-04-20
deconseille ou frequent: to overclock
equivalent EN: overclock @en
equivalent EN: overclock (en)
part of speech: verbe
definition: Faire fonctionner un processeur à une cadence supérieure à celle pour laquelle il a été initialement conçu, afin d'en améliorer les performances.
in scheme: Informatique
in scheme: concepts
notation: INFO725

tutoriel
type: ConceptConcept
type: Concept
creator: Commission d'enrichissement de la langue française, FranceTerme
date parution JO: 2007-04-20
equivalent EN: tutorial @en
equivalent EN: tutorial (en)
part of speech: nom masculin
definition: Guide d'initiation et d'aide à l'utilisation d'un produit ou d'un service informatique.
in scheme: Informatique
in scheme: concepts
notation: INFO726

étiquette
type: ConceptConcept
type: Concept
creator: Commission d'enrichissement de la langue française, FranceTerme
date parution JO: 2007-04-20
equivalent EN: label @en
equivalent EN: label (en)
part of speech: nom féminin
in scheme: Informatique
in scheme: concepts
notation: INFO727

liste de diffusion
type: ConceptConcept
type: Concept
creator: Commission d'enrichissement de la langue française, FranceTerme
date parution JO: 2007-04-20
equivalent EN: mailing list @en
equivalent EN: mailing list (en)
in scheme: Informatique
in scheme: concepts
notation: INFO728

compresser
type: ConceptConcept
type: Concept
creator: Commission d'enrichissement de la langue française, FranceTerme
date parution JO: 2007-05-02
deconseille ou frequent: zipper
equivalent EN: compress @en
equivalent EN: compress (en)
equivalent EN: zip @en
equivalent EN: zip (en)
part of speech: verbe
definition: Diminuer la taille d'un ou de plusieurs fichiers au moyen d'un algorithme permettant leur restitution à l'identique, en vue de les stocker ou de les transférer.
in scheme: Informatique
in scheme: concepts
notation: INFO729

connecteur logiciel
type: ConceptConcept
type: Concept
creator: Commission d'enrichissement de la langue française, FranceTerme
date parution JO: 2000-09-01
equivalent EN: socket @en
equivalent EN: socket (en)
definition: Mécanisme logiciel de communication entre processus informatiques, souvent utilisé entre une application et un réseau.
in scheme: Informatique
in scheme: Télécommunications
in scheme: concept-SD-informatique-internet
in scheme: concept-SD-telecommunications-internet
in scheme: concepts
notation: INFO73

macro-instruction
type: ConceptConcept
type: Concept
creator: Commission d'enrichissement de la langue française, FranceTerme
abbreviation: macro @en
date parution JO: 2007-05-02
equivalent EN: macro @en
equivalent EN: macro (en)
equivalent EN: macroinstruction @en
equivalent EN: macroinstruction (en)
part of speech: nom féminin
definition: Instruction écrite dans un langage de programmation, qui peut se substituer à une suite d'instructions dans ce même langage et dispense l'utilisateur de la saisir.
in scheme: Informatique
in scheme: concepts
notation: INFO730
note: Le terme « macro-instruction » est souvent abrégé en « macro », n.f.

prêt à l'emploi
type: ConceptConcept
type: Concept
creator: Commission d'enrichissement de la langue française, FranceTerme
abbreviation: PnP @en
date parution JO: 2007-05-02
deconseille ou frequent: plug & play
equivalent EN: PnP @en
equivalent EN: PnP (en)
equivalent EN: plug-and-play @en
equivalent EN: plug-and-play (en)
part of speech: locution adjectivale
definition: Se dit d'un équipement électronique utilisable dès sa connexion.
in scheme: Audiovisuel
in scheme: Informatique
in scheme: concepts
notation: INFO731

transférer
type: ConceptConcept
type: Concept
creator: Commission d'enrichissement de la langue française, FranceTerme
date parution JO: 2007-05-02
deconseille ou frequent: forwarder
deconseille ou frequent: to forward
equivalent EN: forward @en
equivalent EN: forward (en)
part of speech: verbe
in scheme: Informatique
in scheme: concepts
notation: INFO732

assistant
type: ConceptConcept
type: Concept
creator: Commission d'enrichissement de la langue française, FranceTerme
date parution JO: 2007-06-07
equivalent EN: wizard @en
equivalent EN: wizard (en)
part of speech: nom masculin
definition: Programme d'aide intégré à un logiciel, qui guide l'utilisateur dans l'exécution de certaines tâches.
in scheme: Informatique
in scheme: concept-SD-informatique-internet
in scheme: concepts
notation: INFO733

grille informatique
type: ConceptConcept
type: Concept
creator: Commission d'enrichissement de la langue française, FranceTerme
abbreviation: grid @en
date parution JO: 2007-06-07
deconseille ou frequent: distributed computing
deconseille ou frequent: grid computing
deconseille ou frequent: grille de calcul
deconseille ou frequent: informatique en grille
equivalent EN: computational grid @en
equivalent EN: computational grid (en)
equivalent EN: computing grid @en
equivalent EN: computing grid (en)
equivalent EN: grid @en
equivalent EN: grid (en)
definition: Réseau constitué d'un grand nombre d'ordinateurs interconnectés dont les ressources sont exploitées de façon à disposer, à moindre coût, d'une capacité de traitement importante.
in scheme: Informatique
in scheme: concept-SD-informatique-internet
in scheme: concepts
notation: INFO734
note: 1. Chaque ordinateur effectue séparément les traitements qui lui sont demandés par un serveur et renvoie les résultats qui sont intégrés à d'autres. Les ordinateurs peuvent être reliés au moyen de l'internet ou appartenir au réseau d'un même organisme, d'une même entreprise.
note: 2. On trouve aussi le terme « grille de calcul ».
note: 3. L'exploitation d'une grille informatique est désignée par le terme « informatique en grille » (en anglais : grid computing ou distributed computing).

lien
type: ConceptConcept
type: Concept
creator: Commission d'enrichissement de la langue française, FranceTerme
date parution JO: 2007-06-07
equivalent EN: link @en
equivalent EN: link (en)
equivalent EN: linkage @en
equivalent EN: linkage (en)
part of speech: nom masculin
definition: Connexion prévue par le concepteur d'une application informatique pour relier des programmes, des parties de programmes, des données, des documents, des sites ou des pages sur la toile.
in scheme: Informatique
in scheme: concept-SD-informatique-internet
in scheme: concepts
notation: INFO735

logiciel espion
type: ConceptConcept
type: Concept
creator: Commission d'enrichissement de la langue française, FranceTerme
date parution JO: 2007-06-07
deconseille ou frequent: espiogiciel
equivalent EN: spyware @en
equivalent EN: spyware (en)
definition: Logiciel destiné à collecter et à transmettre à des tiers, à l'insu de l'utilisateur, des données le concernant ou des informations relatives au système qu'il utilise.
in scheme: Informatique
in scheme: concept-SD-informatique-internet
in scheme: concepts
notation: INFO736
related: logiciel publicitaire
related: concept-JURI62

logiciel publicitaire
type: ConceptConcept
type: Concept
creator: Commission d'enrichissement de la langue française, FranceTerme
date parution JO: 2007-06-07
equivalent EN: advertising software @en
equivalent EN: advertising software (en)
equivalent EN: adware @en
equivalent EN: adware (en)
definition: Logiciel qui affiche des annonces publicitaires sur l'écran d'un ordinateur et qui transmet à son éditeur des renseignements permettant d'adapter ces annonces au profil de l'utilisateur.
in scheme: Informatique
in scheme: concept-SD-informatique-internet
in scheme: concepts
notation: INFO737
note: 1. Le logiciel publicitaire est souvent intégré ou associé à un logiciel gratuit ou à un logiciel à contribution ayant un objet différent.
note: 2. En raison de l'incertitude sur la nature des informations transmises, les logiciels publicitaires sont souvent assimilés à des logiciels espions.
related: logiciel espion

publier
type: ConceptConcept
type: Concept
creator: Commission d'enrichissement de la langue française, FranceTerme
date parution JO: 2007-06-07
deconseille ou frequent: to post
equivalent EN: post @en
equivalent EN: post (en)
part of speech: verbe
definition: Introduire un article ou une contribution sur un forum ou dans un groupe de discussion.
in scheme: Informatique
in scheme: concept-SD-informatique-internet
in scheme: concepts
notation: INFO738

syndication
type: ConceptConcept
type: Concept
creator: Commission d'enrichissement de la langue française, FranceTerme
date parution JO: 2007-06-07
equivalent EN: syndication @en
equivalent EN: syndication (en)
part of speech: nom féminin
definition: Regroupement automatisé de certaines données disponibles dans un ensemble de sites, au fur et à mesure de leur mise à jour.
in scheme: Informatique
in scheme: concept-SD-informatique-internet
in scheme: concepts
notation: INFO739
related: flux de dépêches

tatouage numérique
type: ConceptConcept
type: Concept
creator: Commission d'enrichissement de la langue française, FranceTerme
date parution JO: 2007-06-07
equivalent EN: digital tattoo @en
equivalent EN: digital tattoo (en) [Marque]
equivalent EN: digital tattooing @en
equivalent EN: digital tattooing (en)
equivalent EN: watermark @en
equivalent EN: watermark (en) [Marque]
equivalent EN: watermarking @en
equivalent EN: watermarking (en)
definition: Insertion, dans un document audiovisuel numérique, d'une marque ou d'un message non perceptible, robuste et indélébile ; par extension, la marque ou le message inséré.
in scheme: Audiovisuel
in scheme: Informatique
in scheme: concept-SD-audiovisuel-internet
in scheme: concept-SD-informatique-internet
in scheme: concepts
notation: INFO740
note: Une application usuelle du tatouage numérique est l'insertion d'une signature identifiant l'origine du document ou son ayant droit.

option d'adhésion (à)
type: ConceptConcept
type: Concept
creator: Commission d'enrichissement de la langue française, FranceTerme
date parution JO: 2009-12-27
deconseille ou frequent: à option d'adhésion
equivalent EN: opt-in @en
equivalent EN: opt-in (en)
part of speech: locution adjectivale
definition: Se dit d'un fichier de données personnelles dans lequel un internaute ne peut être inscrit que s'il exprime explicitement son consentement.
in scheme: Informatique
in scheme: concept-SD-informatique-internet
in scheme: concepts
notation: INFO742
related: option de retrait (à)

option de retrait (à)
type: ConceptConcept
type: Concept
creator: Commission d'enrichissement de la langue française, FranceTerme
date parution JO: 2009-12-27
deconseille ou frequent: à option de retrait
equivalent EN: opt-out @en
equivalent EN: opt-out (en)
part of speech: locution adjectivale
definition: Se dit d'un fichier de données personnelles dans lequel un internaute est inscrit sans son accord et continue de figurer tant qu'il n'a pas exprimé explicitement son refus.
in scheme: Informatique
in scheme: concept-SD-informatique-internet
in scheme: concepts
notation: INFO743
related: option d'adhésion (à)

bannière
type: ConceptConcept
type: Concept
creator: Commission d'enrichissement de la langue française, FranceTerme
date parution JO: 2009-12-27
equivalent EN: skyscraper @en
equivalent EN: skyscraper (en)
part of speech: nom féminin
definition: Zone d'écran plus haute que large, à vocation publicitaire, informative ou décorative, située sur un des côtés de la page d'un site.
in scheme: Communication
in scheme: Informatique
in scheme: concept-SD-communication-internet
in scheme: concept-SD-informatique-internet
in scheme: concepts
notation: INFO744
related: bannière publicitaire

démon
type: ConceptConcept
type: Concept
creator: Commission d'enrichissement de la langue française, FranceTerme
date parution JO: 2009-12-27
equivalent EN: daemon @en
equivalent EN: daemon (en)
equivalent EN: disk and execution monitor @en
equivalent EN: disk and execution monitor (en)
part of speech: nom masculin
definition: Programme actif en permanence dans un système multitâche, qui effectue certaines fonctions sans l'intervention de l'utilisateur.
in scheme: Informatique
in scheme: concept-SD-informatique-internet
in scheme: concepts
notation: INFO745
related: démon de messagerie

démon de messagerie
type: ConceptConcept
type: Concept
creator: Commission d'enrichissement de la langue française, FranceTerme
date parution JO: 2009-12-27
equivalent EN: mailer daemon @en
equivalent EN: mailer daemon (en)
definition: Démon qui assure l'acheminement des messages électroniques et avertit l'expéditeur lorsqu'un message n'a pu atteindre son destinataire.
in scheme: Informatique
in scheme: concept-SD-informatique-internet
in scheme: concepts
notation: INFO746
related: démon

dévoiement
type: ConceptConcept
type: Concept
creator: Commission d'enrichissement de la langue française, FranceTerme
date parution JO: 2009-12-27
equivalent EN: pharming @en
equivalent EN: pharming (en)
part of speech: nom masculin
definition: Technique consistant à détourner subrepticement des communications à destination d'un domaine vers une adresse différente de son adresse légitime.
in scheme: Informatique
in scheme: concept-SD-informatique-internet
in scheme: concepts
notation: INFO747
related: domaine
related: concept-JURI83

encre en poudre
type: ConceptConcept
type: Concept
creator: Commission d'enrichissement de la langue française, FranceTerme
date parution JO: 2009-12-27
equivalent EN: toner @en
equivalent EN: toner (en)
in scheme: Informatique
in scheme: concepts
notation: INFO749

moteur de recherche
type: ConceptConcept
type: Concept
creator: Commission d'enrichissement de la langue française, FranceTerme
date parution JO: 2000-09-01
equivalent EN: search engine @en
equivalent EN: search engine (en)
definition: Système d'exploitation de banque de données, et, par extension, serveur spécialisé permettant d'accéder sur la toile à des ressources (pages, sites, etc.) à partir de mots clés.
in scheme: Informatique
in scheme: Télécommunications
in scheme: concept-SD-informatique-internet
in scheme: concept-SD-telecommunications-internet
in scheme: concepts
notation: INFO75

espace de confiance
type: ConceptConcept
type: Concept
creator: Commission d'enrichissement de la langue française, FranceTerme
date parution JO: 2009-12-27
equivalent EN: trust environment @en
equivalent EN: trust environment (en)
definition: Ensemble de ressources, de services informatiques et de services de communication qui permettent des échanges dans des conditions de sécurité suffisantes et cohérentes.
in scheme: Informatique
in scheme: concept-SD-informatique-internet
in scheme: concepts
notation: INFO750
related: cercle de confiance

cercle de confiance
type: ConceptConcept
type: Concept
creator: Commission d'enrichissement de la langue française, FranceTerme
date parution JO: 2009-12-27
equivalent EN: circle of trust @en
equivalent EN: circle of trust (en)
definition: Ensemble des fournisseurs et des utilisateurs d'un espace de confiance.
in scheme: Informatique
in scheme: concept-SD-informatique-internet
in scheme: concepts
notation: INFO751
related: espace de confiance

directeur des systèmes d'information
type: ConceptConcept
type: Concept
creator: Commission d'enrichissement de la langue française, FranceTerme
abbreviation: CIO @en
abbreviation: DSI
date parution JO: 2009-12-27
equivalent EN: CIO @en
equivalent EN: CIO (en)
equivalent EN: chief information officer @en
equivalent EN: chief information officer (en)
in scheme: Économie et gestion d'entreprise
in scheme: Informatique
in scheme: concepts
notation: INFO752

directeur des techniques informatiques
type: ConceptConcept
type: Concept
creator: Commission d'enrichissement de la langue française, FranceTerme
abbreviation: CTO @en
abbreviation: DTI
date parution JO: 2009-12-27
equivalent EN: CTO @en
equivalent EN: CTO (en)
equivalent EN: chief technology officer @en
equivalent EN: chief technology officer (en)
in scheme: Économie et gestion d'entreprise
in scheme: Informatique
in scheme: concepts
notation: INFO753

gestionnaire d'évènement
type: ConceptConcept
type: Concept
creator: Commission d'enrichissement de la langue française, FranceTerme
abbreviation: handler @en
date parution JO: 2009-12-27
equivalent EN: event handler @en
equivalent EN: event handler (en)
equivalent EN: handler @en
equivalent EN: handler (en)
definition: Programme en mémoire qui s'active lorsqu'un évènement particulier survient au cours de l'exécution d'un autre programme.
in scheme: Informatique
in scheme: concepts
notation: INFO755
note: La notion d'évènement recouvre aussi bien l'action d'un utilisateur que l'arrivée d'un traitement lié à une date et une heure ou toute autre circonstance susceptible d'interrompre le traitement en cours.

indexation personnelle
type: ConceptConcept
type: Concept
creator: Commission d'enrichissement de la langue française, FranceTerme
date parution JO: 2009-12-27
equivalent EN: folksonomy @en
equivalent EN: folksonomy (en)
definition: Classification de contenus de l'internet par l'attribution de mots clés librement choisis par un utilisateur.
in scheme: Informatique
in scheme: concept-SD-informatique-internet
in scheme: concepts
notation: INFO756
related: mot clé

offre groupée
type: ConceptConcept
type: Concept
creator: Commission d'enrichissement de la langue française, FranceTerme
date parution JO: 2009-12-27
equivalent EN: bundle @en
equivalent EN: bundle (en)
equivalent EN: package @en
equivalent EN: package (en)
in scheme: Informatique
in scheme: concept-SD-informatique-internet
in scheme: concepts
notation: INFO759

pièce jointe
type: ConceptConcept
type: Concept
creator: Commission d'enrichissement de la langue française, FranceTerme
abbreviation: attachment @en
date parution JO: 2000-09-01
deconseille ou frequent: fichier joint
equivalent EN: attachment @en
equivalent EN: attachment (en)
equivalent EN: attachment file @en
equivalent EN: attachment file (en)
definition: Document ou fichier annexé au corps d'un message électronique.
in scheme: Informatique
in scheme: Télécommunications
in scheme: concept-SD-informatique-internet
in scheme: concept-SD-telecommunications-internet
in scheme: concepts
notation: INFO76
note: On trouve aussi le terme « fichier joint ».

parcours sur la toile
type: ConceptConcept
type: Concept
creator: Commission d'enrichissement de la langue française, FranceTerme
date parution JO: 2009-12-27
deconseille ou frequent: click stream
equivalent EN: clickstream @en
equivalent EN: clickstream (en)
forme abregee: parcours, n.m.
definition: Succession des pages visitées et des actions effectuées par un internaute, dont l'analyse permet de dégager les habitudes, les centres d'intérêt, les goûts.
in scheme: Informatique
in scheme: concept-SD-informatique-internet
in scheme: concepts
notation: INFO760

service de la toile
type: ConceptConcept
type: Concept
creator: Commission d'enrichissement de la langue française, FranceTerme
date parution JO: 2009-12-27
deconseille ou frequent: service web
equivalent EN: Web service @en
equivalent EN: Web service (en)
definition: Composant applicatif utilisant les protocoles de la toile, doté d'une adresse universelle et communiquant avec d'autres composants.
in scheme: Informatique
in scheme: concept-SD-informatique-internet
in scheme: concepts
notation: INFO761

actionneur
type: ConceptConcept
type: Concept
creator: Commission d'enrichissement de la langue française, FranceTerme
date parution JO: 2009-12-27
deconseille ou frequent: actuateur
equivalent EN: actuator @en
equivalent EN: actuator (en)
part of speech: nom masculin
definition: Dispositif qui convertit en énergie cinématique divers types d'énergie tels que l'énergie électrique ou l'énergie chimique, afin de produire une action mécanique.
in scheme: Électronique
in scheme: concepts
notation: INFO763
related: concept-TELE558

microsystème électromécanique
type: ConceptConcept
type: Concept
creator: Commission d'enrichissement de la langue française, FranceTerme
abbreviation: MEMS @en
date parution JO: 2009-12-27
deconseille ou frequent: microelectromechanical system
equivalent EN: MEMS @en
equivalent EN: MEMS (en)
equivalent EN: micro-electromechanical system @en
equivalent EN: micro-electromechanical system (en)
forme abregee: microsystème, n.m.
alternative label: mems
definition: Système intégrant sur une puce des dispositifs mécaniques et électroniques, qui remplit une fonction déterminée.
in scheme: Électronique
in scheme: concepts
notation: INFO764
related: micro-usinage
related: micropoutre
related: microsystème optoélectromécanique

micro-usinage
type: ConceptConcept
type: Concept
creator: Commission d'enrichissement de la langue française, FranceTerme
date parution JO: 2009-12-27
deconseille ou frequent: micro-machining
equivalent EN: micromachining @en
equivalent EN: micromachining (en)
part of speech: nom masculin
definition: Ensemble de techniques utilisées dans la fabrication des microsystèmes électromécaniques.
in scheme: Électronique
in scheme: concepts
notation: INFO765
related: microsystème électromécanique
related: micromiroir
related: micro-usinage de surface
related: micro-usinage de volume

micropoutre
type: ConceptConcept
type: Concept
creator: Commission d'enrichissement de la langue française, FranceTerme
date parution JO: 2009-12-27
deconseille ou frequent: micro-cantilever
equivalent EN: microcantilever @en
equivalent EN: microcantilever (en)
part of speech: nom féminin
definition: Élément d'un microsystème électromécanique, présentant une forme allongée, qui est fixé par une seule de ses extrémités afin de permettre sa déformation par flexion ou par torsion, selon sa fonction.
in scheme: Électronique
in scheme: concepts
notation: INFO766
related: microsystème électromécanique

trou de liaison
type: ConceptConcept
type: Concept
creator: Commission d'enrichissement de la langue française, FranceTerme
date parution JO: 2009-12-27
equivalent EN: via @en
equivalent EN: via (en)
alternative label: trou d'interconnexion
definition: Trou dont la paroi métallisée permet d'établir une liaison électrique entre deux niveaux d'un circuit intégré, à travers la couche isolante.
in scheme: Électronique
in scheme: concepts
notation: INFO767

diode électroluminescente organique
type: ConceptConcept
type: Concept
creator: Commission d'enrichissement de la langue française, FranceTerme
abbreviation: DELO
abbreviation: OLED @en
date parution JO: 2009-12-27
equivalent EN: OLED @en
equivalent EN: OLED (en)
equivalent EN: organic light-emitting diode @en
equivalent EN: organic light-emitting diode (en)
definition: Diode électroluminescente dont la couche émettrice de lumière est composée de semiconducteurs organiques.
in scheme: Électronique
in scheme: concepts
notation: INFO768
note: Les diodes électroluminescentes organiques sont principalement utilisées dans des dispositifs d'affichage et d'éclairage.
related: diode électroluminescente

micromiroir
type: ConceptConcept
type: Concept
creator: Commission d'enrichissement de la langue française, FranceTerme
date parution JO: 2009-12-27
deconseille ou frequent: micro-mirror
equivalent EN: micromirror @en
equivalent EN: micromirror (en)
part of speech: nom masculin
definition: Miroir orientable réalisé par micro-usinage, destiné à réfléchir des signaux lumineux dans des directions déterminées.
in scheme: Électronique
in scheme: concepts
notation: INFO769
note: 1. Plusieurs milliers de micromiroirs, disposés sur une puce, permettent de projeter des images sur un grand écran.
note: 2. On utilise également des micromiroirs pour commuter des signaux entre fibres optiques.
related: micro-usinage
related: matrice de micromiroirs

téléchargement
type: ConceptConcept
type: Concept
creator: Commission d'enrichissement de la langue française, FranceTerme
date parution JO: 2000-09-01
equivalent EN: downloading @en
equivalent EN: downloading (en) [Téléchargement à partir d'un autre ordinateur.]
equivalent EN: uploading @en
equivalent EN: uploading (en) [Téléchargement vers un autre ordinateur.]
part of speech: nom masculin
definition: Transfert de programmes ou de données d'un ordinateur vers un autre.
in scheme: Informatique
in scheme: Télécommunications
in scheme: concept-SD-informatique-internet
in scheme: concept-SD-telecommunications-internet
in scheme: concepts
notation: INFO77
note: Pour un internaute, le téléchargement est le plus souvent un transfert vers son propre ordinateur à partir d'un serveur, mais il peut avoir lieu dans l'autre sens.
related: flux (en)

matrice de micromiroirs
type: ConceptConcept
type: Concept
creator: Commission d'enrichissement de la langue française, FranceTerme
abbreviation: DMD @en
abbreviation: MDM
date parution JO: 2009-12-27
deconseille ou frequent: DLP
deconseille ou frequent: digital light processing
equivalent EN: DMD @en
equivalent EN: DMD (en)
equivalent EN: digital micromirror device @en
equivalent EN: digital micromirror device (en)
definition: Dispositif destiné à la vidéoprojection, composé d'un grand nombre de micromiroirs commandés à partir de données numériques.
in scheme: Électronique
in scheme: concepts
notation: INFO770
note: 1. Le nombre des micromiroirs peut atteindre plusieurs milliers.
note: 2. L'expression anglaise digital light processing (DLP), qui désigne une réalisation particulière utilisant une matrice de micromiroirs, ne doit pas être utilisée.
related: micromiroir

cœur de processeur
type: ConceptConcept
type: Concept
creator: Commission d'enrichissement de la langue française, FranceTerme
abbreviation: core @en
date parution JO: 2009-12-27
equivalent EN: core @en
equivalent EN: core (en)
equivalent EN: processor core @en
equivalent EN: processor core (en)
forme abregee: cœur, n.m.
definition: Unité de calcul d'un processeur.
in scheme: Électronique
in scheme: concepts
notation: INFO771
note: Un processeur peut comporter plusieurs cœurs.
related: processeur multicœur

processeur multicœur
type: ConceptConcept
type: Concept
creator: Commission d'enrichissement de la langue française, FranceTerme
abbreviation: multicore @en
date parution JO: 2009-12-27
deconseille ou frequent: multi-core processor
equivalent EN: multicore @en
equivalent EN: multicore (en)
equivalent EN: multicore processor @en
equivalent EN: multicore processor (en)
forme abregee: multicœur, n.m.
definition: Circuit intégré comprenant plusieurs cœurs de processeur, qui permet le traitement en parallèle de plusieurs opérations, différentes ou de même type.
in scheme: Électronique
in scheme: concepts
notation: INFO772
note: Il existe en particulier des processeurs bicœurs et des processeurs quadricœurs.
related: cœur de processeur
related: processeur bicœur
related: processeur quadricœur

processeur bicœur
type: ConceptConcept
type: Concept
creator: Commission d'enrichissement de la langue française, FranceTerme
abbreviation: dual core @en
date parution JO: 2009-12-27
deconseille ou frequent: dualcore processor
equivalent EN: dual core @en
equivalent EN: dual core (en)
equivalent EN: dual core processor @en
equivalent EN: dual core processor (en)
forme abregee: bicœur, n.m.
in scheme: Électronique
in scheme: concepts
notation: INFO773
related: processeur multicœur

processeur quadricœur
type: ConceptConcept
type: Concept
creator: Commission d'enrichissement de la langue française, FranceTerme
abbreviation: quadcore @en
date parution JO: 2009-12-27
deconseille ou frequent: quadcore processor
equivalent EN: quad core processor @en
equivalent EN: quad core processor (en)
equivalent EN: quadcore @en
equivalent EN: quadcore (en)
forme abregee: quadricœur, n.m.
in scheme: Électronique
in scheme: concepts
notation: INFO774
related: processeur multicœur

boîtier à puce
type: ConceptConcept
type: Concept
creator: Commission d'enrichissement de la langue française, FranceTerme
abbreviation: CSP @en
date parution JO: 2009-12-27
deconseille ou frequent: boîtier-puce
equivalent EN: CSP @en
equivalent EN: CSP (en)
equivalent EN: chip-scale package @en
equivalent EN: chip-scale package (en)
definition: Boîtier destiné à l'encapsulation d'une seule puce de circuit intégré et qui présente une surface à peine supérieure à celle de la puce.
in scheme: Électronique
in scheme: concepts
notation: INFO775
note: On trouve aussi, dans le langage professionnel, le terme « boîtier-puce », qui n'est pas recommandé.
related: mise en boîtier
related: encapsulation sur tranche

boîtier matriciel
type: ConceptConcept
type: Concept
creator: Commission d'enrichissement de la langue française, FranceTerme
date parution JO: 2009-12-27
equivalent EN: grid array @en
equivalent EN: grid array (en)
definition: Boîtier dont les sorties sont disposées sur le fond, selon une structure en grille.
in scheme: Électronique
in scheme: concepts
notation: INFO776
related: boîtier matriciel à billes
related: boîtier matriciel à broches

boîtier matriciel à billes
type: ConceptConcept
type: Concept
creator: Commission d'enrichissement de la langue française, FranceTerme
abbreviation: BGA @en
date parution JO: 2009-12-27
equivalent EN: BGA @en
equivalent EN: BGA (en)
equivalent EN: ball grid array @en
equivalent EN: ball grid array (en)
forme abregee: boîtier à billes
definition: Boîtier matriciel dont les sorties sont des billes de soudure.
in scheme: Électronique
in scheme: concepts
notation: INFO777
related: boîtier matriciel

boîtier matriciel à broches
type: ConceptConcept
type: Concept
creator: Commission d'enrichissement de la langue française, FranceTerme
abbreviation: PGA @en
date parution JO: 2009-12-27
deconseille ou frequent: boîtier PGA
equivalent EN: PGA @en
equivalent EN: PGA (en)
equivalent EN: pin grid array @en
equivalent EN: pin grid array (en)
definition: Boîtier matriciel dont les sorties sont des broches.
in scheme: Électronique
in scheme: concepts
notation: INFO778
note: L'expression « boîtier PGA » est à proscrire.
related: boîtier matriciel

module multipuce
type: ConceptConcept
type: Concept
creator: Commission d'enrichissement de la langue française, FranceTerme
abbreviation: MCM @en
date parution JO: 2009-12-27
deconseille ou frequent: multichip module
equivalent EN: MCM @en
equivalent EN: MCM (en)
equivalent EN: multi-chip module @en
equivalent EN: multi-chip module (en)
definition: Assemblage, sur un même substrat, de plusieurs puces et éventuellement de composants discrets.
in scheme: Électronique
in scheme: concepts
notation: INFO779
related: substrat

visite
type: ConceptConcept
type: Concept
creator: Commission d'enrichissement de la langue française, FranceTerme
date parution JO: 2000-09-01
equivalent EN: tour @en
equivalent EN: tour (en)
equivalent EN: visit @en
equivalent EN: visit (en)
part of speech: nom féminin
definition: Succession d'accès à des documents liés entre eux à l'intérieur d'un site.
in scheme: Informatique
in scheme: concept-SD-informatique-internet
in scheme: concepts
notation: INFO78
related: accès

encapsulation sur tranche
type: ConceptConcept
type: Concept
creator: Commission d'enrichissement de la langue française, FranceTerme
abbreviation: WLP @en
date parution JO: 2009-12-27
equivalent EN: WLP @en
equivalent EN: WLP (en)
equivalent EN: wafer-level packaging @en
equivalent EN: wafer-level packaging (en)
definition: Technique de fabrication conjointe d'un boîtier à puce et de sa puce, qui consiste à réaliser toutes les opérations au niveau des tranches de silicium, avant le découpage en composants individuels.
in scheme: Électronique
in scheme: concepts
notation: INFO780
related: mise en boîtier
related: boîtier à puce

lister
type: ConceptConcept
type: Concept
creator: Commission d'enrichissement de la langue française, FranceTerme
source: révision de l'arrêté du 22 décembre 1981
date parution JO: 2000-09-22
deconseille ou frequent: to list
equivalent EN: list @en
equivalent EN: list (en)
part of speech: verbe
definition: Présenter sous forme de liste des données ou des instructions.
in scheme: Informatique
in scheme: concepts
notation: INFO782
related: listage
related: lister

listage
type: ConceptConcept
type: Concept
creator: Commission d'enrichissement de la langue française, FranceTerme
source: révision de l'arrêté du 22 décembre 1981
date parution JO: 2000-09-22
deconseille ou frequent: liste
equivalent EN: listing @en
equivalent EN: listing (en)
part of speech: nom masculin
definition: Document produit en continu par une imprimante d'ordinateur.
in scheme: Informatique
in scheme: concepts
notation: INFO783
note: Dans cette acception, on dira plus simplement « liste ».
related: listage
related: lister

affichage à émission d'électrons par conduction de surface
type: ConceptConcept
type: Concept
creator: Commission d'enrichissement de la langue française, FranceTerme
abbreviation: AEC
abbreviation: SED @en
date parution JO: 2011-04-21
equivalent EN: SED @en
equivalent EN: SED (en)
equivalent EN: surface-conduction electron-emitter display @en
equivalent EN: surface-conduction electron-emitter display (en)
definition: Dispositif d'affichage constitué d'émetteurs d'électrons à deux électrodes qui, placés chacun devant un pixel luminescent, projettent sous l'action d'un champ électrique les électrons depuis la surface formée par les deux électrodes jusqu'à la couche luminescente.
in scheme: Électronique
in scheme: concepts
notation: INFO784

écran à double affichage
type: ConceptConcept
type: Concept
creator: Commission d'enrichissement de la langue française, FranceTerme
date parution JO: 2011-04-21
deconseille ou frequent: Split view
equivalent EN: dual view LCD @en
equivalent EN: dual view LCD (en)
equivalent EN: dual view display @en
equivalent EN: dual view display (en)
definition: Dispositif d'affichage, généralement à cristaux liquides, permettant de voir deux images différentes selon l'angle sous lequel on le regarde.
in scheme: Électronique
in scheme: concepts
notation: INFO785
note: « Split view », qui est un nom de marque, ne doit pas être utilisé pour désigner de façon générale ce type de dispositif.

silicium étiré
type: ConceptConcept
type: Concept
creator: Commission d'enrichissement de la langue française, FranceTerme
date parution JO: 2011-04-21
deconseille ou frequent: silicium contraint
equivalent EN: strained silicon @en
equivalent EN: strained silicon (en)
definition: Silicium déposé en couche mince sur un matériau de façon à aligner les atomes de silicium sur ceux, plus espacés, du substrat.
in scheme: Électronique
in scheme: concepts
notation: INFO786
note: 1. L'espacement accru entre les atomes de silicium augmente la mobilité des porteurs de charges et de ce fait les performances des circuits.
note: 2. On trouve aussi, dans le langage professionnel, le terme « silicium contraint ».

silicium sur isolant
type: ConceptConcept
type: Concept
creator: Commission d'enrichissement de la langue française, FranceTerme
abbreviation: SOI @en
abbreviation: SSI
date parution JO: 2011-04-21
equivalent EN: SOI @en
equivalent EN: SOI (en)
equivalent EN: silicon on insulator @en
equivalent EN: silicon on insulator (en)
definition: Structure constituée d'une couche de silicium recouvrant une couche d'isolant, dans laquelle sont réalisés les circuits intégrés.
in scheme: Électronique
in scheme: concepts
notation: INFO787

boîtier-système
type: ConceptConcept
type: Concept
creator: Commission d'enrichissement de la langue française, FranceTerme
abbreviation: SiP @en
date parution JO: 2011-04-21
deconseille ou frequent: système en boîtier
equivalent EN: SiP @en
equivalent EN: SiP (en)
equivalent EN: system in package @en
equivalent EN: system in package (en)
part of speech: nom masculin
definition: Boîtier qui contient les puces nécessaires à la mise en œuvre des fonctions d'un système.
in scheme: Électronique
in scheme: concepts
notation: INFO788
note: On trouve aussi le terme « système en boîtier ».
related: boîtier
related: puce-système

circuit intégré développé pour un client
type: ConceptConcept
type: Concept
creator: Commission d'enrichissement de la langue française, FranceTerme
abbreviation: ASIC @en
abbreviation: CIC
abbreviation: USIC @en
date parution JO: 2011-04-21
deconseille ou frequent: circuit intégré spécifique
deconseille ou frequent: circuit intégré spécifique à un client
equivalent EN: ASIC @en
equivalent EN: ASIC (en)
equivalent EN: USIC @en
equivalent EN: USIC (en)
equivalent EN: application specific integrated circuit @en
equivalent EN: application specific integrated circuit (en)
equivalent EN: user specific integrated circuit @en
equivalent EN: user specific integrated circuit (en)
forme abregee: circuit intégré client
definition: Circuit intégré conçu et réalisé pour exécuter des fonctions contenues dans un cahier des charges défini par un client pour une application donnée.
in scheme: Électronique
in scheme: concepts
notation: INFO789
related: composant spécifique standard
scope note: Cette publication annule et remplace celles des termes « circuit intégré spécifique » et « circuit intégré spécifique à un client » au Journal officiel du 22 septembre 2000.

accès direct
type: ConceptConcept
type: Concept
creator: Commission d'enrichissement de la langue française, FranceTerme
source: révision de l'arrêté du 22 décembre 1981
date parution JO: 2000-09-22
equivalent EN: direct access @en
equivalent EN: direct access (en)
equivalent EN: random access @en
equivalent EN: random access (en)
definition: Mode d'écriture ou de lecture de données se faisant au moyen d'adresses qui repèrent l'emplacement de ces données.
in scheme: Informatique
in scheme: concepts
notation: INFO79

composant spécifique standard
type: ConceptConcept
type: Concept
creator: Commission d'enrichissement de la langue française, FranceTerme
abbreviation: ASSP @en
abbreviation: CSS
date parution JO: 2011-04-21
equivalent EN: ASSP @en
equivalent EN: ASSP (en)
equivalent EN: application specific standard product @en
equivalent EN: application specific standard product (en)
definition: Composant électronique destiné à une application donnée et figurant au catalogue d'un fournisseur.
in scheme: Électronique
in scheme: concepts
notation: INFO790
related: circuit intégré développé pour un client

puce-système
type: ConceptConcept
type: Concept
creator: Commission d'enrichissement de la langue française, FranceTerme
abbreviation: SoC @en
date parution JO: 2011-04-21
deconseille ou frequent: système sur puce
equivalent EN: SoC @en
equivalent EN: SoC (en)
equivalent EN: system on chip @en
equivalent EN: system on chip (en)
part of speech: nom féminin
definition: Circuit intégré sur une puce qui contient l'ensemble des composants nécessaires à la mise en œuvre des fonctions d'un système.
in scheme: Électronique
in scheme: concepts
notation: INFO791
note: On trouve aussi le terme « système sur puce ».
related: puce
related: boîtier-système

multitâche
type: ConceptConcept
type: Concept
creator: Commission d'enrichissement de la langue française, FranceTerme
date parution JO: 2011-04-21
deconseille ou frequent: multitasking
equivalent EN: multitask @en
equivalent EN: multitask (en)
part of speech: adjectif
definition: Se dit du mode de fonctionnement d'un ordinateur dont le système d'exploitation permet d'exécuter plusieurs programmes simultanément.
in scheme: Électronique
in scheme: Informatique
in scheme: concepts
notation: INFO792
note: 1. Le système d'exploitation passe d'une tâche à une autre avec des intervalles suffisamment courts pour que l'utilisateur ait l'impression que tous les programmes sont exécutés simultanément.
note: 2. Ce terme est employé comme nom pour désigner un système d'exploitation (en anglais : multitasking).
related: multitraitement

fil d'exécution
type: ConceptConcept
type: Concept
creator: Commission d'enrichissement de la langue française, FranceTerme
date parution JO: 2011-04-21
equivalent EN: thread @en
equivalent EN: thread (en)
forme abregee: fil, n.m.
alternative label: processus léger
definition: Composante élémentaire et indépendante d'un processus, qui intervient dans un programme.
in scheme: Électronique
in scheme: Informatique
in scheme: concepts
notation: INFO793
related: multifil
related: multifil simultané

multifil
type: ConceptConcept
type: Concept
creator: Commission d'enrichissement de la langue française, FranceTerme
date parution JO: 2011-04-21
equivalent EN: multithreading @en
equivalent EN: multithreading (en)
definition: Se dit du mode de fonctionnement d'un programme qui se décompose en plusieurs fils capables d'être exécutés quasi simultanément ; ce mode de fonctionnement lui-même.
in scheme: Électronique
in scheme: Informatique
in scheme: concepts
notation: INFO794
note: Le temps d'attente nécessaire pour accéder au matériel lors de l'exécution d'un fil est mis à profit pour le traitement d'autres fils.
related: fil d'exécution

multifil simultané
type: ConceptConcept
type: Concept
creator: Commission d'enrichissement de la langue française, FranceTerme
abbreviation: SMT @en
date parution JO: 2011-04-21
deconseille ou frequent: HTT
deconseille ou frequent: hyperthreading technology
equivalent EN: SMT @en
equivalent EN: SMT (en)
equivalent EN: simultaneous multithreading @en
equivalent EN: simultaneous multithreading (en)
part of speech: locution adjectivale ou locution masculine
definition: Se dit du mode de fonctionnement d'un processeur permettant l'exécution simultanée de plusieurs fils pouvant provenir de programmes différents, grâce à un logiciel adapté et à la duplication de certaines parties du matériel ; ce mode de fonctionnement lui-même.
in scheme: Électronique
in scheme: Informatique
in scheme: concepts
notation: INFO795
note: 1. Certaines ressources du processeur sont communes à l'ensemble des fils, tandis que d'autres sont propres à chacun d'entre eux.
note: 2. Le nom de marque « hyperthreading technology (HTT) », qui désigne une forme particulière de cette technique, ne doit pas être employé.
related: fil d'exécution

contrôleur de mémoire
type: ConceptConcept
type: Concept
creator: Commission d'enrichissement de la langue française, FranceTerme
abbreviation: IMC @en
abbreviation: MCH @en
date parution JO: 2011-04-21
equivalent EN: IMC @en
equivalent EN: IMC (en)
equivalent EN: MCH @en
equivalent EN: MCH (en)
equivalent EN: integrated memory controller @en
equivalent EN: integrated memory controller (en)
equivalent EN: memory controller hub @en
equivalent EN: memory controller hub (en)
equivalent EN: northbridge @en
equivalent EN: northbridge (en)
definition: Circuit d'un ordinateur qui organise et régule les échanges entre le processeur et les mémoires vives.
in scheme: Électronique
in scheme: concepts
notation: INFO796
related: contrôleur d'entrée et de sortie

contrôleur d'entrée et de sortie
type: ConceptConcept
type: Concept
creator: Commission d'enrichissement de la langue française, FranceTerme
abbreviation: ICH @en
abbreviation: PCH @en
date parution JO: 2011-04-21
equivalent EN: I/O controller hub @en
equivalent EN: I/O controller hub (en)
equivalent EN: ICH @en
equivalent EN: ICH (en)
equivalent EN: PCH @en
equivalent EN: PCH (en)
equivalent EN: input/output controller hub @en
equivalent EN: input/output controller hub (en)
equivalent EN: platform controller hub @en
equivalent EN: platform controller hub (en)
equivalent EN: southbridge @en
equivalent EN: southbridge (en)
forme abregee: contrôleur d'entrée-sortie
alternative label: contrôleur d'extension
definition: Circuit d'un ordinateur qui organise et régule les échanges entre le processeur et les périphériques d'entrée et de sortie.
in scheme: Électronique
in scheme: concepts
notation: INFO797
related: contrôleur de mémoire

mémoire volatile
type: ConceptConcept
type: Concept
creator: Commission d'enrichissement de la langue française, FranceTerme
antonym: mémoire non volatile
date parution JO: 2011-04-21
equivalent EN: volatile memory @en
equivalent EN: volatile memory (en)
definition: Mémoire qui, lors d'une coupure d'alimentation électrique, perd les informations qui y sont stockées.
in scheme: Électronique
in scheme: Informatique
in scheme: concepts
notation: INFO798
related: mémoire vive statique

mémoire vive magnétique
type: ConceptConcept
type: Concept
creator: Commission d'enrichissement de la langue française, FranceTerme
abbreviation: MRAM @en
date parution JO: 2011-04-21
equivalent EN: MRAM @en
equivalent EN: MRAM (en)
equivalent EN: magnetic random access memory @en
equivalent EN: magnetic random access memory (en)
definition: Mémoire vive non volatile dans laquelle les états binaires correspondent à deux valeurs de conductance électrique établies par l'action d'un champ magnétique.
in scheme: Électronique
in scheme: Informatique
in scheme: concepts
notation: INFO799
related: mémoire vive
related: mémoire vive résistive

connectabilité
type: ConceptConcept
type: Concept
creator: Commission d'enrichissement de la langue française, FranceTerme
date parution JO: 1998-10-10
equivalent EN: connectivity @en
equivalent EN: connectivity (en)
part of speech: nom féminin
definition: Ability of an equipment to function within a particular network due to its physical and software features. @en
definition: Aptitude d'un équipement à fonctionner dans un réseau donné du fait de ses caractéristiques matérielles et logicielles.
in scheme: Informatique
in scheme: Télécommunications
in scheme: concepts
notation: INFO8

accès séquentiel
type: ConceptConcept
type: Concept
creator: Commission d'enrichissement de la langue française, FranceTerme
source: révision de l'arrêté du 22 décembre 1981
date parution JO: 2000-09-22
equivalent EN: serial access @en
equivalent EN: serial access (en)
definition: Mode d'écriture ou de lecture de données, effectuées en suivant un ordre préétabli de rangement.
in scheme: Informatique
in scheme: concepts
notation: INFO80

micro-usinage de surface
type: ConceptConcept
type: Concept
creator: Commission d'enrichissement de la langue française, FranceTerme
date parution JO: 2009-12-27
deconseille ou frequent: surface micro-machining
equivalent EN: surface micromachining @en
equivalent EN: surface micromachining (en)
in scheme: Électronique
in scheme: concepts
notation: INFO800
related: micro-usinage

micro-usinage de volume
type: ConceptConcept
type: Concept
creator: Commission d'enrichissement de la langue française, FranceTerme
date parution JO: 2009-12-27
deconseille ou frequent: bulk micro-machining
equivalent EN: bulk micromachining @en
equivalent EN: bulk micromachining (en)
in scheme: Électronique
in scheme: concepts
notation: INFO801
related: micro-usinage

conducteur-poutre
type: ConceptConcept
type: Concept
creator: Commission d'enrichissement de la langue française, FranceTerme
date parution JO: 2009-12-27
equivalent EN: beam lead @en
equivalent EN: beam lead (en)
part of speech: nom masculin
definition: Patte rigide dépassant d'une puce, fabriquée en même temps que celle-ci et servant à sa fixation mécanique et à sa connexion électrique.
in scheme: Électronique
in scheme: concepts
notation: INFO803

mappe
type: ConceptConcept
type: Concept
creator: Commission d'enrichissement de la langue française, FranceTerme
source: révision de l'arrêté du 10 octobre 1985
date parution JO: 2000-09-22
equivalent EN: map @en
equivalent EN: map (en)
equivalent EN: mapping @en
equivalent EN: mapping (en)
part of speech: nom féminin
definition: Représentation de la localisation d'ensembles de données dans une mémoire d'ordinateur, en vue d'en faciliter l'accès et la visualisation.
in scheme: Audiovisuel
in scheme: Informatique
in scheme: concepts
notation: INFO804

accréditation
type: ConceptConcept
type: Concept
creator: Commission d'enrichissement de la langue française, FranceTerme
date parution JO: 2010-08-15
equivalent EN: credentials @en
equivalent EN: credentials (en)
part of speech: nom féminin
definition: Procédure permettant d'attribuer à une personne ou à une entité des droits d'accès à des ressources ou à des services électroniques ; par extension, ensemble des informations caractérisant ces droits.
in scheme: Informatique
in scheme: Télécommunications
in scheme: concepts
notation: INFO805

investigation informatique
type: ConceptConcept
type: Concept
creator: Commission d'enrichissement de la langue française, FranceTerme
date parution JO: 2010-08-15
deconseille ou frequent: découverte
equivalent EN: discovery @en
equivalent EN: discovery (en)
equivalent EN: e-discovery @en
equivalent EN: e-discovery (en)
forme abregee: investigation, n.f.
definition: Processus par lequel des informations ou documents électroniques sont recherchés, identifiés et rassemblés pour la production d'éléments de preuve.
in scheme: Informatique
in scheme: concepts
notation: INFO806
note: Le mot « découverte » est impropre en ce sens.

réseau de stockage
type: ConceptConcept
type: Concept
creator: Commission d'enrichissement de la langue française, FranceTerme
abbreviation: SAN @en
date parution JO: 2010-08-15
equivalent EN: SAN @en
equivalent EN: SAN (en)
equivalent EN: storage area network @en
equivalent EN: storage area network (en)
definition: Ensemble de mémoires reliées par des interconnexions à très haut débit, accessible depuis plusieurs ordinateurs.
in scheme: Informatique
in scheme: Télécommunications
in scheme: concepts
notation: INFO807
related: unité de stockage en réseau

rétrolien
type: ConceptConcept
type: Concept
creator: Commission d'enrichissement de la langue française, FranceTerme
date parution JO: 2010-08-15
deconseille ou frequent: track back
deconseille ou frequent: track back link
equivalent EN: trackback @en
equivalent EN: trackback (en)
equivalent EN: trackback link @en
equivalent EN: trackback link (en)
part of speech: nom masculin
definition: Système de liaison hypertextuelle fonctionnant de manière que, si l'auteur d'un blogue relie son texte à un article connexe d'un autre blogue, un lien est automatiquement créé depuis cet article vers le texte d'origine.
in scheme: Informatique
in scheme: concept-SD-informatique-internet
in scheme: concepts
notation: INFO808
related: hypertexte
related: blogue

unité de stockage en réseau
type: ConceptConcept
type: Concept
creator: Commission d'enrichissement de la langue française, FranceTerme
abbreviation: NAS @en
date parution JO: 2010-08-15
equivalent EN: NAS @en
equivalent EN: NAS (en)
equivalent EN: network attached storage @en
equivalent EN: network attached storage (en)
definition: Mémoire de masse autonome accessible par l'intermédiaire d'un réseau local.
in scheme: Informatique
in scheme: Télécommunications
in scheme: concepts
notation: INFO809
related: réseau de stockage

algorithmique
type: ConceptConcept
type: Concept
creator: Commission d'enrichissement de la langue française, FranceTerme
source: révision de l'arrêté du 27 juin 1989
date parution JO: 2000-09-22
equivalent EN: algorithmics @en
equivalent EN: algorithmics (en)
part of speech: nom féminin
definition: Étude de la résolution de problèmes par la mise en œuvre de suites d'opérations élémentaires selon un processus défini aboutissant à une solution.
in scheme: Informatique
in scheme: concepts
notation: INFO81
related: concept-algorithme

cédérom autonome
type: ConceptConcept
type: Concept
creator: Commission d'enrichissement de la langue française, FranceTerme
date parution JO: 2013-01-01
equivalent EN: live CD @en
equivalent EN: live CD (en)
definition: Cédérom comportant un système d'exploitation qui fonctionne sans installation préalable.
in scheme: Informatique
in scheme: concepts
notation: INFO814
related: concept-INFO96

charge utile
type: ConceptConcept
type: Concept
creator: Commission d'enrichissement de la langue française, FranceTerme
date parution JO: 2013-01-01
equivalent EN: payload @en
equivalent EN: payload (en)
definition: Partie d'un élément transmis, tel qu'un message électronique, un flux de données ou un programme d'installation, qui correspond au contenu à transmettre et non aux données d'acheminement.
in scheme: Informatique
in scheme: concept-SD-informatique-internet
in scheme: concepts
notation: INFO815
related: concept-SPAT1727

appariement de formes
type: ConceptConcept
type: Concept
creator: Commission d'enrichissement de la langue française, FranceTerme
source: révision de l'arrêté du 27 juin 1989
date parution JO: 2000-09-22
equivalent EN: pattern matching @en
equivalent EN: pattern matching (en)
alternative label: filtrage
definition: Mise en correspondance de formes selon un ensemble prédéfini de règles ou de critères.
in scheme: Informatique
in scheme: concepts
notation: INFO82
related: concept-SPAT162

flux de dépêches
type: ConceptConcept
type: Concept
creator: Commission d'enrichissement de la langue française, FranceTerme
abbreviation: RSS @en
date parution JO: 2013-01-01
deconseille ou frequent: fil de syndication
deconseille ou frequent: flux rss
equivalent EN: RSS @en
equivalent EN: RSS (en)
equivalent EN: RSS feed @en
equivalent EN: RSS feed (en)
equivalent EN: really simple syndication @en
equivalent EN: really simple syndication (en)
definition: Suite de données générées automatiquement par un site de la toile pour permettre l'accès aux nouveautés de ce site.
in scheme: Informatique
in scheme: concept-SD-informatique-internet
in scheme: concepts
notation: INFO820
note: Certains sites proposent, sur leur page d'accueil, un bouton qui donne la possibilité de s'abonner au flux de dépêches.
related: syndication

impression en ligne
type: ConceptConcept
type: Concept
creator: Commission d'enrichissement de la langue française, FranceTerme
date parution JO: 2013-01-01
deconseille ou frequent: web 2 print
equivalent EN: e-printing @en
equivalent EN: e-printing (en)
equivalent EN: web-to-print @en
equivalent EN: web-to-print (en)
equivalent EN: web2print @en
equivalent EN: web2print (en)
definition: Service en ligne qui permet de faire réaliser tout type d'impression et de façonnage.
in scheme: Informatique
in scheme: concept-SD-informatique-internet
in scheme: concepts
notation: INFO823
scope note: Cette publication annule et remplace celle du Journal officiel du 26 octobre 2006.

infrastructure à la demande
type: ConceptConcept
type: Concept
creator: Commission d'enrichissement de la langue française, FranceTerme
abbreviation: IaaS @en
date parution JO: 2013-01-01
deconseille ou frequent: infrastructure sous forme de service
equivalent EN: IaaS @en
equivalent EN: IaaS (en)
equivalent EN: infrastructure as a service @en
equivalent EN: infrastructure as a service (en)
definition: Prestation de service qui propose à un client l'utilisation à distance d'une infrastructure comprenant du matériel et des logiciels, et dont le coût correspond à leur usage effectif.
in scheme: Informatique
in scheme: concepts
notation: INFO826
note: On trouve aussi, dans le langage professionnel, le terme « infrastructure sous forme de service ».
related: informatique en nuage
related: matériel à la demande
related: logiciel à la demande

matériel à la demande
type: ConceptConcept
type: Concept
creator: Commission d'enrichissement de la langue française, FranceTerme
abbreviation: HaaS @en
date parution JO: 2013-01-01
deconseille ou frequent: matériel sous forme de service
equivalent EN: HaaS @en
equivalent EN: HaaS (en)
equivalent EN: hardware as a service @en
equivalent EN: hardware as a service (en)
definition: Prestation de service proposant à un client l'utilisation à distance d'un matériel et dont le coût correspond à son usage effectif.
in scheme: Informatique
in scheme: concepts
notation: INFO828
note: On trouve aussi, dans le langage professionnel, le terme « matériel sous forme de service ».
related: informatique en nuage
related: infrastructure à la demande
related: logiciel à la demande

ardoise électronique
type: ConceptConcept
type: Concept
creator: Commission d'enrichissement de la langue française, FranceTerme
source: révision de l'arrêté du 19 février 1993
date parution JO: 2000-09-22
equivalent EN: notepad computer @en
equivalent EN: notepad computer (en)
definition: Ordinateur portatif sans clavier dans lequel on fait entrer les données par saisie directe sur l'écran.
in scheme: Informatique
in scheme: concepts
notation: INFO83

fureteur, -euse
type: ConceptConcept
type: Concept
creator: Commission d'enrichissement de la langue française, FranceTerme
date parution JO: 2014-09-16
deconseille ou frequent: INFO9
deconseille ou frequent: badaud
deconseille ou frequent: badaude
deconseille ou frequent: lurkeur
equivalent EN: lurker @en
equivalent EN: lurker (en)
part of speech: nom
definition: Personne qui, dans un espace d’échanges de l’internet tel qu’un forum ou un blogue, suit les discussions ou consulte les articles sans apporter de contribution.
in scheme: Informatique
in scheme: concept-SD-informatique-internet
in scheme: concepts
notation: INFO833
related: forum
related: blogue

usurpation d'adresse électronique
type: ConceptConcept
type: Concept
creator: Commission d'enrichissement de la langue française, FranceTerme
date parution JO: 2013-01-01
deconseille ou frequent: email spoofing
equivalent EN: e-mail spoofing @en
equivalent EN: e-mail spoofing (en)
definition: Pratique consistant à utiliser frauduleusement une adresse de courrier électronique appartenant à une autre personne.
in scheme: Informatique
in scheme: concept-SD-informatique-internet
in scheme: concepts
notation: INFO837
note: L'usurpation d'adresse électronique est le plus souvent utilisée pour envoyer en grand nombre des courriels indésirables.

exploration de modèle
type: ConceptConcept
type: Concept
creator: Commission d'enrichissement de la langue française, FranceTerme
date parution JO: 2013-01-01
equivalent EN: model checking @en
equivalent EN: model checking (en)
definition: Méthode de vérification algorithmique, qui permet de déterminer avec efficacité si un système représenté par un modèle satisfait à un ensemble de spécifications formelles et qui, si une des spécifications n'est pas vérifiée, fournit des contre-exemples servant à identifier la source des erreurs.
in scheme: Informatique
in scheme: concepts
notation: INFO839
note: L'exploration de modèle trouve de nombreuses applications dans les industries du logiciel et du matériel, la vérification de puces, les protocoles de communication, les logiciels pilotes de périphériques, les systèmes critiques embarqués et les algorithmes de sécurité.
related: explorateur de modèle

arrière-plan (d')
type: ConceptConcept
type: Concept
creator: Commission d'enrichissement de la langue française, FranceTerme
source: révision de l'arrêté du 30 novembre 1983
date parution JO: 2000-09-22
deconseille ou frequent: d'arrière-plan
equivalent EN: background @en
equivalent EN: background (en)
part of speech: locution adjectivale
definition: Qualifie un traitement informatique non prioritaire qui est exécuté lorsque les ressources ne sont pas affectées à un programme en temps réel ou à des programmes prioritaires.
in scheme: Informatique
in scheme: concepts
notation: INFO84

explorateur de modèle
type: ConceptConcept
type: Concept
creator: Commission d'enrichissement de la langue française, FranceTerme
date parution JO: 2013-01-01
equivalent EN: model-checker @en
equivalent EN: model-checker (en)
definition: Dispositif permettant l'exploration d'un modèle.
in scheme: Informatique
in scheme: concepts
notation: INFO840
related: exploration de modèle

rétro-ingénierie
type: ConceptConcept
type: Concept
creator: Commission d'enrichissement de la langue française, FranceTerme
date parution JO: 2013-01-01
deconseille ou frequent: rétroingénierie
equivalent EN: reverse engineering @en
equivalent EN: reverse engineering (en)
part of speech: nom féminin
alternative label: ingénierie inverse
definition: Ensemble des opérations d'analyse d'un logiciel ou d'un matériel destinées à retrouver le processus de sa conception et de sa fabrication, ainsi que les modalités de son fonctionnement.
in scheme: Économie générale
in scheme: Industrie
in scheme: Informatique
in scheme: concepts
notation: INFO842

guichet
type: ConceptConcept
type: Concept
creator: Commission d'enrichissement de la langue française, FranceTerme
date parution JO: 2014-09-16
deconseille ou frequent: INFO9
equivalent EN: front office @en
equivalent EN: front office (en)
part of speech: nom masculin
definition: Interface permettant d'accéder aux services en ligne proposés par une entreprise ou une organisation.
in scheme: Informatique
in scheme: concept-SD-informatique-internet
in scheme: concepts
notation: INFO843
related: arrière-guichet

logiciel à la demande
type: ConceptConcept
type: Concept
creator: Commission d'enrichissement de la langue française, FranceTerme
abbreviation: SaaS @en
date parution JO: 2013-01-01
deconseille ou frequent: logiciel sous forme de service
equivalent EN: SaaS @en
equivalent EN: SaaS (en)
equivalent EN: software as a service @en
equivalent EN: software as a service (en)
definition: Prestation de service proposant à un client l'utilisation à distance d'un logiciel et dont le coût correspond à son usage effectif.
in scheme: Informatique
in scheme: concepts
notation: INFO844
note: On trouve aussi, dans le langage professionnel, le terme « logiciel sous forme de service ».
related: informatique en nuage
related: jeu vidéo à la demande
related: infrastructure à la demande
related: matériel à la demande

arrière-guichet
type: ConceptConcept
type: Concept
creator: Commission d'enrichissement de la langue française, FranceTerme
date parution JO: 2014-09-16
equivalent EN: back office @en
equivalent EN: back office (en)
part of speech: nom masculin
definition: Support informatique et logistique d'un ou de plusieurs guichets.
in scheme: Informatique
in scheme: concept-SD-informatique-internet
in scheme: concepts
notation: INFO845
related: guichet

collecteur
type: ConceptConcept
type: Concept
creator: Commission d'enrichissement de la langue française, FranceTerme
date parution JO: 2013-01-01
equivalent EN: crawler @en
equivalent EN: crawler (en)
part of speech: nom masculin
definition: Programme qui parcourt la toile pour en extraire des éléments de repérage de contenus, destinés à être utilisés par un moteur de recherche.
in scheme: Informatique
in scheme: concept-SD-informatique-internet
in scheme: concepts
notation: INFO847

enregistreur de frappe
type: ConceptConcept
type: Concept
creator: Commission d'enrichissement de la langue française, FranceTerme
date parution JO: 2013-01-01
equivalent EN: keylogger @en
equivalent EN: keylogger (en)
definition: Dispositif conçu pour enregistrer la succession des frappes effectuées par un utilisateur sur un clavier.
in scheme: Informatique
in scheme: concept-SD-informatique-internet
in scheme: concepts
notation: INFO848
note: L'enregistreur de frappe peut être un programme malveillant, qui opère à l'insu de l'utilisateur et permet, par exemple, de connaître son mot de passe.

autonome
type: ConceptConcept
type: Concept
creator: Commission d'enrichissement de la langue française, FranceTerme
source: révision de l'arrêté du 22 décembre 1981
date parution JO: 2000-09-22
equivalent EN: off line @en
equivalent EN: off line (en)
equivalent EN: off-line @en
equivalent EN: off-line (en)
equivalent EN: offline @en
equivalent EN: offline (en)
part of speech: adjectif
definition: Se dit d'un matériel lorsqu'il fonctionne indépendamment de tout autre.
in scheme: Informatique
in scheme: concepts
notation: INFO85
related: ligne (en)

brouillage
type: ConceptConcept
type: Concept
creator: Commission d'enrichissement de la langue française, FranceTerme
date parution JO: 2013-01-01
equivalent EN: obfuscation @en
equivalent EN: obfuscation (en)
part of speech: nom masculin
definition: Transformation du code source d'un programme destinée à le rendre incompréhensible.
in scheme: Informatique
in scheme: concepts
notation: INFO851
note: Le brouillage permet notamment de protéger un programme d'une réutilisation abusive.

mémoire non volatile
type: ConceptConcept
type: Concept
creator: Commission d'enrichissement de la langue française, FranceTerme
abbreviation: NVM @en
antonym: mémoire volatile
date parution JO: 2011-04-21
equivalent EN: NVM @en
equivalent EN: NVM (en)
equivalent EN: non volatile memory @en
equivalent EN: non volatile memory (en)
equivalent EN: nonvolatile memory @en
equivalent EN: nonvolatile memory (en)
in scheme: Électronique
in scheme: Informatique
in scheme: concepts
notation: INFO852
related: disque statique à semiconducteurs
related: mémoire flash
related: mémoire vive résistive
related: concept-TELE554

test captcha
type: ConceptConcept
type: Concept
creator: Commission d'enrichissement de la langue française, FranceTerme
date parution JO: 2013-01-01
equivalent EN: captcha @en
equivalent EN: captcha (en)
equivalent EN: captcha test @en
equivalent EN: captcha test (en)
equivalent EN: completely automated public Turing test to tell computers and humans apart @en
equivalent EN: completely automated public Turing test to tell computers and humans apart (en)
forme abregee: captcha, n.m.
alternative label: test de reconnaissance humaine
definition: Test invitant l'utilisateur d'un site ou d'une application informatique à saisir correctement une suite de caractères présentés à l'écran d'une manière déformée, qui permet de s'assurer que la demande d'accès émane bien d'une personne et non d'un automate.
in scheme: Informatique
in scheme: concept-SD-informatique-internet
in scheme: concepts
notation: INFO853

circuit tampon
type: ConceptConcept
type: Concept
creator: Commission d'enrichissement de la langue française, FranceTerme
source: révision de l'arrêté du 14 septembre 1990
date parution JO: 2000-09-22
equivalent EN: buffer circuit @en
equivalent EN: buffer circuit (en)
definition: Circuit intermédiaire réalisant une adaptation d'impédance.
in scheme: Électronique
in scheme: concept-SD-electronique-composants-electroniques
in scheme: concepts
notation: INFO854

bloc de propriété intellectuelle
type: ConceptConcept
type: Concept
creator: Commission d'enrichissement de la langue française, FranceTerme
abbreviation: BPI
abbreviation: IP block @en
date parution JO: 2015-04-01
equivalent EN: IP block @en
equivalent EN: IP block (en)
equivalent EN: IP core @en
equivalent EN: IP core (en)
equivalent EN: intellectual property block @en
equivalent EN: intellectual property block (en)
forme abregee: bloc de PI
definition: Ensemble électronique dont l’utilisation pour la conception de circuits intégrés est protégée par les règles de la propriété intellectuelle.
in scheme: Électronique
in scheme: concepts
notation: INFO855
note: Un bloc de propriété intellectuelle peut notamment être décrit sous une forme logique, à l’aide d’un schéma électrique ou de manière topologique.
related: topologie

microsystème optoélectromécanique
type: ConceptConcept
type: Concept
creator: Commission d'enrichissement de la langue française, FranceTerme
abbreviation: MOEMS @en
date parution JO: 2015-04-01
deconseille ou frequent: microsystème opto-électromécanique
equivalent EN: MOEMS @en
equivalent EN: MOEMS (en)
equivalent EN: micro-opto-electromechanical system @en
equivalent EN: micro-opto-electromechanical system (en)
alternative label: moems
definition: Système intégrant sur une puce des dispositifs mécaniques, électroniques et optiques, et qui remplit une fonction déterminée.
in scheme: Électronique
in scheme: concepts
notation: INFO856
related: microsystème électromécanique

répartition de l'usure
type: ConceptConcept
type: Concept
creator: Commission d'enrichissement de la langue française, FranceTerme
date parution JO: 2015-04-01
equivalent EN: wear leveling (US) @en
equivalent EN: wear leveling (en-US)
equivalent EN: wear levelling (GB) @en
equivalent EN: wear levelling (en-GB)
definition: Technique qui consiste à répartir les opérations d’écriture sur tout l’espace de stockage d’une mémoire flash afin de solliciter moins souvent les mêmes cellules et d’augmenter la durée de vie de cette mémoire.
in scheme: Électronique
in scheme: concepts
notation: INFO857
related: mémoire flash

cellule binaire
type: ConceptConcept
type: Concept
creator: Commission d'enrichissement de la langue française, FranceTerme
abbreviation: SLC @en
date parution JO: 2015-04-01
equivalent EN: SLC @en
equivalent EN: SLC (en)
equivalent EN: binary cell @en
equivalent EN: binary cell (en)
equivalent EN: bit cell @en
equivalent EN: bit cell (en)
equivalent EN: single-level cell @en
equivalent EN: single-level cell (en)
definition: Cellule de mémoire qui ne peut contenir qu’un seul élément binaire.
in scheme: Électronique
in scheme: concepts
notation: INFO858
related: cellule de mémoire
related: mémoire à cellules multiniveaux
related: concept-TELE362

cellule de mémoire
type: ConceptConcept
type: Concept
creator: Commission d'enrichissement de la langue française, FranceTerme
date parution JO: 2015-04-01
equivalent EN: memory cell @en
equivalent EN: memory cell (en)
definition: Le plus petit emplacement d’une mémoire numérique dans lequel un élément de données peut être introduit, conservé ou duquel il peut être extrait.
in scheme: Électronique
in scheme: concepts
notation: INFO859
note: Une cellule de mémoire peut contenir un ou plusieurs éléments binaires.
related: cellule binaire
related: cellule multiniveau
related: mémoire flash
related: concept-TELE362

banque de données
type: ConceptConcept
type: Concept
creator: Commission d'enrichissement de la langue française, FranceTerme
source: révision de l'arrêté du 22 décembre 1981
date parution JO: 2000-09-22
equivalent EN: data bank @en
equivalent EN: data bank (en)
definition: Ensemble de données relatif à un domaine défini de connaissances et organisé pour être offert aux consultations d'utilisateurs.
in scheme: Informatique
in scheme: concepts
notation: INFO86

cellule multiniveau
type: ConceptConcept
type: Concept
creator: Commission d'enrichissement de la langue française, FranceTerme
abbreviation: MLC @en
date parution JO: 2015-04-01
equivalent EN: MLC @en
equivalent EN: MLC (en)
equivalent EN: multi-level cell @en
equivalent EN: multi-level cell (en)
equivalent EN: multilevel cell @en
equivalent EN: multilevel cell (en)
definition: Cellule de mémoire qui peut contenir plusieurs éléments binaires.
in scheme: Électronique
in scheme: concepts
notation: INFO860
related: cellule de mémoire
related: mémoire à cellules multiniveaux
related: concept-TELE362

dispositif à couplage de charge
type: ConceptConcept
type: Concept
creator: Commission d'enrichissement de la langue française, FranceTerme
abbreviation: CCD @en
abbreviation: DCC
date parution JO: 2015-04-01
equivalent EN: CCD @en
equivalent EN: CCD (en)
equivalent EN: charge-coupled device @en
equivalent EN: charge-coupled device (en)
definition: Dispositif à transfert de charges qui est constitué d’un ensemble de cellules élémentaires, associant chacune un élément générateur d’une charge électrique à un élément d’accumulation de cette dernière, et qui transfère ces charges de proche en proche dans une couche semiconductrice, à partir de variations cycliques de potentiel électrique.
in scheme: Électronique
in scheme: concepts
notation: INFO861
note: L’application la plus courante du dispositif à couplage de charge est le capteur d’images où les charges électriques sont produites par effet photoélectrique.
related: dispositif à transfert de charges

dispositif à transfert de charges
type: ConceptConcept
type: Concept
creator: Commission d'enrichissement de la langue française, FranceTerme
abbreviation: CTD @en
abbreviation: DTC
date parution JO: 2015-04-01
equivalent EN: CTD @en
equivalent EN: CTD (en)
equivalent EN: charge-transfer device @en
equivalent EN: charge-transfer device (en)
definition: Dispositif électronique à semiconducteurs dont le fonctionnement repose sur le déplacement de paquets de charges électriques.
in scheme: Électronique
in scheme: concepts
notation: INFO862
note: 1. Le déplacement des paquets de charges électriques est obtenu grâce à des variations de potentiel électrique.
note: 2. Le dispositif à couplage de charge, le dispositif en chapelet et le photodétecteur à report et intégration sont des exemples de dispositifs à transfert de charges.
related: dispositif à couplage de charge
related: dispositif en chapelet
related: concept-SPAT1626

dispositif en chapelet
type: ConceptConcept
type: Concept
creator: Commission d'enrichissement de la langue française, FranceTerme
abbreviation: BBD @en
date parution JO: 2015-04-01
equivalent EN: BBD @en
equivalent EN: BBD (en)
equivalent EN: bucket-brigade device @en
equivalent EN: bucket-brigade device (en)
definition: Dispositif à transfert de charges où le déplacement des paquets de charges électriques s’effectue par l’intermédiaire de dispositifs de commutation insérés entre les éléments d’accumulation des charges.
in scheme: Électronique
in scheme: concepts
notation: INFO863
related: dispositif à transfert de charges

disque dur hybride
type: ConceptConcept
type: Concept
creator: Commission d'enrichissement de la langue française, FranceTerme
abbreviation: DDH
abbreviation: HHD @en
date parution JO: 2015-04-01
equivalent EN: HHD @en
equivalent EN: HHD (en)
equivalent EN: hybrid hard drive @en
equivalent EN: hybrid hard drive (en)
definition: Dispositif de stockage combinant un disque dur et des mémoires flash qui, utilisées en cache, permettent un accès rapide à ce disque dur.
in scheme: Électronique
in scheme: concepts
notation: INFO864
related: cache
related: mémoire flash

disque statique à semiconducteurs
type: ConceptConcept
type: Concept
creator: Commission d'enrichissement de la langue française, FranceTerme
abbreviation: DSS
abbreviation: SSD @en
date parution JO: 2015-04-01
deconseille ou frequent: disque dur électronique
deconseille ou frequent: disque électronique
equivalent EN: SSD @en
equivalent EN: SSD (en)
equivalent EN: solid state disk @en
equivalent EN: solid state disk (en)
equivalent EN: solid state drive @en
equivalent EN: solid state drive (en)
forme abregee: disque statique
definition: Composant de stockage de données qui est constitué de mémoires non volatiles à semiconducteurs, généralement des mémoires flash, et d’une électronique de commande, et qui remplit la même fonction qu’un disque dur.
in scheme: Électronique
in scheme: concepts
notation: INFO865
note: 1. Ce disque est dit « statique » car il ne comporte aucune pièce mécanique mobile, à la différence du disque dur.
note: 2. On rencontre aussi les expressions « disque électronique » et « disque dur électronique ».
related: mémoire non volatile
related: mémoire flash

mémoire à cellules multiniveaux
type: ConceptConcept
type: Concept
creator: Commission d'enrichissement de la langue française, FranceTerme
abbreviation: MCM
date parution JO: 2015-04-01
deconseille ou frequent: MLC memory
equivalent EN: MCM @en
equivalent EN: MCM (en)
equivalent EN: multi-level cell memory @en
equivalent EN: multi-level cell memory (en)
equivalent EN: multilevel cell memory @en
equivalent EN: multilevel cell memory (en)
definition: Mémoire dont les cellules peuvent contenir plusieurs éléments binaires.
in scheme: Électronique
in scheme: concepts
notation: INFO866
note: Une mémoire à cellules multiniveaux possède une densité de stockage supérieure à celle d’une mémoire à cellules binaires, de technologie similaire.
related: cellule binaire
related: cellule multiniveau

mémoire flash
type: ConceptConcept
type: Concept
creator: Commission d'enrichissement de la langue française, FranceTerme
date parution JO: 2015-04-01
deconseille ou frequent: mémoire à écriture flash
equivalent EN: flash memory @en
equivalent EN: flash memory (en)
definition: Mémoire non volatile à semiconducteurs dont le contenu est modifiable par blocs de cellules de mémoire, ce qui augmente la vitesse d’écriture.
in scheme: Électronique
in scheme: concepts
notation: INFO867
note: 1. La mémoire flash ne supporte généralement qu’un nombre limité d’écritures.
note: 2. La mémoire flash peut servir de mémoire morte ou de mémoire vive.
related: mémoire morte
related: mémoire vive
related: mémoire non volatile
related: répartition de l'usure
related: cellule de mémoire
related: disque dur hybride
related: disque statique à semiconducteurs

mémoire vive statique
type: ConceptConcept
type: Concept
creator: Commission d'enrichissement de la langue française, FranceTerme
abbreviation: SRAM @en
date parution JO: 2015-04-01
equivalent EN: SRAM @en
equivalent EN: SRAM (en)
equivalent EN: static RAM @en
equivalent EN: static RAM (en)
equivalent EN: static random access memory @en
equivalent EN: static random access memory (en)
forme abregee: mémoire statique
definition: Mémoire vive volatile à semiconducteurs qui ne nécessite pas de circuit de régénération de son contenu.
in scheme: Électronique
in scheme: concepts
notation: INFO868
related: mémoire vive dynamique
related: mémoire volatile

mémoire vive résistive
type: ConceptConcept
type: Concept
creator: Commission d'enrichissement de la langue française, FranceTerme
abbreviation: RRAM @en
abbreviation: ReRAM @en
date parution JO: 2015-04-01
equivalent EN: RRAM @en
equivalent EN: RRAM (en)
equivalent EN: ReRAM @en
equivalent EN: ReRAM (en)
equivalent EN: resistive RAM @en
equivalent EN: resistive RAM (en)
equivalent EN: resistive random access memory @en
equivalent EN: resistive random access memory (en)
forme abregee: mémoire résistive
definition: Mémoire vive non volatile dans laquelle les états binaires correspondent à deux valeurs de conductance électrique établies par une tension électrique ou un courant.
in scheme: Électronique
in scheme: concepts
notation: INFO869
related: mémoire vive magnétique
related: mémoire non volatile

base de connaissances
type: ConceptConcept
type: Concept
creator: Commission d'enrichissement de la langue française, FranceTerme
source: révision de l'arrêté du 27 juin 1989
date parution JO: 2000-09-22
equivalent EN: knowledge base @en
equivalent EN: knowledge base (en)
equivalent EN: knowledge database @en
equivalent EN: knowledge database (en)
definition: Partie d'un système expert contenant l'ensemble des informations, en particulier des règles et des faits, qui constituent le domaine de compétence du système.
in scheme: Informatique
in scheme: concepts
notation: INFO87

blogue
type: ConceptConcept
type: Concept
creator: Commission d'enrichissement de la langue française, FranceTerme
date parution JO: 2014-09-16
deconseille ou frequent: bloc-notes
equivalent EN: blog @en
equivalent EN: blog (en)
equivalent EN: weblog @en
equivalent EN: weblog (en)
part of speech: nom masculin
definition: Site, souvent personnel, présentant, du plus récent au plus ancien, de courts articles ouverts aux commentaires des internautes.
in scheme: Informatique
in scheme: concept-SD-informatique-internet
in scheme: concepts
notation: INFO870
related: site
related: rétrolien
related: fureteur, -euse
related: microblogue
related: microblogage
scope note: Cette publication annule et remplace celle du terme « bloc-notes » au Journal officiel du 20 mai 2005.

microblogue
type: ConceptConcept
type: Concept
creator: Commission d'enrichissement de la langue française, FranceTerme
date parution JO: 2014-09-16
deconseille ou frequent: INFO9
equivalent EN: microblog @en
equivalent EN: microblog (en)
equivalent EN: thread @en
equivalent EN: thread (en)
part of speech: nom masculin
definition: Blogue constitué de minimessages diffusés en temps réel, qui contiennent souvent des mots-dièse et dont l’enchaînement forme des fils de discussion.
in scheme: Informatique
in scheme: concept-SD-informatique-internet
in scheme: concepts
notation: INFO871
related: mot-dièse
related: fil de la discussion
related: blogue
related: microblogage
related: concept-TELE354

carrousel
type: ConceptConcept
type: Concept
creator: Commission d'enrichissement de la langue française, FranceTerme
date parution JO: 2014-09-16
deconseille ou frequent: cover flow
equivalent EN: cover flow-like design @en
equivalent EN: cover flow-like design (en)
part of speech: nom masculin
definition: Menu graphique, généralement tridimensionnel, qui fait défiler de manière cyclique sur un écran un ensemble d’images donnant chacune accès à un contenu.
in scheme: Informatique
in scheme: concepts
notation: INFO873

cyberconférence
type: ConceptConcept
type: Concept
creator: Commission d'enrichissement de la langue française, FranceTerme
date parution JO: 2014-09-16
deconseille ou frequent: conférence web
equivalent EN: e-conference @en
equivalent EN: e-conference (en)
equivalent EN: web conference @en
equivalent EN: web conference (en)
equivalent EN: web conferencing @en
equivalent EN: web conferencing (en)
part of speech: nom féminin
definition: Teleconference using the internet or private computer networks and able to combine sound, image and text. @en
definition: Téléconférence utilisant l’internet ou des réseaux informatiques privés et pouvant combiner le son, l’image et le texte.
in scheme: Informatique
in scheme: Télécommunications
in scheme: concept-SD-informatique-internet
in scheme: concept-SD-telecommunications-internet
in scheme: concepts
notation: INFO874
note: A cyberconference is useful, in particular, to the presentation, exchange, sharing or modification of documents. @en
note: Une cyberconférence permet notamment la présentation, l'échange, le partage ou la modification de documents.
related: Recommandation sur les équivalents français à donner au terme webinar
related: concept-TELE92

encre électronique
type: ConceptConcept
type: Concept
creator: Commission d'enrichissement de la langue française, FranceTerme
date parution JO: 2014-09-16
equivalent EN: e-ink @en
equivalent EN: e-ink (en)
equivalent EN: electronic ink @en
equivalent EN: electronic ink (en)
definition: Matériau composé de microcapsules contenant des particules dont le déplacement, sous l’effet d'un champ électrique, permet d'afficher des textes ou des images.
in scheme: Informatique
in scheme: concepts
notation: INFO875
note: Les textes et les images ainsi affichés demeurent visibles après la suppression du champ électrique.
related: liseuse
related: papier électronique

papier électronique
type: ConceptConcept
type: Concept
creator: Commission d'enrichissement de la langue française, FranceTerme
abbreviation: e-paper @en
date parution JO: 2014-09-16
deconseille ou frequent: INFO9
equivalent EN: e-paper @en
equivalent EN: e-paper (en)
equivalent EN: electronic paper @en
equivalent EN: electronic paper (en)
definition: Support souple fonctionnant avec une source d’énergie et un microprocesseur, sur lequel peuvent s’afficher des textes ou des images au moyen d'encre électronique.
in scheme: Informatique
in scheme: concepts
notation: INFO876
related: encre électronique

environnement de développement
type: ConceptConcept
type: Concept
creator: Commission d'enrichissement de la langue française, FranceTerme
abbreviation: IDE @en
abbreviation: framework @en
date parution JO: 2014-09-16
equivalent EN: IDE @en
equivalent EN: IDE (en)
equivalent EN: application framework @en
equivalent EN: application framework (en)
equivalent EN: framework @en
equivalent EN: framework (en)
equivalent EN: integrated development environment @en
equivalent EN: integrated development environment (en)
alternative label: atelier de développement
definition: Infrastructure logicielle qui permet la création de programmes.
in scheme: Informatique
in scheme: concepts
notation: INFO877

bibliothèque de cellules
type: ConceptConcept
type: Concept
creator: Commission d'enrichissement de la langue française, FranceTerme
source: révision de l'arrêté du 29 avril 1992
date parution JO: 2000-09-22
equivalent EN: cell library @en
equivalent EN: cell library (en)
definition: Collection de fonctions électroniques prédéfinies, sous forme de base de données informatisées, contenant des données relatives à la représentation graphique, aux résultats de simulation et à la topologie d'un circuit.
in scheme: Électronique
in scheme: concept-SD-electronique-composants-electroniques
in scheme: concepts
notation: INFO88
note: Une bibliothèque de cellules se rapporte à une technologie donnée.
related: concept-INFO98

aide au dépannage
type: ConceptConcept
type: Concept
creator: Commission d'enrichissement de la langue française, FranceTerme
date parution JO: 2014-09-16
equivalent EN: troubleshooting @en
equivalent EN: troubleshooting (en)
forme abregee: dépannage, n.m.
alternative label: traitement des incidents
definition: Protocole d'assistance proposé à l'utilisateur d’un logiciel ou d'un matériel pour lui permettre de résoudre une difficulté d'emploi ou de faire face à une défaillance technique.
in scheme: Informatique
in scheme: concept-SD-informatique-internet
in scheme: concepts
notation: INFO881

bogue
type: ConceptConcept
type: Concept
creator: Commission d'enrichissement de la langue française, FranceTerme
source: révision de l'arrêté du 30 novembre 1983
date parution JO: 2000-09-22
equivalent EN: bug @en
equivalent EN: bug (en)
part of speech: nom masculin
definition: Défaut de conception ou de réalisation se manifestant par des anomalies de fonctionnement.
in scheme: Informatique
in scheme: concepts
notation: INFO89
related: débogage
related: déboguer
related: débogueur

microblogage
type: ConceptConcept
type: Concept
creator: Commission d'enrichissement de la langue française, FranceTerme
date parution JO: 2014-09-16
deconseille ou frequent: micro-blogging
equivalent EN: microblogging @en
equivalent EN: microblogging (en)
part of speech: nom masculin
definition: Publication de minimessages sur un microblogue.
in scheme: Informatique
in scheme: concept-SD-informatique-internet
in scheme: concepts
notation: INFO899
related: blogue
related: microblogue
related: concept-TELE354

connexion
type: ConceptConcept
type: Concept
creator: Commission d'enrichissement de la langue française, FranceTerme
date parution JO: 1998-10-10
deconseille ou frequent: login
equivalent EN: log in @en
equivalent EN: log in (en)
equivalent EN: log on @en
equivalent EN: log on (en)
part of speech: nom féminin
definition: Procédure permettant à un utilisateur de se mettre en relation avec un système informatique et, si nécessaire, de se faire reconnaître de celui-ci.
in scheme: Informatique
in scheme: concepts
notation: INFO9

boule de commande
type: ConceptConcept
type: Concept
creator: Commission d'enrichissement de la langue française, FranceTerme
source: révision de l'arrêté du 30 mars 1987
date parution JO: 2000-09-22
equivalent EN: rolling ball @en
equivalent EN: rolling ball (en)
equivalent EN: trackball @en
equivalent EN: trackball (en)
definition: Boule qui, par rotation dans son logement, permet de déplacer un curseur sur un écran et d'en relever à volonté les coordonnées.
in scheme: Informatique
in scheme: concepts
notation: INFO90
related: souris

imagette
type: ConceptConcept
type: Concept
creator: Commission d'enrichissement de la langue française, FranceTerme
date parution JO: 2014-09-16
deconseille ou frequent: INFO9
equivalent EN: thumbnail @en
equivalent EN: thumbnail (en)
part of speech: nom féminin
definition: Image dont la taille a été réduite par rapport à l'original pour limiter l'encombrement de l'espace d’affichage.
in scheme: Informatique
in scheme: concepts
notation: INFO900

objet personnel connecté
type: ConceptConcept
type: Concept
creator: Commission d'enrichissement de la langue française, FranceTerme
date parution JO: 2021-03-09
deconseille ou frequent: cybervêtement
deconseille ou frequent: wearable technology
deconseille ou frequent: wearables
equivalent EN: wearable device @en
equivalent EN: wearable device (en)
definition: Objet connecté que l’on porte sur soi, qui peut être un vêtement ou un accessoire.
in scheme: Tous domaines
in scheme: concepts
notation: INFO902
note: 1. Un objet personnel connecté peut être une montre, une paire de lunettes, un bijou, une paire de chaussures ou encore une ceinture.
note: 2. Un objet personnel connecté contribue, par exemple, à la surveillance médicale ou à l’évaluation des performances physiques de son porteur.
related: concept-SANT203
related: concept-TELE538
related: concept-TELE563
related: concept-TELE564
scope note: Cette publication annule et remplace celle du terme « cybervêtement » au Journal officiel du 18 mars 2011.

pair à pair
type: ConceptConcept
type: Concept
creator: Commission d'enrichissement de la langue française, FranceTerme
date parution JO: 2017-05-23
equivalent EN: P-to-P @en
equivalent EN: P-to-P (en)
equivalent EN: P2P @en
equivalent EN: P2P (en)
equivalent EN: peer-to-peer @en
equivalent EN: peer-to-peer (en)
part of speech: locution adjectivale invariable
alternative label: poste à poste
definition: Se dit du mode d’utilisation d’un réseau dans lequel chacun des participants connectés dispose des mêmes droits et qui permet un échange direct de services sans recourir à un serveur central ; par extension, se dit d’un tel réseau.
in scheme: Informatique
in scheme: Télécommunications
in scheme: concept-SD-informatique-internet
in scheme: concept-SD-telecommunications-internet
in scheme: concepts
notation: INFO909
note: Les échanges de fichiers, le calcul décentralisé et les transactions en cybermonnaie sont des exemples de services couramment assurés grâce à un réseau pair à pair.
related: cybermonnaie
related: internet clandestin
related: concept-TELE449
scope note: Cette publication annule et remplace celle du terme « poste à poste » publié au Journal officiel du 13 mai 2006.

bureautique
type: ConceptConcept
type: Concept
creator: Commission d'enrichissement de la langue française, FranceTerme
source: révision de l'arrêté du 22 décembre 1981
date parution JO: 2000-09-22
equivalent EN: bureautics @en
equivalent EN: bureautics (en)
equivalent EN: office automation @en
equivalent EN: office automation (en)
part of speech: nom féminin
definition: Ensemble des techniques et des moyens tendant à automatiser les activités de bureau et principalement le traitement et la communication de la parole, de l'écrit et de l'image.
in scheme: Informatique
in scheme: concepts
notation: INFO91

chaîne de blocs
type: ConceptConcept
type: Concept
creator: Commission d'enrichissement de la langue française, FranceTerme
date parution JO: 2017-05-23
equivalent EN: block chain @en
equivalent EN: block chain (en)
equivalent EN: blockchain @en
equivalent EN: blockchain (en)
definition: Mode d’enregistrement de données produites en continu, sous forme de blocs liés les uns aux autres dans l’ordre chronologique de leur validation, chacun des blocs et leur séquence étant protégés contre toute modification.
in scheme: Informatique
in scheme: Télécommunications
in scheme: concept-SD-informatique-internet
in scheme: concept-SD-telecommunications-internet
in scheme: concepts
notation: INFO910
note: La chaîne de blocs est notamment utilisée dans le domaine de la cybermonnaie, où elle remplit la fonction de registre public des transactions.
related: dispositif d'enregistrement électronique partagé
related: offre au public de cyberjetons
related: cybermonnaie
related: bloc
related: preuve de travail
related: validation de bloc

minage
type: ConceptConcept
type: Concept
creator: Commission d'enrichissement de la langue française, FranceTerme
date parution JO: 2017-05-23
deconseille ou frequent: bitcoin
deconseille ou frequent: ethereum
equivalent EN: mining @en
equivalent EN: mining (en)
part of speech: nom masculin
definition: Validation de bloc donnant lieu à la création de nouvelles unités de compte au profit du participant dont le bloc a été retenu par le réseau.
in scheme: Finance
in scheme: Télécommunications
in scheme: concept-SD-finance-internet
in scheme: concept-SD-telecommunications-internet
in scheme: concepts
notation: INFO911
note: Le minage est utilisé dans certains systèmes de paiement tels que Bitcoin et Ethereum.
related: cybermonnaie
related: validation de bloc
related: concept-JURI58

preuve de travail
type: ConceptConcept
type: Concept
creator: Commission d'enrichissement de la langue française, FranceTerme
date parution JO: 2017-05-23
equivalent EN: PoW @en
equivalent EN: PoW (en)
equivalent EN: proof of work @en
equivalent EN: proof of work (en)
definition: Résultat d’une tâche fortement consommatrice de ressources de calcul, dont l’exactitude est facilement vérifiable par tout participant et atteste que cette tâche a bien été effectuée en consommant les ressources nécessaires.
in scheme: Informatique
in scheme: Télécommunications
in scheme: concept-SD-informatique-internet
in scheme: concept-SD-telecommunications-internet
in scheme: concepts
notation: INFO913
note: La preuve de travail est notamment employée pour contribuer à l’établissement de la confiance des utilisateurs en une cybermonnaie, la fraude étant découragée par la difficulté de la validation de bloc.
related: chaîne de blocs
related: validation de bloc

internet clandestin
type: ConceptConcept
type: Concept
creator: Commission d'enrichissement de la langue française, FranceTerme
date parution JO: 2017-09-26
equivalent EN: dark net @en
equivalent EN: dark net (en)
equivalent EN: darknet @en
equivalent EN: darknet (en)
definition: Ensemble de réseaux conçus pour assurer l’anonymat des utilisateurs par la mise en œuvre d’une architecture décentralisée ainsi que de logiciels et d’autorisations d’accès spécifiques ; par extension, l’ensemble des activités, souvent illicites, qui y sont pratiquées.
in scheme: Informatique
in scheme: concept-SD-informatique-internet
in scheme: concepts
notation: INFO914
note: 1. L’internet clandestin utilise notamment des réseaux privés virtuels ou pair à pair, ainsi que des méthodes de chiffrement et des processus de cooptation.
note: 2. Il convient de distinguer l’« internet clandestin » de la « toile profonde ».
related: pair à pair
related: toile profonde
related: concept-TELE447

directeur, -trice des données
type: ConceptConcept
type: Concept
creator: Commission d'enrichissement de la langue française, FranceTerme
date parution JO: 2017-09-26
equivalent EN: CDO @en
equivalent EN: CDO (en)
equivalent EN: chief data officer @en
equivalent EN: chief data officer (en)
definition: Personne chargée, au sein d’une organisation, de définir la politique de gestion des données, de déterminer celles qui sont utiles à la prise de décision et de s’assurer de la qualité et de la cohérence de ces dernières.
in scheme: Informatique
in scheme: concepts
notation: INFO915
related: donnée

interface avec l'utilisateur
type: ConceptConcept
type: Concept
creator: Commission d'enrichissement de la langue française, FranceTerme
abbreviation: IHM
abbreviation: IU
date parution JO: 2017-09-26
deconseille ou frequent: interfaces homme-machine
deconseille ou frequent: interfaces utilisateur
equivalent EN: UI @en
equivalent EN: UI (en)
equivalent EN: user interface @en
equivalent EN: user interface (en)
forme abregee: interface utilisateur
alternative label: interface homme-machine
definition: Interface informatique qui régit les interactions entre une machine et son utilisateur.
in scheme: Informatique
in scheme: concepts
notation: INFO919
note: 1. Les interfaces avec l'utilisateur peuvent notamment être graphiques, textuelles, tactiles ou vocales.
note: 2. Pluriel : interfaces avec l'utilisateur, interfaces homme-machine, interfaces utilisateur.
related: commande gestuelle
related: interface
related: conception d'interfaces adaptatives
related: concept-INFO950
related: concept-INFO953

graphe de connaissances
type: ConceptConcept
type: Concept
creator: Commission d'enrichissement de la langue française, FranceTerme
date parution JO: 2017-09-26
equivalent EN: knowledge graph @en
equivalent EN: knowledge graph (en)
broader: concept-INFO981
definition: Représentation graphique des relations sémantiques entre des sujets tels que des notions, personnes, organismes ou lieux, qui permet d’exposer de manière synthétique un ensemble de connaissances.
in scheme: Informatique
in scheme: concept-SD-informatique-internet
in scheme: concepts
notation: INFO921
note: Les sujets sont présentés par un cartouche.
related: carte heuristique
related: cartouche
related: concept-INFO961
related: concept-INFO972
related: concept-INFO983

système d'engagement
type: ConceptConcept
type: Concept
creator: Commission d'enrichissement de la langue française, FranceTerme
date parution JO: 2018-12-09
equivalent EN: system of engagement @en
equivalent EN: system of engagement (en)
definition: Ensemble des services mis en ligne par une organisation pour renforcer ses liens avec ses clients, ses partenaires extérieurs et ses employés ou pour créer des relations entre eux, dans le cadre d’une stratégie commerciale ou managériale, ou encore d’une stratégie de communication.
in scheme: Informatique
in scheme: concept-SD-informatique-internet
in scheme: concepts
notation: INFO924
note: 1. Les téléservices, les réseaux sociaux et les forums sont des exemples de services utilisés dans un système d’engagement.
note: 2. Un système d’engagement permet notamment de recueillir des informations sur les utilisateurs, pour étudier par exemple leur comportement ou leurs centres d’intérêt.

toile profonde
type: ConceptConcept
type: Concept
creator: Commission d'enrichissement de la langue française, FranceTerme
date parution JO: 2017-09-26
deconseille ou frequent: dark web
deconseille ou frequent: web caché
deconseille ou frequent: web invisible
deconseille ou frequent: web profond
equivalent EN: deep web @en
equivalent EN: deep web (en)
equivalent EN: deepnet @en
equivalent EN: deepnet (en)
equivalent EN: hidden web @en
equivalent EN: hidden web (en)
equivalent EN: invisible web @en
equivalent EN: invisible web (en)
alternative label: abysse
definition: Partie de la toile qui n’est pas accessible aux internautes au moyen des moteurs de recherche usuels.
in scheme: Informatique
in scheme: concept-SD-informatique-internet
in scheme: concepts
notation: INFO926
note: 1. La toile profonde comprend notamment le contenu de certaines bases de données ou de sites à accès restreint.
note: 2. Il convient de distinguer la « toile profonde » de l’« internet clandestin ».
related: internet clandestin
related: toile

cartouche
type: ConceptConcept
type: Concept
creator: Commission d'enrichissement de la langue française, FranceTerme
date parution JO: 2017-09-26
deconseille ou frequent: encadré
deconseille ou frequent: infoboîte
equivalent EN: infobox @en
equivalent EN: infobox (en)
part of speech: nom masculin
definition: Fenêtre présentant de façon synthétique et structurée des informations textuelles ou graphiques sur un sujet, qui apparaît notamment en marge de la page des résultats d’une recherche sur la toile.
in scheme: Informatique
in scheme: concept-SD-informatique-internet
in scheme: concepts
notation: INFO927
note: 1. À titre d’exemple, le cartouche relatif à une commune peut afficher son nom, sa localisation, sa superficie et sa population.
note: 2. On trouve aussi, dans le langage professionnel, le terme « encadré » et le terme « infoboîte », qui n’est pas recommandé.
related: graphe de connaissances

conception d'interfaces adaptatives
type: ConceptConcept
type: Concept
creator: Commission d'enrichissement de la langue française, FranceTerme
date parution JO: 2017-09-26
deconseille ou frequent: adaptive web design
deconseille ou frequent: conception de sites adaptatifs
deconseille ou frequent: conception de sites web adaptatifs
equivalent EN: RWD @en
equivalent EN: RWD (en)
equivalent EN: responsive design @en
equivalent EN: responsive design (en)
equivalent EN: responsive web design @en
equivalent EN: responsive web design (en)
forme abregee: conception adaptative
definition: Élaboration et mise en œuvre de méthodes et de techniques qui permettent d’adapter automatiquement les interfaces avec l’utilisateur à différents types de terminaux, fixes ou mobiles.
in scheme: Informatique
in scheme: concept-SD-informatique-internet
in scheme: concepts
notation: INFO928
note: La conception d’interfaces adaptatives peut prendre en compte les options ou les configurations choisies par les utilisateurs, notamment en matière d’ergonomie.
related: interface avec l'utilisateur

cadre
type: ConceptConcept
type: Concept
creator: Commission d'enrichissement de la langue française, FranceTerme
source: révision de l'arrêté du 27 juin 1989
date parution JO: 2000-09-22
equivalent EN: frame @en
equivalent EN: frame (en)
part of speech: nom masculin
alternative label: schéma
definition: Structure de données permettant de décrire les connaissances relatives à une entité, sous forme d'un ensemble d'attributs et de procédures liées à ces attributs.
in scheme: Informatique
in scheme: concepts
notation: INFO93

expert, -e en mégadonnées
type: ConceptConcept
type: Concept
creator: Commission d'enrichissement de la langue française, FranceTerme
date parution JO: 2017-09-26
equivalent EN: data scientist @en
equivalent EN: data scientist (en)
definition: Spécialiste de l’extraction et de l’exploitation d’informations pertinentes à partir de mégadonnées, qu’il organise, traite et interprète à l’aide d’outils statistiques, mathématiques et informatiques.
in scheme: Informatique
in scheme: concepts
notation: INFO930
related: mégadonnées
related: exploration de données
related: concept-INFO965

portail de messagerie
type: ConceptConcept
type: Concept
creator: Commission d'enrichissement de la langue française, FranceTerme
date parution JO: 2017-09-26
equivalent EN: web mail @en
equivalent EN: web mail (en)
equivalent EN: webmail @en
equivalent EN: webmail (en)
definition: Service en ligne qui, au moyen d’un logiciel de navigation, permet le traitement des courriels et donne accès aux fonctions habituelles d’un logiciel de messagerie.
in scheme: Informatique
in scheme: concept-SD-informatique-internet
in scheme: concepts
notation: INFO931
note: Les fonctions associées les plus courantes sont la gestion d’un carnet d’adresses ainsi que la gestion des dossiers permettant de classer les messages reçus ou envoyés.
related: logiciel de navigation
related: portail
related: messagerie électronique

provisionnement
type: ConceptConcept
type: Concept
creator: Commission d'enrichissement de la langue française, FranceTerme
date parution JO: 2017-09-26
equivalent EN: provisioning @en
equivalent EN: provisioning (en)
part of speech: nom masculin
alternative label: allocation automatique
definition: Dispositif qui permet d’allouer automatiquement des ressources informatiques ou de télécommunication afin de répondre à une variation d’activité d’un utilisateur.
in scheme: Informatique
in scheme: Télécommunications
in scheme: concepts
notation: INFO932
note: Le provisionnement fait généralement l’objet d’une clause contractuelle.
related: informatique en nuage

monnaie électronique
type: ConceptConcept
type: Concept
creator: Commission d'enrichissement de la langue française, FranceTerme
date parution JO: 2017-05-23
definition: Monnaie dont des unités de compte sont stockées sur un support électronique.
in scheme: Finance
in scheme: concepts
notation: INFO933
related: cybermonnaie
related: monnaie numérique de banque centrale

validation de bloc
type: ConceptConcept
type: Concept
creator: Commission d'enrichissement de la langue française, FranceTerme
date parution JO: 2017-05-23
equivalent EN: block validation @en
equivalent EN: block validation (en)
definition: Opération informatique utilisée pour rendre un bloc infalsifiable et le valider dans une chaîne de blocs.
in scheme: Informatique
in scheme: Télécommunications
in scheme: concept-SD-informatique-internet
in scheme: concept-SD-telecommunications-internet
in scheme: concepts
notation: INFO934
note: La validation de bloc peut être attestée par une preuve de travail.
related: cybermonnaie
related: hachage
related: chaîne de blocs
related: minage
related: preuve de travail

logiciel rançonneur
type: ConceptConcept
type: Concept
creator: Commission d'enrichissement de la langue française, FranceTerme
date parution JO: 2018-02-25
deconseille ou frequent: logiciel de rançon
deconseille ou frequent: ransom software
deconseille ou frequent: rançongiciel
equivalent EN: ransomware @en
equivalent EN: ransomware (en)
forme abregee: rançonneur, n.m.
definition: Logiciel malveillant qui empêche l’accès aux données stockées sur un ordinateur et propose leur récupération contre le paiement d’une rançon.
in scheme: Droit
in scheme: Informatique
in scheme: concepts
notation: INFO935
note: 1. En général, un logiciel rançonneur chiffre les données de l’ordinateur cible en indiquant les instructions de paiement puis, si l’utilisateur y donne suite, fournit leur mode de récupération.
note: 2. On trouve aussi le terme « rançongiciel », qui est déconseillé.
related: cyberattaque
related: cheval de Troie
related: logiciel malveillant
related: ver

référencement abusif
type: ConceptConcept
type: Concept
creator: Commission d'enrichissement de la langue française, FranceTerme
date parution JO: 2018-12-09
deconseille ou frequent: spam indexing
deconseille ou frequent: spamindexing
equivalent EN: spamdexing @en
equivalent EN: spamdexing (en)
definition: Ensemble de techniques qui leurrent les robots d’indexation des moteurs de recherche pour assurer à un site de la toile une meilleure position dans les résultats proposés par ces moteurs.
in scheme: Informatique
in scheme: concept-SD-informatique-internet
in scheme: concepts
notation: INFO936
note: Le référencement abusif recourt par exemple au masquage ou à la dissimulation, dans une page, d’éléments tels que des liens hypertextuels ou des mots clés, qui sont invisibles des internautes mais qui sont pris en compte par les robots d’indexation.
related: hypertextuel
related: mot clé
related: masquage

masquage
type: ConceptConcept
type: Concept
creator: Commission d'enrichissement de la langue française, FranceTerme
date parution JO: 2018-12-09
deconseille ou frequent: dissmulation
equivalent EN: cloaking @en
equivalent EN: cloaking (en)
part of speech: nom masculin
alternative label: camouflage
definition: Référencement abusif qui consiste à proposer deux versions différentes d’une même page de la toile, l’une visible par les internautes, l’autre destinée uniquement aux robots d’indexation des moteurs de recherche.
in scheme: Informatique
in scheme: concept-SD-informatique-internet
in scheme: concepts
notation: INFO937
note: Du fait du masquage, le même site pourra être indexé plusieurs fois, modifiant ainsi le classement établi par les algorithmes.
related: référencement abusif

toile
type: ConceptConcept
type: Concept
creator: Commission d'enrichissement de la langue française, FranceTerme
date parution JO: 2018-12-09
equivalent EN: WWW @en
equivalent EN: WWW (en)
equivalent EN: Web @en
equivalent EN: Web (en)
equivalent EN: World Wide Web @en
equivalent EN: World Wide Web (en)
part of speech: nom féminin
definition: Système de publication, de gestion et de consultation de documents et d’autres ressources, qui est réparti géographiquement et structurellement dans l’internet et fait appel aux techniques de l’hypertexte.
in scheme: Informatique
in scheme: Télécommunications
in scheme: concept-SD-informatique-internet
in scheme: concept-SD-telecommunications-internet
in scheme: concepts
notation: INFO938
related: administrateur, -trice de site, de serveur
related: hypertexte
related: témoin de connexion
related: appliquette
related: page d'accueil
related: diffusion systématique sur la toile
related: distribution sélective
related: internet
related: toile profonde
related: concept-INFO972
scope note: Cette publication annule et remplace celle du terme « toile d’araignée mondiale » au Journal officiel du 16 mars 1999. Les occurrences de « toile d’araignée mondiale » et de « toile mondiale » dans les définitions et notes de « administrateur, -trice de site, de serveur », « adresse universelle », « appliquette », « diffusion systématique sur la toile », « distribution sélective », « page d’accueil », « recherche individuelle », « système d’adressage par domaines » et « témoin de connexion » sont remplacées par « toile ».

apprentissage automatique
type: ConceptConcept
type: Concept
creator: Commission d'enrichissement de la langue française, FranceTerme
date parution JO: 2018-12-09
deconseille ou frequent: apprentissage artificiel
equivalent EN: ML @en
equivalent EN: ML (en)
equivalent EN: machine learning @en
equivalent EN: machine learning (en)
alternative label: apprentissage machine
definition: Processus par lequel un algorithme évalue et améliore ses performances sans l’intervention d’un programmeur, en répétant son exécution sur des jeux de données jusqu’à obtenir, de manière régulière, des résultats pertinents.
in scheme: Informatique
in scheme: concepts
notation: INFO939
note: 1. Un algorithme d’apprentissage automatique comporte un modèle dont il modifie les paramètres, de valeur initiale en général aléatoire, en fonction du résultat constaté.
note: 2. L’apprentissage automatique relève de l’intelligence artificielle.
note: 3. L’apprentissage automatique est fréquemment utilisé pour le traitement du langage naturel et la vision par ordinateur, ou pour effectuer des diagnostics et des prévisions.
related: apprentissage supervisé
related: apprentissage non supervisé
related: apprentissage par renforcement
related: réseau de neurones artificiels
related: apprentissage profond
related: concept-INFO947
related: concept-INFO948
related: concept-INFO949

calculette
type: ConceptConcept
type: Concept
creator: Commission d'enrichissement de la langue française, FranceTerme
source: révision de l'arrêté du 30 novembre 1983
date parution JO: 2000-09-22
equivalent EN: pocket calculator @en
equivalent EN: pocket calculator (en)
part of speech: nom féminin
definition: Calculatrice électronique de petite dimension.
in scheme: Informatique
in scheme: concepts
notation: INFO94

apprentissage supervisé
type: ConceptConcept
type: Concept
creator: Commission d'enrichissement de la langue française, FranceTerme
date parution JO: 2018-12-09
equivalent EN: supervised learning @en
equivalent EN: supervised learning (en)
equivalent EN: supervised training @en
equivalent EN: supervised training (en)
definition: Apprentissage automatique dans lequel l’algorithme s’entraîne à une tâche déterminée en utilisant un jeu de données assorties chacune d’une annotation indiquant le résultat attendu.
in scheme: Informatique
in scheme: concepts
notation: INFO940
note: 1. L’apprentissage supervisé recourt le plus souvent aux réseaux de neurones artificiels.
note: 2. L’apprentissage supervisé est utilisé, par exemple, pour la reconnaissance d’images et la traduction automatique.
related: apprentissage automatique
related: apprentissage non supervisé
related: réseau de neurones artificiels
related: concept-INFO948

apprentissage non supervisé
type: ConceptConcept
type: Concept
creator: Commission d'enrichissement de la langue française, FranceTerme
date parution JO: 2018-12-09
equivalent EN: data clustering @en
equivalent EN: data clustering (en)
equivalent EN: unsupervised learning @en
equivalent EN: unsupervised learning (en)
equivalent EN: unsupervised training @en
equivalent EN: unsupervised training (en)
definition: Apprentissage automatique dans lequel l’algorithme utilise un jeu de données brutes et obtient un résultat en se fondant sur la détection de similarités entre certaines de ces données.
in scheme: Informatique
in scheme: concepts
notation: INFO941
note: L’apprentissage non supervisé est utilisé, par exemple, pour l’identification de comportements et la recommandation d’achats.
related: apprentissage automatique
related: apprentissage supervisé
related: concept-INFO948

apprentissage par renforcement
type: ConceptConcept
type: Concept
creator: Commission d'enrichissement de la langue française, FranceTerme
date parution JO: 2018-12-09
equivalent EN: reinforcement learning @en
equivalent EN: reinforcement learning (en)
definition: Apprentissage automatique dans lequel un programme extérieur évalue positivement ou négativement les résultats successifs de l’algorithme, l’accumulation des résultats permettant à l’algorithme d’améliorer ses performances jusqu’à ce qu’il atteigne un objectif préalablement fixé.
in scheme: Informatique
in scheme: concepts
notation: INFO942
note: 1. L’apprentissage par renforcement est fréquemment utilisé dans la robotique.
note: 2. L’efficacité de l’apprentissage par renforcement a été attestée dans certains jeux stratégiques comme le jeu de go.
related: apprentissage automatique
related: concept-INFO948

réseau de neurones artificiels
type: ConceptConcept
type: Concept
creator: Commission d'enrichissement de la langue française, FranceTerme
date parution JO: 2018-12-09
deconseille ou frequent: réseau neuronal
equivalent EN: artificial neural network @en
equivalent EN: artificial neural network (en)
equivalent EN: neural network @en
equivalent EN: neural network (en)
forme abregee: réseau de neurones
alternative label: réseau de neurones formels
definition: Ensemble de neurones artificiels interconnectés qui constitue une architecture de calcul.
in scheme: Informatique
in scheme: concepts
notation: INFO944
related: apprentissage automatique
related: apprentissage supervisé
related: neurone artificiel
related: apprentissage profond
related: concept-INFO948
related: concept-TELE543
related: concept-TELE561
scope note: Cette publication annule et remplace celle du terme « réseau neuronal » au Journal officiel du 10 octobre 1998.

neurone artificiel
type: ConceptConcept
type: Concept
creator: Commission d'enrichissement de la langue française, FranceTerme
date parution JO: 2018-12-09
equivalent EN: artificial neuron @en
equivalent EN: artificial neuron (en)
equivalent EN: artificial neurone @en
equivalent EN: artificial neurone (en)
equivalent EN: formal neuron @en
equivalent EN: formal neuron (en)
equivalent EN: formal neurone @en
equivalent EN: formal neurone (en)
alternative label: neurone formel
definition: Dispositif à plusieurs entrées et une sortie, qui simule certaines propriétés du neurone biologique.
in scheme: Informatique
in scheme: concepts
notation: INFO945
note: La valeur de sortie du neurone artificiel est une fonction non linéaire, généralement à seuil, d’une combinaison de valeurs d’entrée dont les paramètres sont ajustables.
related: réseau de neurones artificiels
related: concept-TELE543
scope note: Cette publication annule et remplace celle du Journal officiel du 10 octobre 1998.

apprentissage profond
type: ConceptConcept
type: Concept
creator: Commission d'enrichissement de la langue française, FranceTerme
date parution JO: 2018-12-09
deconseille ou frequent: apprentissage en profondeur
equivalent EN: deep learning @en
equivalent EN: deep learning (en)
equivalent EN: deep structured learning @en
equivalent EN: deep structured learning (en)
equivalent EN: hierarchical learning @en
equivalent EN: hierarchical learning (en)
definition: Apprentissage automatique qui utilise un réseau de neurones artificiels composé d’un grand nombre de couches dont chacune correspond à un niveau croissant de complexité dans le traitement et l’interprétation des données.
in scheme: Informatique
in scheme: concepts
notation: INFO946
note: L’apprentissage profond est notamment utilisé dans la détection automatique d’objets au sein d’images et dans la traduction automatique.
related: infox vidéo
related: apprentissage automatique
related: réseau de neurones artificiels
related: concept-INFO948