Content Oriented Guidelines concept scheme
type: ConceptScheme

Accessibility
type: Concept
comment: The ease and the conditions under which statistical information can be obtained.
notation: urn:sdmx:org.sdmx.infomodel.conceptscheme.Concept=SDMX:CROSS_DOMAIN_CONCEPTS[1.0].ACCESSIBILITY
in scheme: Content Oriented Guidelines concept scheme

Accuracy
type: Concept
comment: Closeness of computations or estimates to the exact or true values that the statistics were intended to measure.
notation: urn:sdmx:org.sdmx.infomodel.conceptscheme.Concept=SDMX:CROSS_DOMAIN_CONCEPTS[1.0].ACCURACY
in scheme: Content Oriented Guidelines concept scheme

Accuracy - overall
type: Concept
comment: Assessment of accuracy, linked to a certain data set or domain, which is summarising the various components into one single measure.
notation: urn:sdmx:org.sdmx.infomodel.conceptscheme.Concept=SDMX:CROSS_DOMAIN_CONCEPTS[1.0].ACCURACY_OVERALL
broader: Accuracy
in scheme: Content Oriented Guidelines concept scheme

Accuracy - nonsampling error
type: Concept
comment: Error in sample estimates which cannot be attributed to sampling fluctuations.
notation: urn:sdmx:org.sdmx.infomodel.conceptscheme.Concept=SDMX:CROSS_DOMAIN_CONCEPTS[1.0].NONSAMPLING_ERR
broader: Accuracy
in scheme: Content Oriented Guidelines concept scheme

Accuracy - sampling error
type: Concept
comment: That part of the difference between a population value and an estimate thereof, derived from a random sample, which is due to the fact that only a subset of the population is enumerated.
notation: urn:sdmx:org.sdmx.infomodel.conceptscheme.Concept=SDMX:CROSS_DOMAIN_CONCEPTS[1.0].SAMPLING_ERR
broader: Accuracy
in scheme: Content Oriented Guidelines concept scheme

Adjustment
type: Concept
comment: The set of procedures employed to modify statistical data to enable it to conform to national or international standards or to address data quality differences when compiling specific data sets.
notation: urn:sdmx:org.sdmx.infomodel.conceptscheme.Concept=SDMX:CROSS_DOMAIN_CONCEPTS[1.0].ADJUSTMENT
in scheme: Content Oriented Guidelines concept scheme

Adjustment - coded
type: Concept
comment: Type of adjustment used, represented by a code.
notation: urn:sdmx:org.sdmx.infomodel.conceptscheme.Concept=SDMX:CROSS_DOMAIN_CONCEPTS[1.0].ADJUST_CODED
broader: Adjustment
in scheme: Content Oriented Guidelines concept scheme

Adjustment - detail
type: Concept
comment: Textual description of the type of adjustment used.
notation: urn:sdmx:org.sdmx.infomodel.conceptscheme.Concept=SDMX:CROSS_DOMAIN_CONCEPTS[1.0].ADJUST_DETAIL
broader: Adjustment
in scheme: Content Oriented Guidelines concept scheme

Age
type: Concept
comment: The length of time that a person has lived or a thing has existed.
notation: urn:sdmx:org.sdmx.infomodel.conceptscheme.Concept=SDMX:CROSS_DOMAIN_CONCEPTS[1.0].AGE
in scheme: Content Oriented Guidelines concept scheme

Base Period
type: Concept
comment: The period of time used as the base of an index number, or to which a constant price series refers.
notation: urn:sdmx:org.sdmx.infomodel.conceptscheme.Concept=SDMX:CROSS_DOMAIN_CONCEPTS[1.0].BASE_PER
in scheme: Content Oriented Guidelines concept scheme

Civil Status
type: Concept
comment: Legal, conjugal status of each individual in relation to the marriage laws or customs of the country.
notation: urn:sdmx:org.sdmx.infomodel.conceptscheme.Concept=SDMX:CROSS_DOMAIN_CONCEPTS[1.0].CIVIL_STATUS
in scheme: Content Oriented Guidelines concept scheme

Clarity
type: Concept
comment: The extent to which easily comprehensible metadata are available, where these metadata are necessary to give a full understanding of statistical data.
notation: urn:sdmx:org.sdmx.infomodel.conceptscheme.Concept=SDMX:CROSS_DOMAIN_CONCEPTS[1.0].CLARITY
in scheme: Content Oriented Guidelines concept scheme

Classification systems
type: Concept
comment: Arrangement or division of objects into groups based on characteristics which the objects have in common.
notation: urn:sdmx:org.sdmx.infomodel.conceptscheme.Concept=SDMX:CROSS_DOMAIN_CONCEPTS[1.0].CLASS_SYSTEM
in scheme: Content Oriented Guidelines concept scheme

Coherence
type: Concept
comment: Adequacy of statistics to be combined in different ways and for various uses.
notation: urn:sdmx:org.sdmx.infomodel.conceptscheme.Concept=SDMX:CROSS_DOMAIN_CONCEPTS[1.0].COHERENCE
in scheme: Content Oriented Guidelines concept scheme

Coherence - cross domain
type: Concept
comment: Extent to which statistics are reconcilable with those obtained through other data sources or statistical domains.
notation: urn:sdmx:org.sdmx.infomodel.conceptscheme.Concept=SDMX:CROSS_DOMAIN_CONCEPTS[1.0].COHER_X_DOM
broader: Coherence
in scheme: Content Oriented Guidelines concept scheme

Coherence - Internal
type: Concept
comment: Extent to which statistics are consistent within a given data set.
notation: urn:sdmx:org.sdmx.infomodel.conceptscheme.Concept=SDMX:CROSS_DOMAIN_CONCEPTS[1.0].COHER_INTERNAL
broader: Coherence
in scheme: Content Oriented Guidelines concept scheme

Comment
type: Concept
comment: Supplementary descriptive text which can be attached to data or metadata.
notation: urn:sdmx:org.sdmx.infomodel.conceptscheme.Concept=SDMX:CROSS_DOMAIN_CONCEPTS[1.0].COMMENT
in scheme: Content Oriented Guidelines concept scheme

Comparability
type: Concept
comment: The extent to which differences between statistics can be attributed to differences between the true values of the statistical characteristics.
notation: urn:sdmx:org.sdmx.infomodel.conceptscheme.Concept=SDMX:CROSS_DOMAIN_CONCEPTS[1.0].COMPARABILITY
in scheme: Content Oriented Guidelines concept scheme

Comparability - between domains
type: Concept
comment: Extent to which statistics are comparable between different statistical domains.
notation: urn:sdmx:org.sdmx.infomodel.conceptscheme.Concept=SDMX:CROSS_DOMAIN_CONCEPTS[1.0].COMPAR_DOMAINS
broader: Comparability
in scheme: Content Oriented Guidelines concept scheme

Comparability - geographical
type: Concept
comment: Extent to which statistics are comparable between geographical areas.
notation: urn:sdmx:org.sdmx.infomodel.conceptscheme.Concept=SDMX:CROSS_DOMAIN_CONCEPTS[1.0].COMPAR_GEO
broader: Comparability
in scheme: Content Oriented Guidelines concept scheme

Comparability - over time
type: Concept
comment: Extent to which statistics are comparable or reconcilable over time.
notation: urn:sdmx:org.sdmx.infomodel.conceptscheme.Concept=SDMX:CROSS_DOMAIN_CONCEPTS[1.0].COMPAR_TIME
broader: Comparability
in scheme: Content Oriented Guidelines concept scheme

Compiling agency
type: Concept
comment: The organisation compiling the data being reported.
notation: urn:sdmx:org.sdmx.infomodel.conceptscheme.Concept=SDMX:CROSS_DOMAIN_CONCEPTS[1.0].COMPILING_ORG
in scheme: Content Oriented Guidelines concept scheme

Confidentiality
type: Concept
comment: A property of data indicating the extent to which their unauthorised disclosure could be prejudicial or harmful to the interest of the source or other relevant parties.
notation: urn:sdmx:org.sdmx.infomodel.conceptscheme.Concept=SDMX:CROSS_DOMAIN_CONCEPTS[1.0].CONF
in scheme: Content Oriented Guidelines concept scheme

Confidentiality - data treatment
type: Concept
comment: Rules applied for treating the data set to ensure statistical confidentiality and prevent unauthorised disclosure.
notation: urn:sdmx:org.sdmx.infomodel.conceptscheme.Concept=SDMX:CROSS_DOMAIN_CONCEPTS[1.0].CONF_DATA_TR
broader: Confidentiality
in scheme: Content Oriented Guidelines concept scheme

Confidentiality - policy
type: Concept
comment: Legislative measures or other formal procedures which prevent unauthorised disclosure of data that identify a person or economic entity either directly or indirectly.
notation: urn:sdmx:org.sdmx.infomodel.conceptscheme.Concept=SDMX:CROSS_DOMAIN_CONCEPTS[1.0].CONF_POLICY
broader: Confidentiality
in scheme: Content Oriented Guidelines concept scheme

Confidentiality - status
type: Concept
comment: Information about the confidentiality status of the object to which this attribute is attached.
notation: urn:sdmx:org.sdmx.infomodel.conceptscheme.Concept=SDMX:CROSS_DOMAIN_CONCEPTS[1.0].CONF_STATUS
broader: Confidentiality
in scheme: Content Oriented Guidelines concept scheme

Contact
type: Concept
comment: Individual or organisational contact points for the data or metadata, including information on how to reach the contact points.
notation: urn:sdmx:org.sdmx.infomodel.conceptscheme.Concept=SDMX:CROSS_DOMAIN_CONCEPTS[1.0].CONTACT
in scheme: Content Oriented Guidelines concept scheme

Contact email address
type: Concept
comment: E-mail address of the contact points for the data or metadata.
notation: urn:sdmx:org.sdmx.infomodel.conceptscheme.Concept=SDMX:CROSS_DOMAIN_CONCEPTS[1.0].CONTACT_EMAIL
broader: Contact
in scheme: Content Oriented Guidelines concept scheme

Contact fax number
type: Concept
comment: Fax number of the contact points for the data or metadata.
notation: urn:sdmx:org.sdmx.infomodel.conceptscheme.Concept=SDMX:CROSS_DOMAIN_CONCEPTS[1.0].CONTACT_FAX
broader: Contact
in scheme: Content Oriented Guidelines concept scheme

Contact mail address
type: Concept
comment: The postal address of the contact points for the data or metadata.
notation: urn:sdmx:org.sdmx.infomodel.conceptscheme.Concept=SDMX:CROSS_DOMAIN_CONCEPTS[1.0].CONTACT_MAIL
broader: Contact
in scheme: Content Oriented Guidelines concept scheme

Contact name
type: Concept
comment: The name of the contact points for the data or metadata.
notation: urn:sdmx:org.sdmx.infomodel.conceptscheme.Concept=SDMX:CROSS_DOMAIN_CONCEPTS[1.0].CONTACT_NAME
broader: Contact
in scheme: Content Oriented Guidelines concept scheme

Contact organisation
type: Concept
comment: The name of the organisation of the contact points for the data or metadata.
notation: urn:sdmx:org.sdmx.infomodel.conceptscheme.Concept=SDMX:CROSS_DOMAIN_CONCEPTS[1.0].CONTACT_ORGANISATION
broader: Contact
in scheme: Content Oriented Guidelines concept scheme

Contact organization unit
type: Concept
comment: An addressable subdivision of an organization.
notation: urn:sdmx:org.sdmx.infomodel.conceptscheme.Concept=SDMX:CROSS_DOMAIN_CONCEPTS[1.0].ORGANISATION_UNIT
broader: Contact
in scheme: Content Oriented Guidelines concept scheme

Contact person job title
type: Concept
comment: The area of technical responsibility of the contact, such as "methodology", "database management" or "dissemination".
notation: urn:sdmx:org.sdmx.infomodel.conceptscheme.Concept=SDMX:CROSS_DOMAIN_CONCEPTS[1.0].CONTACT_FUNCT
broader: Contact
in scheme: Content Oriented Guidelines concept scheme

Contact phone number
type: Concept
comment: The telephone number of the contact points for the data or metadata.
notation: urn:sdmx:org.sdmx.infomodel.conceptscheme.Concept=SDMX:CROSS_DOMAIN_CONCEPTS[1.0].CONTACT_PHONE
broader: Contact
in scheme: Content Oriented Guidelines concept scheme

Cost and Burden
type: Concept
comment: Costs associated with the collection and production of a statistical product and burden on respondents.
notation: urn:sdmx:org.sdmx.infomodel.conceptscheme.Concept=SDMX:CROSS_DOMAIN_CONCEPTS[1.0].COST_BURDEN
in scheme: Content Oriented Guidelines concept scheme

Cost and Burden - efficiency management
type: Concept
comment: Cost benefit analysis, effectiveness of execution of medium term statistical programs, and ensuring efficient use of resources.
notation: urn:sdmx:org.sdmx.infomodel.conceptscheme.Concept=SDMX:CROSS_DOMAIN_CONCEPTS[1.0].COST_BURDEN_EFF
broader: Cost and Burden
in scheme: Content Oriented Guidelines concept scheme

Cost and Burden - resources
type: Concept
comment: Staff, facilities, computing resources, and financing to undertake statistical production.
notation: urn:sdmx:org.sdmx.infomodel.conceptscheme.Concept=SDMX:CROSS_DOMAIN_CONCEPTS[1.0].COST_BURDEN_RES
broader: Cost and Burden
in scheme: Content Oriented Guidelines concept scheme

Counterpart Reference Area
type: Concept
comment: The secondary area, as opposed to reference area, to which the measured data is in relation.
notation: urn:sdmx:org.sdmx.infomodel.conceptscheme.Concept=SDMX:CROSS_DOMAIN_CONCEPTS[1.0].VIS_AREA
in scheme: Content Oriented Guidelines concept scheme

Coverage
type: Concept
comment: The definition of the population that statistics aim to cover.
notation: urn:sdmx:org.sdmx.infomodel.conceptscheme.Concept=SDMX:CROSS_DOMAIN_CONCEPTS[1.0].COVERAGE
in scheme: Content Oriented Guidelines concept scheme

Coverage - sector
type: Concept
comment: Main economic or other sectors covered by the statistics.
notation: urn:sdmx:org.sdmx.infomodel.conceptscheme.Concept=SDMX:CROSS_DOMAIN_CONCEPTS[1.0].COVERAGE_SECTOR
broader: Coverage
in scheme: Content Oriented Guidelines concept scheme

Coverage- time
type: Concept
comment: The length of time for which data are available.
notation: urn:sdmx:org.sdmx.infomodel.conceptscheme.Concept=SDMX:CROSS_DOMAIN_CONCEPTS[1.0].COVERAGE_TIME
broader: Coverage
in scheme: Content Oriented Guidelines concept scheme

Currency
type: Concept
comment: Monetary denomination of the object being measured.
notation: urn:sdmx:org.sdmx.infomodel.conceptscheme.Concept=SDMX:CROSS_DOMAIN_CONCEPTS[1.0].CURRENCY
in scheme: Content Oriented Guidelines concept scheme

Data Collection Method
type: Concept
comment: Systematic process of gathering data for official statistics.
notation: urn:sdmx:org.sdmx.infomodel.conceptscheme.Concept=SDMX:CROSS_DOMAIN_CONCEPTS[1.0].COLL_METHOD
in scheme: Content Oriented Guidelines concept scheme

Data Compilation
type: Concept
comment: Operations performed on data to derive new information according to a given set of rules.
notation: urn:sdmx:org.sdmx.infomodel.conceptscheme.Concept=SDMX:CROSS_DOMAIN_CONCEPTS[1.0].DATA_COMP
in scheme: Content Oriented Guidelines concept scheme

Data Dissemination Agency
type: Concept
comment: The organisation disseminating the data.
notation: urn:sdmx:org.sdmx.infomodel.conceptscheme.Concept=SDMX:CROSS_DOMAIN_CONCEPTS[1.0].DISS_ORG
in scheme: Content Oriented Guidelines concept scheme

Data Editing
type: Concept
comment: Activity aimed at detecting and correcting errors, logical inconsistencies and suspicious data.
notation: urn:sdmx:org.sdmx.infomodel.conceptscheme.Concept=SDMX:CROSS_DOMAIN_CONCEPTS[1.0].DATA_EDITING
in scheme: Content Oriented Guidelines concept scheme

Data Presentation
type: Concept
comment: Description of the disseminated data.
notation: urn:sdmx:org.sdmx.infomodel.conceptscheme.Concept=SDMX:CROSS_DOMAIN_CONCEPTS[1.0].DATA_PRES
in scheme: Content Oriented Guidelines concept scheme

Data Presentation - data description
type: Concept
comment: Main characteristics of the data set described in an easily understandable manner, referring to the data and indicators disseminated.
notation: urn:sdmx:org.sdmx.infomodel.conceptscheme.Concept=SDMX:CROSS_DOMAIN_CONCEPTS[1.0].DATA_DESCR
broader: Data Presentation
in scheme: Content Oriented Guidelines concept scheme

Data Presentation - disseminated detail
type: Concept
comment: Disseminated domain, measure, and time period breakdowns of statistics in the dataset.
notation: urn:sdmx:org.sdmx.infomodel.conceptscheme.Concept=SDMX:CROSS_DOMAIN_CONCEPTS[1.0].DISS_DET
broader: Data Presentation
in scheme: Content Oriented Guidelines concept scheme

Data Provider
type: Concept
comment: Organisation which produces data or metadata
notation: urn:sdmx:org.sdmx.infomodel.conceptscheme.Concept=SDMX:CROSS_DOMAIN_CONCEPTS[1.0].DATA_PROVIDER
in scheme: Content Oriented Guidelines concept scheme

Data Revision
type: Concept
comment: Any change in a value of a statistic released to the public.
notation: urn:sdmx:org.sdmx.infomodel.conceptscheme.Concept=SDMX:CROSS_DOMAIN_CONCEPTS[1.0].DATA_REV
in scheme: Content Oriented Guidelines concept scheme

Data Revision - policy
type: Concept
comment: Policy aimed at ensuring the transparency of disseminated data, whereby preliminary data are compiled that are later revised.
notation: urn:sdmx:org.sdmx.infomodel.conceptscheme.Concept=SDMX:CROSS_DOMAIN_CONCEPTS[1.0].REV_POLICY
broader: Data Revision
in scheme: Content Oriented Guidelines concept scheme

Data Revision - practice
type: Concept
comment: Information on the data revision practice.
notation: urn:sdmx:org.sdmx.infomodel.conceptscheme.Concept=SDMX:CROSS_DOMAIN_CONCEPTS[1.0].REV_PRACTICE
broader: Data Revision
in scheme: Content Oriented Guidelines concept scheme

Data Revision - studies
type: Concept
comment: Information about data revision studies and analyses.
notation: urn:sdmx:org.sdmx.infomodel.conceptscheme.Concept=SDMX:CROSS_DOMAIN_CONCEPTS[1.0].REV_STUDY
broader: Data Revision
in scheme: Content Oriented Guidelines concept scheme

Data Set Identifier
type: Concept
comment: Sequence of characters identifying the data set with which it is associated.
notation: urn:sdmx:org.sdmx.infomodel.conceptscheme.Concept=SDMX:CROSS_DOMAIN_CONCEPTS[1.0].DSI
in scheme: Content Oriented Guidelines concept scheme

Data Update
type: Concept
comment: The date on which the data element was inserted or modified in the database.
notation: urn:sdmx:org.sdmx.infomodel.conceptscheme.Concept=SDMX:CROSS_DOMAIN_CONCEPTS[1.0].DATA_UPDATE
in scheme: Content Oriented Guidelines concept scheme

Data Validation
type: Concept
comment: Process of monitoring the results of data compilation and ensuring the quality of the statistical results.
notation: urn:sdmx:org.sdmx.infomodel.conceptscheme.Concept=SDMX:CROSS_DOMAIN_CONCEPTS[1.0].DATA_VALIDATION
in scheme: Content Oriented Guidelines concept scheme

Data Validation - intermediate
type: Concept
comment: Validation that intermediate calculations leading to statistical outputs have been correctly done.
notation: urn:sdmx:org.sdmx.infomodel.conceptscheme.Concept=SDMX:CROSS_DOMAIN_CONCEPTS[1.0].DATA_VAL_INTER
broader: Data Validation
in scheme: Content Oriented Guidelines concept scheme

Data Validation - output
type: Concept
comment: Assessment of discrepancies and other problems in statistical outputs.
notation: urn:sdmx:org.sdmx.infomodel.conceptscheme.Concept=SDMX:CROSS_DOMAIN_CONCEPTS[1.0].DATA_VAL_OUTPUT
broader: Data Validation
in scheme: Content Oriented Guidelines concept scheme

Data Validation - source
type: Concept
comment: Assessment of discrepancies and other problems related to source data.
notation: urn:sdmx:org.sdmx.infomodel.conceptscheme.Concept=SDMX:CROSS_DOMAIN_CONCEPTS[1.0].DATA_VAL_SOURCE
broader: Data Validation
in scheme: Content Oriented Guidelines concept scheme

Decimals
type: Concept
comment: The number of digits of an observation to the right of a decimal point.
notation: urn:sdmx:org.sdmx.infomodel.conceptscheme.Concept=SDMX:CROSS_DOMAIN_CONCEPTS[1.0].DECIMALS
in scheme: Content Oriented Guidelines concept scheme

Dissemination Format
type: Concept
comment: Media by which statistical data and metadata are disseminated.
notation: urn:sdmx:org.sdmx.infomodel.conceptscheme.Concept=SDMX:CROSS_DOMAIN_CONCEPTS[1.0].DISS_FORMAT
in scheme: Content Oriented Guidelines concept scheme

Dissemination Format - mirco-data access
type: Concept
comment: Information on whether micro-data are also disseminated.
notation: urn:sdmx:org.sdmx.infomodel.conceptscheme.Concept=SDMX:CROSS_DOMAIN_CONCEPTS[1.0].MICRO_DAT_ACC
broader: Dissemination Format
in scheme: Content Oriented Guidelines concept scheme

Dissemination Format - news release
type: Concept
comment: Regular or ad-hoc press releases linked to the data.
notation: urn:sdmx:org.sdmx.infomodel.conceptscheme.Concept=SDMX:CROSS_DOMAIN_CONCEPTS[1.0].NEWS_REL
broader: Dissemination Format
in scheme: Content Oriented Guidelines concept scheme

Dissemination Format - online database
type: Concept
comment: Information about on-line databases in which the disseminated data can be accessed.
notation: urn:sdmx:org.sdmx.infomodel.conceptscheme.Concept=SDMX:CROSS_DOMAIN_CONCEPTS[1.0].ONLINE_DB
broader: Dissemination Format
in scheme: Content Oriented Guidelines concept scheme

Dissemination Format - other
type: Concept
comment: References to the most important other data dissemination done.
notation: urn:sdmx:org.sdmx.infomodel.conceptscheme.Concept=SDMX:CROSS_DOMAIN_CONCEPTS[1.0].DISS_OTHER
broader: Dissemination Format
in scheme: Content Oriented Guidelines concept scheme

Dissemination Format - publications
type: Concept
comment: Regular or ad-hoc publications in which the data are made available to the public.
notation: urn:sdmx:org.sdmx.infomodel.conceptscheme.Concept=SDMX:CROSS_DOMAIN_CONCEPTS[1.0].PUBLICATIONS
broader: Dissemination Format
in scheme: Content Oriented Guidelines concept scheme

Documentation on methodology
type: Concept
comment: Descriptive text and references to methodological documents available.
notation: urn:sdmx:org.sdmx.infomodel.conceptscheme.Concept=SDMX:CROSS_DOMAIN_CONCEPTS[1.0].DOC_METHOD
in scheme: Content Oriented Guidelines concept scheme

Documentation on methodology - advance notice
type: Concept
comment: Policy on notifying the public of changes in methodology, indicating whether the public is notified before a methodological change affects disseminated data and, if so, how long before.
notation: urn:sdmx:org.sdmx.infomodel.conceptscheme.Concept=SDMX:CROSS_DOMAIN_CONCEPTS[1.0].ADV_NOTICE
broader: Documentation on methodology
in scheme: Content Oriented Guidelines concept scheme

Education Level
type: Concept
comment: The highest level of an educational programme the person has successfully completed.
notation: urn:sdmx:org.sdmx.infomodel.conceptscheme.Concept=SDMX:CROSS_DOMAIN_CONCEPTS[1.0].EDUCATION_LEV
in scheme: Content Oriented Guidelines concept scheme

Embargo Time
type: Concept
comment: The exact time at which the data could be made available to the public.
notation: urn:sdmx:org.sdmx.infomodel.conceptscheme.Concept=SDMX:CROSS_DOMAIN_CONCEPTS[1.0].EMBARGO_TIME
in scheme: Content Oriented Guidelines concept scheme

Frequency
type: Concept
comment: The time interval at which observations occur over a given time period.
notation: urn:sdmx:org.sdmx.infomodel.conceptscheme.Concept=SDMX:CROSS_DOMAIN_CONCEPTS[1.0].FREQ
in scheme: Content Oriented Guidelines concept scheme
type: FrequencyRole

Frequency Detail
type: Concept
comment: A further specification of the frequency to include more detailed information about the type of frequency and frequencies not commonly used.
notation: urn:sdmx:org.sdmx.infomodel.conceptscheme.Concept=SDMX:CROSS_DOMAIN_CONCEPTS[1.0].FREQ_DETAIL
broader: Frequency
in scheme: Content Oriented Guidelines concept scheme

Frequency of data collection
type: Concept
comment: Frequency with which the source data are collected.
notation: urn:sdmx:org.sdmx.infomodel.conceptscheme.Concept=SDMX:CROSS_DOMAIN_CONCEPTS[1.0].FREQ_COLL
broader: Frequency
in scheme: Content Oriented Guidelines concept scheme

Frequency of dissemination
type: Concept
comment: The time interval at which the statistics are disseminated over a given time period.
notation: urn:sdmx:org.sdmx.infomodel.conceptscheme.Concept=SDMX:CROSS_DOMAIN_CONCEPTS[1.0].FREQ_DISS
broader: Frequency
in scheme: Content Oriented Guidelines concept scheme

Grossing/Netting
type: Concept
comment: Form of consolidation used in presenting the data.
notation: urn:sdmx:org.sdmx.infomodel.conceptscheme.Concept=SDMX:CROSS_DOMAIN_CONCEPTS[1.0].GROSS_NET
in scheme: Content Oriented Guidelines concept scheme

Index Type
type: Concept
comment: The type of index number used in the statistical production process.
notation: urn:sdmx:org.sdmx.infomodel.conceptscheme.Concept=SDMX:CROSS_DOMAIN_CONCEPTS[1.0].IND_TYPE
in scheme: Content Oriented Guidelines concept scheme

Institutional Mandate
type: Concept
comment: Set of rules or other formal set of instructions assigning responsibility as well as the authority to an organisation for the collection, processing, and dissemination of statistics.
notation: urn:sdmx:org.sdmx.infomodel.conceptscheme.Concept=SDMX:CROSS_DOMAIN_CONCEPTS[1.0].INST_MANDATE
in scheme: Content Oriented Guidelines concept scheme

Institutional Mandate - data sharing
type: Concept
comment: Arrangements or procedures for data sharing and coordination between data producing agencies.
notation: urn:sdmx:org.sdmx.infomodel.conceptscheme.Concept=SDMX:CROSS_DOMAIN_CONCEPTS[1.0].INST_MAN_SHAR
broader: Institutional Mandate
in scheme: Content Oriented Guidelines concept scheme

Institutional Mandate - legal acts and other agreements.
type: Concept
comment: Legal acts or other formal or informal agreements that assign responsibility as well as the authority to an agency for the collection, processing, and dissemination of statistics.
notation: urn:sdmx:org.sdmx.infomodel.conceptscheme.Concept=SDMX:CROSS_DOMAIN_CONCEPTS[1.0].INST_MAN_LA_OA
broader: Institutional Mandate
in scheme: Content Oriented Guidelines concept scheme

Institutional Mandate - respondent relations.
type: Concept
comment: Measures to encourage statistical reporting and/or to sanction non-reporting.
notation: urn:sdmx:org.sdmx.infomodel.conceptscheme.Concept=SDMX:CROSS_DOMAIN_CONCEPTS[1.0].I_M_RES_REL
broader: Institutional Mandate
in scheme: Content Oriented Guidelines concept scheme

Maintenance Agency
type: Concept
comment: The organisation or other expert body that maintains a domain-specific data or metadata structure definition.
notation: urn:sdmx:org.sdmx.infomodel.conceptscheme.Concept=SDMX:CROSS_DOMAIN_CONCEPTS[1.0].M_AGENCY
in scheme: Content Oriented Guidelines concept scheme

Metadata Update
type: Concept
comment: The date on which the metadata element was inserted or modified in the database.
notation: urn:sdmx:org.sdmx.infomodel.conceptscheme.Concept=SDMX:CROSS_DOMAIN_CONCEPTS[1.0].META_UPDATE
in scheme: Content Oriented Guidelines concept scheme

Metadata Update - last certified
type: Concept
comment: Date of the latest certification provided by the domain manager to confirm that the metadata posted are still up-to-date, even if the content has not been amended.
notation: urn:sdmx:org.sdmx.infomodel.conceptscheme.Concept=SDMX:CROSS_DOMAIN_CONCEPTS[1.0].META_CERTIFIED
broader: Metadata Update
in scheme: Content Oriented Guidelines concept scheme

Metadata Update - last posted
type: Concept
comment: Date of the latest dissemination of the metadata.
notation: urn:sdmx:org.sdmx.infomodel.conceptscheme.Concept=SDMX:CROSS_DOMAIN_CONCEPTS[1.0].META_POSTED
broader: Metadata Update
in scheme: Content Oriented Guidelines concept scheme

Metadata Update - last update
type: Concept
comment: Date of last update of the content of the metadata.
notation: urn:sdmx:org.sdmx.infomodel.conceptscheme.Concept=SDMX:CROSS_DOMAIN_CONCEPTS[1.0].META_LAST_UPD
broader: Metadata Update
in scheme: Content Oriented Guidelines concept scheme

Observation
type: Concept
comment: The value of a particular variable at a particular period.
notation: urn:sdmx:org.sdmx.infomodel.conceptscheme.Concept=SDMX:CROSS_DOMAIN_CONCEPTS[1.0].OBS_VALUE
in scheme: Content Oriented Guidelines concept scheme
type: PrimaryMeasureRole

Observation Pre-break Value
type: Concept
comment: The observation, at a time series break period, that was calculated using the old methodology.
notation: urn:sdmx:org.sdmx.infomodel.conceptscheme.Concept=SDMX:CROSS_DOMAIN_CONCEPTS[1.0].OBS_PRE_BREAK
in scheme: Content Oriented Guidelines concept scheme

Observation Status
type: Concept
comment: Information on the quality of a value or an unusual or missing value.
notation: urn:sdmx:org.sdmx.infomodel.conceptscheme.Concept=SDMX:CROSS_DOMAIN_CONCEPTS[1.0].OBS_STATUS
in scheme: Content Oriented Guidelines concept scheme

Occupation
type: Concept
comment: Job or position held by an individual who performs a set of tasks and duties.
notation: urn:sdmx:org.sdmx.infomodel.conceptscheme.Concept=SDMX:CROSS_DOMAIN_CONCEPTS[1.0].OCCUPATION
in scheme: Content Oriented Guidelines concept scheme

Original Data Identifier
type: Concept
comment: The data identifier as found in the originating database.
notation: urn:sdmx:org.sdmx.infomodel.conceptscheme.Concept=SDMX:CROSS_DOMAIN_CONCEPTS[1.0].ORIG_DATA_ID
in scheme: Content Oriented Guidelines concept scheme

Professionalism
type: Concept
comment: The standard, skill and ability suitable for producing statistics of good quality.
notation: urn:sdmx:org.sdmx.infomodel.conceptscheme.Concept=SDMX:CROSS_DOMAIN_CONCEPTS[1.0].PROF
in scheme: Content Oriented Guidelines concept scheme

Professionalism - code of conduct
type: Concept
comment: Provision for assuring the qualifications of staff and allowing staff to perform their functions without intervention motivated by non-statistical objectives.
notation: urn:sdmx:org.sdmx.infomodel.conceptscheme.Concept=SDMX:CROSS_DOMAIN_CONCEPTS[1.0].PROF_COND
broader: Professionalism
in scheme: Content Oriented Guidelines concept scheme

Professionalism - impartiality
type: Concept
comment: Description of the elements providing assurances that statistics are produced on an impartial basis.
notation: urn:sdmx:org.sdmx.infomodel.conceptscheme.Concept=SDMX:CROSS_DOMAIN_CONCEPTS[1.0].PROF_IMP
broader: Professionalism
in scheme: Content Oriented Guidelines concept scheme

Professionalism - methodology
type: Concept
comment: Describes the elements providing assurances that the choices of sources and statistical techniques as well as decisions about dissemination are informed solely by statistical considerations.
notation: urn:sdmx:org.sdmx.infomodel.conceptscheme.Concept=SDMX:CROSS_DOMAIN_CONCEPTS[1.0].PROF_METH
broader: Professionalism
in scheme: Content Oriented Guidelines concept scheme

Professionalism - statistical commentary
type: Concept
comment: Describes the elements providing assurances that the statistical entity is entitled to comment on erroneous interpretation and misuse of statistics.
notation: urn:sdmx:org.sdmx.infomodel.conceptscheme.Concept=SDMX:CROSS_DOMAIN_CONCEPTS[1.0].PROF_STAT_COM
broader: Professionalism
in scheme: Content Oriented Guidelines concept scheme

Punctuality
type: Concept
comment: Time lag between the actual delivery of the data and the target date when it should have been delivered.
notation: urn:sdmx:org.sdmx.infomodel.conceptscheme.Concept=SDMX:CROSS_DOMAIN_CONCEPTS[1.0].PUNCTUALITY
in scheme: Content Oriented Guidelines concept scheme

Quality Management
type: Concept
comment: Systems and frameworks in place within an organisation to manage the quality of statistical products and processes.
notation: urn:sdmx:org.sdmx.infomodel.conceptscheme.Concept=SDMX:CROSS_DOMAIN_CONCEPTS[1.0].QUALITY_MGMNT
in scheme: Content Oriented Guidelines concept scheme

Quality Management - assessment
type: Concept
comment: Overall assessment of data quality, based on standard quality criteria.
notation: urn:sdmx:org.sdmx.infomodel.conceptscheme.Concept=SDMX:CROSS_DOMAIN_CONCEPTS[1.0].QUALITY_ASSMNT
broader: Quality Management
in scheme: Content Oriented Guidelines concept scheme

Quality Management - assurance
type: Concept
comment: Guidelines focusing on quality in general and dealing with quality of statistical programmes, including measures for ensuring the efficient use of resources.
notation: urn:sdmx:org.sdmx.infomodel.conceptscheme.Concept=SDMX:CROSS_DOMAIN_CONCEPTS[1.0].QUALITY_ASSURE
broader: Quality Management
in scheme: Content Oriented Guidelines concept scheme

Quality Management - documentation
type: Concept
comment: Documentation on procedures applied for quality management and quality assessment.
notation: urn:sdmx:org.sdmx.infomodel.conceptscheme.Concept=SDMX:CROSS_DOMAIN_CONCEPTS[1.0].QUALITY_DOC
broader: Quality Management
in scheme: Content Oriented Guidelines concept scheme

Recording Basis
type: Concept
comment: Processes and standards employed in calculating statistical aggregates.
notation: urn:sdmx:org.sdmx.infomodel.conceptscheme.Concept=SDMX:CROSS_DOMAIN_CONCEPTS[1.0].RECORDING
in scheme: Content Oriented Guidelines concept scheme

Reference Area
type: Concept
comment: The country or geographic area to which the measured statistical phenomenon relates.
notation: urn:sdmx:org.sdmx.infomodel.conceptscheme.Concept=SDMX:CROSS_DOMAIN_CONCEPTS[1.0].REF_AREA
in scheme: Content Oriented Guidelines concept scheme

Reference Period
type: Concept
comment: The period of time or point in time to which the measured observation is intended to refer.
notation: urn:sdmx:org.sdmx.infomodel.conceptscheme.Concept=SDMX:CROSS_DOMAIN_CONCEPTS[1.0].REF_PERIOD
in scheme: Content Oriented Guidelines concept scheme
type: TimeRole

Reference Period - weights
type: Concept
comment: Dates or periods to which the observations used to compile the weights refer.
notation: urn:sdmx:org.sdmx.infomodel.conceptscheme.Concept=SDMX:CROSS_DOMAIN_CONCEPTS[1.0].REF_PER_WGTS
broader: Reference Period
in scheme: Content Oriented Guidelines concept scheme

Release Policy
type: Concept
comment: Rules for disseminating statistical data to interested parties.
notation: urn:sdmx:org.sdmx.infomodel.conceptscheme.Concept=SDMX:CROSS_DOMAIN_CONCEPTS[1.0].REL_POLICY
in scheme: Content Oriented Guidelines concept scheme

Release Policy - legal acts and other agreements
type: Concept
comment: Legal acts and other agreements pertaining to data access.
notation: urn:sdmx:org.sdmx.infomodel.conceptscheme.Concept=SDMX:CROSS_DOMAIN_CONCEPTS[1.0].REL_POL_LEG_ACTS
broader: Release Policy
in scheme: Content Oriented Guidelines concept scheme

Release Policy - policy commentary
type: Concept
comment: Legal acts and other agreements pertaining to data access.
notation: urn:sdmx:org.sdmx.infomodel.conceptscheme.Concept=SDMX:CROSS_DOMAIN_CONCEPTS[1.0].REL_COMMENT
broader: Release Policy
in scheme: Content Oriented Guidelines concept scheme

Release Policy - release calendar
type: Concept
comment: The schedule of statistical release dates.
notation: urn:sdmx:org.sdmx.infomodel.conceptscheme.Concept=SDMX:CROSS_DOMAIN_CONCEPTS[1.0].REL_CAL_POLICY
broader: Release Policy
in scheme: Content Oriented Guidelines concept scheme

Release Policy - release calendar access
type: Concept
comment: Access to the release calendar information.
notation: urn:sdmx:org.sdmx.infomodel.conceptscheme.Concept=SDMX:CROSS_DOMAIN_CONCEPTS[1.0].REL_CAL_ACCESS
broader: Release Policy
in scheme: Content Oriented Guidelines concept scheme

Release Policy - transparency
type: Concept
comment: Dissemination of the release policy to the public.
notation: urn:sdmx:org.sdmx.infomodel.conceptscheme.Concept=SDMX:CROSS_DOMAIN_CONCEPTS[1.0].REL_POL_TRA
broader: Release Policy
in scheme: Content Oriented Guidelines concept scheme

Release Policy - user access
type: Concept
comment: The policy for release of the data to users, the scope of dissemination (eg, to the public, to selected users), how users are informed that the data are being released, and whether the policy provides determines the dissemination of statistical data to all users.
notation: urn:sdmx:org.sdmx.infomodel.conceptscheme.Concept=SDMX:CROSS_DOMAIN_CONCEPTS[1.0].REL_POL_US_AC
broader: Release Policy
in scheme: Content Oriented Guidelines concept scheme

Relevance
type: Concept
comment: The degree to which statistical information meets the real or perceived needs of clients.
notation: urn:sdmx:org.sdmx.infomodel.conceptscheme.Concept=SDMX:CROSS_DOMAIN_CONCEPTS[1.0].RELEVANCE
in scheme: Content Oriented Guidelines concept scheme

Relevance - Completeness
type: Concept
comment: The extent to which all statistics that are needed are available.
notation: urn:sdmx:org.sdmx.infomodel.conceptscheme.Concept=SDMX:CROSS_DOMAIN_CONCEPTS[1.0].COMPLETENESS
broader: Relevance
in scheme: Content Oriented Guidelines concept scheme

Relevance - user needs
type: Concept
comment: Description of users and their respective needs with respect to the statistical data.
notation: urn:sdmx:org.sdmx.infomodel.conceptscheme.Concept=SDMX:CROSS_DOMAIN_CONCEPTS[1.0].USER_NEEDS
broader: Relevance
in scheme: Content Oriented Guidelines concept scheme

Relevance - user satisifaction
type: Concept
comment: Measure to determine user satisfaction.
notation: urn:sdmx:org.sdmx.infomodel.conceptscheme.Concept=SDMX:CROSS_DOMAIN_CONCEPTS[1.0].USER_SAT
broader: Relevance
in scheme: Content Oriented Guidelines concept scheme

Reporting Agency
type: Concept
comment: The organisation that supplies the data for a given instance of the statistics.
notation: urn:sdmx:org.sdmx.infomodel.conceptscheme.Concept=SDMX:CROSS_DOMAIN_CONCEPTS[1.0].REP_AGENCY
in scheme: Content Oriented Guidelines concept scheme

Sampling
type: Concept
comment: The process of selecting a number of cases from all the cases in a particular group or universe.
notation: urn:sdmx:org.sdmx.infomodel.conceptscheme.Concept=SDMX:CROSS_DOMAIN_CONCEPTS[1.0].SAMPLING
in scheme: Content Oriented Guidelines concept scheme

Sex
type: Concept
comment: The state of being male or female.
notation: urn:sdmx:org.sdmx.infomodel.conceptscheme.Concept=SDMX:CROSS_DOMAIN_CONCEPTS[1.0].SEX
in scheme: Content Oriented Guidelines concept scheme

Source Data
type: Concept
comment: Characteristics and components of the raw statistical data used for compiling statistical aggregates.
notation: urn:sdmx:org.sdmx.infomodel.conceptscheme.Concept=SDMX:CROSS_DOMAIN_CONCEPTS[1.0].SOURCE_TYPE
in scheme: Content Oriented Guidelines concept scheme

Statistical Concepts and Definitions
type: Concept
comment: Statistical characteristics of statistical observations.
notation: urn:sdmx:org.sdmx.infomodel.conceptscheme.Concept=SDMX:CROSS_DOMAIN_CONCEPTS[1.0].STAT_CONC_DEF
in scheme: Content Oriented Guidelines concept scheme

Statistical Population
type: Concept
comment: The total membership or population or "universe" of a defined class of people, objects or events.
notation: urn:sdmx:org.sdmx.infomodel.conceptscheme.Concept=SDMX:CROSS_DOMAIN_CONCEPTS[1.0].STAT_POP
in scheme: Content Oriented Guidelines concept scheme

Statistical Unit
type: Concept
comment: Entity for which information is sought and for which statistics are ultimately compiled.
notation: urn:sdmx:org.sdmx.infomodel.conceptscheme.Concept=SDMX:CROSS_DOMAIN_CONCEPTS[1.0].STAT_UNIT
in scheme: Content Oriented Guidelines concept scheme

Time Format
type: Concept
comment: Technical format in which time is represented for the measured phenomenon.
notation: urn:sdmx:org.sdmx.infomodel.conceptscheme.Concept=SDMX:CROSS_DOMAIN_CONCEPTS[1.0].TIME_FORMAT
in scheme: Content Oriented Guidelines concept scheme

Time Period
type: Concept
comment: The period of time or point in time to which the measured observation refers.
notation: urn:sdmx:org.sdmx.infomodel.conceptscheme.Concept=SDMX:CROSS_DOMAIN_CONCEPTS[1.0].TIME_PERIOD
in scheme: Content Oriented Guidelines concept scheme
type: TimeRole

Time Period - collection
type: Concept
comment: Dates or periods during which the observations have been collected (such as middle, average or end of period) to compile the indicator for the target reference period.
notation: urn:sdmx:org.sdmx.infomodel.conceptscheme.Concept=SDMX:CROSS_DOMAIN_CONCEPTS[1.0].TIME_PER_COLLECT
broader: Time Period
in scheme: Content Oriented Guidelines concept scheme

Timelinesst
type: Concept
comment: Length of time between data availability and the event or phenomenon they describe.
notation: urn:sdmx:org.sdmx.infomodel.conceptscheme.Concept=SDMX:CROSS_DOMAIN_CONCEPTS[1.0].TIMELINESS
in scheme: Content Oriented Guidelines concept scheme

Timeliness - output
type: Concept
comment: The lapse of time between the end of a reference period and dissemination of the data.
notation: urn:sdmx:org.sdmx.infomodel.conceptscheme.Concept=SDMX:CROSS_DOMAIN_CONCEPTS[1.0].TIME_OUTPUT
broader: Timelinesst
in scheme: Content Oriented Guidelines concept scheme

Timeliness - source data
type: Concept
comment: The time between the end of a reference period and actual receipt of the data by the compiling agency.
notation: urn:sdmx:org.sdmx.infomodel.conceptscheme.Concept=SDMX:CROSS_DOMAIN_CONCEPTS[1.0].TIME_SOURCE
broader: Timelinesst
in scheme: Content Oriented Guidelines concept scheme

Title
type: Concept
comment: Textual label used as identification of a statistical object.
notation: urn:sdmx:org.sdmx.infomodel.conceptscheme.Concept=SDMX:CROSS_DOMAIN_CONCEPTS[1.0].TITLE
in scheme: Content Oriented Guidelines concept scheme

Unit Multiplier
type: Concept
comment: Exponent in base 10 specified so that multiplying the observation numeric values by 10^UNIT_MULT gives a value expressed in the UNIT.
notation: urn:sdmx:org.sdmx.infomodel.conceptscheme.Concept=SDMX:CROSS_DOMAIN_CONCEPTS[1.0].UNIT_MULT
in scheme: Content Oriented Guidelines concept scheme

Unit of Measure
type: Concept
comment: The unit in which the data values are measured.
notation: urn:sdmx:org.sdmx.infomodel.conceptscheme.Concept=SDMX:CROSS_DOMAIN_CONCEPTS[1.0].UNIT_MEASURE
in scheme: Content Oriented Guidelines concept scheme

Unit of Measure Detail
type: Concept
comment: Additional textual information on the unit of measure.
notation: urn:sdmx:org.sdmx.infomodel.conceptscheme.Concept=SDMX:CROSS_DOMAIN_CONCEPTS[1.0].UNIT_MEAS_DETAIL
broader: Unit of Measure
in scheme: Content Oriented Guidelines concept scheme

Valuation
type: Concept
comment: The definition of the price per unit, for goods and services flows and asset stocks.
notation: urn:sdmx:org.sdmx.infomodel.conceptscheme.Concept=SDMX:CROSS_DOMAIN_CONCEPTS[1.0].VALUATION
in scheme: Content Oriented Guidelines concept scheme