FINANCES PUBLIQUES
type: ConceptScheme
description: Vocabulaire des Finances publiques
description: Vocabulary of public finance techniques and economic and social environment, published by the Centre national de documentation des finances publiques. @en
has part: Administration de L'Etat
has part: Applications Informatiques
has part: Questions Economiques
has part: Géographie
has part: Droit et Justice
has part: Mots Outils
has part: Communication Documentation Informatique
has part: Entreprises
has part: Fonction Publique et Gestion des Ressources Humaines
has part: Questions de Société
has part: Finance
has part: Missions Transverses des Finances publiques
has part: Budget
has part: Comptabilité
has part: Gestion Publique
has part: Fiscalité
updated: 2021-02-03
change note: Dernière mise à jour
definition: Vocabulaire des techniques des Finances publiques, et de l'environnement économique et social, publié par le Centre national de documentation des finances publiques.
definition: Vocabulary of public finance techniques and economic and social environment, published by the Centre national de documentation des finances publiques. @en
preferred label: PUBLIC FINANCES @en

Budget de l’État
type: DomaineReFip
type: ConceptScheme
is part of: Budget
notation: D-REFIP1

Droit de Contrôle de l'Administration
type: DomaineReFip
type: ConceptScheme
is part of: Fiscalité
notation: D-REFIP10

Société
type: DomaineReFip
type: ConceptScheme
is part of: Forme juridique
notation: D-REFIP100

Systeme bancaire et financier
type: DomaineReFip
type: ConceptScheme
has part: Etablissement de crédit
has part: Secteur bancaire
has part: Marché financier
has part: Opération financière
is part of: Finance
notation: D-REFIP101

Paiement
type: DomaineReFip
type: ConceptScheme
is part of: Finance
notation: D-REFIP102

Moyen de paiement
type: DomaineReFip
type: ConceptScheme
is part of: Finance
notation: D-REFIP103

Instrument financier
type: DomaineReFip
type: ConceptScheme
has part: Emprunt
has part: Organisme de Placement Collectif en Valeurs Mobilières
has part: Organisme de Placement Collectif Immobilier
has part: Valeur Mobiliere
has part: Instrument financier à terme
is part of: Finance
notation: D-REFIP104

Assurances
type: DomaineReFip
type: ConceptScheme
is part of: Finance
notation: D-REFIP105

Emprunt
type: DomaineReFip
type: ConceptScheme
is part of: Instrument financier
notation: D-REFIP106

Organisme de Placement Collectif en Valeurs Mobilières
type: DomaineReFip
type: ConceptScheme
is part of: Instrument financier
notation: D-REFIP107

Organisme de Placement Collectif Immobilier
type: DomaineReFip
type: ConceptScheme
is part of: Instrument financier
notation: D-REFIP108

Valeur Mobiliere
type: DomaineReFip
type: ConceptScheme
is part of: Instrument financier
notation: D-REFIP109

Applications missions transverses
type: DomaineReFip
type: ConceptScheme
is part of: Applications Informatiques
notation: D-REFIP11

Etablissement de crédit
type: DomaineReFip
type: ConceptScheme
is part of: Systeme bancaire et financier
notation: D-REFIP110

Secteur bancaire
type: DomaineReFip
type: ConceptScheme
is part of: Systeme bancaire et financier
notation: D-REFIP111

Marché financier
type: DomaineReFip
type: ConceptScheme
is part of: Systeme bancaire et financier
notation: D-REFIP112

Opération financière
type: DomaineReFip
type: ConceptScheme
is part of: Systeme bancaire et financier
notation: D-REFIP113

Etat
type: DomaineReFip
type: ConceptScheme
has part: Mission de Service Public
has part: Réforme de l'Etat
is part of: Administration de L'Etat
notation: D-REFIP114

Mission de Service Public
type: DomaineReFip
type: ConceptScheme
is part of: Etat
notation: D-REFIP115

Réforme de l'Etat
type: DomaineReFip
type: ConceptScheme
is part of: Etat
notation: D-REFIP116

Organisation Structurelle de l'Etat
type: DomaineReFip
type: ConceptScheme
has part: Autorité Administrative
has part: Entreprise Publique
has part: Institutions
has part: Pouvoirs Publics
has part: Ministère
has part: Opérateur de l'Etat
has part: Organisme Consultatif et Représentatif
has part: Organisme de Sécurité Sociale
has part: Organisme en charge du Logement Social
has part: Organisme Privé Assurant Service Public
is part of: Administration de L'Etat
notation: D-REFIP117

Autorité Administrative
type: DomaineReFip
type: ConceptScheme
is part of: Organisation Structurelle de l'Etat
notation: D-REFIP118

Entreprise Publique
type: DomaineReFip
type: ConceptScheme
is part of: Organisation Structurelle de l'Etat
notation: D-REFIP119

Principe comptable
type: DomaineReFip
type: ConceptScheme
is part of: Comptabilité
notation: D-REFIP12

Institutions
type: DomaineReFip
type: ConceptScheme
is part of: Organisation Structurelle de l'Etat
notation: D-REFIP120

Pouvoirs Publics
type: DomaineReFip
type: ConceptScheme
is part of: Organisation Structurelle de l'Etat
notation: D-REFIP121

Ministère
type: DomaineReFip
type: ConceptScheme
is part of: Organisation Structurelle de l'Etat
notation: D-REFIP122

Opérateur de l'Etat
type: DomaineReFip
type: ConceptScheme
is part of: Organisation Structurelle de l'Etat
notation: D-REFIP123

Organisme Consultatif et Représentatif
type: DomaineReFip
type: ConceptScheme
is part of: Organisation Structurelle de l'Etat
notation: D-REFIP124

Organisme de Sécurité Sociale
type: DomaineReFip
type: ConceptScheme
is part of: Organisation Structurelle de l'Etat
notation: D-REFIP125

Organisme en charge du Logement Social
type: DomaineReFip
type: ConceptScheme
is part of: Organisation Structurelle de l'Etat
notation: D-REFIP126

Organisme Privé Assurant Service Public
type: DomaineReFip
type: ConceptScheme
is part of: Organisation Structurelle de l'Etat
notation: D-REFIP127

Organisation Territoriale
type: DomaineReFip
type: ConceptScheme
has part: Structures Territoriales
has part: 212106
is part of: Administration de L'Etat
notation: D-REFIP128

Structures Territoriales
type: DomaineReFip
type: ConceptScheme
is part of: Organisation Territoriale
notation: D-REFIP129

Procédure Civile
type: DomaineReFip
type: ConceptScheme
is part of: Procédure
notation: D-REFIP13

Gestion des ressources humaines
type: DomaineReFip
type: ConceptScheme
has part: Carrière
has part: Conditions de travail
has part: Document de GRH
has part: Formation professionnelle
has part: Gestion prévisionnelle des ressources humaines
has part: Rémunération
has part: Retraite
has part: Statut du fonctionnaire
has part: Temps de travail
is part of: Fonction Publique et Gestion des Ressources Humaines
notation: D-REFIP130

Personnels et fonctions
type: DomaineReFip
type: ConceptScheme
has part: Fonction (NON DESCRIPTEUR)
has part: Fonction de la Direction générale des Finances publiques (NON DESCRIPTEUR)
has part: Fonction publique
is part of: Fonction Publique et Gestion des Ressources Humaines
notation: D-REFIP132

Environnement
type: DomaineReFip
type: ConceptScheme
has part: Dégradation de l'Environnement
has part: Milieu Naturel
has part: Protection de l'Environnement
is part of: Questions de Société
notation: D-REFIP133

Famille Education Population
type: DomaineReFip
type: ConceptScheme
has part: Enseignement
has part: Famille
has part: Population
is part of: Questions de Société
notation: D-REFIP134

Santé et Protection Sociale
type: DomaineReFip
type: ConceptScheme
has part: Protection Sociale
has part: Santé
is part of: Questions de Société
notation: D-REFIP135

Culture et Loisirs
type: DomaineReFip
type: ConceptScheme
has part: Activité Artistique
has part: Activité Culturelle
has part: Patrimoine Culturel
has part: Loisirs
is part of: Questions de Société
notation: D-REFIP136

Aménagement du territoire Urbanisme Habitat
type: DomaineReFip
type: ConceptScheme
has part: Aménagement du Territoire
has part: Habitat
is part of: Questions de Société
notation: D-REFIP137

Questions Politiques Relations Internationales
type: DomaineReFip
type: ConceptScheme
has part: Politique
has part: Relations Internationales
is part of: Questions de Société
notation: D-REFIP138

Dégradation de l'Environnement
type: DomaineReFip
type: ConceptScheme
is part of: Environnement
notation: D-REFIP139

Responsabilité des comptables
type: DomaineReFip
type: ConceptScheme
is part of: Missions Transverses des Finances publiques
notation: D-REFIP14

Milieu Naturel
type: DomaineReFip
type: ConceptScheme
is part of: Environnement
notation: D-REFIP140

Protection de l'Environnement
type: DomaineReFip
type: ConceptScheme
is part of: Environnement
notation: D-REFIP141

Enseignement
type: DomaineReFip
type: ConceptScheme
is part of: Famille Education Population
notation: D-REFIP142

Famille
type: DomaineReFip
type: ConceptScheme
is part of: Famille Education Population
notation: D-REFIP143

Population
type: DomaineReFip
type: ConceptScheme
is part of: Famille Education Population
notation: D-REFIP144

Protection Sociale
type: DomaineReFip
type: ConceptScheme
is part of: Santé et Protection Sociale
notation: D-REFIP145

Santé
type: DomaineReFip
type: ConceptScheme
is part of: Santé et Protection Sociale
notation: D-REFIP146

Activité Artistique
type: DomaineReFip
type: ConceptScheme
is part of: Culture et Loisirs
notation: D-REFIP147

Activité Culturelle
type: DomaineReFip
type: ConceptScheme
is part of: Culture et Loisirs
notation: D-REFIP148

Patrimoine Culturel
type: DomaineReFip
type: ConceptScheme
is part of: Culture et Loisirs
notation: D-REFIP149

Procédure Pénale
type: DomaineReFip
type: ConceptScheme
is part of: Procédure
notation: D-REFIP15

Loisirs
type: DomaineReFip
type: ConceptScheme
is part of: Culture et Loisirs
notation: D-REFIP150

Aménagement du Territoire
type: DomaineReFip
type: ConceptScheme
is part of: Aménagement du territoire Urbanisme Habitat
notation: D-REFIP151

Habitat
type: DomaineReFip
type: ConceptScheme
is part of: Aménagement du territoire Urbanisme Habitat
notation: D-REFIP152

Politique
type: DomaineReFip
type: ConceptScheme
is part of: Questions Politiques Relations Internationales
notation: D-REFIP153

Relations Internationales
type: DomaineReFip
type: ConceptScheme
is part of: Questions Politiques Relations Internationales
notation: D-REFIP154

Contrat de Travail
type: DomaineReFip
type: ConceptScheme
is part of: Travail
notation: D-REFIP155

Gestion de l'Entreprise
type: DomaineReFip
type: ConceptScheme
is part of: Vie et Gestion de l'entreprise
notation: D-REFIP156

Instrument financier à terme
type: DomaineReFip
type: ConceptScheme
is part of: Instrument financier
notation: D-REFIP157

Entreprise
type: DomaineReFip
type: ConceptScheme
is part of: Forme juridique
notation: D-REFIP158

Lieu de Travail
type: DomaineReFip
type: ConceptScheme
is part of: Travail
notation: D-REFIP159

Administration de L'Etat
type: DomaineReFip
type: ConceptScheme
has part: Etat
has part: Organisation Structurelle de l'Etat
has part: Organisation Territoriale
is part of: FINANCES PUBLIQUES
definition: Ensemble des termes relatifs aux missions de service public et à l'organisation structurelle et territoriale de l'Etat.
notation: D-REFIP16

Vie de l'Entreprise
type: DomaineReFip
type: ConceptScheme
is part of: Vie et Gestion de l'entreprise
notation: D-REFIP160

Carrière
type: DomaineReFip
type: ConceptScheme
is part of: Gestion des ressources humaines
notation: D-REFIP161

Conditions de travail
type: DomaineReFip
type: ConceptScheme
is part of: Gestion des ressources humaines
notation: D-REFIP162

Document de GRH
type: DomaineReFip
type: ConceptScheme
is part of: Gestion des ressources humaines
notation: D-REFIP163

Formation professionnelle
type: DomaineReFip
type: ConceptScheme
is part of: Gestion des ressources humaines
notation: D-REFIP164

Gestion prévisionnelle des ressources humaines
type: DomaineReFip
type: ConceptScheme
is part of: Gestion des ressources humaines
notation: D-REFIP165

Rémunération
type: DomaineReFip
type: ConceptScheme
is part of: Gestion des ressources humaines
notation: D-REFIP166

Retraite
type: DomaineReFip
type: ConceptScheme
is part of: Gestion des ressources humaines
notation: D-REFIP167

Statut du fonctionnaire
type: DomaineReFip
type: ConceptScheme
is part of: Gestion des ressources humaines
notation: D-REFIP168

Temps de travail
type: DomaineReFip
type: ConceptScheme
is part of: Gestion des ressources humaines
notation: D-REFIP169

Principes Généraux
type: DomaineReFip
type: ConceptScheme
is part of: Procédure
notation: D-REFIP17

Fonction (NON DESCRIPTEUR)
type: DomaineReFip
type: ConceptScheme
is part of: Personnels et fonctions
notation: D-REFIP170

Fonction de la Direction générale des Finances publiques (NON DESCRIPTEUR)
type: DomaineReFip
type: ConceptScheme
is part of: Personnels et fonctions
notation: D-REFIP171

Fonction publique
type: DomaineReFip
type: ConceptScheme
is part of: Personnels et fonctions
notation: D-REFIP172

Fiscalité - Autres notions
type: DomaineReFip
type: ConceptScheme
is part of: Fiscalité
notation: D-REFIP173

Exécution du budget
type: DomaineReFip
type: ConceptScheme
is part of: Budget
notation: D-REFIP18

Documents comptables
type: DomaineReFip
type: ConceptScheme
is part of: Comptabilité
notation: D-REFIP19

Branche d'activité
type: DomaineReFip
type: ConceptScheme
has part: Agriculture
has part: Artisanat
has part: Commerce
has part: Construction
has part: Industrie
has part: Services et professions libérales
has part: Tourisme
has part: Transports
is part of: Questions Economiques
notation: D-REFIP2

Procédure Administrative
type: DomaineReFip
type: ConceptScheme
is part of: Procédure
notation: D-REFIP20

Élaboration du budget
type: DomaineReFip
type: ConceptScheme
is part of: Budget
notation: D-REFIP21

Recouvrement
type: DomaineReFip
type: ConceptScheme
is part of: Fiscalité
notation: D-REFIP22

Applications Informatiques
type: DomaineReFip
type: ConceptScheme
has part: Applications missions transverses
has part: Applications fiscales
has part: Applications gestion publique
is part of: FINANCES PUBLIQUES
definition: Ensemble des applications informatiques de la DGFIP.
notation: D-REFIP23

Comptabilité publique
type: DomaineReFip
type: ConceptScheme
is part of: Comptabilité
notation: D-REFIP24

Profession Juridique
type: DomaineReFip
type: ConceptScheme
is part of: Organisation Juridictionnelle
notation: D-REFIP25

Communication
type: DomaineReFip
type: ConceptScheme
is part of: Communication Documentation Informatique
notation: D-REFIP26

Questions Economiques
type: DomaineReFip
type: ConceptScheme
has part: Branche d'activité
has part: Economie générale
is part of: FINANCES PUBLIQUES
definition: Ensemble des termes relatifs aux différentes branches d'activité et aux notions d'économie générale.
notation: D-REFIP27

Liquidation de l'Impôt
type: DomaineReFip
type: ConceptScheme
is part of: Fiscalité
notation: D-REFIP28

Documentation
type: DomaineReFip
type: ConceptScheme
is part of: Communication Documentation Informatique
notation: D-REFIP29

Droit de Reprise de l'Administration
type: DomaineReFip
type: ConceptScheme
is part of: Fiscalité
notation: D-REFIP3

Documentation budgétaire
type: DomaineReFip
type: ConceptScheme
is part of: Budget
notation: D-REFIP30

Comptabilité informatisée
type: DomaineReFip
type: ConceptScheme
is part of: Comptabilité
notation: D-REFIP31

Géographie
type: DomaineReFip
type: ConceptScheme
has part: Océanie
has part: Europe
has part: Amérique
has part: Asie
has part: Afrique
is part of: FINANCES PUBLIQUES
definition: Ensemble des pays classés par continent. Focus sur la France. Indication des accords fiscaux internationaux signés avec la France.
notation: D-REFIP32

Informatique
type: DomaineReFip
type: ConceptScheme
is part of: Communication Documentation Informatique
notation: D-REFIP33

Droit et Justice
type: DomaineReFip
type: ConceptScheme
has part: Divisions du Droit
has part: Droit Général
has part: Infractions et Sanctions
has part: Organisation Juridictionnelle
has part: Procédure
has part: Sources du Droit
is part of: FINANCES PUBLIQUES
definition: Ensemble des termes relatifs à la règle de droit, ses procédures, ses sources ainsi que l'organisation juridictionnelle.
notation: D-REFIP34

Divisions du Droit
type: DomaineReFip
type: ConceptScheme
has part: Droit Privé
has part: Droit Public
has part: Droit Européen
has part: Droit International
is part of: Droit et Justice
notation: D-REFIP35

Comptabilité générale de l'Etat
type: DomaineReFip
type: ConceptScheme
is part of: Comptabilité
notation: D-REFIP36

Mots Outils
type: DomaineReFip
type: ConceptScheme
is part of: FINANCES PUBLIQUES
definition: Ensemble des termes relatifs ayant un sens général et vague, ne pouvant être utilisés seuls.
notation: D-REFIP37

Champ d'Application
type: DomaineReFip
type: ConceptScheme
is part of: Fiscalité
notation: D-REFIP38

Sanction
type: DomaineReFip
type: ConceptScheme
is part of: Infractions et Sanctions
notation: D-REFIP39

Applications fiscales
type: DomaineReFip
type: ConceptScheme
is part of: Applications Informatiques
notation: D-REFIP4

Audit
type: DomaineReFip
type: ConceptScheme
is part of: Missions Transverses des Finances publiques
notation: D-REFIP40

Communication Documentation Informatique
type: DomaineReFip
type: ConceptScheme
has part: Communication
has part: Documentation
has part: Informatique
is part of: FINANCES PUBLIQUES
definition: Ensemble des termes relatifs aux trois domaines communication, documentation et informatique.
notation: D-REFIP41

Juridiction
type: DomaineReFip
type: ConceptScheme
is part of: Organisation Juridictionnelle
notation: D-REFIP42

Entreprises
type: DomaineReFip
type: ConceptScheme
has part: Forme juridique
has part: Travail
has part: Vie et Gestion de l'entreprise
is part of: FINANCES PUBLIQUES
definition: Ensemble des termes relatifs aux différents types de structures, à l'aspect social et aux évènements marquant la vie et la gestion de celles-ci.
notation: D-REFIP43

Droit Général
type: DomaineReFip
type: ConceptScheme
is part of: Droit et Justice
notation: D-REFIP44

Secteur public local
type: DomaineReFip
type: ConceptScheme
is part of: Gestion Publique
notation: D-REFIP45

Océanie
type: DomaineReFip
type: ConceptScheme
is part of: Géographie
notation: D-REFIP46

Documentation Fiscale
type: DomaineReFip
type: ConceptScheme
is part of: Fiscalité
notation: D-REFIP47

Europe
type: DomaineReFip
type: ConceptScheme
is part of: Géographie
notation: D-REFIP48

Fonction Publique et Gestion des Ressources Humaines
type: DomaineReFip
type: ConceptScheme
has part: Gestion des ressources humaines
has part: Personnels et fonctions
is part of: FINANCES PUBLIQUES
definition: Ensemble des termes relatifs aux trois fonctions publiques et la gestion des ressources humaines y afférant.
notation: D-REFIP49

Procédures et Techniques Comptables
type: DomaineReFip
type: ConceptScheme
is part of: Comptabilité
notation: D-REFIP5

Régime d'Imposition
type: DomaineReFip
type: ConceptScheme
is part of: Fiscalité
notation: D-REFIP50

Dépenses publiques
type: DomaineReFip
type: ConceptScheme
is part of: Gestion Publique
notation: D-REFIP51

Commande publique
type: DomaineReFip
type: ConceptScheme
is part of: Gestion Publique
notation: D-REFIP52

Comptabilité générale
type: DomaineReFip
type: ConceptScheme
is part of: Comptabilité
notation: D-REFIP53

Infractions et Sanctions
type: DomaineReFip
type: ConceptScheme
has part: Sanction
has part: Infraction
is part of: Droit et Justice
notation: D-REFIP54

Infraction
type: DomaineReFip
type: ConceptScheme
is part of: Infractions et Sanctions
notation: D-REFIP55

Contentieux Fiscal
type: DomaineReFip
type: ConceptScheme
is part of: Fiscalité
notation: D-REFIP56

Questions de Société
type: DomaineReFip
type: ConceptScheme
has part: Environnement
has part: Famille Education Population
has part: Santé et Protection Sociale
has part: Culture et Loisirs
has part: Aménagement du territoire Urbanisme Habitat
has part: Questions Politiques Relations Internationales
is part of: FINANCES PUBLIQUES
definition: Ensemble des termes relatifs aux questions de société en lien avec les domaines d'intervention de la DGFIP (aménagement du territoire, santé...).
notation: D-REFIP57

Finance
type: DomaineReFip
type: ConceptScheme
has part: Systeme bancaire et financier
has part: Paiement
has part: Moyen de paiement
has part: Instrument financier
has part: Assurances
is part of: FINANCES PUBLIQUES
definition: Ensemble des termes relatifs aux établissements financiers, aux moyens de paiement et aux produits financiers et d'assurance.
notation: D-REFIP58

Droit Privé
type: DomaineReFip
type: ConceptScheme
is part of: Divisions du Droit
notation: D-REFIP59

Documentation Juridique
type: DomaineReFip
type: ConceptScheme
is part of: Sources du Droit
notation: D-REFIP6

Organisation Juridictionnelle
type: DomaineReFip
type: ConceptScheme
has part: Profession Juridique
has part: Juridiction
is part of: Droit et Justice
notation: D-REFIP60

Missions Transverses des Finances publiques
type: DomaineReFip
type: ConceptScheme
has part: Responsabilité des comptables
has part: Audit
has part: Qualité de service
has part: Responsabilité de l'ordonnateur
has part: Maîtrise des risques
has part: Pilotage
is part of: FINANCES PUBLIQUES
definition: Ensemble des termes relatifs à l'audit, au contrôle, au pilotage et à la maîtrise des risques, qualité de service et responsabilité des comptables.
notation: D-REFIP61

Qualité de service
type: DomaineReFip
type: ConceptScheme
is part of: Missions Transverses des Finances publiques
notation: D-REFIP62

Amérique
type: DomaineReFip
type: ConceptScheme
is part of: Géographie
notation: D-REFIP63

Budget
type: DomaineReFip
type: ConceptScheme
has part: Budget de l’État
has part: Exécution du budget
has part: Élaboration du budget
has part: Documentation budgétaire
is part of: FINANCES PUBLIQUES
definition: Ensemble des termes relatifs à l'élaboration et à l'exécution du budget de l'Etat.
notation: D-REFIP64

Droit Public
type: DomaineReFip
type: ConceptScheme
is part of: Divisions du Droit
notation: D-REFIP65

Procédure
type: DomaineReFip
type: ConceptScheme
has part: Procédure Civile
has part: Procédure Pénale
has part: Principes Généraux
has part: Procédure Administrative
is part of: Droit et Justice
notation: D-REFIP66

Responsabilité de l'ordonnateur
type: DomaineReFip
type: ConceptScheme
is part of: Missions Transverses des Finances publiques
notation: D-REFIP67

Comptabilité d'exercice
type: DomaineReFip
type: ConceptScheme
is part of: Comptabilité
notation: D-REFIP68

Asie
type: DomaineReFip
type: ConceptScheme
is part of: Géographie
notation: D-REFIP69

Agriculture
type: DomaineReFip
type: ConceptScheme
is part of: Branche d'activité
notation: D-REFIP7

Domaine
type: DomaineReFip
type: ConceptScheme
is part of: Gestion Publique
notation: D-REFIP70

Sources du Droit
type: DomaineReFip
type: ConceptScheme
has part: Documentation Juridique
has part: Sources du Droit Objectif
has part: Sources des Droits Subjectifs
is part of: Droit et Justice
notation: D-REFIP71

Cadastre
type: DomaineReFip
type: ConceptScheme
is part of: Fiscalité
notation: D-REFIP72

Analyse financière
type: DomaineReFip
type: ConceptScheme
is part of: Comptabilité
notation: D-REFIP73

Afrique
type: DomaineReFip
type: ConceptScheme
is part of: Géographie
notation: D-REFIP74

Maîtrise des risques
type: DomaineReFip
type: ConceptScheme
is part of: Missions Transverses des Finances publiques
notation: D-REFIP75

Politique immobilière de l'Etat
type: DomaineReFip
type: ConceptScheme
is part of: Gestion Publique
notation: D-REFIP76

Comptabilité
type: DomaineReFip
type: ConceptScheme
has part: Principe comptable
has part: Documents comptables
has part: Comptabilité publique
has part: Comptabilité informatisée
has part: Comptabilité générale de l'Etat
has part: Procédures et Techniques Comptables
has part: Comptabilité générale
has part: Comptabilité d'exercice
has part: Analyse financière
has part: Comptabilité analytique
is part of: FINANCES PUBLIQUES
definition: Ensemble des termes relatifs à la comptabilité, publique ou privée ainsi qu'à l'analyse financière.
notation: D-REFIP77

Sources du Droit Objectif
type: DomaineReFip
type: ConceptScheme
is part of: Sources du Droit
notation: D-REFIP78

Gestion Publique
type: DomaineReFip
type: ConceptScheme
has part: Secteur public local
has part: Dépenses publiques
has part: Commande publique
has part: Domaine
has part: Politique immobilière de l'Etat
has part: Expertise et action économiques et financières
is part of: FINANCES PUBLIQUES
definition: Ensemble des termes relatifs aux missions de la DGFIP en matière de gestion publique : commande publique, dépense, secteur public local, domaine, politique immobilière de l'Etat, expertise et action économiques et financières.
notation: D-REFIP79

Applications gestion publique
type: DomaineReFip
type: ConceptScheme
is part of: Applications Informatiques
notation: D-REFIP8

Droit Européen
type: DomaineReFip
type: ConceptScheme
is part of: Divisions du Droit
notation: D-REFIP80

Pilotage
type: DomaineReFip
type: ConceptScheme
is part of: Missions Transverses des Finances publiques
notation: D-REFIP81

Expertise et action économiques et financières
type: DomaineReFip
type: ConceptScheme
is part of: Gestion Publique
notation: D-REFIP82

Comptabilité analytique
type: DomaineReFip
type: ConceptScheme
is part of: Comptabilité
notation: D-REFIP83

Droit International
type: DomaineReFip
type: ConceptScheme
is part of: Divisions du Droit
notation: D-REFIP84

Sources des Droits Subjectifs
type: DomaineReFip
type: ConceptScheme
is part of: Sources du Droit
notation: D-REFIP85

Fiscalité
type: DomaineReFip
type: ConceptScheme
has part: Droit de Contrôle de l'Administration
has part: Fiscalité - Autres notions
has part: Recouvrement
has part: Liquidation de l'Impôt
has part: Droit de Reprise de l'Administration
has part: Champ d'Application
has part: Documentation Fiscale
has part: Régime d'Imposition
has part: Contentieux Fiscal
has part: Cadastre
has part: Impôt
is part of: FINANCES PUBLIQUES
definition: Ensemble des termes relatifs à la fiscalité en matière d'assiette, de recouvrement, au cadastre ainsi que les procédures et pratiques administratives relatives à l'impôt.
notation: D-REFIP86

Artisanat
type: DomaineReFip
type: ConceptScheme
is part of: Branche d'activité
notation: D-REFIP87

Commerce
type: DomaineReFip
type: ConceptScheme
is part of: Branche d'activité
notation: D-REFIP88

Construction
type: DomaineReFip
type: ConceptScheme
is part of: Branche d'activité
notation: D-REFIP89

Impôt
type: DomaineReFip
type: ConceptScheme
is part of: Fiscalité
notation: D-REFIP9

Industrie
type: DomaineReFip
type: ConceptScheme
is part of: Branche d'activité
notation: D-REFIP90

Services et professions libérales
type: DomaineReFip
type: ConceptScheme
is part of: Branche d'activité
notation: D-REFIP91

Tourisme
type: DomaineReFip
type: ConceptScheme
is part of: Branche d'activité
notation: D-REFIP92

Transports
type: DomaineReFip
type: ConceptScheme
is part of: Branche d'activité
notation: D-REFIP93

Economie générale
type: DomaineReFip
type: ConceptScheme
is part of: Questions Economiques
notation: D-REFIP94

Forme juridique
type: DomaineReFip
type: ConceptScheme
has part: Société
has part: Entreprise
has part: Association
has part: Groupement d'Intérêt Economique
is part of: Entreprises
notation: D-REFIP95

Travail
type: DomaineReFip
type: ConceptScheme
has part: Contrat de Travail
has part: Lieu de Travail
has part: 212619
is part of: Entreprises
notation: D-REFIP96

Vie et Gestion de l'entreprise
type: DomaineReFip
type: ConceptScheme
has part: Gestion de l'Entreprise
has part: Vie de l'Entreprise
is part of: Entreprises
notation: D-REFIP97

Association
type: DomaineReFip
type: ConceptScheme
is part of: Forme juridique
notation: D-REFIP98

Groupement d'Intérêt Economique
type: DomaineReFip
type: ConceptScheme
is part of: Forme juridique
notation: D-REFIP99

Ardennes
type: ConceptReFip
type: Concept
broader: refip-REFIP7009
definition: Département français
in scheme: FINANCES PUBLIQUES
in scheme: Géographie
in scheme: Europe
notation: REFIP1

application CHORUS
type: ConceptReFip
type: Concept
alternative label: CHORUS
broader: applications gestion publique (non-descripteur)
definition: Application permettant de gérer la dépense, les recettes non fiscales et la comptabilité de l'État.
in scheme: FINANCES PUBLIQUES
in scheme: Applications Informatiques
in scheme: Applications gestion publique
notation: REFIP10
related: système d'information financière de l'Etat
related: facturation interne
related: refip-REFIP850

imposition forfaitaire annuelle
type: ConceptReFip
type: Concept
alternative label: IFA
broader: impôt direct
definition: Impôt dû par les personnes morales soumises à l'impôt sur les sociétés d'un montant variable suivant le chiffre d'affaires et imputable sur l'impôt sur les sociétés dû pendant l'année de l'exigibilité de cette imposition et les deux années suivantes. Supprimée à compter du 1er janvier 2014.
in scheme: FINANCES PUBLIQUES
in scheme: Fiscalité
in scheme: Impôt
notation: REFIP100

vente
type: ConceptReFip
type: Concept
broader: droit des obligations et contrats (non-descripteur)
definition: Convention par laquelle l'un s'oblige à livrer une chose, et l'autre à la payer.
in scheme: FINANCES PUBLIQUES
in scheme: Droit et Justice
in scheme: Divisions du Droit
in scheme: Droit Privé
narrower: vente aux enchères
narrower: résolution de vente
narrower: vente en consignation
narrower: vente à consommer sur place
narrower: vente à perte
narrower: vente à réméré
narrower: vente amiable
narrower: vente à emporter
narrower: promesse de vente
narrower: vente forcée
narrower: vente à tempérament
narrower: vente à terme
notation: REFIP1001

application TCC
type: ConceptReFip
type: Concept
alternative label: TCC
broader: applications gestion publique (non-descripteur)
definition: Application, interfacée avec CHORUS, de centralisation et d’exploitation des écritures de comptabilité générale de l’État assurant également la gestion des nomenclatures comptables.
in scheme: FINANCES PUBLIQUES
in scheme: Applications Informatiques
in scheme: Applications gestion publique
notation: REFIP1002

compte d'affectation spéciale
type: ConceptReFip
type: Concept
broader: refip-REFIP822
definition: État retraçant des opérations budgétaires financées au moyen de recettes particulières qui sont, par nature, en relation directe avec les dépenses concernées.
in scheme: FINANCES PUBLIQUES
in scheme: Élaboration du budget
in scheme: Budget
narrower: compte spécial du Trésor
notation: REFIP1003

maintenance informatique
type: ConceptReFip
type: Concept
alternative label: maintenance
broader: informatique
definition: Ensemble des opérations d'entretien, à titre préventif, ou correctif, des biens durables dans un but de continuité du service et d'économie.
in scheme: FINANCES PUBLIQUES
in scheme: Informatique
in scheme: Communication Documentation Informatique
notation: REFIP1004

charges à repartir
type: ConceptReFip
type: Concept
alternative label: charges à repartir sur plusieurs exercices
broader: actif
definition: Charges constatées durant un exercice mais dont l'imputation peut être échelonné dans le temps.
in scheme: FINANCES PUBLIQUES
in scheme: Documents comptables
in scheme: Comptabilité
notation: REFIP1006

exécution du budget
type: ConceptReFip
type: Concept
alternative label: exécution budgétaire
broader: budget
definition: Procédure obéissant à un certain nombre de règles qui cherchent à garantir que le budget sera exécuté au plus près de la volonté exprimée par le Parlement, tout en offrant aux gestionnaires une certaine souplesse.
in scheme: FINANCES PUBLIQUES
in scheme: Exécution du budget
in scheme: Budget
narrower: enveloppe budgétaire
narrower: unité opérationnelle
narrower: comptabilité patrimoniale
narrower: délégation de paiement
narrower: comptabilité d'analyse des coûts
narrower: mouvement de crédits
narrower: imputation budgétaire
narrower: régulation budgétaire
narrower: chapitre budgétaire
narrower: budget opérationnel de programme
narrower: fongibilité des crédits
narrower: comptabilité des délégations et subdélégations
narrower: article budgétaire
narrower: crédit évaluatif
narrower: exercice budgétaire
narrower: décret d'avance
narrower: fongibilité asymétrique des crédits
narrower: crédit budgétaire
narrower: autorisation de programme
narrower: réserve pour aléas de gestion
narrower: crédit limitatif
narrower: comptabilité budgétaire
narrower: nomenclature budgétaire de l'Etat
narrower: crédit de paiement
narrower: comptabilité des engagements
narrower: rattachement de crédit
narrower: analyse de l'exécution
narrower: décret de répartition
narrower: autorisation d'engagement
narrower: refip-REFIP711
narrower: refip-REFIP785
narrower: refip-REFIP930
notation: REFIP1008
related: refip-REFIP7123

ministre
type: ConceptReFip
type: Concept
broader: gouvernement
definition: Membre du gouvernement en charge d'un domaine de compétence, il dirige un ministère ou un département ministériel qu'il représente au sein du gouvernement tout en conduisant la politique décidée par celui-ci dans son domaine.
in scheme: FINANCES PUBLIQUES
in scheme: Organisation Structurelle de l'Etat
in scheme: Pouvoirs Publics
in scheme: Administration de L'Etat
notation: REFIP1009

application REBECA
type: ConceptReFip
type: Concept
alternative label: REBECA
broader: applications fiscales (non-descripteur)
definition: Application permettant la gestion des demandes de remboursement de crédit de TVA.
in scheme: FINANCES PUBLIQUES
in scheme: Applications Informatiques
in scheme: Applications fiscales
notation: REFIP101

patrimoine immobilier
type: ConceptReFip
type: Concept
alternative label: parc immobilier
broader: patrimoine
definition: Ensemble des biens immobiliers possédés par une personne physique ou morale.
in scheme: FINANCES PUBLIQUES
in scheme: Droit et Justice
in scheme: Divisions du Droit
in scheme: Droit Privé
notation: REFIP1010

matériel
type: ConceptReFip
type: Concept
alternative label: matériel technique
broader: aménagement du lieu de travail
definition: Ensemble des objets, des instruments utilisés dans une entreprise, un service, une exploitation.
in scheme: FINANCES PUBLIQUES
in scheme: Lieu de Travail
in scheme: Entreprises
in scheme: Travail
narrower: badgeuse
narrower: machine à affranchir
narrower: matériel de bureau
notation: REFIP1012
related: bien d'équipement
related: gestion du matériel
related: refip-REFIP757

direction spécialisée de contrôle fiscal
type: ConceptReFip
type: Concept
alternative label: DIRCOFI
alternative label: direction de contrôle fiscal
broader: refip-REFIP895
definition: Direction spécialisée de la DGFIP, les DIRCOFI assurent, dans la limite de leur ressort territorial toutes opérations, relatives à l'assiette et au contrôle des impôts, droits, prélèvements, cotisations et taxes de toute nature, à l'égard des personnes physiques ou morales, groupements de droit ou de fait ou entités qui ont déposé ou auraient dû déposer, auprès des services de la DGFIP du ressort territorial desdites directions spécialisées, une déclaration, un acte ou tout autre document ; des personnes, groupements ou entités qui, même en l'absence d'obligation déclarative, ont été ou auraient dû être imposés par ces mêmes services ou dont la résidence principale, le siège ou le principal établissement est situé dans le ressort desdits services.
in scheme: FINANCES PUBLIQUES
in scheme: Organisation Structurelle de l'Etat
in scheme: Ministère
in scheme: Administration de L'Etat
notation: REFIP1013

denrée alimentaire
type: ConceptReFip
type: Concept
alternative label: aliment
broader: agroalimentaire
definition: Toute substance ou produit transformé ou pas, destiné à l'alimentation humaine.
in scheme: FINANCES PUBLIQUES
in scheme: Branche d'activité
in scheme: Questions Economiques
in scheme: Industrie
narrower: céréale
narrower: viande
narrower: lait
narrower: cacao
notation: REFIP1014

frais irrépétibles
type: ConceptReFip
type: Concept
broader: frais de procédure
definition: Frais engagés par le justiciable qui ne sont pas pris en charge (non remboursables). Frais non compris dans les dépens laissés à la charge de chacune des parties au procès. Ces dépenses ne peuvent pas être récupérées à l'issue du procès.
in scheme: FINANCES PUBLIQUES
in scheme: Principes Généraux
in scheme: Droit et Justice
in scheme: Procédure
notation: REFIP1015

établissement public local d'enseignement
type: ConceptReFip
type: Concept
alternative label: EPLE
alternative label: établissement public d'enseignement
broader: établissement d'enseignement
definition: Etablissement public à caractère administratif regroupant les collèges, les lycées d'enseignement général, technologique et professionnel et les établissements d'éducation spéciale. Rattaché à une collectivité territoriale, le département pour les collèges, la région pour les lycées. Chargé de mettre en œuvre le service public de l'enseignement, qui est un service public d'État, au bénéfice des élèves du second degré, de la sixième à la troisième pour les collèges, de la seconde à la terminale pour les lycées.
in scheme: FINANCES PUBLIQUES
in scheme: Organisation Territoriale
in scheme: Structures Territoriales
in scheme: Administration de L'Etat
narrower: groupement d'établissements pour la formation des adultes
narrower: service annexe d'hébergement des établissements publics locaux d'enseignement
narrower: lycée
narrower: collège
notation: REFIP1016

application AMD
type: ConceptReFip
type: Concept
alternative label: AMD
broader: applications fiscales (non-descripteur)
definition: Application de gestion des amendes et condamnations pécuniaires de toutes natures, de la prise en charge à l’apurement.
in scheme: FINANCES PUBLIQUES
in scheme: Applications Informatiques
in scheme: Applications fiscales
notation: REFIP1017

régularisation des écritures comptables
type: ConceptReFip
type: Concept
alternative label: régularisation comptable
broader: fin de gestion
definition: Opération nécessaire pour ajuster le solde de certains comptes du grand livre en date de fin d’exercice.
in scheme: FINANCES PUBLIQUES
in scheme: Procédures et Techniques Comptables
in scheme: Comptabilité
notation: REFIP1018

capacité financière
type: ConceptReFip
type: Concept
broader: refip-REFIP788
definition: Indicateur visant à apprécier la capacité d'un agent économique à faire face à un certain nombre d'engagements financiers actuels ou à venir. La capacité financière va correspondre à l'ensemble des actifs détenus par un agent économique et qui sont mobilisables à des fins d'investissements, d'emprunts ou de remises de garanties.
in scheme: FINANCES PUBLIQUES
in scheme: Analyse financière
in scheme: Comptabilité
notation: REFIP1019

acompte d'impôt
type: ConceptReFip
type: Concept
broader: paiement de l'impôt
definition: Paiement partiel de l'impôt avant la mise en recouvrement.
in scheme: FINANCES PUBLIQUES
in scheme: Recouvrement
in scheme: Fiscalité
narrower: restitution d'avance ou d'acompte
narrower: acompte provisionnel
notation: REFIP1020

Code du domaine de l'Etat
type: ConceptReFip
type: Concept
broader: documentation juridique (non-descripteur)
definition: Ensemble des lois relatives au droit du domaine de l'État français. L'État ou les établissements publics nationaux peuvent se porter acquéreur de biens. La composition du domaine, notamment l'origine des biens (par ex les biens vacants et sans propriétaire), l'administration des biens domaniaux (par ex. l'intervention de certains organismes dans la gestion d'immeubles domaniaux), l'aliénation des biens domaniaux et enfin des dispositions diverses font l'objet des dispositions de ce code.
in scheme: FINANCES PUBLIQUES
in scheme: Droit et Justice
in scheme: Documentation Juridique
in scheme: Sources du Droit
notation: REFIP1022

rétrocession
type: ConceptReFip
type: Concept
broader: affectation de biens
definition: Transfert de la propriété d'un bien acquis à la personne qui l'avait antérieurement cédé.
in scheme: FINANCES PUBLIQUES
in scheme: Domaine
in scheme: Gestion Publique
notation: REFIP1023

Serbie
type: ConceptReFip
type: Concept
alternative label: République de Serbie
broader: Europe
definition: Pays
in scheme: FINANCES PUBLIQUES
in scheme: Géographie
in scheme: Europe
notation: REFIP1024

actionnaire
type: ConceptReFip
type: Concept
broader: actionnariat
definition: Personne physique ou morale qui détient des actions dans une société.
in scheme: FINANCES PUBLIQUES
in scheme: Gestion de l'Entreprise
in scheme: Entreprises
in scheme: Vie et Gestion de l'entreprise
notation: REFIP1025

communication de dossier
type: ConceptReFip
type: Concept
broader: accès aux documents administratifs
definition: Fait de communiquer un dossier (administratif, médical etc,) en vertu du droit à l'accès aux documents administratifs.
in scheme: FINANCES PUBLIQUES
in scheme: Droit et Justice
in scheme: Divisions du Droit
in scheme: Droit Public
notation: REFIP1026

actionnariat
type: ConceptReFip
type: Concept
broader: gestion de l'entreprise (non-descripteur)
definition: Ensemble des actionnaires considérés comme un groupe.
in scheme: FINANCES PUBLIQUES
in scheme: Gestion de l'Entreprise
in scheme: Entreprises
in scheme: Vie et Gestion de l'entreprise
narrower: actionnaire
narrower: refip-REFIP837
narrower: refip-REFIP903
notation: REFIP1027
related: refip-REFIP6862

droit administratif
type: ConceptReFip
type: Concept
broader: droit public
definition: Ensemble des règles du droit privé et du droit public qui s'appliquent à l'Administration dans sa gestion des services publics et dans ses rapports avec les particuliers.
in scheme: FINANCES PUBLIQUES
in scheme: Droit et Justice
in scheme: Divisions du Droit
in scheme: Droit Public
narrower: concession
narrower: propre assureur
narrower: prérogative de puissance publique
narrower: acte administratif
narrower: droit de préemption
narrower: inscription
narrower: théorie de l'imprévision
narrower: expulsion
narrower: contrôle administratif
narrower: continuité du service public
narrower: droit de priorité
narrower: accès aux documents administratifs
narrower: contrôle juridictionnel
narrower: délégation de pouvoir
narrower: délégation de gestion
narrower: responsabilité de l'Etat
narrower: droit au logement
narrower: délégation de signature
narrower: enquête administrative
narrower: délibération
narrower: intérêt général
narrower: refip-REFIP7108
narrower: refip-REFIP7151
narrower: refip-REFIP845
narrower: refip-REFIP852
narrower: refip-REFIP946
notation: REFIP1029

brigade d'évaluation domaniale
type: ConceptReFip
type: Concept
alternative label: BED
broader: direction départementale des finances publiques
definition: Service d'une Direction départementale des finances publiques chargé de l’évaluation des biens immobiliers du département dans le cadre de procédures publiques d’acquisition ou de vente.
in scheme: FINANCES PUBLIQUES
in scheme: Organisation Structurelle de l'Etat
in scheme: Ministère
in scheme: Administration de L'Etat
notation: REFIP103

application VIR
type: ConceptReFip
type: Concept
alternative label: VIR
broader: applications gestion publique (non-descripteur)
definition: Application permettant la dématérialisation des virements papiers.
in scheme: FINANCES PUBLIQUES
in scheme: Applications Informatiques
in scheme: Applications gestion publique
notation: REFIP1030

délit d'entrave
type: ConceptReFip
type: Concept
alternative label: entrave
broader: délit
definition: Comportement volontaire ou non de l'employeur visant à empêcher la mise en place ou le fonctionnement normal d'institutions représentatives du personnel et de leurs prérogatives.
in scheme: FINANCES PUBLIQUES
in scheme: Droit et Justice
in scheme: Infractions et Sanctions
in scheme: Infraction
notation: REFIP1031

Cour de justice de l'Union européenne
type: ConceptReFip
type: Concept
alternative label: CJUE
broader: juridiction
definition: Institution juridictionnelle de l’Union Européenne dont la mission consiste à assurer le respect du droit dans l’interprétation et l’application des traités. Elle contrôle la légalité des actes des institutions de l’Union européenne, veille au respect, par les États membres, des obligations qui découlent des traités, interprète le droit de l’Union à la demande des juges nationaux. Elle constitue ainsi l’autorité judiciaire de l’Union européenne et veille, en collaboration avec les juridictions des États membres, à l’application et à l’interprétation uniforme du droit communautaire. Elle comprend trois juridictions : la Cour de justice, le Tribunal et le Tribunal de la fonction publique de l’Union européenne.
in scheme: FINANCES PUBLIQUES
in scheme: Droit et Justice
in scheme: Juridiction
in scheme: Organisation Juridictionnelle
narrower: tribunal de la fonction publique de l'Union européenne
notation: REFIP1032

courrier
type: ConceptReFip
type: Concept
alternative label: correspondance
broader: communication
definition: Correspondance envoyée ou reçue par la poste.
in scheme: FINANCES PUBLIQUES
in scheme: Communication
in scheme: Communication Documentation Informatique
narrower: affranchissement
narrower: courriel
narrower: accusé de réception
narrower: lettre recommandée
narrower: refip-REFIP7119
notation: REFIP1033

impôt de solidarité sur la fortune
type: ConceptReFip
type: Concept
alternative label: ISF
alternative label: impôt sur la fortune
alternative label: impôt sur les grandes fortunes
broader: impôt direct
definition: Impôt annuel dû par une personne physique propriétaire d'un patrimoine excédant le seuil d'imposition au 1er janvier de l'année d'imposition.
in scheme: FINANCES PUBLIQUES
in scheme: Fiscalité
in scheme: Impôt
notation: REFIP1035
scope note: Remplacé par l'impôt sur la fortune immobilière au 1er janvier 2018

Météo France
type: ConceptReFip
type: Concept
broader: établissement public à caractère administratif
definition: Etablissement public administratif, chargé de la prévision et de l'étude des phénomènes météorologiques, placé sous la tutelle du ministère de l'Ecologie.
in scheme: FINANCES PUBLIQUES
in scheme: Organisation Structurelle de l'Etat
in scheme: Opérateur de l'Etat
in scheme: Administration de L'Etat
notation: REFIP1037

Fonds académique de rémunération des personnels d'internat (supprimé)
type: ConceptReFip
type: Concept
broader: ZZ
in scheme: FINANCES PUBLIQUES
notation: REFIP1038

élu local
type: ConceptReFip
type: Concept
broader: organisation territoriale (non-descripteur)
definition: Représentant des citoyens des différentes collectivités territoriales, élu dans le but d'agir pour l’intérêt local, Membre des organes délibérants de ces collectivités.
in scheme: FINANCES PUBLIQUES
in scheme: Organisation Territoriale
in scheme: Administration de L'Etat
in scheme: 212106
narrower: adjoint au maire
narrower: conseiller municipal
narrower: conseiller départemental
narrower: conseiller régional
narrower: refip-REFIP736
notation: REFIP104

exportation
type: ConceptReFip
type: Concept
broader: économie générale (non-descripteur)
definition: Vente à l'étranger d'une partie de la production de biens ou de services d'un ensemble économique, pays ou région.
in scheme: FINANCES PUBLIQUES
in scheme: Questions Economiques
in scheme: Economie générale
notation: REFIP1041
related: livraison intra-communautaire

combustible
type: ConceptReFip
type: Concept
broader: énergie
definition: Matière dont la combustion produit de l'énergie.
in scheme: FINANCES PUBLIQUES
in scheme: Branche d'activité
in scheme: Questions Economiques
in scheme: Industrie
narrower: gaz
narrower: fioul
narrower: charbon
narrower: carburant
notation: REFIP1042

principe d'indépendance des exercices
type: ConceptReFip
type: Concept
alternative label: rattachement au bon exercice
alternative label: rattachement à la bonne période comptable
broader: refip-REFIP819
definition: Principe comptable imposant le rattachement les factures clients et fournisseurs à l'exercice comptable qu'ils concernent, indépendamment de leur date de facturation.D'une façon générale, chaque charge et chaque produit doit être rattaché à l'exercice qui le concerne et à cet exercice seulement.
in scheme: FINANCES PUBLIQUES
in scheme: Principe comptable
in scheme: Comptabilité
notation: REFIP1043

Grande-Bretagne
type: ConceptReFip
type: Concept
broader: Royaume-Uni
definition: Pays
in scheme: FINANCES PUBLIQUES
in scheme: Géographie
in scheme: Europe
narrower: île de Guernesey
narrower: île de Man
narrower: Gibraltar
narrower: île de Jersey
notation: REFIP1044
related: Saint-Christophe-et-Niévès
related: îles Caimans
related: Anguilla
related: les Bermudes

coefficient multiplicateur
type: ConceptReFip
type: Concept
broader: mots outils (liste additive)
definition: Coefficient de proportionnalité qui traduit l'application d'un pourcentage par une multiplication.
in scheme: FINANCES PUBLIQUES
in scheme: Mots Outils
notation: REFIP1048

magasin
type: ConceptReFip
type: Concept
alternative label: boutique
broader: commerce
definition: Établissement de commerce où l'on vend des marchandises en gros ou au détail.
in scheme: FINANCES PUBLIQUES
in scheme: Branche d'activité
in scheme: Questions Economiques
in scheme: Commerce
narrower: magasin de grande surface
notation: REFIP105

taxe de balayage
type: ConceptReFip
type: Concept
broader: taxes assimilées aux impôts directs locaux (non descripteur)
definition: Taxe facultative et pouvant être instituée, sur délibération prise sous conditions, par les communes, les communautés urbaines, les communautés d'agglomération ou les communautés de communes lorsqu'elles assurent le balayage de la superficie des voies livrées à la circulation publique qui incombe aux propriétaires riverains.
in scheme: FINANCES PUBLIQUES
in scheme: Fiscalité
in scheme: Impôt
notation: REFIP1050

plafonnement des loyers
type: ConceptReFip
type: Concept
broader: gestion des immeubles
definition: Montant maximum des loyers des immeubles de bureaux dans le cadre de la politique immobilière de l'État.
in scheme: FINANCES PUBLIQUES
in scheme: Politique immobilière de l'Etat
in scheme: Gestion Publique
notation: REFIP1051

nantissement du fonds de commerce
type: ConceptReFip
type: Concept
broader: nantissement
definition: Sûreté réelle mobilière inscrite par un créancier sur un fonds de commerce appartenant à un débiteur afin de garantir sa dette.
in scheme: FINANCES PUBLIQUES
in scheme: Recouvrement
in scheme: Fiscalité
notation: REFIP1052

collectivité d'outre-mer
type: ConceptReFip
type: Concept
alternative label: COM
alternative label: territoire d'outre-mer
broader: structures territoriales (non-descripteur)
definition: Territoires de la République française régis par l'article 74 de la Constitution. Ils remplacent les anciens territoires d'outre-mer (TOM) et d'autres collectivités à statut particulier. Ces collectivités sont la Polynésie française, Saint-Barthélemy, Saint-Martin, Saint-Pierre-et-Miquelon et Wallis-et-Futuna. Les COM sont dotées d’un statut fixé par la loi organique qui tient compte des intérêts propres de chacune d’elles au sein de la République.
in scheme: FINANCES PUBLIQUES
in scheme: Organisation Territoriale
in scheme: Structures Territoriales
in scheme: Administration de L'Etat
notation: REFIP1053
scope note: Depuis la réforme 28/03/2003, comprend les anciens TOM et les 5 collectivités à statut particulier

application REC
type: ConceptReFip
type: Concept
alternative label: application MEN
alternative label: application REC-MEN
broader: applications fiscales (non-descripteur)
definition: Application servant à la gestion du recouvrement des impôts sur rôle en phase amiable.
in scheme: FINANCES PUBLIQUES
in scheme: Applications Informatiques
in scheme: Applications fiscales
notation: REFIP1055

encaissement
type: ConceptReFip
type: Concept
broader: comptabilité de caisse
definition: Action de mettre en caisse de l'argent ou des valeurs.
in scheme: FINANCES PUBLIQUES
in scheme: Comptabilité publique
in scheme: Comptabilité
narrower: encaissement immédiat
notation: REFIP1056

commission consultative paritaire
type: ConceptReFip
type: Concept
broader: organisme consultatif et représentatif (non-descripteur)
definition: Organe consultatif compétent pour les questions d'ordre individuel concernant les personnels contractuels, par exemple les questions relatives aux licenciements intervenant à l'expiration de la période d'essai, les sanctions disciplinaires autres que l'avertissement et le blâme...
in scheme: FINANCES PUBLIQUES
in scheme: Organisation Structurelle de l'Etat
in scheme: Organisme Consultatif et Représentatif
in scheme: Administration de L'Etat
notation: REFIP1057
related: refip-REFIP6578

imprimé
type: ConceptReFip
type: Concept
alternative label: formulaire
broader: document
definition: Livre, brochure, feuille ou formule administrative imprimés.
in scheme: FINANCES PUBLIQUES
in scheme: Documentation
in scheme: Communication Documentation Informatique
narrower: formulaire électronique
notation: REFIP1058

acte constitutif
type: ConceptReFip
type: Concept
broader: sources des droits subjectifs (non-descripteur)
definition: Acte faisant naître un droit réel (accessoire ou démembré).
in scheme: FINANCES PUBLIQUES
in scheme: Droit et Justice
in scheme: Sources du Droit
in scheme: Sources des Droits Subjectifs
notation: REFIP1059

condamnation solidaire
type: ConceptReFip
type: Concept
alternative label: condamnation in solidum
broader: condamnation
definition: Décision permettant aux parties civiles de réclamer leurs dommages à un des condamnés, à charge pour ce dernier de se faire rembourser les quotes-parts auprès des autres coupables solidaires avec lui.
in scheme: FINANCES PUBLIQUES
in scheme: Principes Généraux
in scheme: Droit et Justice
in scheme: Procédure
notation: REFIP106

part sociale
type: ConceptReFip
type: Concept
broader: droits sociaux
definition: Titre de propriété sur le capital d'une entreprise comportant plusieurs associés. Une part sociale est détenue par un associé d'une société à statut commercial n'ayant pas celui de société par actions (cas par exemple des SARL en France) ou par un sociétaire d'une coopérative ou mutuelle.
in scheme: FINANCES PUBLIQUES
in scheme: Droit et Justice
in scheme: Divisions du Droit
in scheme: Droit Privé
notation: REFIP1060

régie de transport
type: ConceptReFip
type: Concept
broader: régie
definition: Structure ayant pour objet d'exploiter des services de transports publics de personnes qu'ils soient urbains ou routiers non urbains et, à titre accessoire à celui-ci, effectuées à la demande ou avec l'accord de l'autorité organisatrice.
in scheme: FINANCES PUBLIQUES
in scheme: Secteur public local
in scheme: Gestion Publique
notation: REFIP1061

horticulture
type: ConceptReFip
type: Concept
broader: agriculture
definition: Culture des légumes, des fleurs, des arbres ou arbustes fruitiers et d'ornement.
in scheme: FINANCES PUBLIQUES
in scheme: Branche d'activité
in scheme: Questions Economiques
in scheme: Agriculture
notation: REFIP1062

cahier des charges
type: ConceptReFip
type: Concept
alternative label: cahier des charges type
broader: marché public
definition: Document contractuel qui contient la liste des besoins, des exigences et des contraintes qu'il faut respecter lors de la réalisation d'un projet.
in scheme: FINANCES PUBLIQUES
in scheme: Commande publique
in scheme: Gestion Publique
narrower: cahier des clauses administratives particulières
narrower: cahier des clauses administratives générales
narrower: cahier des clauses techniques générales
narrower: cahier des clauses techniques particulières
notation: REFIP1063

liquidation de l'impôt
type: ConceptReFip
type: Concept
alternative label: calcul de l'impôt
definition: Opération qui consiste à calculer la dette fiscale du contribuable par application d'un taux ou d'un tarif à la base imposable après prise en compte, le cas échéant, de réductions ou de majorations portant sur l'impôt brut.
in scheme: FINANCES PUBLIQUES
in scheme: Liquidation de l'Impôt
in scheme: Fiscalité
narrower: évaluation forfaitaire
narrower: impôt à payer
narrower: système du quotient
narrower: non-imposition
narrower: déficit foncier
narrower: plafonnement
narrower: déductibilité
narrower: tranche d'imposition
narrower: revenu fiscal de référence
narrower: refip-REFIP952
notation: REFIP1064

garantie de parfait achèvement
type: ConceptReFip
type: Concept
broader: exécution d'un marché public
definition: Garantie légale, dans le cadre des marches publics, destinée à satisfaire aux réserves formulées lors de la réception et à remédier aux imperfections apparues au cours de la première année
in scheme: FINANCES PUBLIQUES
in scheme: Commande publique
in scheme: Gestion Publique
notation: REFIP1065

acte de l'Etat civil
type: ConceptReFip
type: Concept
broader: refip-REFIP859
definition: Résultat d'une procédure écrite d'identification administrative : actes de naissance, de mariage et de décès.
in scheme: FINANCES PUBLIQUES
in scheme: Droit et Justice
in scheme: Divisions du Droit
in scheme: Droit Privé
narrower: certificat de décès
notation: REFIP1066

bordereau de renouvellement
type: ConceptReFip
type: Concept
broader: bordereau d'inscription
definition: Document permettant de requérir le renouvellement d'une inscription hypothécaire légale notamment. Il doit être déposé avant le terme de l’inscription originaire à savoir avant la date extrême d’effet.
in scheme: FINANCES PUBLIQUES
in scheme: Documentation Fiscale
in scheme: Fiscalité
notation: REFIP107

recours administratif
type: ConceptReFip
type: Concept
broader: procédure administrative
definition: Recours portés devant l'Administration en vue de faire annuler l'un des actes prétendu illégal ou de demander une réparation pécuniaire, par opposition aux recours juridictionnels portés devant les tribunaux,. Ils se divisent en recours gracieux, adressés à l'autorité même dont émane la mesure critiquée, et en recours hiérarchiques, portés devant un supérieur de cette autorité. Dans certaines matières, ils sont obligatoires avant un recours juridictionnel.
in scheme: FINANCES PUBLIQUES
in scheme: Procédure Administrative
in scheme: Droit et Justice
in scheme: Procédure
narrower: recours gracieux
narrower: recours hiérarchique
notation: REFIP1070

Premier Ministre
type: ConceptReFip
type: Concept
broader: gouvernement
definition: Chef du gouvernement, nommé par le Président de la République.
in scheme: FINANCES PUBLIQUES
in scheme: Organisation Structurelle de l'Etat
in scheme: Pouvoirs Publics
in scheme: Administration de L'Etat
notation: REFIP1071

décision d'affermissement
type: ConceptReFip
type: Concept
alternative label: affermissement
broader: refip-REFIP7149
definition: Décision de la personne responsable du marché, notifiée au titulaire dans les conditions fixées au marché qui consiste à rendre ferme une tranche conditionnelle.
in scheme: FINANCES PUBLIQUES
in scheme: Commande publique
in scheme: Gestion Publique
notation: REFIP1072

Ministère du Travail de l'Emploi et du Dialogue social (obsolète)
type: ConceptReFip
type: Concept
is replaced by: refip-REFIP7068
broader: ZZ
in scheme: FINANCES PUBLIQUES
notation: REFIP1074

action directe
type: ConceptReFip
type: Concept
broader: action en justice
definition: Fait pour un créancier d'agir en justice en son nom et pour son compte contre le débiteur de son débiteur.
in scheme: FINANCES PUBLIQUES
in scheme: Principes Généraux
in scheme: Droit et Justice
in scheme: Procédure
notation: REFIP1075

application INTRANET COMMUN (supprimé)
type: ConceptReFip
type: Concept
broader: ZZ
in scheme: FINANCES PUBLIQUES
notation: REFIP1076

association
type: ConceptReFip
type: Concept
broader: forme juridique
definition: Groupement permanent de personnes mettant en commun leurs connaissances, leur activité et leurs ressources, en vue d'un but qui n'est pas exclusivement ou principalement le partage de bénéfices.
in scheme: FINANCES PUBLIQUES
in scheme: Entreprises
in scheme: Forme juridique
narrower: organisme sans but lucratif
narrower: association foncière urbaine
narrower: refip-REFIP7154
notation: REFIP1077

exonération
type: ConceptReFip
type: Concept
broader: base d'imposition
definition: Dispense de paiement d'impôt, de taxe ou de droit sous certaines conditions définies dans le cadre de la loi,
in scheme: FINANCES PUBLIQUES
in scheme: Champ d'Application
in scheme: Fiscalité
notation: REFIP1079

compagnie de navigation aérienne
type: ConceptReFip
type: Concept
alternative label: compagnie aérienne
broader: aviation civile
definition: Entreprise de transport aérien.
in scheme: FINANCES PUBLIQUES
in scheme: Branche d'activité
in scheme: Questions Economiques
in scheme: Transports
narrower: personnel navigant
notation: REFIP108

application ALPAGE
type: ConceptReFip
type: Concept
broader: applications fiscales (non-descripteur)
definition: Outil d'aide à la programmation, à l'analyse et à la gestion du contrôle fiscal externe et sur pièces.
in scheme: FINANCES PUBLIQUES
in scheme: Applications Informatiques
in scheme: Applications fiscales
notation: REFIP1080

République du Costa Rica
type: ConceptReFip
type: Concept
alternative label: Costa Rica
broader: Amérique
definition: Pays
in scheme: FINANCES PUBLIQUES
in scheme: Géographie
in scheme: Amérique
notation: REFIP1082

inspection de contrôle et d'expertise
type: ConceptReFip
type: Concept
alternative label: ICE
broader: direction départementale des finances publiques
definition: Structure chargée des travaux complexes relatifs aux dossiers professionnels notamment l'instruction des contentieux complexes, le contrôle sur pièces des dossiers des professionnels, le contrôle fiscal externe. Les ICE peuvent être regroupées en pôle de contrôle et d'expertise (PCE).
in scheme: FINANCES PUBLIQUES
in scheme: Organisation Structurelle de l'Etat
in scheme: Ministère
in scheme: Administration de L'Etat
notation: REFIP1083

Code de l'action sociale et des familles
type: ConceptReFip
type: Concept
broader: documentation juridique (non-descripteur)
definition: Ensemble des dispositions législatives et réglementaires sur l'action sociale et la famille. Ce code organise pour une grande part la solidarité républicaine en direction des familles avec des enfants et de catégories sociales pauvres et marginalisées.
in scheme: FINANCES PUBLIQUES
in scheme: Droit et Justice
in scheme: Documentation Juridique
in scheme: Sources du Droit
notation: REFIP1084

droit annuel de francisation et de navigation (supprimé)
type: ConceptReFip
type: Concept
broader: ZZ
in scheme: FINANCES PUBLIQUES
notation: REFIP1085

Union nationale interprofessionnelle pour l'emploi dans l'industrie et le commerce
type: ConceptReFip
type: Concept
alternative label: UNEDIC
broader: organisme privé assurant service public (non-descripteur)
definition: Organisme de droit privé chargé par délégation de service public, de la gestion de l'Assurance chômage.
in scheme: FINANCES PUBLIQUES
in scheme: Organisation Structurelle de l'Etat
in scheme: Organisme Privé Assurant Service Public
in scheme: Administration de L'Etat
notation: REFIP1088
related: Pôle Emploi
related: assurance chômage

Code des postes et communications électroniques
type: ConceptReFip
type: Concept
broader: documentation juridique (non-descripteur)
definition: Ensemble des obligations de la Poste, ses responsabilités ainsi que les cas de dérogations à certaines obligations. Par ailleurs, le Code rassemble aussi les dispositions relatives aux communications électroniques.
in scheme: FINANCES PUBLIQUES
in scheme: Droit et Justice
in scheme: Documentation Juridique
in scheme: Sources du Droit
notation: REFIP1089

contribution de solidarité territoriale
type: ConceptReFip
type: Concept
broader: contribution
definition: Taxe assise sur le montant total, hors taxe sur la valeur ajoutée et déduction faite des contributions versées par l'Etat en compensation des tarifs sociaux et conventionnés, du chiffre d'affaires encaissé au cours du dernier exercice clos à la date d'exigibilité de la taxe afférent aux opérations situées dans le champ d'application de la TVA réalisé au titre des prestations de transport ferroviaire de voyageurs, et des prestations commerciales qui leur sont directement liées, effectuées entre deux gares du réseau ferré national. Cette taxe est due par les entreprises de transport ferroviaire autorisées le 1er janvier de l'année en cours à exploiter des services de transport.
in scheme: FINANCES PUBLIQUES
in scheme: Fiscalité
in scheme: Impôt
notation: REFIP109
scope note: Remplace la taxe professionnelle par loi de finances pour 2010 n° 2009-1673 du 30/12/2009

visioconférence
type: ConceptReFip
type: Concept
broader: technologie de l'information et de la communication
definition: Réunion tenue à distance utilisant la vidéo et l'audio, et permettant à chaque participant, pouvant être éloigné, de dialoguer avec ses interlocuteurs.
in scheme: FINANCES PUBLIQUES
in scheme: Communication
in scheme: Communication Documentation Informatique
notation: REFIP1090

phase comminatoire amiable
type: ConceptReFip
type: Concept
alternative label: phase comminatoire
broader: recouvrement
definition: Procédure amiable qui a pour objet d'inciter le redevable de produits locaux, d'amendes et de condamnation pécuniaire, à s'acquitter de sa dette auprès d'un huissier de justice.
in scheme: FINANCES PUBLIQUES
in scheme: Recouvrement
in scheme: Fiscalité
notation: REFIP1091

Saint-Christophe-et-Niévès
type: ConceptReFip
type: Concept
alternative label: Saint Kitts-et-Nevis
broader: Caraïbes
definition: Pays
in scheme: FINANCES PUBLIQUES
in scheme: Géographie
in scheme: Amérique
notation: REFIP1092
related: Grande-Bretagne

cautionnement du comptable
type: ConceptReFip
type: Concept
broader: responsabilité des comptables
definition: Garantie de l’organisme public auprès duquel le comptable public est placé. Le montant du cautionnement est fixé par arrêté du ministre. Les garanties consistent soit en l’engagement d’une caution solidaire, soit dans la constitution d’un cautionnement. L’engagement d’une caution solidaire est représenté par l’affiliation du comptable public à une association de cautionnement mutuel agréée par le ministre de l’économie et des finances (AFCM). Le cautionnement est constitué par un dépôt de numéraire, de rentes sur l’Etat ou d’autres valeurs du Trésor.
in scheme: FINANCES PUBLIQUES
in scheme: Responsabilité des comptables
in scheme: Missions Transverses des Finances publiques
notation: REFIP1093
scope note: Constitution des garanties lors de la prise de fonction d'un comptable

service public
type: ConceptReFip
type: Concept
broader: mission de service public
definition: Activité d'intérêt général exercée directement par l'autorité publique (État, collectivité territoriale ou locale) ou sous son contrôle, dans le but de satisfaire un besoin d'intérêt général.
in scheme: FINANCES PUBLIQUES
in scheme: Etat
in scheme: Mission de Service Public
in scheme: Administration de L'Etat
narrower: service public social et médico-social
narrower: service public d'eau et d'assainissement
narrower: service public d'assainissement non collectif
narrower: service public à caractère industriel et commercial
narrower: service d'intérêt économique général
narrower: service public hospitalier
narrower: audiovisuel public
narrower: refip-REFIP847
notation: REFIP1094
related: open data

société immobilière de copropriété
type: ConceptReFip
type: Concept
broader: société civile
definition: Société qui a pour unique objet, soit la construction ou l'acquisition d'immeubles ou de groupes d'immeubles en vue de leur division par fractions destinées aux associés en propriété ou en jouissance, soit la gestion de ces immeubles ou groupes d'immeubles ainsi divisés, soit la location pour le compte d'un ou plusieurs des membres de la société de tout ou partie des immeubles ou fractions d'immeubles appartenant à chacun de ces membres.
in scheme: FINANCES PUBLIQUES
in scheme: Société
in scheme: Entreprises
in scheme: Forme juridique
notation: REFIP1095

bouclier fiscal
type: ConceptReFip
type: Concept
alternative label: droit à restitution des impositions directes en fonction du revenu
alternative label: plafonnement des impositions directes en fonction des revenus
broader: restitution des impositions directes
definition: Droit à restitution de la fraction des impositions directes du contribuable qui excède le seuil de 50 % de ses revenus.
in scheme: FINANCES PUBLIQUES
in scheme: Contentieux Fiscal
in scheme: Fiscalité
notation: REFIP1096
scope note: Dispositif supprimé depuis le 1er janvier 2013

dégagement de caisse
type: ConceptReFip
type: Concept
broader: comptabilité de caisse
definition: Versement de l'excédent de numéraire détenu afin de respecter le plafond d'encaisse du service.
in scheme: FINANCES PUBLIQUES
in scheme: Comptabilité publique
in scheme: Comptabilité
notation: REFIP1097

Val-de-Marne
type: ConceptReFip
type: Concept
broader: Ile-de-France
definition: Département français
in scheme: FINANCES PUBLIQUES
in scheme: Géographie
in scheme: Europe
notation: REFIP1098

tiers
type: ConceptReFip
type: Concept
broader: droit des obligations et contrats (non-descripteur)
definition: Toute personne qui n'y a pas été partie, ou qui n'y a pas été représentée, relativement aux dispositions d'une convention. S'agissant d'un jugement le tiers est la personne qui n'a figuré à la procédure ni comme demandeur, ni comme défendeur, ni comme tiers-intervenant ou qui n'a pas été mise en cause.
in scheme: FINANCES PUBLIQUES
in scheme: Droit et Justice
in scheme: Divisions du Droit
in scheme: Droit Privé
narrower: tiers détenteur
notation: REFIP1099

élément du train de vie
type: ConceptReFip
type: Concept
alternative label: signe extérieur de richesse
alternative label: train de vie
broader: évaluation forfaitaire
definition: Critère pris en compte lorsqu'il existe une disproportion marquée entre le train de vie d'un contribuable et ses revenus, afin de déterminer de manière forfaitaire la base d'imposition à l'impôt sur le revenu.
in scheme: FINANCES PUBLIQUES
in scheme: Liquidation de l'Impôt
in scheme: Fiscalité
notation: REFIP11

forain
type: ConceptReFip
type: Concept
alternative label: commerçant forain
alternative label: marchand forain
broader: foire et marché
definition: Propriétaire ou employé des grandes et petites attractions, des manèges, des stands de foire, des étals de foire et de marché.
in scheme: FINANCES PUBLIQUES
in scheme: Branche d'activité
in scheme: Questions Economiques
in scheme: Commerce
notation: REFIP110

média
type: ConceptReFip
type: Concept
alternative label: communication de masse
alternative label: mass-média
alternative label: média de masse
broader: traitement de l'information
definition: Moyen de diffusion technique (radio, télévision, cinéma, internet) permettant la communication, la transmission et l'échange d'informations.
in scheme: FINANCES PUBLIQUES
in scheme: Communication
in scheme: Communication Documentation Informatique
narrower: presse
narrower: radio
narrower: télévision
notation: REFIP1100

comptabilité des immobilisations
type: ConceptReFip
type: Concept
broader: comptabilité générale
definition: Comptabilité liée aux opérations concernant les immobilisations de leur acquisition à leur sortie en passant par leur perte de valeur.
in scheme: FINANCES PUBLIQUES
in scheme: Comptabilité générale
in scheme: Comptabilité
notation: REFIP1101

Inspection générale des finances
type: ConceptReFip
type: Concept
alternative label: IGF
broader: Ministère de l'Economie et des Finances
definition: Corps qui exerce une mission générale de contrôle, d'audit, d'étude, de conseil et d'évaluation en matière administrative, économique et financière, pour le compte des ministres chargés de l'économie et du budget. Elle peut également recevoir des missions du Premier ministre et effectuer des missions à la demande d'autres autorités nationales, d'organismes publics, de collectivités territoriales ou de leurs groupements, de fondations ou d'associations, d'États étrangers, d'organisations internationales ou de l'Union européenne.
in scheme: FINANCES PUBLIQUES
in scheme: Organisation Structurelle de l'Etat
in scheme: Ministère
in scheme: Administration de L'Etat
notation: REFIP1104
related: refip-REFIP7061

déclaration de taxe sur les salaires
type: ConceptReFip
type: Concept
broader: refip-REFIP804
definition: Formulaire 2502-SD permettant la liquidation et de régularisation de taxe sur les salaires due par les employeurs établis en France, et qui ne sont pas soumis à la TVA sur la totalité de leur chiffre d'affaires.
in scheme: FINANCES PUBLIQUES
in scheme: Documentation Fiscale
in scheme: Fiscalité
notation: REFIP1107

commission départementale de coopération intercommunale
type: ConceptReFip
type: Concept
alternative label: CDCI
broader: structure locale (non-descripteur)
definition: Commission ayant pour mission d’établir et de tenir à jour l’état de la coopération intercommunale dans le département, ainsi que de formuler des propositions pour la renforcer. Elle est composée de représentants : des communes du département, des EPCI, des syndicats mixtes et des syndicats de communes, du conseil départemental et du conseil régional dans la circonscription départementale.
in scheme: FINANCES PUBLIQUES
in scheme: Organisation Territoriale
in scheme: Structures Territoriales
in scheme: Administration de L'Etat
notation: REFIP1108

bilan d'ouverture
type: ConceptReFip
type: Concept
broader: bilan
definition: Bilan établi en début d'exercice.
in scheme: FINANCES PUBLIQUES
in scheme: Documents comptables
in scheme: Comptabilité
notation: REFIP1109

agroalimentaire
type: ConceptReFip
type: Concept
alternative label: industrie agroalimentaire
broader: industrie
definition: Secteur d'activité correspondant à l'ensemble des entreprises des secteurs primaire et secondaire qui participent à la production de produits alimentaires finis.
in scheme: FINANCES PUBLIQUES
in scheme: Branche d'activité
in scheme: Questions Economiques
in scheme: Industrie
narrower: denrée alimentaire
narrower: abattoir
narrower: alcool
notation: REFIP111

Maroc
type: ConceptReFip
type: Concept
broader: Afrique
definition: Pays
in scheme: FINANCES PUBLIQUES
in scheme: Géographie
in scheme: Afrique
notation: REFIP1110

hypothèque légale du Trésor
type: ConceptReFip
type: Concept
alternative label: hypothèque du Trésor
broader: hypothèque
definition: Hypothèque portant sur l'ensemble des immeubles des redevables pour le recouvrement des impositions de toute nature et des amendes fiscales exigibles et non payées à leur échéance confié aux comptables publics, Elle confère au Trésor un droit de préférence sur la plupart des autres créanciers et un droit de suite entre les mains de l'acquéreur.
in scheme: FINANCES PUBLIQUES
in scheme: Recouvrement
in scheme: Fiscalité
notation: REFIP1111

créance acquise
type: ConceptReFip
type: Concept
broader: créance
definition: Créance certaine dans son principe et déterminée dans son montant, c'est-à-dire que si l'accord a été réalisé entre les parties sur la chose et sur le prix, même si ce prix n'est payable qu'ultérieurement.
in scheme: FINANCES PUBLIQUES
in scheme: Documents comptables
in scheme: Comptabilité
notation: REFIP1112

Guinée-Bissau
type: ConceptReFip
type: Concept
alternative label: Guinée-Bissao
alternative label: République de Guinée-Bissao
alternative label: République de Guinée-Bissau
broader: Afrique
definition: Pays
in scheme: FINANCES PUBLIQUES
in scheme: Géographie
in scheme: Afrique
notation: REFIP1113

transfert d'entreprise
type: ConceptReFip
type: Concept
broader: vie de l'entreprise (non-descripteur)
definition: Modification de la situation juridique de l'employeur en droit du travail.
in scheme: FINANCES PUBLIQUES
in scheme: Vie de l'Entreprise
in scheme: Entreprises
in scheme: Vie et Gestion de l'entreprise
narrower: cession d'entreprise
narrower: fusion de sociétés
narrower: scission de sociétés
narrower: reprise d'entreprise
notation: REFIP1114

recouvrement forcé
type: ConceptReFip
type: Concept
alternative label: recouvrement contentieux
broader: action en recouvrement
definition: Actions mises en œuvre par le comptable public lorsque un contribuable n'a pas acquitté spontanément à l'échéance prévue le montant dû.
in scheme: FINANCES PUBLIQUES
in scheme: Recouvrement
in scheme: Fiscalité
notation: REFIP1115

urgence impérieuse
type: ConceptReFip
type: Concept
broader: exécution d'un marché public
definition: Circonstance imprévisible pour le pouvoir adjudicateur, qui n'est pas de son fait dans le cadre de marché public et qui rend impossible le respect des délais normaux, y compris réduits pour cause d'urgence simple. Circonstance à laquelle le pouvoir adjudicateur doit remédier immédiatement, faire réaliser une prestation pour assurer la sécurité du public, ou permettre la continuité d'une activité de service public.
in scheme: FINANCES PUBLIQUES
in scheme: Commande publique
in scheme: Gestion Publique
notation: REFIP1116

local à usage d'habitation
type: ConceptReFip
type: Concept
broader: local
definition: Local dont la destination est uniquement l'habitation.
in scheme: FINANCES PUBLIQUES
in scheme: Cadastre
in scheme: Fiscalité
notation: REFIP1119

marché alloti
type: ConceptReFip
type: Concept
alternative label: allotissement
alternative label: marché à lots
broader: marché public
definition: Marché fractionné en plusieurs sous-ensembles appelés "lots" susceptibles d'être attribués séparément et de donner lieu, chacun, à l'établissement d'un marché distinct.
in scheme: FINANCES PUBLIQUES
in scheme: Commande publique
in scheme: Gestion Publique
narrower: lots
notation: REFIP112

résident étranger
type: ConceptReFip
type: Concept
broader: territorialité de l'impôt
definition: Personne non-résidente désireuse de domicilier ses revenus ou son patrimoine en France. Elle peut solliciter le service d’accueil des non-résidents et expatriés (SANR), afin d'obtenir une prise de position formelle sur sa situation personnelle par le biais d’un "rescrit domiciliation".
in scheme: FINANCES PUBLIQUES
in scheme: Champ d'Application
in scheme: Fiscalité
notation: REFIP1122

fraude sociale
type: ConceptReFip
type: Concept
alternative label: fraude aux prestations sociales
alternative label: lutte contre la fraude sociale
broader: fraude
definition: Toute action ou tout comportement visant à obtenir des avantages sociaux indus ou de se soustraire au paiement des cotisations sociales.
in scheme: FINANCES PUBLIQUES
in scheme: Droit et Justice
in scheme: Infractions et Sanctions
in scheme: Infraction
notation: REFIP1123

plan comptable
type: ConceptReFip
type: Concept
broader: documents comptables
definition: Ensemble des règles d'évaluation et de tenue des comptes qui constitue la norme de la comptabilité. Le plan de comptes, c'est-à-dire la liste des comptes ordonnée, est un des éléments du plan comptable.
in scheme: FINANCES PUBLIQUES
in scheme: Documents comptables
in scheme: Comptabilité
narrower: compte comptable
narrower: compte de tiers
notation: REFIP1124

société de perception et de répartition des droits
type: ConceptReFip
type: Concept
alternative label: SACEM
alternative label: SPRD
alternative label: société de gestion des droits d'auteur
alternative label: société des auteurs compositeurs et éditeurs de musique
broader: organisme privé assurant service public (non-descripteur)
definition: Société par laquelle des auteurs exercent la gestion collective de leurs droits.
in scheme: FINANCES PUBLIQUES
in scheme: Organisation Structurelle de l'Etat
in scheme: Organisme Privé Assurant Service Public
in scheme: Administration de L'Etat
notation: REFIP1127

interlocuteur fiscal unique
type: ConceptReFip
type: Concept
broader: service des impôts des entreprises
definition: Service visant à offrir aux usagers, quel que soit le lieu où ils se trouvent et quel que soit le mode de contact, la possibilité d’effectuer l’essentiel de leurs démarches fiscales auprès d’un seul interlocuteur.
in scheme: FINANCES PUBLIQUES
in scheme: Organisation Structurelle de l'Etat
in scheme: Ministère
in scheme: Administration de L'Etat
notation: REFIP113

service des retraites de l'Etat
type: ConceptReFip
type: Concept
alternative label: SRE
broader: service à compétence nationale
definition: Service à compétence nationale chargé de la mise en œuvre de la gestion administrative et financière du régime de retraite et d'invalidité des fonctionnaires civils et militaires de l'Etat. Il représente le régime de retraite de l'Etat auprès des organismes de retraite et des instances de gouvernance des régimes de retraite. Il est responsable du processus de gestion des pensions de retraite et d'invalidité des fonctionnaires civils et militaires de l'Etat.
in scheme: FINANCES PUBLIQUES
in scheme: Organisation Structurelle de l'Etat
in scheme: Ministère
in scheme: Administration de L'Etat
notation: REFIP1130

Agence France Trésor
type: ConceptReFip
type: Concept
broader: Direction générale du Trésor
definition: Service à compétence nationale placé sous l'autorité du ministre de l'Economie et du directeur général du Trésor, l'AFT a pour mission de gérer la dette et la trésorerie de l’État au mieux des intérêts du contribuable. Elle poursuit le développement de nouveaux produits et la modernisation de la gestion de la dette et de la trésorerie de l’État afin de réduire son coût pour les finances publiques et le contribuable.
in scheme: FINANCES PUBLIQUES
in scheme: Organisation Structurelle de l'Etat
in scheme: Ministère
in scheme: Administration de L'Etat
notation: REFIP1131

centre prélèvement service
type: ConceptReFip
type: Concept
alternative label: CPS
broader: direction régionale des finances publiques
definition: Service d'accueil à distance spécialisé dans la gestion du prélèvement automatique de l'impôt administré par la DGFIP. Les agents apportent par téléphone des réponses aux questions des contribuables concernant le prélèvement à l'échéance ou mensuel pour l'impôt sur le revenu, la taxe foncière, ainsi que la taxe d'habitation/contribution à l'audiovisuel public.
in scheme: FINANCES PUBLIQUES
in scheme: Organisation Structurelle de l'Etat
in scheme: Ministère
in scheme: Administration de L'Etat
notation: REFIP1132

redevance d'enlèvement des ordures ménagères
type: ConceptReFip
type: Concept
broader: taxes assimilées aux impôts directs locaux (non descripteur)
definition: Redevance due par les usagers de ce service, calculée en fonction de l'importance du service rendu (volume des ordures et déchets enlevés notamment). Elle est encaissée soit par la commune ou le groupement de communes, soit, sur décision de la collectivité concernée, par le concessionnaire du service.
in scheme: FINANCES PUBLIQUES
in scheme: Fiscalité
in scheme: Impôt
notation: REFIP1133
related: ordures ménagères
related: taxe d'enlèvement des ordures ménagères

concours à un marché public
type: ConceptReFip
type: Concept
broader: passation des marchés publics
definition: Procédure par laquelle le pouvoir adjudicateur choisit un plan ou un projet avant d’attribuer à l’un des lauréats du concours un marché.
in scheme: FINANCES PUBLIQUES
in scheme: Commande publique
in scheme: Gestion Publique
narrower: soumissionnaire des marchés publics
notation: REFIP1134

subdélégation d'autorisation de programme globale
type: ConceptReFip
type: Concept
broader: autorisation de programme
definition: Délégation d’autorisation de programme globalisée permettant au responsable de programme de mettre à disposition du responsable de BOP une enveloppe globalisée d’autorisations d’engagement.
in scheme: FINANCES PUBLIQUES
in scheme: Exécution du budget
in scheme: Budget
notation: REFIP1135

sanction administrative
type: ConceptReFip
type: Concept
broader: sanction
definition: Décision administrative émanant d'une autorité administrative qui vise à réprimer un comportement fautif. Elle vise à punir une personne qui a enfreint une réglementation préexistante et non à prévenir des troubles à l’ordre public.
in scheme: FINANCES PUBLIQUES
in scheme: Droit et Justice
in scheme: Sanction
in scheme: Infractions et Sanctions
narrower: consignation environnementale
narrower: contribution forfaitaire représentative des frais de réacheminement des étrangers en situation irrégulière
notation: REFIP1136

tableau général des propriétés de l'Etat
type: ConceptReFip
type: Concept
alternative label: TGPE
broader: politique immobilière de l'Etat
definition: Récapitulatif de l’ensemble des immeubles de l’État.
in scheme: FINANCES PUBLIQUES
in scheme: Politique immobilière de l'Etat
in scheme: Gestion Publique
notation: REFIP1137

Pôle métropolitain
type: ConceptReFip
type: Concept
broader: syndicat mixte
definition: Etablissement public, assimilé à un syndicat mixte fermé, constitué par accord entre des établissements publics de coopération intercommunale (EPCI) à fiscalité propre, en vue d'actions d'intérêt métropolitain en matière de développement économique ; de promotion de l'innovation, de la recherche, de l'enseignement supérieur et de la culture ; d'aménagement de l'espace par la coordination des schémas de cohérence territoriale dont le périmètre est identique à celui des EPCI qui composent le pôle ; de développement des infrastructures et des services de transport.
in scheme: FINANCES PUBLIQUES
in scheme: Organisation Territoriale
in scheme: Structures Territoriales
in scheme: Administration de L'Etat
notation: REFIP1140

sommation
type: ConceptReFip
type: Concept
broader: procédure civile
definition: Acte d'huissier de justice enjoignant à un débiteur de payer ce qu'il doit ou d'accompagner l'acte auquel il s'est obligé, mais ne reposant pas sur un titre exécutoire.
in scheme: FINANCES PUBLIQUES
in scheme: Procédure Civile
in scheme: Droit et Justice
in scheme: Procédure
notation: REFIP1141

Code de l'expropriation pour cause d'utilité publique
type: ConceptReFip
type: Concept
broader: documentation juridique (non-descripteur)
definition: Ensemble des dispositions législatives et réglementaires relatives au droit de l'expropriation. Il fixe notamment les règles relatives à la déclaration d'utilité publique et à l'indemnisation des propriétaires.
in scheme: FINANCES PUBLIQUES
in scheme: Droit et Justice
in scheme: Documentation Juridique
in scheme: Sources du Droit
notation: REFIP1144

Code de l'urbanisme
type: ConceptReFip
type: Concept
broader: documentation juridique (non-descripteur)
definition: Ensemble des dispositions législatives et réglementaires relatives au droit de l'urbanisme. L’aménagement du territoire français nécessite le respect de diverses règles économiques et écologiques par les acteurs concernés, essentiellement les collectivités. Ces règles font l’objet du code de l’urbanisme, qui réglemente les conditions générales d'aménagement et d'urbanisme ainsi que les rapports entre les différents acteurs (communes, particuliers, entreprises...), afin notamment de permettre à toute personne de bénéficier d’un cadre de vie décent, sain et sécurisé.
in scheme: FINANCES PUBLIQUES
in scheme: Droit et Justice
in scheme: Documentation Juridique
in scheme: Sources du Droit
notation: REFIP1145

ordre de paiement
type: ConceptReFip
type: Concept
alternative label: ordre de payer
alternative label: ordre à payer
broader: refip-REFIP996
definition: Procédure particulière, préalable au règlement de certaines dépenses, et non un moyen de règlement. Il est établi soit à l’initiative de l’ordonnateur, soit à l’initiative de l’agent comptable, en fonction de leurs compétences respectives.
in scheme: FINANCES PUBLIQUES
in scheme: Dépenses publiques
in scheme: Gestion Publique
notation: REFIP1147

application SGDS
type: ConceptReFip
type: Concept
broader: applications fiscales (non-descripteur)
definition: Application de Suivi de Gestion des dossiers sensibles pour le Compte Fiscal Simplifié.
in scheme: FINANCES PUBLIQUES
in scheme: Applications Informatiques
in scheme: Applications fiscales
notation: REFIP1148

procédure adaptée
type: ConceptReFip
type: Concept
broader: passation des marchés publics
definition: Dispositif de passation des Marchés Publics qu'il est possible de mettre en œuvre lorsque les seuils nécessitant le respect d'une procédure formalisée ne sont pas atteints.
in scheme: FINANCES PUBLIQUES
in scheme: Commande publique
in scheme: Gestion Publique
notation: REFIP1149
related: marché à procédure adaptée
related: seuil de passation des marchés

droit sur les tabacs et les boissons alcooliques
type: ConceptReFip
type: Concept
broader: contribution indirecte
definition: Contribution indirecte qui s'applique à l'alcool, aux boissons alcooliques, aux boissons non alcooliques ainsi qu'aux tabacs manufacturés.
in scheme: FINANCES PUBLIQUES
in scheme: Fiscalité
in scheme: Impôt
notation: REFIP1150

mutation secrète (supprimé)
type: ConceptReFip
type: Concept
broader: ZZ
in scheme: FINANCES PUBLIQUES
notation: REFIP1151

pourvoi juridictionnel
type: ConceptReFip
type: Concept
broader: voie de recours
definition: Action par laquelle on attaque devant une juridiction supérieure la décision d'un tribunal inférieur.
in scheme: FINANCES PUBLIQUES
in scheme: Principes Généraux
in scheme: Droit et Justice
in scheme: Procédure
narrower: pourvoi en cassation
notation: REFIP1152

sous-préfet
type: ConceptReFip
type: Concept
broader: fonction publique de l'Etat
definition: Haut fonctionnaire de l'État obéissant aux ordres du préfet. Membre du corps préfectoral, le sous-préfet aide le préfet dans la réalisation de leurs différentes missions et attributions. Il est chargé de l'administration de l'arrondissement, circonscription administrative de l'État et, relaie le préfet en assurant le contrôle administratif des communes de son arrondissement.
in scheme: FINANCES PUBLIQUES
in scheme: Personnels et fonctions
in scheme: Fonction Publique et Gestion des Ressources Humaines
notation: REFIP1153
related: préfet

marché unique (supprimé)
type: ConceptReFip
type: Concept
broader: ZZ
in scheme: FINANCES PUBLIQUES
notation: REFIP1156

tabac
type: ConceptReFip
type: Concept
broader: agriculture
definition: Produit manufacturé élaboré à partir de feuilles séchées de plantes de tabac commun.
in scheme: FINANCES PUBLIQUES
in scheme: Branche d'activité
in scheme: Questions Economiques
in scheme: Agriculture
notation: REFIP1158

centre amendes service
type: ConceptReFip
type: Concept
broader: direction régionale des finances publiques
definition: Service ayant pour mission de gérer, en appui des trésoreries amendes, les contacts à distance avec les redevables, par courrier, appels téléphoniques, courriels. Il offre une possibilité de paiement à distance.
in scheme: FINANCES PUBLIQUES
in scheme: Organisation Structurelle de l'Etat
in scheme: Ministère
in scheme: Administration de L'Etat
notation: REFIP116

avis d'appel public à concurrence
type: ConceptReFip
type: Concept
broader: appel d'offres
definition: Document publié par le pouvoir adjudicateur destinée à informer les candidats potentiels à un marché public des principales caractéristiques de ce dernier.
in scheme: FINANCES PUBLIQUES
in scheme: Commande publique
in scheme: Gestion Publique
notation: REFIP1160

transport de fonds
type: ConceptReFip
type: Concept
broader: refip-REFIP766
definition: Activité de transport routier ou parfois ferroviaire dans lequel les marchandises acheminées sont des fonds en espèces.
in scheme: FINANCES PUBLIQUES
in scheme: Branche d'activité
in scheme: Questions Economiques
in scheme: Transports
narrower: convoyeur de fonds
notation: REFIP1161

contribuable étranger
type: ConceptReFip
type: Concept
alternative label: redevable étranger
broader: territorialité de l'impôt
definition: Personne de nationalité étrangère résidant en France ou à l'étranger et ayant des revenus de source française,
in scheme: FINANCES PUBLIQUES
in scheme: Champ d'Application
in scheme: Fiscalité
notation: REFIP1163

établissement public d'enseignement supérieur et de recherche
type: ConceptReFip
type: Concept
alternative label: PRES
alternative label: pôle de recherche et d'enseignement supérieur
broader: établissement public national
definition: Etablissement concourant aux missions du service public de l'enseignement supérieur et de la recherche et, pouvant relever de différents statuts, notamment les établissements publics à caractère scientifique, culturel et professionnel (E.P.S.C.P.), les établissements publics à caractère scientifique et technologique (EPST) et les établissements publics à caractère industriel et commercial (EPIC).
in scheme: FINANCES PUBLIQUES
in scheme: Organisation Structurelle de l'Etat
in scheme: Opérateur de l'Etat
in scheme: Administration de L'Etat
notation: REFIP1164

fonds de réserve pour les retraites
type: ConceptReFip
type: Concept
alternative label: FRR
broader: établissement public à caractère administratif
definition: Etablissement public de l'Etat à caractère administratif, le Fonds de réserves pour les retraites (FRR) est un investisseur de long terme ayant pour mission de « gérer les sommes qui lui sont affectées, afin de constituer des réserves destinées à contribuer à la pérennité des régimes de retraite éligibles ». Il assure également la gestion financière d’une partie de la contribution exceptionnelle, forfaitaire et libératoire due à la Caisse nationale d’assurance vieillesse des travailleurs salariés (CNAV).
in scheme: FINANCES PUBLIQUES
in scheme: Organisation Structurelle de l'Etat
in scheme: Opérateur de l'Etat
in scheme: Administration de L'Etat
notation: REFIP1165

conflit de juridictions
type: ConceptReFip
type: Concept
broader: organisation juridictionnelle (non-descripteur)
definition: Situation juridique dans laquelle plusieurs tribunaux apparaissent compétents pour juger une cause ou un type de cause; le Tribunal des conflits tranche les conflits de juridiction entre les juridictions de l'ordre judiciaire et celles de l'ordre administratif.
in scheme: FINANCES PUBLIQUES
in scheme: Droit et Justice
in scheme: Organisation Juridictionnelle
notation: REFIP1166
related: tribunal des conflits

retenue
type: ConceptReFip
type: Concept
alternative label: prélèvement
broader: mots outils (liste additive)
definition: Ce qui est déduit, prélevé sur une somme due.
in scheme: FINANCES PUBLIQUES
in scheme: Mots Outils
notation: REFIP1167

application GOELAND
type: ConceptReFip
type: Concept
alternative label: outil GOELAND
broader: applications fiscales (non-descripteur)
definition: Outil de gestion des listes d'aide à la mise à jour de la taxe d'habitation et l'envoi de lettres de renseignements.
in scheme: FINANCES PUBLIQUES
in scheme: Applications Informatiques
in scheme: Applications fiscales
notation: REFIP1169

Mali
type: ConceptReFip
type: Concept
broader: Afrique
definition: Pays
in scheme: FINANCES PUBLIQUES
in scheme: Géographie
in scheme: Afrique
notation: REFIP1170

charte graphique
type: ConceptReFip
type: Concept
broader: charte
definition: Document de travail contenant l'ensemble des règles fondamentales d'utilisation des signes graphiques qui constituent l'identité graphique d'une organisation, d'un projet, d'une entreprise.
in scheme: FINANCES PUBLIQUES
in scheme: Documentation
in scheme: Communication Documentation Informatique
notation: REFIP1171

activité de conseil
type: ConceptReFip
type: Concept
alternative label: mission de conseil
broader: mission de service public
definition: Mission de conseil financier et fiscal de la DGFIP auprès des collectivités locales.
in scheme: FINANCES PUBLIQUES
in scheme: Etat
in scheme: Mission de Service Public
in scheme: Administration de L'Etat
notation: REFIP1173

solde bancaire insaisissable
type: ConceptReFip
type: Concept
alternative label: SBI
broader: refip-REFIP6880
definition: Somme forfaitaire, destinée à couvrir les besoins alimentaires immédiats, ne pouvant faire l'objet de saisie sur compte bancaire détenu par un débiteur personne physique.
in scheme: FINANCES PUBLIQUES
in scheme: Recouvrement
in scheme: Fiscalité
notation: REFIP1175

déchets d'équipements électriques électroniques
type: ConceptReFip
type: Concept
alternative label: D3E
alternative label: DEEE
alternative label: produits électriques électroniques en fin de vie
alternative label: équipements électriques électroniques
broader: déchets
definition: Equipement ou une partie d’Equipement Electrique et Electronique (EEE) arrivé en fin de vie ou ayant perdu son usage initial.
in scheme: FINANCES PUBLIQUES
in scheme: Environnement
in scheme: Dégradation de l'Environnement
in scheme: Questions de Société
notation: REFIP1177

administration centrale de l'Etat
type: ConceptReFip
type: Concept
alternative label: services centraux
broader: ministère
definition: Appellation générique qui qualifie l'ensemble des services de chaque ministère à compétence nationale, assurant au niveau national un rôle de conception, d’animation, d’orientation, d’évaluation et de contrôle. Pour cela, elle participe à l’élaboration des projets de loi et de décret et préparent et mettent en œuvre les décisions du gouvernement et de chacun des ministres.
in scheme: FINANCES PUBLIQUES
in scheme: Organisation Structurelle de l'Etat
in scheme: Ministère
in scheme: Administration de L'Etat
notation: REFIP1178

Fonds national de péréquation des ressources intercommunales et communales
type: ConceptReFip
type: Concept
alternative label: FPIC
broader: fonds (non-descripteur)
definition: Fonds de péréquation horizontal destiné à réduire les écarts de richesse entre les ensembles intercommunaux constitués des communes et leur établissement public de coopération intercommunale (EPCI).
in scheme: FINANCES PUBLIQUES
in scheme: Dépenses publiques
in scheme: Gestion Publique
notation: REFIP118

procédure d'extrême urgence
type: ConceptReFip
type: Concept
broader: expropriation pour cause d'utilité publique
definition: Procédure permettant une prise de possession très rapide des terrains par l'expropriant.
in scheme: FINANCES PUBLIQUES
in scheme: Domaine
in scheme: Gestion Publique
notation: REFIP1180

objectif de performance
type: ConceptReFip
type: Concept
broader: refip-REFIP978
definition: Priorité stratégique de l’action publique mesurée par des indicateurs de performance.
in scheme: FINANCES PUBLIQUES
in scheme: Élaboration du budget
in scheme: Budget
narrower: indicateur de programme
notation: REFIP1181

somme
type: ConceptReFip
type: Concept
broader: refip-REFIP7010
definition: Département français
in scheme: FINANCES PUBLIQUES
in scheme: Géographie
in scheme: Europe
notation: REFIP1182
scope note: Département

jouissance gratuite d'un bien
type: ConceptReFip
type: Concept
broader: droit civil
definition: Jouissance gratuite du domicile conjugal après divorce par exemple.
in scheme: FINANCES PUBLIQUES
in scheme: Droit et Justice
in scheme: Divisions du Droit
in scheme: Droit Privé
notation: REFIP1183

erreur matérielle
type: ConceptReFip
type: Concept
broader: droit général (non-descripteur)
definition: Inexactitude qui se glisse par inadvertance dans l'exécution d'une opération (ex: erreur de calcul) ou dans la rédaction d'un acte (ex, omission de nom) et qui appelle une simple rectification à partir des données en général évidentes.
in scheme: FINANCES PUBLIQUES
in scheme: Droit et Justice
in scheme: Droit Général
notation: REFIP1184

Direction nationale d'enquêtes fiscales
type: ConceptReFip
type: Concept
alternative label: DNEF
broader: service à compétence nationale
definition: Service à compétence nation de la DGFIP, la direction nationale d’enquêtes fiscales est l’échelon national d’action et de coordination du dispositif de recherche du renseignement fiscal. Une partie des services de la DNEF a pour mission la détection des mécanismes frauduleux et la conduite d’opérations de recherches et d’enquêtes en vue de propositions de contrôles et de production documentaire.
in scheme: FINANCES PUBLIQUES
in scheme: Organisation Structurelle de l'Etat
in scheme: Ministère
in scheme: Administration de L'Etat
notation: REFIP1185

charte intercommunale de développement et d'aménagement
type: ConceptReFip
type: Concept
broader: coopération intercommunale
definition: Document élaboré par les communes qui définit les perspectives à moyen terme de leur développement économique, social et culturel, détermine les programmes d'action correspondants, et précise les conditions d'organisation et de fonctionnement des équipements et services publics.
in scheme: FINANCES PUBLIQUES
in scheme: Secteur public local
in scheme: Gestion Publique
notation: REFIP1186

avance remboursable
type: ConceptReFip
type: Concept
alternative label: avance récupérable
broader: aide aux entreprises
definition: Apport de trésorerie pour réaliser un projet de recherche et développement qui ne sera remboursée qu'en cas de réalisation.
in scheme: FINANCES PUBLIQUES
in scheme: Dépenses publiques
in scheme: Gestion Publique
notation: REFIP1188

application ESAR
type: ConceptReFip
type: Concept
alternative label: ESAR
alternative label: application de prise en charge des rôles d'impôts
broader: applications fiscales (non-descripteur)
definition: Application de prise en charge des rôles d’impôts.
in scheme: FINANCES PUBLIQUES
in scheme: Applications Informatiques
in scheme: Applications fiscales
notation: REFIP1189

organisme de sécurité sociale
type: ConceptReFip
type: Concept
broader: organisation structurelle de l'Etat (non-descripteur)
definition: Organisme constituant la Sécurité sociale souvent de droit privé, auxquels la loi a conféré une mission de service public pour la gestion des régimes obligatoires couvrant les risques sociaux des salariés ou non, ainsi que des professions libérales.
in scheme: FINANCES PUBLIQUES
in scheme: Organisation Structurelle de l'Etat
in scheme: Organisme de Sécurité Sociale
in scheme: Administration de L'Etat
narrower: Union de recouvrement des cotisations de sécurité sociale et d'allocations familiales
narrower: Caisse nationale d'assurance vieillesse des travailleurs salariés
narrower: association des régimes de retraites complémentaires
narrower: Caisse d'assurance retraite et de la santé au travail
narrower: Caisse centrale de la mutualité sociale agricole
narrower: association générale des institutions de retraite des cadres
narrower: Agence centrale des organismes de sécurité sociale
narrower: Caisse régionale d'assurance maladie
narrower: Caisse nationale de prévoyance de la fonction publique
narrower: Caisse nationale du régime social des indépendants
narrower: refip-REFIP751
notation: REFIP119

participation pour raccordement à l'égout
type: ConceptReFip
type: Concept
broader: taxes assimilées aux impôts directs locaux (non descripteur)
definition: Participation financière demandée par la commune au propriétaire d’un immeuble qui se raccorde au réseau d’assainissement collectif existant, à l’occasion de la construction ou reconstruction ou extension d’un immeuble. Seuls les immeubles créés après la mise en place du réseau sont redevables de la PRE. Les constructions préexistant à la mise en service de l’égout public et assainies par un dispositif d’assainissement autonome sont exclues du champ d’application de la PRE, mais elles doivent être obligatoirement raccordées à ce réseau public dans les 2 années suivant sa réalisation.
in scheme: FINANCES PUBLIQUES
in scheme: Fiscalité
in scheme: Impôt
notation: REFIP1190
related: refip-REFIP6811

amnistie
type: ConceptReFip
type: Concept
alternative label: loi d'amnistie
broader: droit pénal
definition: Acte qui dispose que des fautes passées devront être oubliées, et qui interdit à quiconque de les rechercher ou de les évoquer sous peine de sanctions.
in scheme: FINANCES PUBLIQUES
in scheme: Droit et Justice
in scheme: Divisions du Droit
in scheme: Droit Public
notation: REFIP1192

mission handicap
type: ConceptReFip
type: Concept
alternative label: CRIPH
alternative label: Cellule de recrutement et d'insertion des personnes handicapées
broader: secrétariat général des ministères économiques et financiers
definition: Structure des ministères économiques et financiers mettant en œuvre une politique de recrutement et d'insertion des personnes en situations d'handicap. L'environnement sociétal, l'immobilier, les postes de travail, les conditions de travail et le déroulement de carrière sont des sujets quotidiens gérés par la cellule.
in scheme: FINANCES PUBLIQUES
in scheme: Organisation Structurelle de l'Etat
in scheme: Ministère
in scheme: Administration de L'Etat
notation: REFIP1193

importation
type: ConceptReFip
type: Concept
broader: économie générale (non-descripteur)
definition: Ensemble des achats de marchandises à l’extérieur d’un pays, qu’il s’agisse de biens destinés à la consommation (biens de consommation) ou de biens destinés à servir à l’investissement (biens de capital).
in scheme: FINANCES PUBLIQUES
in scheme: Questions Economiques
in scheme: Economie générale
notation: REFIP1194
related: refip-REFIP969

débet
type: ConceptReFip
type: Concept
alternative label: débet administratif
alternative label: débet juridictionnel
broader: refip-REFIP7041
definition: Constat objectif d'un déficit ou manquant en monnaie ou en valeurs, recette non recouvrée, dépense irrégulièrement payée ou indemnisation d'un tiers du fait du comptable public, entraînant la mise en jeu de la responsabilité personnelle et pécuniaire de ce dernier.
in scheme: FINANCES PUBLIQUES
in scheme: Responsabilité des comptables
in scheme: Missions Transverses des Finances publiques
notation: REFIP1195

Belgique
type: ConceptReFip
type: Concept
broader: Europe
definition: Pays
in scheme: FINANCES PUBLIQUES
in scheme: Géographie
in scheme: Europe
notation: REFIP1196

guide d'installation
type: ConceptReFip
type: Concept
broader: document
definition: Manuel contenant les instructions à suivre pour réaliser la mise en service d'un appareil, d'un service ou autre.
in scheme: FINANCES PUBLIQUES
in scheme: Documentation
in scheme: Communication Documentation Informatique
notation: REFIP1197

comptabilité M 41
type: ConceptReFip
type: Concept
broader: comptabilité publique locale
definition: Instruction comptable M 41 applicable aux services publics de distribution d'énergie électrique et gazière.
in scheme: FINANCES PUBLIQUES
in scheme: Secteur public local
in scheme: Gestion Publique
notation: REFIP1198

commission de délégation de service public
type: ConceptReFip
type: Concept
broader: délégation de service public
definition: Instance chargée d'ouvrir les plis, de dresser la liste des candidats admis à présenter une offre et d'émettre un avis sur les candidatures et les offres, dans le cadre de marché public.
in scheme: FINANCES PUBLIQUES
in scheme: Commande publique
in scheme: Gestion Publique
notation: REFIP1199

déclaration de créances
type: ConceptReFip
type: Concept
broader: recouvrement
definition: Formalité obligatoire pour les créanciers d'un débiteur qui fait l'objet d'une procédure de sauvegarde, de redressement ou de liquidation judiciaire afin de pouvoir prétendre et participer à la répartition des dividendes le cas échéant. au titre du paiement des sommes qui leur sont dues.
in scheme: FINANCES PUBLIQUES
in scheme: Recouvrement
in scheme: Fiscalité
narrower: créance provisionnelle
narrower: admission de créance
narrower: refip-REFIP6998
narrower: refip-REFIP6999
notation: REFIP12

clause attributive de compétence
type: ConceptReFip
type: Concept
broader: droit des obligations et contrats (non-descripteur)
definition: Disposition contractuelle dans laquelle les parties conviennent de confier le règlement d'un litige à une juridiction qui n'est pas légalement compétente, qu'il s'agisse de compétence d'attribution ou de compétence territoriale.
in scheme: FINANCES PUBLIQUES
in scheme: Droit et Justice
in scheme: Divisions du Droit
in scheme: Droit Privé
notation: REFIP120

Comité interministériel de restructuration industrielle
type: ConceptReFip
type: Concept
alternative label: CIRI
broader: Direction générale du Trésor
definition: Organisme insterministériel ayant pour mission d'aider les entreprises en difficultés à élaborer et mettre en oeuvre des solutions permettant d'assurer leur pérennité et leur développement. Le CIRI est compétent pour étudier la restructuration des entreprises de plus de 400 salariés. Sa mission consiste à examiner les causes des difficultés d'adaptation de certaines entreprises industrielles à leur environnement ; et à susciter des partenaires existants ou potentiels de ces entreprises l'élaboration et la mise en oeuvre des mesures industrielles, sociales et financières visant à assurer leur redressement, le maintien d'emplois durables et leur contribution au développement économique, ou, à défaut, de provoquer la mise au point de mesures de conversion.
in scheme: FINANCES PUBLIQUES
in scheme: Organisation Structurelle de l'Etat
in scheme: Ministère
in scheme: Administration de L'Etat
notation: REFIP1200
related: difficulté financière

transport maritime
type: ConceptReFip
type: Concept
broader: refip-REFIP766
definition: Activité de transport par voies maritimes pour les marchandises et les personnes (traversées courtes et croisières).
in scheme: FINANCES PUBLIQUES
in scheme: Branche d'activité
in scheme: Questions Economiques
in scheme: Transports
narrower: navire
narrower: port
narrower: bateau de plaisance
narrower: marine marchande
notation: REFIP1201
related: domaine public maritime
related: grand port maritime

adresse
type: ConceptReFip
type: Concept
broader: mots outils (liste additive)
definition: Ensemble d'indications (rue, numéro, localité, département, pays, etc.) qui situent précisément le domicile de quelqu'un ou le siège d'une collectivité.
in scheme: FINANCES PUBLIQUES
in scheme: Mots Outils
notation: REFIP1202

Pôle national de soutien au réseau
type: ConceptReFip
type: Concept
alternative label: PNSR
broader: refip-REFIP895
definition: Structure ayant pour vocation d'apporter son soutien (juridique et technique) et son expertise dans différents domaines métiers, en répondant aux questions du réseau de la DGFIP et qui ne nécessitent pas une expertise de l'administration centrale. Bien que rattachée à une direction déconcentrée pour la gestion administrative, le pilotage de sa mission relève du point de vue fonctionnelle de l'administration centrale.
in scheme: FINANCES PUBLIQUES
in scheme: Organisation Structurelle de l'Etat
in scheme: Ministère
in scheme: Administration de L'Etat
narrower: Pôle national dématérialisation dans le secteur public local
narrower: Pôle national d'assistance aux comptables dans leurs relations avec le juge des comptes
narrower: Pôle national d'analyse financière du secteur public local analyse des risques des collectivités locales et agrégation territorialisée
narrower: Pôle national ressources humaines
narrower: Pôle national d'assistance informatique du secteur public local
narrower: Pôle national de soutien au réseau fonctions publiques territoriale et hospitalière
narrower: Pôle national de soutien au réseau comptabilité fiscalité intercommunalité
narrower: Pôle national gestion des patrimoines privés
narrower: Pôle national de soutien au réseau commande publique
narrower: refip-REFIP7125
narrower: refip-REFIP7179
narrower: refip-REFIP7180
narrower: refip-REFIP7181
narrower: refip-REFIP7241
notation: REFIP1203

application SAFRAN
type: ConceptReFip
type: Concept
alternative label: SAFRAN
broader: applications gestion publique (non-descripteur)
definition: Outil permettant la réalisation d'analyses financières rétrospective, prospective et la réalisation d'analyses consolidées pour les communes et les groupements de communes.
in scheme: FINANCES PUBLIQUES
in scheme: Applications Informatiques
in scheme: Applications gestion publique
notation: REFIP1204

fiche immobilisation en cours
type: ConceptReFip
type: Concept
alternative label: FIEC
broader: CHORUS (non-descripteur)
definition: Donnée de base qui permet de suivre et matérialiser un bien immobilisé, et de centraliser toutes les écritures relatives à une immobilisation. La fiche d'immobilisation en cours est créée pour une immobilisation non mise en service dans CHORUS.
in scheme: FINANCES PUBLIQUES
in scheme: Comptabilité publique
in scheme: Comptabilité
narrower: travaux en cours
notation: REFIP1205

nécessité absolue de service
type: ConceptReFip
type: Concept
broader: refip-REFIP6565
definition: Condition d’attribution à un agent d'un logement de fonction lorsqu'il ne peut accomplir normalement son service sans être logé dans les bâtiments où il doit exercer ses fonctions.
in scheme: FINANCES PUBLIQUES
in scheme: Gestion des ressources humaines
in scheme: Statut du fonctionnaire
in scheme: Fonction Publique et Gestion des Ressources Humaines
narrower: concession de logement
notation: REFIP1206

engagement de payer
type: ConceptReFip
type: Concept
broader: paiement de la dépense (non-descripteur)
definition: Effet qui constate l’engagement de payer une somme d’argent souscrit par l’émetteur.
in scheme: FINANCES PUBLIQUES
in scheme: Dépenses publiques
in scheme: Gestion Publique
notation: REFIP1207

fonds de correction des déséquilibres régionaux
type: ConceptReFip
type: Concept
broader: fonds (non-descripteur)
definition: Fonds alimenté par un prélèvement sur les recettes fiscales de certaines régions. Il est destiné à éviter l'aggravation des disparités régionales.
in scheme: FINANCES PUBLIQUES
in scheme: Dépenses publiques
in scheme: Gestion Publique
notation: REFIP1208

Seine-Maritime
type: ConceptReFip
type: Concept
broader: refip-REFIP7016
definition: Département français
in scheme: FINANCES PUBLIQUES
in scheme: Géographie
in scheme: Europe
notation: REFIP121

bonus pour l'acquisition d'un véhicule propre
type: ConceptReFip
type: Concept
alternative label: bonus écologique
broader: aide aux particuliers (non-descripteur)
definition: Dispositif qui allège le prix d'une automobile neuve remplissant certaines conditions.
in scheme: FINANCES PUBLIQUES
in scheme: Dépenses publiques
in scheme: Gestion Publique
notation: REFIP1211

hypothèque rechargeable
type: ConceptReFip
type: Concept
broader: hypothèque conventionnelle
definition: Hypothèque permettant au constituant de l'hypothèque originelle d'affecter son hypothèque à la garantie de créances autres que celles mentionnées par l'acte constitutif pourvu que celui-ci le prévoit expressément, dans la limite de la somme déterminée dans l'acte constitutif.
in scheme: FINANCES PUBLIQUES
in scheme: Recouvrement
in scheme: Fiscalité
notation: REFIP1212

amende forfaitaire
type: ConceptReFip
type: Concept
broader: amende
definition: Condamnation suite à une infraction au paiement d'une contravention des 4 premières classes pour éviter des poursuites pénales.
in scheme: FINANCES PUBLIQUES
in scheme: Droit et Justice
in scheme: Sanction
in scheme: Infractions et Sanctions
narrower: amende forfaitaire majorée
notation: REFIP1214

Loiret
type: ConceptReFip
type: Concept
broader: Centre-Val de Loire
definition: Département français
in scheme: FINANCES PUBLIQUES
in scheme: Géographie
in scheme: Europe
notation: REFIP1216

Pôle de topographie et de gestion cadastrale
type: ConceptReFip
type: Concept
alternative label: PTGC
broader: direction départementale des finances publiques
definition: Pôle assurant la mission topographique, l’accueil et la délivrance de la documentation cadastrale aux usagers professionnels et la gestion administrative dans MAJIC2 relative aux aspects topographiques ou nécessitant une participation du gestionnaire du plan. Par ailleurs, il assure des prestations de service pour des travaux fiscaux nécessitant un déplacement sur le terrain.
in scheme: FINANCES PUBLIQUES
in scheme: Organisation Structurelle de l'Etat
in scheme: Ministère
in scheme: Administration de L'Etat
notation: REFIP1217

Haute-Saône
type: ConceptReFip
type: Concept
broader: refip-REFIP7017
definition: Département français
in scheme: FINANCES PUBLIQUES
in scheme: Géographie
in scheme: Europe
notation: REFIP1220

transfert de mission
type: ConceptReFip
type: Concept
broader: réforme de l'Etat
definition: Abandon de la part d'une entité d'une mission à une autre entité dans le cadre d'une restructuration (fusion de services, de directions, de communes...).
in scheme: FINANCES PUBLIQUES
in scheme: Etat
in scheme: Réforme de l'Etat
in scheme: Administration de L'Etat
notation: REFIP1221

application AGORA DECISIONNEL
type: ConceptReFip
type: Concept
alternative label: AGD
alternative label: AGORA DECISIONNEL
alternative label: application AGORA DEC
alternative label: infocentre RHB
broader: applications missions transverses (non-descripteur)
definition: Infocentre décisionnel dans le domaine de la gestion des ressources humaines permettant de consulter et d'analyser les informations contenues au sein du système de gestion Agora.
in scheme: FINANCES PUBLIQUES
in scheme: Applications missions transverses
in scheme: Applications Informatiques
notation: REFIP1222
scope note: Remplacée par l'application SIRHIUS décisionnel à compter du 08/02/19

Ecole de formation maritime et aquacole
type: ConceptReFip
type: Concept
broader: lycée
definition: Lycée professionnel privé situé à La Trinité, en Martinique. Sa mission est d'assurer la formation professionnelle des métiers de la mer.
in scheme: FINANCES PUBLIQUES
in scheme: Organisation Territoriale
in scheme: Structures Territoriales
in scheme: Administration de L'Etat
notation: REFIP1225

trésorerie militaire
type: ConceptReFip
type: Concept
broader: refip-REFIP7076
definition: Etablissement dépendant des Forces Armées ayant pour mission l'encaissement des recettes et le décaissement des dépenses dont elles ont la charge, la garde et la conservation des fonds et des valeurs qui leur sont confiés, le maniement des fonds et les mouvements de comptes de disponibilités, la tenue de la comptabilité des opérations, la conservation des pièces justificatives ainsi que des documents de comptabilité.
in scheme: FINANCES PUBLIQUES
in scheme: Organisation Structurelle de l'Etat
in scheme: Ministère
in scheme: Administration de L'Etat
notation: REFIP1228

système d'acquisition dynamique
type: ConceptReFip
type: Concept
alternative label: SAD
broader: passation des marchés publics
definition: Processus entièrement électronique de passation de marché public, pour des achats d’usage courant, par lequel l’acheteur attribue, après mise en concurrence, un ou plusieurs marchés spécifiques à l’un des opérateurs économiques préalablement sélectionnés.
in scheme: FINANCES PUBLIQUES
in scheme: Commande publique
in scheme: Gestion Publique
notation: REFIP1229

navire
type: ConceptReFip
type: Concept
alternative label: bateau
broader: transport maritime
definition: Bateau destiné à la navigation maritime.
in scheme: FINANCES PUBLIQUES
in scheme: Branche d'activité
in scheme: Questions Economiques
in scheme: Transports
narrower: épave
notation: REFIP123

logiciel produit en interne
type: ConceptReFip
type: Concept
alternative label: LPI
broader: refip-REFIP98
definition: Logiciel créé par des équipes internes pour satisfaire aux besoins des utilisateurs publics.
in scheme: FINANCES PUBLIQUES
in scheme: Informatique
in scheme: Communication Documentation Informatique
notation: REFIP1230

mise en demeure
type: ConceptReFip
type: Concept
broader: document
definition: Acte par lequel l'administration demande à un contribuable d'exécuter ses obligations dans les délais impartis, notamment souscrire une déclaration.
in scheme: FINANCES PUBLIQUES
in scheme: Documentation
in scheme: Communication Documentation Informatique
notation: REFIP1231

redevable
type: ConceptReFip
type: Concept
broader: assujetti
definition: Personne légalement tenue au paiement d'un impôt, taxe, droit, redevance.
in scheme: FINANCES PUBLIQUES
in scheme: Champ d'Application
in scheme: Fiscalité
notation: REFIP1232
scope note: Personne physique ou morale qui verse l'impôt

obligation solidaire
type: ConceptReFip
type: Concept
alternative label: obligation in solidum
broader: responsabilité solidaire
definition: Chaque débiteur est tenu de payer l'intégralité de la dette dans les rapports avec le créancier commun.
in scheme: FINANCES PUBLIQUES
in scheme: Droit et Justice
in scheme: Divisions du Droit
in scheme: Droit Privé
notation: REFIP1233

compte d'avance
type: ConceptReFip
type: Concept
broader: comptabilité générale de l'Etat
definition: Compte retraçant les avances faites par l’État à des collectivités, organismes ou personnes privées.
in scheme: FINANCES PUBLIQUES
in scheme: Comptabilité générale de l'Etat
in scheme: Comptabilité
notation: REFIP1234

facture pro forma
type: ConceptReFip
type: Concept
broader: facture
definition: Document provisoire, sans valeur comptable, tenant lieu de proposition d'offre commerciale, précisant des quantités, des prix et des conditions de vente. Elle n'engage pas son destinataire. Peut servir de base au bon de commande.
in scheme: FINANCES PUBLIQUES
in scheme: Documents comptables
in scheme: Comptabilité
notation: REFIP1236

concession
type: ConceptReFip
type: Concept
broader: droit administratif
definition: Contrat entre l'Administration et une personne privée par lequel la première autorise la seconde, moyennant une rémunération, à occuper un domaine public ou à effectuer un ouvrage public.
in scheme: FINANCES PUBLIQUES
in scheme: Droit et Justice
in scheme: Divisions du Droit
in scheme: Droit Public
notation: REFIP1237

rapport économique social et financier
type: ConceptReFip
type: Concept
alternative label: RESF
broader: refip-REFIP982
definition: Document présentant la situation et les perspectives économiques, sociales et financières de la nation. Il comprend notamment la présentation des hypothèses, des méthodes et des résultats des projections sur la base desquelles est établi le projet de loi de finances de l'année.
in scheme: FINANCES PUBLIQUES
in scheme: Documentation budgétaire
in scheme: Budget
notation: REFIP1239

application TSE
type: ConceptReFip
type: Concept
alternative label: transparence structure écran
broader: applications fiscales (non-descripteur)
definition: Base nationale de restitution des liens d'associés et de dirigeants entre les sociétés d'une part, et les personnes morales et physiques d'autre part.
in scheme: FINANCES PUBLIQUES
in scheme: Applications Informatiques
in scheme: Applications fiscales
notation: REFIP124

commission administrative paritaire
type: ConceptReFip
type: Concept
broader: organisme consultatif et représentatif (non-descripteur)
definition: Organe de représentation des agents titulaires de la fonction publique. Les commissions administratives paritaires sont chargées d'examiner des situations individuelles, mais elles soumettent aussi parfois des motions à caractère collectif. Les décisions de la CAP n'ont qu'un caractère consultatif auprès de l'autorité employeur.
in scheme: FINANCES PUBLIQUES
in scheme: Organisation Structurelle de l'Etat
in scheme: Organisme Consultatif et Représentatif
in scheme: Administration de L'Etat
notation: REFIP1240
related: refip-REFIP6578

Val-d'Oise
type: ConceptReFip
type: Concept
broader: Ile-de-France
definition: Département français
in scheme: FINANCES PUBLIQUES
in scheme: Géographie
in scheme: Europe
notation: REFIP1241

réforme des retraites
type: ConceptReFip
type: Concept
broader: réforme de l'Etat
definition: Réforme visant à réduire le déficit des différents régimes de retraite à travers différents aménagements et dispositifs affectant tous les assurés.
in scheme: FINANCES PUBLIQUES
in scheme: Etat
in scheme: Réforme de l'Etat
in scheme: Administration de L'Etat
notation: REFIP1242

bordereau
type: ConceptReFip
type: Concept
broader: documents comptables
definition: Document d'enregistrement, relevé détaillé des divers articles dont se compose une somme à payer ou à recevoir.
in scheme: FINANCES PUBLIQUES
in scheme: Documents comptables
in scheme: Comptabilité
notation: REFIP1243

amiante
type: ConceptReFip
type: Concept
broader: pollution
definition: Minéraux toxiques à texture fibreuse utilisés notamment dans l’industrie.
in scheme: FINANCES PUBLIQUES
in scheme: Environnement
in scheme: Dégradation de l'Environnement
in scheme: Questions de Société
notation: REFIP1244

classement
type: ConceptReFip
type: Concept
broader: documentation
definition: Processus qui consiste à classer, trier, un ensemble d'éléments selon un ou des critères préexistants.
in scheme: FINANCES PUBLIQUES
in scheme: Documentation
in scheme: Communication Documentation Informatique
narrower: plan de classement
narrower: codification
narrower: système normalisé de numérotation
narrower: nomenclature
notation: REFIP1245

bien mobilier d'investissement
type: ConceptReFip
type: Concept
broader: dépenses d'investissement
definition: Bien meuble acquis dans le but de réaliser un investissement.
in scheme: FINANCES PUBLIQUES
in scheme: Dépenses publiques
in scheme: Gestion Publique
notation: REFIP1247

bien d'occasion
type: ConceptReFip
type: Concept
broader: fiscalité des professionnels
definition: Bien meuble corporel susceptible de remploi, en l'état ou après réparation, et ayant fait l'objet d'une première utilisation.
in scheme: FINANCES PUBLIQUES
in scheme: Champ d'Application
in scheme: Fiscalité
notation: REFIP1249

taxe sur les services d'information ou interactifs à caractère pornographique
type: ConceptReFip
type: Concept
broader: refip-REFIP934
definition: Taxe sur les personnes qui fournissent au public, par l'intermédiaire du réseau téléphonique, des services d'informations ou des services interactifs à caractère pornographique, et faisant l'objet d'une publicité sous quelque forme que ce soit.
in scheme: FINANCES PUBLIQUES
in scheme: Fiscalité
in scheme: Impôt
notation: REFIP125

caution solidaire
type: ConceptReFip
type: Concept
broader: caution
definition: Personne qui s'engage envers le créancier qui, renonçant au bénéfice de discussion (sans attendre de poursuites envers le débiteur principal) et de division (s'il y a plusieurs cautions), devient envers le créancier codébiteur solidaire.
in scheme: FINANCES PUBLIQUES
in scheme: Recouvrement
in scheme: Fiscalité
notation: REFIP1250

Agence nationale des titres sécurisés
type: ConceptReFip
type: Concept
alternative label: ANTS
broader: établissement public à caractère administratif
definition: Etablissement public administratif ayant pour mission de répondre aux besoins des administrations de l’État en matière de titres sécurisés comme le certificat d'immatriculation et le passeport biométrique.
in scheme: FINANCES PUBLIQUES
in scheme: Organisation Structurelle de l'Etat
in scheme: Opérateur de l'Etat
in scheme: Administration de L'Etat
notation: REFIP1251

avis de la Commission d'appel d'offres (supprimé)
type: ConceptReFip
type: Concept
broader: ZZ
in scheme: FINANCES PUBLIQUES
notation: REFIP1252

gardiennage
type: ConceptReFip
type: Concept
alternative label: service de gardiennage
alternative label: société de gardiennage
broader: services et professions libérales (non-descripteur)
definition: Service de protection fournis par du personnel recruté spécialement pour assurer la sécurité des personnes ou de bâtiments privés, commerciaux ou industriels, notamment les protéger contre le feu, le vol, le vandalisme ou toute intrusion.
in scheme: FINANCES PUBLIQUES
in scheme: Branche d'activité
in scheme: Questions Economiques
in scheme: Services et professions libérales
narrower: vigile
notation: REFIP1254
related: gardien de nuit
related: gardien d'immeuble

droit de mutation à titre onéreux
type: ConceptReFip
type: Concept
alternative label: DMTO
broader: droit de mutation
definition: Droit d'enregistrement perçu par l'État sur les transferts de propriétés à titre onéreux (vente, échange etc.).
in scheme: FINANCES PUBLIQUES
in scheme: Fiscalité
in scheme: Impôt
notation: REFIP1255

application OASIS
type: ConceptReFip
type: Concept
broader: applications fiscales (non-descripteur)
definition: Application permettant la sélection et l'analyse des liasses fiscales et TVA afin de programmer des contrôles fiscaux.
in scheme: FINANCES PUBLIQUES
in scheme: Applications Informatiques
in scheme: Applications fiscales
notation: REFIP1257

université
type: ConceptReFip
type: Concept
broader: établissement public à caractère scientifique culturel et professionnel
definition: Établissement d'enseignement supérieur.
in scheme: FINANCES PUBLIQUES
in scheme: Organisation Structurelle de l'Etat
in scheme: Opérateur de l'Etat
in scheme: Administration de L'Etat
notation: REFIP1259

poursuites
type: ConceptReFip
type: Concept
alternative label: acte de poursuite
broader: recouvrement
definition: Ensemble des actions exercées à l'encontre d'un contribuable n'ayant pas acquitté spontanément à l'échéance prévue par les textes les montants dus, poursuites engagées par les comptables publics chargés du recouvrement forcé.
in scheme: FINANCES PUBLIQUES
in scheme: Recouvrement
in scheme: Fiscalité
narrower: frais de poursuites
narrower: saisie
narrower: opposition à tiers détenteur
narrower: avis à tiers détenteur
narrower: empêchement à poursuites
narrower: schéma des poursuites
narrower: suspension des poursuites
narrower: avertissement de payer
narrower: mise en demeure de payer
narrower: refip-REFIP87
notation: REFIP126

redevance sanitaire
type: ConceptReFip
type: Concept
alternative label: redevance sanitaire d'abattage
alternative label: redevance sanitaire de découpage
alternative label: redevance sanitaire pour le contrôle de certaines substances et de leurs résidus
broader: refip-REFIP934
definition: Redevance déclarée et liquidée sur les déclarations de TVA. Il existe différences redevances sanitaires : la redevance sanitaire de découpage, la redevance sanitaire d'abattage, la redevance sanitaire sur certaines substances et résidus et la redevance sanitaire de 1ere mise sur le marché pour les produits de la pêche et de l'aquaculture.
in scheme: FINANCES PUBLIQUES
in scheme: Fiscalité
in scheme: Impôt
notation: REFIP1261

Direction de la législation fiscale
type: ConceptReFip
type: Concept
alternative label: DLF
broader: Ministère de l'Economie et des Finances
definition: Direction de la DGFIP, la DLF conçoit et élabore les dispositions législatives et réglementaires à caractère fiscal ainsi que les instructions nécessaires à leur application. Elle intervient dans l’ensemble du processus de création des normes fiscales, participe aux travaux interministériels et aux réunions préparatoires au Conseil d’Etat, assiste le gouvernement au cours des débats parlementaires, notamment ceux portant sur la loi de finances. Elle représente la France dans les négociations fiscales au sein de l’Union européenne et de l’OCDE et négocie les conventions fiscales internationales et assure leur suivi.
in scheme: FINANCES PUBLIQUES
in scheme: Organisation Structurelle de l'Etat
in scheme: Ministère
in scheme: Administration de L'Etat
notation: REFIP1262

condition de fond
type: ConceptReFip
type: Concept
broader: droit civil
definition: Condition relative au contenu même de l'acte juridique.
in scheme: FINANCES PUBLIQUES
in scheme: Droit et Justice
in scheme: Divisions du Droit
in scheme: Droit Privé
notation: REFIP1263

Corée du Sud
type: ConceptReFip
type: Concept
alternative label: République de Corée
broader: Asie
definition: Pays
in scheme: FINANCES PUBLIQUES
in scheme: Géographie
in scheme: Asie
notation: REFIP1264

Lot
type: ConceptReFip
type: Concept
broader: refip-REFIP7036
definition: Département français
in scheme: FINANCES PUBLIQUES
in scheme: Géographie
in scheme: Europe
notation: REFIP1265
scope note: Département

dissimulation de prix
type: ConceptReFip
type: Concept
broader: fraude fiscale
definition: La dissimulation du prix est le fait d'indiquer dans l'acte un prix inférieur à celui réellement payé par l’acquéreur. La fraude est manifeste.
in scheme: FINANCES PUBLIQUES
in scheme: Droit de Contrôle de l'Administration
in scheme: Fiscalité
notation: REFIP1266

application DVF
type: ConceptReFip
type: Concept
alternative label: DVF
alternative label: demande de valeurs foncières
broader: applications gestion publique (non-descripteur)
definition: Base de données mise à disposition des collectivités territoriales, établissements publics et institutionnels permettant d'obtenir des données foncières relevant de leur périmètre géographique pour conduire leur politique foncière et d'aménagement
in scheme: FINANCES PUBLIQUES
in scheme: Applications Informatiques
in scheme: Applications gestion publique
notation: REFIP1267

Office public de l'habitat
type: ConceptReFip
type: Concept
alternative label: OPAC
alternative label: OPH
alternative label: OPHLM
alternative label: Office public d'aménagement et de construction
alternative label: Office public d'habitations à loyer modéré
broader: établissement public à caractère industriel et commercial
definition: Etablissement public industriel et commercial rattaché soit à un établissement public de coopération intercommunale compétent en matière d’habitat, soit à un département soit encore à une commune. L'office public de l'habitat effectue des opérations de construction et de gestion d’immeubles, d’interventions foncières, d’actions ou d'opérations d’aménagement et de prestations de services.
in scheme: FINANCES PUBLIQUES
in scheme: Organisation Structurelle de l'Etat
in scheme: Opérateur de l'Etat
in scheme: Administration de L'Etat
notation: REFIP1269
scope note: Les OPHLM et OPAC sont devenus depuis le 03/02/2007 des offices publics de l'habitat

application PLATINE
type: ConceptReFip
type: Concept
broader: applications gestion publique (non-descripteur)
definition: Outil permettant la gestion et la tenue des comptes titres utilisés dans chaque DDFIP par le service Dépôt et Service Financier.
in scheme: FINANCES PUBLIQUES
in scheme: Applications Informatiques
in scheme: Applications gestion publique
notation: REFIP127

responsabilité de l'ordonnateur
type: ConceptReFip
type: Concept
in scheme: FINANCES PUBLIQUES
in scheme: Missions Transverses des Finances publiques
in scheme: Responsabilité de l'ordonnateur
notation: REFIP1270

société de capital risque
type: ConceptReFip
type: Concept
alternative label: SCR
broader: société de capitaux
definition: Société par actions dont les actionnaires sont des investisseurs en capital et qui a pour objet social de prendre des participations minoritaires dans les sociétés non cotées au moment de leur création et pendant leur tout premier développement, dans le but de dégager à moyen terme une plus-value très substantielle en revendant ces participations.
in scheme: FINANCES PUBLIQUES
in scheme: Société
in scheme: Entreprises
in scheme: Forme juridique
notation: REFIP1272

Code général de la propriété des personnes publiques
type: ConceptReFip
type: Concept
broader: documentation juridique (non-descripteur)
definition: Regroupe les lois relatives au droit général de la propriété des personnes publiques français. Relatif au droit concernant les biens et les droits, à caractère mobilier ou immobilier, appartenant à une personne publique : il peut s'agir de l'État, des collectivités territoriales et leurs groupements, ou les établissements publics. Il précise notamment les procédures d'acquisition, la gestion des biens du domaine public, ou les cas de sessions de biens relevant du domaine public français.
in scheme: FINANCES PUBLIQUES
in scheme: Droit et Justice
in scheme: Documentation Juridique
in scheme: Sources du Droit
notation: REFIP1274

bureau d'étude
type: ConceptReFip
type: Concept
broader: services et professions libérales (non-descripteur)
definition: Structure où sont réalisées des expertises à caractère scientifique et/ou technique, généralement sous la responsabilité d'un ingénieur.
in scheme: FINANCES PUBLIQUES
in scheme: Branche d'activité
in scheme: Questions Economiques
in scheme: Services et professions libérales
notation: REFIP1275

délai global de paiement
type: ConceptReFip
type: Concept
broader: paiement de la dépense (non-descripteur)
definition: Délai couvrant l'intégralité de la chaîne de la dépense. Il court de la date de réception de la facture (ou constatation du service fait si celui-ci est postérieur) à la date de rapprochement de la demande de paiement par le contrôleur de règlement auquel s'ajoute le délai bancaire.
in scheme: FINANCES PUBLIQUES
in scheme: Dépenses publiques
in scheme: Gestion Publique
notation: REFIP1276

comptabilité occulte
type: ConceptReFip
type: Concept
broader: fraude fiscale
definition: Comptabilité secrète, qui échappe à tout contrôle.
in scheme: FINANCES PUBLIQUES
in scheme: Droit de Contrôle de l'Administration
in scheme: Fiscalité
notation: REFIP1277

mandatement d'office
type: ConceptReFip
type: Concept
broader: mandatement
definition: Décision de l'autorité supérieure qui se substitue à une autorité décentralisée ayant refusé d'ordonnancer une dépense régulièrement autorisée et liquidée.
in scheme: FINANCES PUBLIQUES
in scheme: Dépenses publiques
in scheme: Gestion Publique
notation: REFIP1278

accord amiable
type: ConceptReFip
type: Concept
alternative label: arrangement amiable
broader: procédure civile
definition: Entente, à portée juridique, obtenue par la conciliation directe entre deux parties pour régler un différend. Une convention écrite devra être signée une fois l'accord trouvé. Il peut éviter un procès.
in scheme: FINANCES PUBLIQUES
in scheme: Procédure Civile
in scheme: Droit et Justice
in scheme: Procédure
narrower: transaction
notation: REFIP1279

comptabilité de caisse
type: ConceptReFip
type: Concept
broader: comptabilité publique
definition: Type de comptabilité tenue en partie simple retraçant les recettes et dépenses.
in scheme: FINANCES PUBLIQUES
in scheme: Comptabilité publique
in scheme: Comptabilité
narrower: encaissement
narrower: dégagement de caisse
narrower: approvisionnement de caisse
narrower: unité de caisse
narrower: encaisse
narrower: maniement de fonds
narrower: recettes au comptant
narrower: refip-REFIP82
narrower: refip-REFIP985
notation: REFIP128

dévolution
type: ConceptReFip
type: Concept
broader: droit successoral
definition: Passage d'un droit, d'un bien ou d'un ensemble de biens composant un patrimoine dans un ou plusieurs autres patrimoines.
in scheme: FINANCES PUBLIQUES
in scheme: Droit et Justice
in scheme: Divisions du Droit
in scheme: Droit Privé
narrower: dévolution successorale
notation: REFIP1283

conjoint de l'exploitant
type: ConceptReFip
type: Concept
alternative label: conjoint associé
alternative label: conjoint collaborateur
alternative label: conjoint salarié
broader: droit commercial
definition: Si l'époux(se) ou le partenaire de pacs du chef d'entreprise travaille dans l'entreprise artisanale, commerciale ou libérale de ce dernier, il doit obligatoirement choisir le statut qui déterminera ses droits et obligations professionnels et sociaux : collaborateur, associé ou salarié. Lors de l'immatriculation de l'entreprise, le chef d'entreprise déclare le statut choisi par son époux(se) ou partenaire de pacs.
in scheme: FINANCES PUBLIQUES
in scheme: Droit et Justice
in scheme: Divisions du Droit
in scheme: Droit Privé
notation: REFIP1284

Aude
type: ConceptReFip
type: Concept
broader: refip-REFIP7036
definition: Département français
in scheme: FINANCES PUBLIQUES
in scheme: Géographie
in scheme: Europe
notation: REFIP1285

séparation de biens
type: ConceptReFip
type: Concept
broader: régime matrimonial
definition: Régime matrimonial caractérisé par l'absence de biens communs aux deux époux et où chacun conserve l'administration, la jouissance et la libre disposition de tous ses biens personnels, sous l'obligation de contribuer aux charges du mariage. Ce régime est soit conventionnel (contrat de mariage), soit judiciaire (décision lorsque la conduite de l'un des époux met en péril les intérêts de l'autre conjoint).
in scheme: FINANCES PUBLIQUES
in scheme: Droit et Justice
in scheme: Divisions du Droit
in scheme: Droit Privé
notation: REFIP1287

fibre optique
type: ConceptReFip
type: Concept
broader: refip-REFIP739
definition: Support qui achemine en très haut débit les données numériques sous forme d'impulsions lumineuses modulées.
in scheme: FINANCES PUBLIQUES
in scheme: Communication
in scheme: Communication Documentation Informatique
notation: REFIP1288

apport partiel d'actif
type: ConceptReFip
type: Concept
alternative label: apport d'une partie des éléments d'actif
broader: refip-REFIP998
definition: Opération qui consiste, pour une société à apporter à une autre société (nouvelle ou existante) (société bénéficiaire de l’apport) une partie de ses éléments d’actif et de passif. La société reçoit, en rémunération de cet apport en nature, des titres composant le capital de la société bénéficiaire de l'apport, que cette dernière émettra au moyen d’une augmentation de capital.
in scheme: FINANCES PUBLIQUES
in scheme: Gestion de l'Entreprise
in scheme: Entreprises
in scheme: Vie et Gestion de l'entreprise
notation: REFIP1289
related: fusion de sociétés

Japon
type: ConceptReFip
type: Concept
broader: Asie
definition: Pays
in scheme: FINANCES PUBLIQUES
in scheme: Géographie
in scheme: Asie
notation: REFIP129

Union de recouvrement des cotisations de sécurité sociale et d'allocations familiales
type: ConceptReFip
type: Concept
alternative label: URSSAF
broader: organisme de sécurité sociale
definition: Organisme gouvernemental et officiel qui se charge de collecter les cotisations et contributions sociales des entreprises dans le but d’assurer la gestion de la trésorerie de la Sécurité Sociale.
in scheme: FINANCES PUBLIQUES
in scheme: Organisation Structurelle de l'Etat
in scheme: Organisme de Sécurité Sociale
in scheme: Administration de L'Etat
notation: REFIP1290

contrôle interne de deuxième niveau
type: ConceptReFip
type: Concept
alternative label: contrôle de corroboration
broader: contrôle interne
definition: Contrôle réalisé par le 2ème niveau de contrôle interne afin de s’assurer de l’effectivité et de la qualité des contrôles exercés au 1er niveau et qui consiste à fiabiliser les constats opérés par l’encadrement dans l’exercice de ses contrôles de supervision.
in scheme: FINANCES PUBLIQUES
in scheme: Missions Transverses des Finances publiques
in scheme: Maîtrise des risques
notation: REFIP1291

régie
type: ConceptReFip
type: Concept
broader: contrat et mode de gestion (non-descripteur)
definition: Mode de gestion d'un service, permet le paiement des dépenses et/ou l'encaissement de recettes jusqu'à un certain seuil.
in scheme: FINANCES PUBLIQUES
in scheme: Secteur public local
in scheme: Gestion Publique
narrower: régie de transport
narrower: régie d'avances et de recettes
narrower: régie intéressée
narrower: travaux en régie
narrower: régie dotée de la personnalité morale et de l'autonomie financière
narrower: reprise en régie d'un service public délégué
narrower: régie personnalisée
narrower: régie directe
narrower: régie industrielle des établissements pénitentiaires
narrower: régie municipale
narrower: régie d'avances
narrower: avance au régisseur
narrower: compte nominatif
narrower: régie de recettes
narrower: refip-REFIP691
narrower: refip-REFIP7226
notation: REFIP1292

conservation du cadastre
type: ConceptReFip
type: Concept
alternative label: conservation cadastrale
broader: cadastre
definition: Mission des services du cadastre qui a pour objet de tenir la documentation à jour de toutes les modifications constatées dans la situation des biens et des propriétaires. Son exécution obéit à des sujétions particulières qui tiennent à l'existence du fichier immobilier des conservations des hypothèques.
in scheme: FINANCES PUBLIQUES
in scheme: Cadastre
in scheme: Fiscalité
narrower: conservation des réquisitions
notation: REFIP1293

délai d'appel
type: ConceptReFip
type: Concept
broader: appel en justice
definition: Délai ouvert pour former un recours contre une décision de justice devant une juridiction du second degré. Le délai d'appel varie suivant les affaires, entre 10 jours et 1 mois. Le délai court à compter de la signification de la décision par huissier, de sa notification par le greffe ou du prononcé de la décision en audience publique. La décision devient définitive une fois le délai expiré. Tant que le délai n'est pas expiré, le jugement ne peut pas, sauf exception, être exécuté.
in scheme: FINANCES PUBLIQUES
in scheme: Principes Généraux
in scheme: Droit et Justice
in scheme: Procédure
notation: REFIP1294

charge déductible
type: ConceptReFip
type: Concept
replaces: achat déductible (obsolète)
broader: frais déductibles
definition: Dépense qui vient en diminution de la base d’imposition de l’Impôt en application des articles du CGI qui définissent ou prévoient les conditions, limitations, restrictions et régularisations prévues pour l'exercice du droit à déduction.
in scheme: FINANCES PUBLIQUES
in scheme: Liquidation de l'Impôt
in scheme: Fiscalité
narrower: impôt déductible
notation: REFIP1295

indivisibilité
type: ConceptReFip
type: Concept
broader: droit civil
definition: État de ce qui ne peut être divisé et doit être envisagé dans son ensemble.
in scheme: FINANCES PUBLIQUES
in scheme: Droit et Justice
in scheme: Divisions du Droit
in scheme: Droit Privé
notation: REFIP1296

Moldavie
type: ConceptReFip
type: Concept
alternative label: République de Moldavie
broader: Europe
definition: Pays
in scheme: FINANCES PUBLIQUES
in scheme: Géographie
in scheme: Europe
notation: REFIP1297

application FIC-SPE (supprimé)
type: ConceptReFip
type: Concept
broader: ZZ
in scheme: FINANCES PUBLIQUES
notation: REFIP1299

Saint-Pierre-et-Miquelon
type: ConceptReFip
type: Concept
broader: collectivités et territoires d'outre mer (non-descripteur)
definition: Collectivité d'outre-mer
in scheme: FINANCES PUBLIQUES
in scheme: Géographie
in scheme: Europe
notation: REFIP13

guide méthodologique
type: ConceptReFip
type: Concept
alternative label: méthode
alternative label: méthodologie
broader: document
definition: Document présentant la ou les différentes méthodes à mettre en œuvre.
in scheme: FINANCES PUBLIQUES
in scheme: Documentation
in scheme: Communication Documentation Informatique
notation: REFIP1300

pêche
type: ConceptReFip
type: Concept
alternative label: chalutier
alternative label: flotte de pêche
alternative label: navire de pêche
broader: agriculture
definition: Activité consistant à capturer des animaux aquatiques dans leur milieu naturel, elle est pratiquée par les pêcheurs, comme loisir ou profession.
in scheme: FINANCES PUBLIQUES
in scheme: Branche d'activité
in scheme: Questions Economiques
in scheme: Agriculture
narrower: artisan pêcheur
notation: REFIP1304
related: port

casier judiciaire
type: ConceptReFip
type: Concept
broader: droit pénal
definition: Relevé national et automatisé des condamnations pénales et de certaines autres décisions.
in scheme: FINANCES PUBLIQUES
in scheme: Droit et Justice
in scheme: Divisions du Droit
in scheme: Droit Public
notation: REFIP1305

enveloppe budgétaire
type: ConceptReFip
type: Concept
broader: exécution du budget
definition: Montant global des crédits alloués à un budget.
in scheme: FINANCES PUBLIQUES
in scheme: Exécution du budget
in scheme: Budget
notation: REFIP1306

application AGRI VITI
type: ConceptReFip
type: Concept
broader: applications fiscales (non-descripteur)
definition: Permet l'obtention automatique, à partir d'éléments stockés dans des fichiers, du montant du bénéfice forfaitaire qu'un agriculteur doit déclarer.
in scheme: FINANCES PUBLIQUES
in scheme: Applications Informatiques
in scheme: Applications fiscales
notation: REFIP1307

Caisse de garantie du logement locatif social
type: ConceptReFip
type: Concept
alternative label: CGLLS
broader: établissement public à caractère administratif
definition: Etablissement public à caractère administratif, opérateur de l’Etat, et une société de financement, chargée de garantir les prêts réglementés accordés par la Caisse des dépôts et consignations aux bailleurs sociaux, en l’absence d’une garantie des collectivités territoriales et de prévenir les difficultés financières des bailleurs sociaux et aider au rétablissement de leur équilibre.
in scheme: FINANCES PUBLIQUES
in scheme: Organisation Structurelle de l'Etat
in scheme: Opérateur de l'Etat
in scheme: Administration de L'Etat
notation: REFIP1308

flux de trésorerie
type: ConceptReFip
type: Concept
broader: refip-REFIP788
definition: Mesure de performance financière indiquant les montants de liquidités encaissés ou dépensés par une entité durant une période donnée.
in scheme: FINANCES PUBLIQUES
in scheme: Analyse financière
in scheme: Comptabilité
narrower: valeur actuelle nette
notation: REFIP1309

groupement de commandes
type: ConceptReFip
type: Concept
broader: marché public
definition: Association contractuelle de personnes morales de droit public à fin de mutualisation de leurs achats et de passation de marchés en commun par le biais d'une procédure de passation unique.
in scheme: FINANCES PUBLIQUES
in scheme: Commande publique
in scheme: Gestion Publique
notation: REFIP131

livraison à soi-même
type: ConceptReFip
type: Concept
alternative label: LASM
broader: fiscalité des professionnels
definition: Opération par laquelle une personne obtient, avec ou sans le concours de tiers, un bien ou une prestation de services à partir de biens ou de moyens lui appartenant.
in scheme: FINANCES PUBLIQUES
in scheme: Champ d'Application
in scheme: Fiscalité
notation: REFIP1310

solde comptable
type: ConceptReFip
type: Concept
broader: compte comptable
definition: Différence entre les valeurs totales des entrées dans les deux parties d’un compte.
in scheme: FINANCES PUBLIQUES
in scheme: Documents comptables
in scheme: Comptabilité
notation: REFIP1312

usurpation
type: ConceptReFip
type: Concept
alternative label: usurpation d'identité
alternative label: usurpation de fonctions
alternative label: usurpation de titre
broader: fraude
definition: Infraction consistant à s'approprier sans droit une fonction, un signe, un titre, une identité ou une qualité dans le but d'entraîner une confusion entre des activités privées et celles réservées à l'administration publique ou exercées sous son contrôle.
in scheme: FINANCES PUBLIQUES
in scheme: Droit et Justice
in scheme: Infractions et Sanctions
in scheme: Infraction
notation: REFIP1313

régime simplifié du micro-foncier
type: ConceptReFip
type: Concept
alternative label: micro-foncier
broader: régime d'imposition
definition: Régime fiscal des contribuables titulaires de revenus fonciers de faible montant, dénommé “micro-foncier”. Ils disposent d'obligations déclaratives allégées et leurs revenus fonciers sont imposés après application d'un abattement forfaitaire.
in scheme: FINANCES PUBLIQUES
in scheme: Régime d'Imposition
in scheme: Fiscalité
notation: REFIP1314

bien en transit (supprimé)
type: ConceptReFip
type: Concept
broader: ZZ
in scheme: FINANCES PUBLIQUES
notation: REFIP1315

incarcération
type: ConceptReFip
type: Concept
alternative label: détention
alternative label: emprisonnement
broader: sanction pénale
definition: Mesure de détention ou d'emprisonnement.
in scheme: FINANCES PUBLIQUES
in scheme: Droit et Justice
in scheme: Sanction
in scheme: Infractions et Sanctions
notation: REFIP1316

contrat à durée indéterminée
type: ConceptReFip
type: Concept
alternative label: CDI
broader: contrat de travail
definition: Contrat de travail de droit commun, passé entre l'employeur et le salarié, sans limitation de durée.
in scheme: FINANCES PUBLIQUES
in scheme: Contrat de Travail
in scheme: Entreprises
in scheme: Travail
notation: REFIP1317

bail à réhabilitation
type: ConceptReFip
type: Concept
broader: refip-REFIP95
definition: Contrat par lequel un organisme d'HLM ou une société d'économie mixte dont l'objet est de donner à bail des logements, s'engage à réaliser des travaux d'amélioration sur l'immeuble du bailleur, en vue de le sous-louer à un usage d'habitation pendant la durée du bail.
in scheme: FINANCES PUBLIQUES
in scheme: Droit et Justice
in scheme: Divisions du Droit
in scheme: Droit Privé
notation: REFIP1318

établissement d'enseignement français à l'étranger
type: ConceptReFip
type: Concept
alternative label: EEFE
broader: établissement d'enseignement
definition: Etablissement scolaire permettant aux enfants français établis hors de France de suivre une scolarité similaire à la scolarité suivie par les enfants résidant en France. Ils suivent notamment les mêmes programmes et passent les mêmes diplômes. Les établissements font l'objet d'une procédure d'homologation attestant de leur conformité aux programmes, objectifs pédagogiques et aux règles d'organisation françaises. Trois statuts doivent être distingués : les établissements gérés directement par l'Agence pour l'enseignement français à l'étranger ; les établissements conventionnés ; les établissements partenaires.
in scheme: FINANCES PUBLIQUES
in scheme: Organisation Territoriale
in scheme: Structures Territoriales
in scheme: Administration de L'Etat
notation: REFIP1319

presse
type: ConceptReFip
type: Concept
alternative label: presse en ligne
alternative label: presse écrite
alternative label: presse électronique
alternative label: publication de presse
alternative label: service de presse en ligne
alternative label: édition de presse
broader: média
definition: Ensemble des journaux et des revues périodiques.
in scheme: FINANCES PUBLIQUES
in scheme: Communication
in scheme: Communication Documentation Informatique
narrower: journaliste
narrower: Agence de presse
notation: REFIP132

principe de permanence des méthodes comptables
type: ConceptReFip
type: Concept
alternative label: méthode comptable
broader: refip-REFIP819
definition: Principe comptable imposant que les mêmes règles et procédures comptables soient appliquées chaque année afin que les informations comptables soient comparables.
in scheme: FINANCES PUBLIQUES
in scheme: Principe comptable
in scheme: Comptabilité
narrower: droits constatés
narrower: comparabilité des comptes
notation: REFIP1320

application STATISTIQUES FICOBA
type: ConceptReFip
type: Concept
alternative label: STATISTIQUES FICOBA
broader: applications missions transverses (non-descripteur)
definition: Application permettant d'obtenir des restitutions statistiques sur l'utilisation de l'application FICOBA 2. Fermeture définitive le 31/12/12
in scheme: FINANCES PUBLIQUES
in scheme: Applications missions transverses
in scheme: Applications Informatiques
notation: REFIP1323

émission de rôle d'imposition
type: ConceptReFip
type: Concept
broader: rôle d'imposition
definition: Émission du titre de créance établi par l’administration fiscale et rendu exécutoire par la formule d’homologation apposée par le Préfet.
in scheme: FINANCES PUBLIQUES
in scheme: Documentation Fiscale
in scheme: Fiscalité
notation: REFIP1324

imposition forfaitaire sur le matériel roulant utilisé sur le réseau ferré national pour les opérations de transport de voyageurs
type: ConceptReFip
type: Concept
alternative label: IFMR
broader: imposition forfaitaire sur les entreprises de réseaux
definition: Imposition qui s'applique au matériel roulant utilisé sur le réseau ferré national pour des opérations de transport de voyageurs. Elle est due chaque année par l'entreprise de transport ferroviaire qui dispose, pour les besoins de son activité professionnelle, au 1er janvier de l'année d'imposition, de matériel roulant ayant été utilisé l'année précédente. Constitue une composante de l'IFER.
in scheme: FINANCES PUBLIQUES
in scheme: Fiscalité
in scheme: Impôt
notation: REFIP1325

intelligence économique
type: ConceptReFip
type: Concept
broader: structure rattachée au Premier Ministre (non-descripteur)
definition: Ensemble des moyens qui, organisés en système de management de la connaissance, produit de l’information utile à la prise de décision dans une perspective de performance et de création de valeur pour toutes les parties prenantes.
in scheme: FINANCES PUBLIQUES
in scheme: Organisation Structurelle de l'Etat
in scheme: Ministère
in scheme: Administration de L'Etat
notation: REFIP1326

technologie de l'information et de la communication
type: ConceptReFip
type: Concept
alternative label: TIC
broader: information
definition: Secteur regroupant les producteurs et distributeurs de matériel informatique et de télécommunication ainsi que les services s'y rapportant.
in scheme: FINANCES PUBLIQUES
in scheme: Communication
in scheme: Communication Documentation Informatique
narrower: visioconférence
narrower: outil collaboratif
narrower: internet
narrower: numérique
notation: REFIP1327

Bosnie-Herzégovine
type: ConceptReFip
type: Concept
alternative label: Bosnie
broader: Europe
definition: Pays
in scheme: FINANCES PUBLIQUES
in scheme: Géographie
in scheme: Europe
notation: REFIP1328

Saône-et-Loire
type: ConceptReFip
type: Concept
broader: refip-REFIP7017
definition: Département français
in scheme: FINANCES PUBLIQUES
in scheme: Géographie
in scheme: Europe
notation: REFIP1329

application MICROTHEQUE
type: ConceptReFip
type: Concept
broader: applications fiscales (non-descripteur)
definition: Application permettant de visualiser via un navigateur web les données applicatives conservées auparavant sur micro-fiches. Remplacée par PDF Edit.
in scheme: FINANCES PUBLIQUES
in scheme: Applications Informatiques
in scheme: Applications fiscales
notation: REFIP133

transfert de propriété
type: ConceptReFip
type: Concept
broader: droit de propriété
definition: Opération par laquelle l'acquéreur devient propriétaire en lieu et place de son prédécesseur.
in scheme: FINANCES PUBLIQUES
in scheme: Droit et Justice
in scheme: Divisions du Droit
in scheme: Droit Privé
notation: REFIP1330

ordre entre créanciers
type: ConceptReFip
type: Concept
alternative label: ordre légal de préférence
broader: droit des obligations et contrats (non-descripteur)
definition: Ordre fixé par la Loi de paiement des créanciers. Lorsque plusieurs créanciers doivent se partager le produit de la vente des biens ayant appartenu à un débiteur commun et que cette somme n'est pas d'un montant suffisant pour les désintéresser tous, il s'ouvre une procédure dite "de distribution". Les créanciers qui disposent d'un privilège ou d'une sûreté pour le paiement des impôts restés impayés sont dits "créanciers privilégiés", ils sont remboursés avant les autres, et dans l'ordre que fixe la loi.
in scheme: FINANCES PUBLIQUES
in scheme: Droit et Justice
in scheme: Divisions du Droit
in scheme: Droit Privé
narrower: au marc le franc
narrower: créancier
notation: REFIP1332

service de la caisse
type: ConceptReFip
type: Concept
alternative label: caisse
alternative label: service de caisse
broader: direction départementale des finances publiques
definition: Service permettant de réaliser les opérations d'encaissement et de dépôt et retraits de fonds au sein d'une structure comptable.
in scheme: FINANCES PUBLIQUES
in scheme: Organisation Structurelle de l'Etat
in scheme: Ministère
in scheme: Administration de L'Etat
notation: REFIP1333

défaillant de paiement
type: ConceptReFip
type: Concept
broader: civisme fiscal
definition: Contribuable ne s'acquittant pas de sa dette fiscale à l'échéance.
in scheme: FINANCES PUBLIQUES
in scheme: Fiscalité - Autres notions
in scheme: Fiscalité
narrower: relance des défaillants de paiement
notation: REFIP1336

Aquitaine (obsolète)
type: ConceptReFip
type: Concept
is replaced by: refip-REFIP7020
broader: ZZ
in scheme: FINANCES PUBLIQUES
notation: REFIP1337

échéancier
type: ConceptReFip
type: Concept
broader: mots outils (liste additive)
definition: Registre des échéances des dettes et des créances.
in scheme: FINANCES PUBLIQUES
in scheme: Mots Outils
notation: REFIP1338

travaux en cours
type: ConceptReFip
type: Concept
broader: fiche immobilisation en cours
definition: Travaux de longue durée comptabilisés au fur et à mesure de leur avancement. Selon la méthode comptable retenue, la marge sera constatée soit à l'avancement, soit à l'achèvement des travaux.
in scheme: FINANCES PUBLIQUES
in scheme: Comptabilité publique
in scheme: Comptabilité
notation: REFIP134
scope note: Comptabilité

société anonyme de crédit immobilier
type: ConceptReFip
type: Concept
broader: société anonyme
definition: Organisme d'habitations à loyer modéré. Son statut est défini au code de la construction et de l'habitation. Soumise au droit privé, elle peut accorder aux particuliers des prêts immobiliers ouvrant droit à l'aide personnalisée au logement et réaliser des opérations de construction.
in scheme: FINANCES PUBLIQUES
in scheme: Société
in scheme: Entreprises
in scheme: Forme juridique
notation: REFIP1340

domaine public
type: ConceptReFip
type: Concept
alternative label: parc immobilier de l'Etat
broader: propriété des personnes publiques
definition: Ensemble des biens (immeubles ou meubles) appartenant à une personne publique et affectés à l'usage direct du public (voies de circulation, parcs publics...) ou à un service public avec un aménagement indispensable à l'exécution des missions de service public (écoles, hôtels de ville...).
in scheme: FINANCES PUBLIQUES
in scheme: Domaine
in scheme: Gestion Publique
narrower: avis du service des domaines
narrower: affectation de biens
narrower: réserve foncière
narrower: volume immobilier
narrower: bien spécifique
narrower: domaine public maritime
narrower: lieu public
narrower: bien non enlevé non loti
narrower: ouvrage public
narrower: bien communal
narrower: occupation de locaux
narrower: domaine public fluvial
narrower: parc automobile
narrower: domaine public routier
narrower: refip-REFIP7013
narrower: refip-REFIP754
notation: REFIP1341
related: affouage

application SAM WEB
type: ConceptReFip
type: Concept
alternative label: SAM WEB
broader: applications gestion publique (non-descripteur)
definition: Outil d'aide au suivi des comptes de gestion destiné notamment au DD/DRFiP, aux pôle interrégionaux d'apurement administratif, au service d'apurement des comptes des établissements publics locaux d'enseignement et aux services centraux. Elle permet un suivi du compte de gestion du visa sur chiffres jusqu'au jugement des comptes.
in scheme: FINANCES PUBLIQUES
in scheme: Applications Informatiques
in scheme: Applications gestion publique
notation: REFIP1342

Royaume-Uni
type: ConceptReFip
type: Concept
broader: Europe
definition: Pays
in scheme: FINANCES PUBLIQUES
in scheme: Géographie
in scheme: Europe
narrower: Grande-Bretagne
notation: REFIP1343

Côte-d'Or
type: ConceptReFip
type: Concept
broader: refip-REFIP7017
definition: Département français
in scheme: FINANCES PUBLIQUES
in scheme: Géographie
in scheme: Europe
notation: REFIP1345

fonds régional de l'apprentissage et de la formation professionnelle continue (supprimé)
type: ConceptReFip
type: Concept
broader: ZZ
in scheme: FINANCES PUBLIQUES
notation: REFIP1348

CHORUS (non-descripteur)
type: ConceptReFip
type: Concept
broader: comptabilité publique
definition: Terme ne servant pas à l'indexation.
in scheme: FINANCES PUBLIQUES
in scheme: Comptabilité publique
in scheme: Comptabilité
narrower: fiche immobilisation en cours
narrower: fiche immobilisation en service
narrower: compte collectif
narrower: organisation d'achats
narrower: centre de profit
narrower: centre financier
narrower: centre de coût
narrower: plan de comptes de l'Etat cible
narrower: fonction de supervision des tiers
narrower: compte d'écart
narrower: plan de comptes de l'Etat palier
notation: REFIP1349
note: Étiquette de nœud

créance spéciale du Trésor
type: ConceptReFip
type: Concept
broader: recouvrement
definition: Créance spécifique de nature non fiscale (notamment avec les débets des comptables publics et certains produits divers de l'Etat émanant d'ordonnateurs spécialisés) ou fiscale (avec notamment l'assistance internationale au recouvrement et l'encaissement de droits spécifiques dans le domaine de la santé, de la politique du logement et de la stabilité du système financier).
in scheme: FINANCES PUBLIQUES
in scheme: Recouvrement
in scheme: Fiscalité
notation: REFIP135

groupe d'expression métier
type: ConceptReFip
type: Concept
alternative label: GEM
broader: groupe de travail
definition: Espace de discussions, permettant à chaque agent de s'exprimer sur son travail au quotidien et faire émerger des propositions d'amélioration des services, des outils, des méthodes de travail, de mutualiser les bonnes pratiques ou encore d'identifier des pistes de synergies.
in scheme: FINANCES PUBLIQUES
in scheme: Missions Transverses des Finances publiques
in scheme: Pilotage
notation: REFIP1350

année comptable
type: ConceptReFip
type: Concept
broader: amortissement comptable
definition: Notion comptable équivalente à 360 jours.
in scheme: FINANCES PUBLIQUES
in scheme: Procédures et Techniques Comptables
in scheme: Comptabilité
notation: REFIP1351

régime d'imposition
type: ConceptReFip
type: Concept
alternative label: régime fiscal
definition: Modalités de calcul de l'impôt qui entraîne des obligations comptables et déclaratives différentes.
in scheme: FINANCES PUBLIQUES
in scheme: Régime d'Imposition
in scheme: Fiscalité
narrower: régime simplifié du micro-foncier
narrower: régime d'imposition au forfait
narrower: régime de la taxe sur la valeur ajoutée agricole
narrower: régime suspensif douanier
narrower: régime déclaratif spécial
narrower: régime de déclaration contrôlée
narrower: franchise de taxe
narrower: retenue de taxe sur la valeur ajoutée
narrower: régime réel d'imposition
narrower: agrément fiscal
narrower: taxation sur la marge
narrower: intégration fiscale
narrower: régime dérogatoire
narrower: refip-REFIP7216
narrower: refip-REFIP7221
notation: REFIP1352

compte prévisionnel (supprimé)
type: ConceptReFip
type: Concept
broader: ZZ
in scheme: FINANCES PUBLIQUES
notation: REFIP1353

provision
type: ConceptReFip
type: Concept
broader: passif
definition: Passif dont l'échéance ou le montant n'est pas fixé de façon précise.
in scheme: FINANCES PUBLIQUES
in scheme: Documents comptables
in scheme: Comptabilité
narrower: provision réglementée
narrower: provision pour dépréciation
narrower: provision pour risques
narrower: provision pour charges
notation: REFIP1354

simplification de service
type: ConceptReFip
type: Concept
alternative label: mesure de simplification
broader: simplification administrative
definition: Ensemble de mesures visant à simplifier les procédures et outils internes, rythmant la vie des services de l'administration.
in scheme: FINANCES PUBLIQUES
in scheme: Missions Transverses des Finances publiques
in scheme: Pilotage
notation: REFIP1359

substitution de base légale
type: ConceptReFip
type: Concept
broader: contentieux fiscal
definition: Droit de l'administration en matière de réclamation contentieuse, et à tout moment de la procédure, de se fonder sur un motif de droit différent de celui initialement invoqué pour justifier le bien-fondé de l'imposition.
in scheme: FINANCES PUBLIQUES
in scheme: Contentieux Fiscal
in scheme: Fiscalité
notation: REFIP1360

comptabilité irrégulière
type: ConceptReFip
type: Concept
broader: fraude fiscale
definition: Comptabilité irrégulière ou incomplète entachée de négligence, erreur ou lacune de nature à la rendre impropre à justifier les résultats déclarés.
in scheme: FINANCES PUBLIQUES
in scheme: Droit de Contrôle de l'Administration
in scheme: Fiscalité
notation: REFIP1362

fiche immobilisation en service
type: ConceptReFip
type: Concept
alternative label: FIES
broader: CHORUS (non-descripteur)
definition: Donnée de base qui permet de suivre et matérialiser un bien immobilisé, et de centraliser toutes les écritures relatives à une immobilisation. La fiche d'immobilisation en service est créée pour une immobilisation mise en service dans CHORUS.
in scheme: FINANCES PUBLIQUES
in scheme: Comptabilité publique
in scheme: Comptabilité
notation: REFIP1363

capacité juridique
type: ConceptReFip
type: Concept
alternative label: incapacité
broader: droit civil
definition: Capacité à acquérir et à exercer un droit. On distingue deux degrés dans la capacité : la capacité de jouissance (aptitude à avoir des droits et des obligations) que toute personne physique a en principe; et la capacité d'exercice : pouvoir de mettre en œuvre soi-même et seul ses droits et obligations, sans assistance, ni représentation par un tiers.
in scheme: FINANCES PUBLIQUES
in scheme: Droit et Justice
in scheme: Divisions du Droit
in scheme: Droit Privé
narrower: protection juridique
notation: REFIP1364

accueil du public
type: ConceptReFip
type: Concept
broader: relations avec le public
definition: Réception des usagers quel que soit le canal de contact (accueil physique ou en ligne, par téléphone, par courriel ou par courrier).
in scheme: FINANCES PUBLIQUES
in scheme: Missions Transverses des Finances publiques
in scheme: Qualité de service
narrower: accueil téléphonique
narrower: accueil physique
narrower: accueil internet
narrower: refip-REFIP7008
notation: REFIP1365

commencement d'activité
type: ConceptReFip
type: Concept
broader: refip-REFIP938
definition: Début d'une activité non salariée en fiscalité professionnelle.
in scheme: FINANCES PUBLIQUES
in scheme: Vie de l'Entreprise
in scheme: Entreprises
in scheme: Vie et Gestion de l'entreprise
notation: REFIP1366

représentant fiscal
type: ConceptReFip
type: Concept
alternative label: mandataire fiscal
broader: fiscalité
definition: Tiers, désigné par une personne physique ou morale, sous certaines conditions, exerçant des activités en France ou y possédant des biens sans y avoir leur domicile fiscal ou leur siège social, autorisé à recevoir les communications relatives à l'assiette, au recouvrement et au contentieux de l'impôt.
in scheme: FINANCES PUBLIQUES
in scheme: Fiscalité - Autres notions
in scheme: Fiscalité
notation: REFIP1368

Haute-Marne
type: ConceptReFip
type: Concept
broader: refip-REFIP7009
definition: Département français
in scheme: FINANCES PUBLIQUES
in scheme: Géographie
in scheme: Europe
notation: REFIP1369

contrôle mutuel
type: ConceptReFip
type: Concept
broader: contrôle interne de premier niveau
definition: Contrôle de premier niveau exercé par un agent sur les opérations d’un autre agent, ou par une entité sur les opérations d’une autre entité, a posteriori.
in scheme: FINANCES PUBLIQUES
in scheme: Missions Transverses des Finances publiques
in scheme: Maîtrise des risques
notation: REFIP1371

Pôle de gestion des patrimoines privés
type: ConceptReFip
type: Concept
broader: direction départementale des finances publiques
definition: Pôle départemental, service du Domaine, administrant les successions vacantes et appréhendant les successions en déshérence. Cette gestion des patrimoines privés consiste à liquider l’actif successoral afin de dédommager les créanciers de la succession.
in scheme: FINANCES PUBLIQUES
in scheme: Organisation Structurelle de l'Etat
in scheme: Ministère
in scheme: Administration de L'Etat
notation: REFIP1372

plan de classement
type: ConceptReFip
type: Concept
broader: classement
definition: Système d'organisation structurée d'informations, de documents en fonction de critères déterminés afin de les retrouver et les gérer facilement.
in scheme: FINANCES PUBLIQUES
in scheme: Documentation
in scheme: Communication Documentation Informatique
notation: REFIP1373

tribunal de grande instance
type: ConceptReFip
type: Concept
alternative label: TGI
broader: juridiction civile
definition: Juridiction de droit commun en matière civile, connaissant en première instance de toutes les questions pour lesquelles compétence n'est pas attribuée expressément à une autre juridiction en raison de la nature ou du montant de la demande, et ayant reçu compétence exclusive dans certaines matières (mariage, filiation, succession etc.).
in scheme: FINANCES PUBLIQUES
in scheme: Droit et Justice
in scheme: Juridiction
in scheme: Organisation Juridictionnelle
notation: REFIP1374

promulgation
type: ConceptReFip
type: Concept
broader: droit constitutionnel
definition: Acte par lequel le chef de l'État constate officiellement l'existence de la loi et la rend exécutoire.
in scheme: FINANCES PUBLIQUES
in scheme: Droit et Justice
in scheme: Divisions du Droit
in scheme: Droit Public
notation: REFIP1375

maison départementale des personnes handicapées
type: ConceptReFip
type: Concept
alternative label: MDPH
broader: groupement d'intérêt public
definition: Structure chargée de l’accueil et de l’accompagnement des personnes handicapées et de leurs proches. Il existe une MDPH dans chaque département, fonctionnant comme un guichet unique pour toutes les démarches liées aux diverses situations de handicap.
in scheme: FINANCES PUBLIQUES
in scheme: Organisation Structurelle de l'Etat
in scheme: Opérateur de l'Etat
in scheme: Administration de L'Etat
notation: REFIP1376

revenu imposable
type: ConceptReFip
type: Concept
broader: base d'imposition
definition: Ensemble des revenus, bénéfices et gains de toute sorte, perçus par le foyer fiscal quelle qu'en soit la source, française ou étrangère.
in scheme: FINANCES PUBLIQUES
in scheme: Champ d'Application
in scheme: Fiscalité
narrower: revenu catégoriel
narrower: revenu professionnel
narrower: revenu du patrimoine
narrower: revenu de source française
narrower: revenu d'origine indéterminée
narrower: revenu de source étrangère
narrower: revenu disponible
narrower: revenu accessoire
narrower: revenu exceptionnel
narrower: refip-REFIP918
notation: REFIP1377

application CAISSE
type: ConceptReFip
type: Concept
broader: applications gestion publique (non-descripteur)
definition: Application servant à automatiser les fonctions de caisse, sous-caisse et guichet, à enregistrer toutes les opérations en numéraire et gérer l’encaisse, d'éditer quittances, états et journaux.
in scheme: FINANCES PUBLIQUES
in scheme: Applications Informatiques
in scheme: Applications gestion publique
notation: REFIP1378

procédure collective
type: ConceptReFip
type: Concept
broader: entreprise en difficulté
definition: Procédure qui place sous contrôle judiciaire le fonctionnement d'une entreprise en difficulté. Elle est déclenchée soit sur assignation d'un créancier, soit à la suite de la déclaration de cessation de paiements par les dirigeants, soit d'office par le tribunal lui-même.
in scheme: FINANCES PUBLIQUES
in scheme: Vie de l'Entreprise
in scheme: Entreprises
in scheme: Vie et Gestion de l'entreprise
narrower: administrateur judiciaire
narrower: liquidation judiciaire
narrower: procédure de sauvegarde
narrower: cessation de paiement
narrower: redressement judiciaire
narrower: mandataire judiciaire
narrower: période d'observation
notation: REFIP1379

convention d'utilisation
type: ConceptReFip
type: Concept
alternative label: convention d'occupation domaniale
broader: occupation de locaux
definition: Convention autorisant l'occupation du domaine public de l'État ou d'autres personnes publiques.
in scheme: FINANCES PUBLIQUES
in scheme: Domaine
in scheme: Gestion Publique
narrower: amodiation
notation: REFIP1380

Comores
type: ConceptReFip
type: Concept
broader: Afrique
definition: Pays
in scheme: FINANCES PUBLIQUES
in scheme: Géographie
in scheme: Afrique
notation: REFIP1383
related: Mayotte

Conseil supérieur du notariat
type: ConceptReFip
type: Concept
broader: organisme consultatif et représentatif (non-descripteur)
definition: Etablissement d'utilité publique représentant la profession auprès des pouvoirs publics, il contribue à l'évolution du notariat et fournit des services collectifs aux notaires. Il est le seul organe de la profession habilité à s'exprimer au nom de tous les notaires de France.
in scheme: FINANCES PUBLIQUES
in scheme: Organisation Structurelle de l'Etat
in scheme: Organisme Consultatif et Représentatif
in scheme: Administration de L'Etat
notation: REFIP1384

application RIALTO
type: ConceptReFip
type: Concept
alternative label: RIALTO
broader: applications fiscales (non-descripteur)
definition: Outil de gestion informatisé des dossiers de vérification de particuliers et d'entreprises.
in scheme: FINANCES PUBLIQUES
in scheme: Applications Informatiques
in scheme: Applications fiscales
notation: REFIP1385

île de Guernesey
type: ConceptReFip
type: Concept
alternative label: Guernesey
broader: Grande-Bretagne
definition: Territoire de Grande-Bretagne
in scheme: FINANCES PUBLIQUES
in scheme: Géographie
in scheme: Europe
notation: REFIP1386

application CLARA
type: ConceptReFip
type: Concept
alternative label: CLARA
broader: applications gestion publique (non-descripteur)
definition: Application de gestion comptable utilisée par les collectivités d'outre mer.
in scheme: FINANCES PUBLIQUES
in scheme: Applications Informatiques
in scheme: Applications gestion publique
notation: REFIP1387

groupement d'établissements pour la formation des adultes
type: ConceptReFip
type: Concept
alternative label: GRETA
alternative label: groupement d'établissements pour la formation continue
broader: établissement public local d'enseignement
definition: Regroupement d'établissements publics locaux d'enseignement qui mutualisent leurs compétences et leurs moyens pour proposer une offre de formation pour les adultes. Il s’appuie sur les ressources en équipements et en personnels de ces établissements pour construire une offre de formation adaptée à l’économie locale. Chaque Greta est créé par une convention conclue entre les établissements et approuvée par le recteur.
in scheme: FINANCES PUBLIQUES
in scheme: Organisation Territoriale
in scheme: Structures Territoriales
in scheme: Administration de L'Etat
notation: REFIP1388

appel en justice
type: ConceptReFip
type: Concept
alternative label: appel d'une décision de justice
broader: voie de recours
definition: Voie de recours ordinaire qui tend à faire réformer ou annuler par une juridiction de second degré, un jugement rendu par une juridiction de premier degré.
in scheme: FINANCES PUBLIQUES
in scheme: Principes Généraux
in scheme: Droit et Justice
in scheme: Procédure
narrower: délai d'appel
notation: REFIP139

prix de vente
type: ConceptReFip
type: Concept
alternative label: prix de cession
broader: facturation
definition: Prix proposé par le vendeur et payé par l'acheteur
in scheme: FINANCES PUBLIQUES
in scheme: Procédures et Techniques Comptables
in scheme: Comptabilité
notation: REFIP1391

présomption d'héritier (supprimé)
type: ConceptReFip
type: Concept
broader: ZZ
in scheme: FINANCES PUBLIQUES
notation: REFIP1392

transfert de compétence
type: ConceptReFip
type: Concept
broader: réforme de l'Etat
definition: Abandon de la part d'une entité de la gestion d'un domaine à une autre entité. Les entités concernées peuvent être des organisations supranationales, des collectivités territoriales ou des structures intercommunales.
in scheme: FINANCES PUBLIQUES
in scheme: Etat
in scheme: Réforme de l'Etat
in scheme: Administration de L'Etat
narrower: transfert de personnel
notation: REFIP1393

droit de partage
type: ConceptReFip
type: Concept
broader: droits d'enregistrement
definition: Prélèvement fiscal (droit d'enregistrement ou taxe de publicité foncière) opéré à l'occasion d'une opération de partage, notamment aux partages purs et simples entre copropriétaires, coassociés et cohéritiers, à l'ensemble des partages familiaux bénéficiant du régime de faveur, aux licitations de biens dépendant d'une succession, d'une indivision entre époux ou entre partenaires et aux partages et licitations de biens appartenant à des groupements fonciers agricoles.
in scheme: FINANCES PUBLIQUES
in scheme: Fiscalité
in scheme: Impôt
notation: REFIP1394

commandement à parquet
type: ConceptReFip
type: Concept
broader: avertissement de payer
definition: Notification d'actes destinés à une personne ayant sa résidence à l'étranger, sauf dans les cas où un règlement communautaire ou un traité international autorise l'huissier de justice ou le greffe du tribunal à transmettre directement cet acte à son destinataire ou à une autorité compétente de l'Etat de destination.
in scheme: FINANCES PUBLIQUES
in scheme: Recouvrement
in scheme: Fiscalité
notation: REFIP1395

association syndicale de propriétaires
type: ConceptReFip
type: Concept
broader: association syndicale autorisée
definition: Groupement de propriétaires fonciers, elle a pour objet d'effectuer en commun des travaux d'amélioration, d'entretien ou de mise en valeur des biens. Elle gère aussi des problèmes environnementaux et existe sous diverses formes, qui correspondent chacune à un certain degré d'implication de l'État.
in scheme: FINANCES PUBLIQUES
in scheme: Organisation Structurelle de l'Etat
in scheme: Opérateur de l'Etat
in scheme: Administration de L'Etat
notation: REFIP1396

boni
type: ConceptReFip
type: Concept
alternative label: boni de liquidation
broader: comptabilisation
definition: Résultat positif des capitaux propres du bilan de liquidation, après déduction du capital social. Si ce résultat est négatif on parle de mali.
in scheme: FINANCES PUBLIQUES
in scheme: Procédures et Techniques Comptables
in scheme: Comptabilité
notation: REFIP1397

gaz
type: ConceptReFip
type: Concept
broader: combustible
definition: Combustible.
in scheme: FINANCES PUBLIQUES
in scheme: Branche d'activité
in scheme: Questions Economiques
in scheme: Industrie
narrower: gaz naturel pour les véhicules
narrower: gaz de pétrole liquéfie
notation: REFIP1398
related: matières premières

participation au développement de la formation professionnelle continue
type: ConceptReFip
type: Concept
alternative label: déclaration 2483
alternative label: participation des employeurs aux dépenses de formation professionnelle continue
broader: taxes et participations assises sur les salaires (non-descripteur)
definition: Concours de tout employeur, quel que soit le nombre des ses employés, au développement de la formation professionnelle continue par la participation, chaque année, au financement des actions de formation de son personnel ou de demandeurs d'emploi
in scheme: FINANCES PUBLIQUES
in scheme: Fiscalité
in scheme: Impôt
notation: REFIP14

rectification comptable
type: ConceptReFip
type: Concept
broader: procédures et techniques comptables (non-descripteur)
definition: Modification d'écriture comptable visant à rétablir la situation d'un compte telle qu'elle aurait du être.
in scheme: FINANCES PUBLIQUES
in scheme: Procédures et Techniques Comptables
in scheme: Comptabilité
narrower: contre-passation
notation: REFIP140

régime spécial des partages avec soultes ou plus-values (supprimé)
type: ConceptReFip
type: Concept
broader: ZZ
in scheme: FINANCES PUBLIQUES
notation: REFIP1400

délai de réponse de l'administration
type: ConceptReFip
type: Concept
broader: réponse de l'administration
definition: Temps dont dispose l'administration pour répondre à une demande. Ce délai peut varier en fonction de la nature de la demande, de la matière concernée, de sa complexité, de son urgence.
in scheme: FINANCES PUBLIQUES
in scheme: Missions Transverses des Finances publiques
in scheme: Qualité de service
notation: REFIP1401

frais de poursuites
type: ConceptReFip
type: Concept
broader: poursuites
definition: Ensemble des frais mis à la charge des redevables à raison des actes de poursuites établis par les huissiers de justice ou les huissiers des finances publiques à la demande des comptables de la DGFIP. Ces frais comportent des frais proportionnels au montant de la créance et des frais accessoires réclamés pour leur montant réel par application de tarifs réglementaires.
in scheme: FINANCES PUBLIQUES
in scheme: Recouvrement
in scheme: Fiscalité
narrower: frais d'huissier
notation: REFIP1403

privilège
type: ConceptReFip
type: Concept
broader: convention
definition: Droit que la loi reconnaît à un créancier, en raison de la nature de sa créance, d'être préféré aux autres créanciers sur l'ensemble des biens de son débiteur ou sur certains d'entre eux seulement.
in scheme: FINANCES PUBLIQUES
in scheme: Droit et Justice
in scheme: Divisions du Droit
in scheme: Droit Privé
narrower: privilège de pluviôse
narrower: privilège des salaires
narrower: privilège spécial immobilier
notation: REFIP1404

gestion
type: ConceptReFip
type: Concept
broader: mots outils (liste additive)
definition: Action et effet de gérer, d'administrer.
in scheme: FINANCES PUBLIQUES
in scheme: Mots Outils
notation: REFIP1405

ayant cause
type: ConceptReFip
type: Concept
broader: droit civil
definition: Personne qui tient son droit d'une autre appelée auteur.
in scheme: FINANCES PUBLIQUES
in scheme: Droit et Justice
in scheme: Divisions du Droit
in scheme: Droit Privé
notation: REFIP1406

Eure
type: ConceptReFip
type: Concept
broader: refip-REFIP7016
definition: Département français
in scheme: FINANCES PUBLIQUES
in scheme: Géographie
in scheme: Europe
notation: REFIP1407

revenu distribué
type: ConceptReFip
type: Concept
broader: revenu de capitaux mobiliers
definition: Sont considérés comme revenus distribués les bénéfices ou produits qui ne sont pas mis en réserve ou incorporés au capital par la société, et plus généralement, toutes les sommes qui sont mises à la disposition des associés, actionnaires ou porteurs de parts même si elles ne sont pas prélevées sur les bénéfices.
in scheme: FINANCES PUBLIQUES
in scheme: Champ d'Application
in scheme: Fiscalité
narrower: présomption de distribution
notation: REFIP1408

audit extérieur
type: ConceptReFip
type: Concept
broader: audit
definition: Mission à la charge des auditeurs de la DGFIP exercée sur un organisme public ou privé relevant du pouvoir de contrôle de la DGFIP, menée selon les mêmes méthodes et normes que l'audit interne.
in scheme: FINANCES PUBLIQUES
in scheme: Audit
in scheme: Missions Transverses des Finances publiques
notation: REFIP1409

imposition par foyer fiscal (obsolète)
type: ConceptReFip
type: Concept
is replaced by: foyer fiscal
broader: ZZ
in scheme: FINANCES PUBLIQUES
notation: REFIP1410

action en recouvrement
type: ConceptReFip
type: Concept
broader: recouvrement
definition: Mise en œuvre de procédures civiles, commerciales ou fiscales tendant au recouvrement forcé des impôts et taxes non acquittées dans les délais légaux.
in scheme: FINANCES PUBLIQUES
in scheme: Recouvrement
in scheme: Fiscalité
narrower: recouvrement forcé
narrower: recouvrement amiable
notation: REFIP1411

système national de référence de coordonnées géographiques planimétriques et altimétriques
type: ConceptReFip
type: Concept
alternative label: système de référence géographique
broader: système d'information géographique
definition: Système de référence rassemblant toutes les informations localisées issues des travaux topographiques ou cartographiques réalisées par l'Etat, les collectivités locales, les entreprises chargées de l'exécution d'une mission de service public.
in scheme: FINANCES PUBLIQUES
in scheme: Cadastre
in scheme: Fiscalité
narrower: représentation parcellaire cadastrale unique
narrower: topographie
notation: REFIP1412

application VENDOM
type: ConceptReFip
type: Concept
alternative label: VENDOM
broader: applications gestion publique (non-descripteur)
definition: Application permettant la gestion des ventes mobilières de la remise à la ventilation comptable des produits.
in scheme: FINANCES PUBLIQUES
in scheme: Applications Informatiques
in scheme: Applications gestion publique
notation: REFIP1413
scope note: Remplacée par l'application HERMES à compter du 18/07/2017

excédent budgétaire
type: ConceptReFip
type: Concept
broader: budget de l'Etat
definition: Excédent des ressources par rapport aux dépenses dans les budgets nationaux.
in scheme: FINANCES PUBLIQUES
in scheme: Budget de l’État
in scheme: Budget
notation: REFIP1414

prescription trentenaire
type: ConceptReFip
type: Concept
broader: prescription
definition: Mode d’extinction d’un droit résultant de l’inaction de son titulaire dans un délai de 30 ans.
in scheme: FINANCES PUBLIQUES
in scheme: Droit et Justice
in scheme: Droit Général
notation: REFIP1415

procédures et techniques comptables (non-descripteur)
type: ConceptReFip
type: Concept
definition: Terme ne pouvant servir à l'indexation
in scheme: FINANCES PUBLIQUES
in scheme: Procédures et Techniques Comptables
in scheme: Comptabilité
narrower: rectification comptable
narrower: assignation comptable
narrower: opération de trésorerie
narrower: certification des comptes
narrower: preuve comptable
narrower: fiabilisation des comptes
narrower: réquisition de paiement
narrower: fin de gestion
narrower: amortissement comptable
narrower: opération d'ordre
narrower: transfert comptable
narrower: centralisation comptable
narrower: comptabilisation
narrower: procédure des annulations d'opérations compensées à tort
narrower: débit d'office
narrower: consolidation des comptes
narrower: crédit d'office
narrower: facturation
narrower: agrégation des comptes
narrower: refip-REFIP7123
narrower: refip-REFIP872
notation: REFIP1416
scope note: Etiquette de noeud

pilotage
type: ConceptReFip
type: Concept
definition: Processus visant à conduire un ensemble d'activités destiné à établir et déployer les lignes directrices d'une organisation, à mettre en œuvre une stratégie ou mesurer l'accomplissement d'un travail ou d'une activité et, à analyser et améliorer son fonctionnement.
in scheme: FINANCES PUBLIQUES
in scheme: Missions Transverses des Finances publiques
in scheme: Pilotage
narrower: tableau de bord
narrower: simplification administrative
narrower: classement des postes comptables
narrower: statistique
narrower: contrôle de gestion
narrower: organigramme
narrower: rapport d'activité
narrower: démarche stratégique
narrower: indicateur de performance
narrower: contrat de performance
narrower: dialogue de gestion
narrower: traçabilité
narrower: attribution métier
narrower: animation
narrower: groupe de travail
narrower: refip-REFIP7023
narrower: refip-REFIP7024
narrower: refip-REFIP7025
narrower: refip-REFIP7026
narrower: refip-REFIP7032
narrower: refip-REFIP7034
narrower: refip-REFIP7129
notation: REFIP142

dépenses ultérieures
type: ConceptReFip
type: Concept
broader: refip-REFIP996
definition: Dépenses qui n'ont d'autre objet que de maintenir un élément de l'actif en état tel que son utilisation puisse être poursuivie jusqu'à la fin de la période d'amortissement restant à courir. L’effet sur les avantages économiques futurs attachés à une immobilisation des dépenses ultérieures réalisées sur cette même immobilisation doit être apprécié au moment où ces dépenses sont engagées.
in scheme: FINANCES PUBLIQUES
in scheme: Dépenses publiques
in scheme: Gestion Publique
notation: REFIP1420

Guatemala
type: ConceptReFip
type: Concept
alternative label: République du Guatemala
broader: Amérique
definition: Pays
in scheme: FINANCES PUBLIQUES
in scheme: Géographie
in scheme: Amérique
notation: REFIP1425

comité d'entreprise
type: ConceptReFip
type: Concept
alternative label: CE
broader: gestion de l'entreprise (non-descripteur)
definition: Institution représentative du personnel au sein de l'entreprise, le comité d'entreprise a un rôle général pour assurer ou contrôler la gestion des activités sociales et culturelles de l'entreprise. Ses attributions sur le plan économique et social, relatives à l'organisation et marche de l'entreprise, aux conditions de travail, à la formation professionnelle et l'apprentissage, rendent sa consultation obligatoire dans certains cas.
in scheme: FINANCES PUBLIQUES
in scheme: Gestion de l'Entreprise
in scheme: Entreprises
in scheme: Vie et Gestion de l'entreprise
notation: REFIP1427
related: refip-REFIP759

crédit d'impôt pour les étudiants
type: ConceptReFip
type: Concept
broader: refip-REFIP849
definition: Dispositif institué au profit des étudiants, âgés de 25 ans au plus au 1er janvier de l'année de souscription du prêt, Pour les aider à financer leurs études supérieures. Ils peuvent bénéficier d'un crédit d'impôt sur le revenu à raison des cinq premières annuités de remboursement des prêts souscrits, en vue de financer leurs études, entre le 1.9.2005 et le 31.12.2008.
in scheme: FINANCES PUBLIQUES
in scheme: Liquidation de l'Impôt
in scheme: Fiscalité
notation: REFIP1428

nu-propriétaire
type: ConceptReFip
type: Concept
broader: nue-propriété
definition: Propriétaire de la chose grevée d'un usufruit. Il est dépouillé de la jouissance pendant la durée de l'usufruit et ne conserve que le droit de disposer de la nue-propriété.
in scheme: FINANCES PUBLIQUES
in scheme: Droit et Justice
in scheme: Divisions du Droit
in scheme: Droit Privé
notation: REFIP1429

concession d'endigage (supprimé)
type: ConceptReFip
type: Concept
broader: ZZ
in scheme: FINANCES PUBLIQUES
notation: REFIP1431

services déconcentrés des finances publiques
type: ConceptReFip
type: Concept
alternative label: services déconcentrés du Trésor
alternative label: services extérieurs du Trésor
broader: Direction générale des finances publiques
definition: Ensemble de services déconcentrés de la DGFiP exerçant leurs fonctions au niveau local. Il comprend notamment les directions départementales des Finances publiques (DDFiP), les directions régionales des Finances publiques (DRFiP), les directions locales des Finances publiques (DLFiP) et les directions spécialisées des Finances publiques (DSFiP).
in scheme: FINANCES PUBLIQUES
in scheme: Organisation Structurelle de l'Etat
in scheme: Ministère
in scheme: Administration de L'Etat
narrower: direction régionale des finances publiques
narrower: direction locale des finances publiques
narrower: trésorerie générale
narrower: direction départementale des finances publiques
notation: REFIP1432

autonomie financière
type: ConceptReFip
type: Concept
broader: finances locales (non-descripteur)
definition: Composante juridique du principe constitutionnel de libre administration., les collectivités bénéficient de ressources dont elles peuvent disposer librement, elles peuvent recevoir tout ou partie du produit des impositions de toutes natures et la loi peut les autoriser, dans certaines limites, à en fixer l’assiette et le taux; les recettes fiscales et les autres ressources propres des collectivités territoriales représentent, pour chaque catégorie de collectivités, une part déterminante de l’ensemble de leurs ressources.
in scheme: FINANCES PUBLIQUES
in scheme: Secteur public local
in scheme: Gestion Publique
notation: REFIP1433

arbitrage
type: ConceptReFip
type: Concept
broader: règlement amiable
definition: Mode alternatif de règlement des conflits. Procédure juridictionnelle privée et payante de règlement des litiges par recours à une ou plusieurs personnes privées (appelées arbitres) choisies par accord entre les parties pour statuer sur l'affaire. L'arbitre rend une sentence qui a autorité de chose jugée pour les parties.
in scheme: FINANCES PUBLIQUES
in scheme: Procédure Civile
in scheme: Droit et Justice
in scheme: Procédure
notation: REFIP1435

créance provisionnelle
type: ConceptReFip
type: Concept
broader: déclaration de créances
definition: Créance non authentifiée par un titre exécutoire déclarée en tant que tel (sur la base d'une évaluation) au passif d'une procédure collective (sauvegarde de justice, redressement judiciaire et liquidation judiciaire), qui sera ultérieurement convertie à titre définitif (en présence d'un titre exécutoire) ou abandonnée.
in scheme: FINANCES PUBLIQUES
in scheme: Recouvrement
in scheme: Fiscalité
notation: REFIP1436

trésorerie du contrôle automatisé
type: ConceptReFip
type: Concept
broader: direction régionale des finances publiques
definition: Trésorerie à compétence nationale spécialisée dans l'activité de recouvrement des amendes forfaitaires majorées prononcées pour des infractions relevées par le système de contrôle automatisé.
in scheme: FINANCES PUBLIQUES
in scheme: Organisation Structurelle de l'Etat
in scheme: Ministère
in scheme: Administration de L'Etat
notation: REFIP1438

Ministère du Budget des Comptes publics et de la Fonction publique (obsolète)
type: ConceptReFip
type: Concept
is replaced by: refip-REFIP7061
broader: ZZ
in scheme: FINANCES PUBLIQUES
notation: REFIP144

fichier informatique
type: ConceptReFip
type: Concept
broader: informatique
definition: Ensemble d'informations numériques réunies sous un même nom, enregistrées sur un support de stockage.
in scheme: FINANCES PUBLIQUES
in scheme: Informatique
in scheme: Communication Documentation Informatique
notation: REFIP1440

application MOOREA
type: ConceptReFip
type: Concept
alternative label: MOOREA
broader: applications fiscales (non-descripteur)
definition: Micro-informatique pour l'Enregistrement des Actes permettant la gestion des travaux d'enregistrement des services des impôts des entreprises, de la prise en compte des actes et déclarations jusqu'aux statistiques.
in scheme: FINANCES PUBLIQUES
in scheme: Applications Informatiques
in scheme: Applications fiscales
notation: REFIP1441

Délégation nationale à la lutte contre la fraude
type: ConceptReFip
type: Concept
alternative label: DNLF
broader: refip-REFIP7061
definition: Service qui a pour mission le pilotage de la coordination des administrations et des organismes publics en charge, chacun dans son domaine, de la lutte contre la fraude fiscale et sociale. L’objectif de la DNLF, laquelle ne doit en aucun cas se substituer ou s’ajouter aux services opérationnels de lutte contre la fraude, est de professionnaliser les démarches d’échanges entre organismes, d’assurer l’absence de déperdition d’informations entre entités, de mettre en évidence les mesures à prendre pour combler les lacunes juridiques ou les failles opérationnelles des dispositifs antifraudes.
in scheme: FINANCES PUBLIQUES
in scheme: Organisation Structurelle de l'Etat
in scheme: Ministère
in scheme: Administration de L'Etat
notation: REFIP1442

prime de cohésion sociale
type: ConceptReFip
type: Concept
alternative label: contrat d'avenir
broader: prime (non-descripteur)
definition: Prime destinée aux employeurs embauchant en contrat d’avenir des bénéficiaires de l’Allocation de Solidarité Spécifique depuis plus de deux ans et âgé de plus de 50 ans.
in scheme: FINANCES PUBLIQUES
in scheme: Dépenses publiques
in scheme: Gestion Publique
notation: REFIP1444

marché de fournitures
type: ConceptReFip
type: Concept
broader: marché public
definition: Marché conclu entre un pouvoir adjudicateur et un fournisseur qui a pour objet l’achat, la prise en crédit-bail, la location ou la location-vente de produits ou matériels.
in scheme: FINANCES PUBLIQUES
in scheme: Commande publique
in scheme: Gestion Publique
narrower: marché industriel
notation: REFIP1445

collectivités et territoires d'outre mer (non-descripteur)
type: ConceptReFip
type: Concept
broader: refip-REFIP886
definition: Terme ne servant pas à l'indexation.
in scheme: FINANCES PUBLIQUES
in scheme: Géographie
in scheme: Europe
narrower: Saint-Pierre-et-Miquelon
narrower: Guyane
narrower: terres australes et antarctiques françaises
narrower: La Réunion
narrower: Guadeloupe
narrower: Mayotte
narrower: Polynésie française
narrower: Nouvelle-Calédonie
narrower: Wallis et Futuna
narrower: Martinique
notation: REFIP1446
note: Étiquette de nœud

documentation hypothécaire
type: ConceptReFip
type: Concept
broader: documentation fiscale (non-descripteur)
definition: Ensemble des documents déposés et détenus dans les services de publicité foncière.
in scheme: FINANCES PUBLIQUES
in scheme: Documentation Fiscale
in scheme: Fiscalité
notation: REFIP1447

Centre national d'études spatiales
type: ConceptReFip
type: Concept
alternative label: CNES
broader: établissement public à caractère industriel et commercial
definition: Etablissement public à caractère industriel et commercial, le CNES propose aux pouvoirs publics la politique spatiale de la France et la met en oeuvre dans 5 grands domaines stratégiques : Ariane, les Sciences, l’Observation, les Télécommunications et la Défense.
in scheme: FINANCES PUBLIQUES
in scheme: Organisation Structurelle de l'Etat
in scheme: Opérateur de l'Etat
in scheme: Administration de L'Etat
notation: REFIP1448

application EDITION-ROLETH
type: ConceptReFip
type: Concept
alternative label: fichier ROLETH
alternative label: outil EDITION-ROLETH
broader: applications fiscales (non-descripteur)
definition: Application permettant l'édition des rôles de Taxe d'habitation.
in scheme: FINANCES PUBLIQUES
in scheme: Applications Informatiques
in scheme: Applications fiscales
notation: REFIP145

contravention
type: ConceptReFip
type: Concept
broader: refip-REFIP660
definition: Infraction pénale sanctionnée par une amende.
in scheme: FINANCES PUBLIQUES
in scheme: Droit et Justice
in scheme: Infractions et Sanctions
in scheme: Infraction
narrower: contravention de petite voirie
narrower: contravention de grande voirie
notation: REFIP1450

artisan pêcheur
type: ConceptReFip
type: Concept
alternative label: marin pêcheur
alternative label: patron pêcheur
alternative label: pêcheur
broader: pêche
definition: Patron embarqué, propriétaire du navire, possédant au maximum deux navires d'une longueur n'excédant pas 24 mètres.
in scheme: FINANCES PUBLIQUES
in scheme: Branche d'activité
in scheme: Questions Economiques
in scheme: Agriculture
notation: REFIP1451

taxe annuelle sur la détention de véhicules les plus polluants
type: ConceptReFip
type: Concept
alternative label: malus annuel
alternative label: malus applicable aux voitures polluantes
alternative label: malus à l'acquisition de véhicules polluants
alternative label: taxe additionnelle à la taxe sur les certificats d'immatriculation des véhicules les plus polluants
alternative label: taxe annuelle sur les véhicules polluants
alternative label: taxe à l'achat de véhicules polluants
alternative label: éco-pastille
broader: droit de timbre
definition: Taxe annuelle due pour la détention de véhicules qui répondent à certaines conditions précises, due par toutes les personnes propriétaires ou locataires, dans le cadre d'un contrat de location avec option d'achat ou d'un contrat souscrit pour une durée d'au moins deux ans, au 1er janvier de l'année d'imposition, de véhicules répondant aux conditions.
in scheme: FINANCES PUBLIQUES
in scheme: Fiscalité
in scheme: Impôt
notation: REFIP1452

boni de fusion
type: ConceptReFip
type: Concept
broader: fusion de sociétés
definition: Ecart positif entre le prix d'acquisition des titres de la société absorbée par la société absorbante et la valeur nette comptable au moment de l'apport de ces mêmes titres.
in scheme: FINANCES PUBLIQUES
in scheme: Vie de l'Entreprise
in scheme: Entreprises
in scheme: Vie et Gestion de l'entreprise
notation: REFIP1453

déclaration d'ensemble des revenus
type: ConceptReFip
type: Concept
alternative label: déclaration d'impôt sur le revenu
alternative label: formulaire 2042
broader: refip-REFIP804
definition: Formulaire n° 2042 permettant de déclarer les revenus perçus par les membres du foyer fiscal et et d'établir l'impôt sur le revenu des personnes physiques.
in scheme: FINANCES PUBLIQUES
in scheme: Documentation Fiscale
in scheme: Fiscalité
notation: REFIP1454

Projet annuel de performance
type: ConceptReFip
type: Concept
broader: refip-REFIP982
definition: Document retraçant pour chaque programme, la stratégie, les objectifs, les indicateurs et les cibles de résultat dont l’atteinte sera mesurée dans les rapports annuels de performances (RAP) annexés au projet de loi de règlement.
in scheme: FINANCES PUBLIQUES
in scheme: Documentation budgétaire
in scheme: Budget
narrower: refip-REFIP7030
notation: REFIP1456

compétence d'attribution
type: ConceptReFip
type: Concept
broader: principes généraux (non-descripteur)
definition: Compétence déterminée en fonction de la nature des affaires, parfois aussi de leur importance pécuniaire. Les règles de compétence d'attribution répartissent les litiges entre les divers ordres, degrés et nature de juridiction.
in scheme: FINANCES PUBLIQUES
in scheme: Principes Généraux
in scheme: Droit et Justice
in scheme: Procédure
notation: REFIP1457

naturalisation
type: ConceptReFip
type: Concept
broader: nationalité française
definition: Un des modes d'acquisition de la nationalité française. Ne constitue pas un droit contrairement à la déclaration. Elle est soumise à la décision discrétionnaire de l'administration. Les conditions sont liées notamment à la régularité du séjour en France, à l'intégration dans la communauté française, à l'absence de condamnations pénales.
in scheme: FINANCES PUBLIQUES
in scheme: Droit et Justice
in scheme: Divisions du Droit
in scheme: Droit Privé
notation: REFIP1458

affranchissement
type: ConceptReFip
type: Concept
alternative label: affranchissement du courrier
alternative label: frais d'affranchissement
alternative label: frais de correspondance
alternative label: timbre-poste
broader: courrier
definition: Fait de s'acquitter du paiement du port postal.
in scheme: FINANCES PUBLIQUES
in scheme: Communication
in scheme: Communication Documentation Informatique
notation: REFIP1459
related: machine à affranchir

document
type: ConceptReFip
type: Concept
broader: documentation
definition: Ensemble d'un support d'information, quel qu'il soit, des données enregistrées sur ce support et de leur signification, servant à la consultation, l'étude, la preuve ou la trace.
in scheme: FINANCES PUBLIQUES
in scheme: Documentation
in scheme: Communication Documentation Informatique
narrower: imprimé
narrower: guide d'installation
narrower: mise en demeure
narrower: guide méthodologique
narrower: matrice
narrower: pièces justificatives
narrower: convocation
narrower: carte
narrower: livre
narrower: rapport
narrower: mémoire
narrower: lexique
narrower: bordereau de dépôt
narrower: annuaire
narrower: compte-rendu
narrower: étude de faisabilité
narrower: certificat de paiement
narrower: guide d'utilisation
narrower: convention-type
narrower: bilan d'activité
narrower: carnet à souches
narrower: certificat électronique
narrower: charte
narrower: duplicata
narrower: quittance
narrower: déclaration de conformité
narrower: ticket
narrower: label
narrower: norme
narrower: refip-REFIP795
narrower: refip-REFIP927
notation: REFIP146

organisme en charge du logement social
type: ConceptReFip
type: Concept
alternative label: organisme chargé du logement social
alternative label: organisme de logement social
broader: organisation structurelle de l'Etat (non-descripteur)
definition: Bailleur social gérant et construisant les logements sociaux (y compris les foyers). Les principaux sont les organismes d'HLM, les sociétés d'économie mixte gérant les logements sociaux, les associations foncières logements et sociétés civiles immobilières dont cette association détient la majorité des parts, les organismes bénéficiant de l'agrément relatif à la maîtrise d'ouvrage.
in scheme: FINANCES PUBLIQUES
in scheme: Organisation Structurelle de l'Etat
in scheme: Organisme en charge du Logement Social
in scheme: Administration de L'Etat
notation: REFIP1460

géomètre topographe
type: ConceptReFip
type: Concept
broader: construction
definition: Personne fixant les limites exactes des propriétés foncières, effectuant les relais topographiques et concevant les plans.
in scheme: FINANCES PUBLIQUES
in scheme: Branche d'activité
in scheme: Questions Economiques
in scheme: Construction
notation: REFIP1461
related: géomètre cadastreur des finances publiques

congé ordinaire de maladie
type: ConceptReFip
type: Concept
alternative label: CMO
alternative label: congé de maladie ordinaire
alternative label: congé maladie
broader: congés (non-descripteur)
definition: Le fonctionnaire en activité a droit à des congés de maladie en cas de maladie dûment constatée le mettant dans l’impossibilité d’exercer ses fonctions.
in scheme: FINANCES PUBLIQUES
in scheme: Gestion des ressources humaines
in scheme: Temps de travail
in scheme: Fonction Publique et Gestion des Ressources Humaines
narrower: jour de carence
notation: REFIP1462

communauté urbaine
type: ConceptReFip
type: Concept
broader: refip-REFIP821
definition: Etablissement public de coopération intercommunale regroupant plusieurs communes d’un seul tenant et sans enclave qui forment, à la date de sa création, un ensemble de plus de 250 000 habitants. Jusqu’à la création des métropoles, les communautés urbaines constituaient les EPCI à fiscalité propre les plus intégrés. Elles sont créées sans limitation de durée ni possibilité de retrait pour leurs communes membres. Elles exercent les compétences : d'aménagement et développement économique, social et culturel de l’espace communautaire ; d'équilibre social de l’habitat ; de politique de la ville ; de protection et mise en valeur de l’environnement ; de politique du cadre de vie ; de gestion des services d’intérêt collectif.
in scheme: FINANCES PUBLIQUES
in scheme: Organisation Territoriale
in scheme: Structures Territoriales
in scheme: Administration de L'Etat
notation: REFIP1463

clerc de notaire
type: ConceptReFip
type: Concept
broader: profession juridique (non-descripteur)
definition: Collaborateur du notaire chargé de préparer les actes qui entrent dans le monopole du notaire, parfois autorisé à les accomplir lui-même. Les clercs sont devenus « les collaborateurs des offices de notaire ».
in scheme: FINANCES PUBLIQUES
in scheme: Profession Juridique
in scheme: Droit et Justice
in scheme: Organisation Juridictionnelle
notation: REFIP1464

autorisation préalable
type: ConceptReFip
type: Concept
broader: document administratif
definition: Décision délivrée par l'Administration ou une autorité compétente, une fois que celle-ci a vérifié le respect des règles en vigueur préalablement à la mise en place d'un projet.
in scheme: FINANCES PUBLIQUES
in scheme: Documentation
in scheme: Communication Documentation Informatique
notation: REFIP1465

Portugal
type: ConceptReFip
type: Concept
broader: Europe
definition: Pays
in scheme: FINANCES PUBLIQUES
in scheme: Géographie
in scheme: Europe
notation: REFIP1467

dotation de solidarité urbaine et de cohésion sociale
type: ConceptReFip
type: Concept
broader: dotation
definition: Dotation ayant pour objet de contribuer à l'amélioration des conditions de vie dans les communes urbaines confrontées à une insuffisance de leurs ressources et supportant des charges élevées.
in scheme: FINANCES PUBLIQUES
in scheme: Dépenses publiques
in scheme: Gestion Publique
notation: REFIP1468

compte fiscal des particuliers
type: ConceptReFip
type: Concept
alternative label: CF PART
broader: fiscalité
definition: Compte personnel sécurisé sur internet qui permet à un usager particulier d'accéder à l'ensemble des services en ligne disponibles sur le site ou l'application « impots.gouv » : consulter sa situation fiscale, déclarer ses revenus, payer ses impôts et effectuer ses démarches en ligne, prendre un rendez-vous, obtenir un renseignement....
in scheme: FINANCES PUBLIQUES
in scheme: Fiscalité - Autres notions
in scheme: Fiscalité
notation: REFIP1469

comité d'action sociale
type: ConceptReFip
type: Concept
broader: organisme consultatif et représentatif (non-descripteur)
definition: Instance chargée de proposer aux agents les orientations de l’action sociale. Organisée en organes consultatifs au niveau interministériel, ministériel ou régional afin de participer à la mise en œuvre de l’action sociale.
in scheme: FINANCES PUBLIQUES
in scheme: Organisation Structurelle de l'Etat
in scheme: Organisme Consultatif et Représentatif
in scheme: Administration de L'Etat
notation: REFIP147

système d'information financière de l'Etat
type: ConceptReFip
type: Concept
alternative label: SIFE
broader: maîtrise des risques
definition: Ensemble d'applications financières des administrations centrales et des services déconcentrés de l'État, notamment CHORUS
in scheme: FINANCES PUBLIQUES
in scheme: Missions Transverses des Finances publiques
in scheme: Maîtrise des risques
notation: REFIP1470
related: application CHORUS
related: application ACCORD

créance chirographaire
type: ConceptReFip
type: Concept
broader: recouvrement
definition: Créance ne bénéficiant d'aucune garantie particulière par nature (privilège, nantissement, hypothèque).
in scheme: FINANCES PUBLIQUES
in scheme: Recouvrement
in scheme: Fiscalité
notation: REFIP1471

suspension de taxe (supprimé)
type: ConceptReFip
type: Concept
in scheme: FINANCES PUBLIQUES
notation: REFIP1472

contrôle de légalité
type: ConceptReFip
type: Concept
alternative label: tutelle administrative
broader: contrôle administratif
definition: Procédure par laquelle le représentant de l’État (le préfet le plus souvent) s'assure de la conformité aux dispositions législatives et réglementaires des actes pris par les collectivités territoriales et certains établissements publics.
in scheme: FINANCES PUBLIQUES
in scheme: Droit et Justice
in scheme: Divisions du Droit
in scheme: Droit Public
narrower: déféré préfectoral
notation: REFIP1473
scope note: Se substitue à la tutelle administrative à compter de 1982

anonymat
type: ConceptReFip
type: Concept
alternative label: levée de l'anonymat
broader: relations avec le public
definition: Mesure s'inscrivant dans le cadre de la transparence administrative, le lever de l'anonymat permet à tout usager de connaître l'identité et la qualité de l'agent en charge de sa demande ainsi que l'adresse administrative du service compétent. Cependant, l'anonymat de l'agent peut être préservé pour des motifs intéressant la sécurité publique ou la sécurité des personnes.
in scheme: FINANCES PUBLIQUES
in scheme: Missions Transverses des Finances publiques
in scheme: Qualité de service
notation: REFIP1475

affermage
type: ConceptReFip
type: Concept
alternative label: contrat d'affermage
broader: délégation de service public
definition: Contrat par lequel le contractant s'engage à gérer un service public contre une rémunération versée par les usagers.
in scheme: FINANCES PUBLIQUES
in scheme: Commande publique
in scheme: Gestion Publique
notation: REFIP1476

subrogation
type: ConceptReFip
type: Concept
broader: droit civil
definition: Opération qui consiste à substituer une personne à une autre dans une relation juridique.
in scheme: FINANCES PUBLIQUES
in scheme: Droit et Justice
in scheme: Divisions du Droit
in scheme: Droit Privé
notation: REFIP1477

action à fins de subsides
type: ConceptReFip
type: Concept
broader: action en justice
definition: Action en justice permettant à un enfant, sans filiation paternelle, d'obtenir de celui qui a eu des relations intimes avec sa mère pendant la période légale de conception, une pension destinée à couvrir ses frais d’entretien et d’éducation, sans avoir à prouver la paternité.
in scheme: FINANCES PUBLIQUES
in scheme: Principes Généraux
in scheme: Droit et Justice
in scheme: Procédure
notation: REFIP1478

coût d'objectif (supprimé)
type: ConceptReFip
type: Concept
broader: ZZ
in scheme: FINANCES PUBLIQUES
notation: REFIP1479

Gard
type: ConceptReFip
type: Concept
broader: refip-REFIP7036
definition: Département français
in scheme: FINANCES PUBLIQUES
in scheme: Géographie
in scheme: Europe
notation: REFIP148

gestion publique
type: ConceptReFip
type: Concept
definition: Gestion des comptes de l'Etat, des collectivités et entreprises publiques.
in scheme: FINANCES PUBLIQUES
in scheme: Gestion Publique
narrower: dépenses publiques
narrower: commande publique
narrower: politique immobilière de l'Etat
narrower: secteur public local
narrower: domaine (non-descripteur)
narrower: expertise et action économiques et financières
notation: REFIP1480

communauté d'agglomération
type: ConceptReFip
type: Concept
broader: refip-REFIP821
definition: Etablissement public de coopération intercommunale qui remplace la communauté de ville et qui regroupe plusieurs communes sur un territoire d’un seul tenant et sans enclave. Visant les zones urbaines, la communauté d’agglomération doit former, lors de sa création, un ensemble de plus de 50 000 habitants, autour d’une ou plusieurs communes centres de 15 000 habitants. Les communes s'associent au sein d'un espace de solidarité, en vue d'élaborer et conduire ensemble un projet commun de développement urbain et d'aménagement de leur territoire.
in scheme: FINANCES PUBLIQUES
in scheme: Organisation Territoriale
in scheme: Structures Territoriales
in scheme: Administration de L'Etat
notation: REFIP1481

régime d'imposition au forfait
type: ConceptReFip
type: Concept
alternative label: régime du forfait
alternative label: régime forfaitaire
alternative label: régime forfaitaire agricole
broader: régime d'imposition
definition: Régime d'imposition le plus simple réservé aux petites exploitations, principalement agricoles, dont le chiffre d'affaires annuel n'excède pas certains seuils.
in scheme: FINANCES PUBLIQUES
in scheme: Régime d'Imposition
in scheme: Fiscalité
narrower: dénonciation du forfait agricole
notation: REFIP1482

consultation de données informatiques
type: ConceptReFip
type: Concept
alternative label: consultation informatique
broader: base de données
definition: Fait d'accéder à des informations présentes dans une base de données sur un serveur.
in scheme: FINANCES PUBLIQUES
in scheme: Informatique
in scheme: Communication Documentation Informatique
notation: REFIP1484

bois
type: ConceptReFip
type: Concept
broader: exploitation forestière
definition: Matière première utilisée dans le bâtiment et l'industrie et en tant que combustible.
in scheme: FINANCES PUBLIQUES
in scheme: Branche d'activité
in scheme: Questions Economiques
in scheme: Agriculture
notation: REFIP1485
related: refip-REFIP6925

Charente
type: ConceptReFip
type: Concept
broader: refip-REFIP7020
definition: Département français
in scheme: FINANCES PUBLIQUES
in scheme: Géographie
in scheme: Europe
notation: REFIP1487

fraude
type: ConceptReFip
type: Concept
alternative label: manœuvre frauduleuse
broader: délit
definition: Tromperie ou soustraction à la législation dans le but d'obtenir un avantage indu ou un consentement.
in scheme: FINANCES PUBLIQUES
in scheme: Droit et Justice
in scheme: Infractions et Sanctions
in scheme: Infraction
narrower: fraude sociale
narrower: usurpation
narrower: falsification
narrower: fraude sur internet
notation: REFIP1488

Nigeria
type: ConceptReFip
type: Concept
broader: Afrique
definition: Pays
in scheme: FINANCES PUBLIQUES
in scheme: Géographie
in scheme: Afrique
notation: REFIP1489

crédit d'impôt pour dépenses d'équipement en nouvelles technologies
type: ConceptReFip
type: Concept
broader: refip-REFIP849
definition: Dispositif institué en faveur des petites et moyennes entreprises qui exposent des dépenses d'équipement en nouvelles technologies. Elles peuvent, sous certaines conditions, bénéficier d'un crédit d'impôt égal à 20 % de ces dépenses.
in scheme: FINANCES PUBLIQUES
in scheme: Liquidation de l'Impôt
in scheme: Fiscalité
notation: REFIP149

Haute autorité de santé
type: ConceptReFip
type: Concept
alternative label: HAS
broader: Autorité publique indépendante
definition: Autorité publique indépendante qui contribue à la régulation du système de santé par la qualité. Elle exerce ses missions dans les champs de l'évaluation des produits de santé, des pratiques professionnelles, de l’organisation des soins et de la santé publique.
in scheme: FINANCES PUBLIQUES
in scheme: Organisation Structurelle de l'Etat
in scheme: Autorité Administrative
in scheme: Administration de L'Etat
notation: REFIP1490

erreur de droit
type: ConceptReFip
type: Concept
broader: droit général (non-descripteur)
definition: Erreur sur l'existence, le sens ou la portée d'un droit ou d'une règle de droit.
in scheme: FINANCES PUBLIQUES
in scheme: Droit et Justice
in scheme: Droit Général
notation: REFIP1492

application INDIA REMUNERATIONS
type: ConceptReFip
type: Concept
alternative label: INDIA REMUNERATION
broader: applications missions transverses (non-descripteur)
definition: Application permettant de répondre au besoin d’études et de suivi des opérations de paie.
in scheme: FINANCES PUBLIQUES
in scheme: Applications missions transverses
in scheme: Applications Informatiques
notation: REFIP1493

juridiction financière
type: ConceptReFip
type: Concept
broader: juridiction
definition: Ensemble des juridictions de l'ordre financier : la Cour des comptes, la Cour de discipline budgétaire et financière et les chambres régionales des comptes
in scheme: FINANCES PUBLIQUES
in scheme: Droit et Justice
in scheme: Juridiction
in scheme: Organisation Juridictionnelle
narrower: Cour des comptes
narrower: Cour des comptes européenne
narrower: Cour de discipline budgétaire et financière
notation: REFIP1495

déclaration d'utilité publique
type: ConceptReFip
type: Concept
alternative label: DUP
broader: propriété des personnes publiques
definition: Procédure administrative qui permet de réaliser une opération d'aménagement sur des terrains privés en les expropriant, précisément pour cause d'utilité publique. La DUP est obtenue à l'issue d'une enquête d'utilité publique.
in scheme: FINANCES PUBLIQUES
in scheme: Domaine
in scheme: Gestion Publique
narrower: expropriation pour cause d'utilité publique
narrower: enquête d'utilité publique
notation: REFIP1496

prescription décennale
type: ConceptReFip
type: Concept
broader: prescription
definition: Extinction de l'exercice d'un droit dans le délai de dix ans notamment en matière de garantie constructeur.
in scheme: FINANCES PUBLIQUES
in scheme: Droit et Justice
in scheme: Droit Général
notation: REFIP1498

maîtrise d'oeuvre
type: ConceptReFip
type: Concept
alternative label: maître d'oeuvre
broader: marché public
definition: Personne de droit privé ou groupement de personnes de droit privé chargée de définir la solution et les moyens techniques qu'elle devra mettre en œuvre pour réaliser, maintenir, voire exploiter le produit fini en conformité avec le cahier des charges établi par la maîtrise d'ouvrage.
in scheme: FINANCES PUBLIQUES
in scheme: Commande publique
in scheme: Gestion Publique
notation: REFIP15

compte prorata
type: ConceptReFip
type: Concept
alternative label: compte interentreprises
broader: exécution d'un marché public
definition: Compte mis en place lorsque plusieurs entreprises de divers corps de métier interviennent simultanément ou se succèdent sur un chantier.
in scheme: FINANCES PUBLIQUES
in scheme: Commande publique
in scheme: Gestion Publique
notation: REFIP1501

virus informatique
type: ConceptReFip
type: Concept
broader: informatique
definition: Programme malveillant destiné à endommager ou freiner le fonctionnement d'un système informatique.
in scheme: FINANCES PUBLIQUES
in scheme: Informatique
in scheme: Communication Documentation Informatique
notation: REFIP1502

éligibilité
type: ConceptReFip
type: Concept
alternative label: inéligibilité
broader: droit constitutionnel
definition: Aptitude à être élu, qui suppose la réunion de diverses conditions,
in scheme: FINANCES PUBLIQUES
in scheme: Droit et Justice
in scheme: Divisions du Droit
in scheme: Droit Public
notation: REFIP1503

Code de la sécurité sociale
type: ConceptReFip
type: Concept
broader: documentation juridique (non-descripteur)
definition: Recueil d'articles législatifs ou réglementaires, ayant pour fonction de déterminer le financement, l'organisation, le fonctionnement et le régime juridique général de la sécurité sociale.
in scheme: FINANCES PUBLIQUES
in scheme: Droit et Justice
in scheme: Documentation Juridique
in scheme: Sources du Droit
notation: REFIP1505

commerçant
type: ConceptReFip
type: Concept
broader: commerce
definition: Professionnel indépendant qui effectue des actes de commerce, à titre habituel, en son nom et pour son propre compte.
in scheme: FINANCES PUBLIQUES
in scheme: Branche d'activité
in scheme: Questions Economiques
in scheme: Commerce
narrower: refip-REFIP737
notation: REFIP1506

approvisionnement de caisse
type: ConceptReFip
type: Concept
broader: comptabilité de caisse
definition: Alimentation en numéraire de la caisse des comptables du Trésor, procédure propre à la fonction de caissier au sein de la DGFIP.
in scheme: FINANCES PUBLIQUES
in scheme: Comptabilité publique
in scheme: Comptabilité
notation: REFIP1507

application POLARIS
type: ConceptReFip
type: Concept
alternative label: POLARIS
broader: applications missions transverses (non-descripteur)
definition: Application permettant l'accès aux guides de procédure et aux référentiels de contrôle interne de la DGFIP.
in scheme: FINANCES PUBLIQUES
in scheme: Applications missions transverses
in scheme: Applications Informatiques
notation: REFIP1509

tableau de bord
type: ConceptReFip
type: Concept
broader: pilotage
definition: Outil d'aide au pilotage permettant de donner une vision synthétique des résultats des indicateurs en présentant les tendances (analyse rétrospective et éventuellement prospective), les facteurs explicatifs (exogènes, structurels, conjoncturels...), les marges de progrès et les éventuels leviers d'action mobilisés en concertation avec les pôles métiers.
in scheme: FINANCES PUBLIQUES
in scheme: Missions Transverses des Finances publiques
in scheme: Pilotage
notation: REFIP151

pétrole
type: ConceptReFip
type: Concept
broader: matières premières
definition: Huile minérale source d'énergie fossile, carburant.
in scheme: FINANCES PUBLIQUES
in scheme: Branche d'activité
in scheme: Questions Economiques
in scheme: Industrie
notation: REFIP1510

taxe sur les permis de conduire
type: ConceptReFip
type: Concept
broader: droits d'enregistrement
definition: Taxe exigible sur les permis de conduire des véhicules automobiles, des motocyclettes d'une cylindrée supérieure à 125 cm3 et tous autres véhicules à moteur. Elle est perçue au profit de la région.
in scheme: FINANCES PUBLIQUES
in scheme: Fiscalité
in scheme: Impôt
notation: REFIP1512

gîte rural
type: ConceptReFip
type: Concept
broader: tourisme
definition: Meublé de tourisme destiné à la location saisonnière.
in scheme: FINANCES PUBLIQUES
in scheme: Branche d'activité
in scheme: Questions Economiques
in scheme: Tourisme
notation: REFIP1513

dépenses de fonctionnement
type: ConceptReFip
type: Concept
alternative label: charges de fonctionnement
broader: dépenses de l'Etat
definition: Ensemble des dépenses de fonctionnement courant des services de l’État (achats, gestion immobilière, dépenses d’entretien, etc.), mais aussi les subventions pour charges de service public versées par l’État aux différents opérateurs des politiques publiques (universités, Pôle emploi).
in scheme: FINANCES PUBLIQUES
in scheme: Dépenses publiques
in scheme: Gestion Publique
narrower: frais de réception
narrower: frais de port
narrower: frais de fonctionnement
narrower: frais de représentation
narrower: frais de reprographie
notation: REFIP1514

Jura
type: ConceptReFip
type: Concept
broader: refip-REFIP7017
definition: Département français
in scheme: FINANCES PUBLIQUES
in scheme: Géographie
in scheme: Europe
notation: REFIP1516

état de l'actif
type: ConceptReFip
type: Concept
broader: documents comptables
definition: Document comptable permettant de suivre les évolutions de l'actif immobilisé (entrées, sorties etc), a une finalité différente de l'inventaire (tenu par l'ordonnateur et non le comptable).
in scheme: FINANCES PUBLIQUES
in scheme: Documents comptables
in scheme: Comptabilité
notation: REFIP1517

assignation comptable
type: ConceptReFip
type: Concept
alternative label: transfert d'assignation
alternative label: transfert d'assignation comptable
broader: procédures et techniques comptables (non-descripteur)
definition: Attribution des opérations comptables
in scheme: FINANCES PUBLIQUES
in scheme: Procédures et Techniques Comptables
in scheme: Comptabilité
notation: REFIP1518

application ACROPOLE
type: ConceptReFip
type: Concept
alternative label: ACROPOLE
alternative label: apports en capital remis aux opérateurs des politiques de l'Etat
broader: applications gestion publique (non-descripteur)
definition: Base de connaissances des pôles de soutien au réseau.
in scheme: FINANCES PUBLIQUES
in scheme: Applications Informatiques
in scheme: Applications gestion publique
notation: REFIP1519

Seine-et-Marne
type: ConceptReFip
type: Concept
broader: Ile-de-France
definition: Département français
in scheme: FINANCES PUBLIQUES
in scheme: Géographie
in scheme: Europe
notation: REFIP152

contrat de droit privé
type: ConceptReFip
type: Concept
broader: contrat
definition: Convention par laquelle une ou plusieurs personnes s'obligent envers une ou plusieurs autres personnes à créer, modifier, transmettre ou éteindre une obligation.
in scheme: FINANCES PUBLIQUES
in scheme: Droit et Justice
in scheme: Divisions du Droit
in scheme: Droit Privé
notation: REFIP1520

construction nouvelle
type: ConceptReFip
type: Concept
broader: construction
definition: Tout bâtiment ou, dans le cas des établissements industriels, tout ensemble de bâtiments qui se trouve édifié pour la première fois sur une parcelle de terrain non bâti (construction nouvelle proprement dite) ou construit en remplacement d'un immeuble préexistant préalablement démoli (reconstruction).
in scheme: FINANCES PUBLIQUES
in scheme: Branche d'activité
in scheme: Questions Economiques
in scheme: Construction
notation: REFIP1521

déduction des intérêts
type: ConceptReFip
type: Concept
broader: frais déductibles
definition: Concerne la déduction des intérêts d'emprunt en matière d'impôt sur le revenu (intérêts d'emprunt pour achat habitation ou pour reprise d'une société).
in scheme: FINANCES PUBLIQUES
in scheme: Liquidation de l'Impôt
in scheme: Fiscalité
notation: REFIP1522

application CEP
type: ConceptReFip
type: Concept
alternative label: CEP
broader: applications gestion publique (non-descripteur)
definition: Application de tenue des comptes au trésor pour les institutionnels.
in scheme: FINANCES PUBLIQUES
in scheme: Applications Informatiques
in scheme: Applications gestion publique
notation: REFIP1523

agence immobilière
type: ConceptReFip
type: Concept
alternative label: agent immobilier
broader: immobilier
definition: Commerce dont la fonction est de proposer ses services et moyens pour la négociation et le conseil en matière de biens immobiliers : vente et location, conseil en matière d'achat, estimation de biens.
in scheme: FINANCES PUBLIQUES
in scheme: Branche d'activité
in scheme: Questions Economiques
in scheme: Services et professions libérales
notation: REFIP1524

construction
type: ConceptReFip
type: Concept
broader: branche d'activité
definition: Activité de mise en œuvre ou d'installation sur le chantier d'un client et qui concerne aussi bien les travaux neufs que la rénovation, la réparation ou la maintenance.
in scheme: FINANCES PUBLIQUES
in scheme: Branche d'activité
in scheme: Questions Economiques
in scheme: Construction
narrower: géomètre topographe
narrower: construction nouvelle
narrower: entreprise de construction
narrower: rénovation de bâtiments
narrower: malfaçon
narrower: génie civil
narrower: construction navale
narrower: travaux publics
narrower: travaux d'entretien
narrower: travaux de construction
narrower: refip-REFIP727
narrower: refip-REFIP919
notation: REFIP1525
scope note: Secteur économique

relevé de condamnation pénale
type: ConceptReFip
type: Concept
alternative label: relevé de condamnation pécuniaire
broader: documentation fiscale (non-descripteur)
definition: Résumé d'un jugement rappelant les condamnations prononcées par la juridiction et notamment les condamnations pécuniaires dues au Trésor public.
in scheme: FINANCES PUBLIQUES
in scheme: Documentation Fiscale
in scheme: Fiscalité
notation: REFIP1526

tribunal des conflits
type: ConceptReFip
type: Concept
broader: juridiction
definition: Juridiction composée à parité, de membres du Conseil d'État et de la Cour de cassation. Il a pour mission de résoudre les conflits de compétence entre les juridictions de l'ordre judiciaire et les juridictions de l'ordre administratif et de prévenir un déni de justice dans le cas de contrariété de décisions définitives rendues, dans le même litige, par une juridiction de chacun des deux ordres.
in scheme: FINANCES PUBLIQUES
in scheme: Droit et Justice
in scheme: Juridiction
in scheme: Organisation Juridictionnelle
notation: REFIP1527
related: conflit de juridictions

incitation fiscale à l'investissement immobilier locatif (supprimé)
type: ConceptReFip
type: Concept
broader: ZZ
in scheme: FINANCES PUBLIQUES
notation: REFIP1528

messagerie électronique
type: ConceptReFip
type: Concept
alternative label: BALF
alternative label: BALF usagers
alternative label: BALP
alternative label: boite à lettre fonctionnelle
alternative label: boite à lettre personnelle
alternative label: messagerie
broader: outil collaboratif
definition: Service de transmission de messages envoyés électroniquement via un réseau informatique dans la boîte aux lettres électronique d’un destinataire choisi par l’émetteur.
in scheme: FINANCES PUBLIQUES
in scheme: Communication
in scheme: Communication Documentation Informatique
notation: REFIP153

régime de la taxe sur la valeur ajoutée agricole
type: ConceptReFip
type: Concept
alternative label: régime de la TVA agricole
broader: régime d'imposition
definition: Régime d'imposition des exploitants agricoles, susceptibles d'être soumis à deux régimes distincts d'imposition à la TVA : le régime général de cette taxe pour les activités de nature autre qu'agricole, et un régime d'imposition simplifié propre à l'agriculture pour leurs activités purement agricoles.
in scheme: FINANCES PUBLIQUES
in scheme: Régime d'Imposition
in scheme: Fiscalité
narrower: régime simplifié de l'agriculture
narrower: refip-REFIP93
notation: REFIP1530

documentation cadastrale
type: ConceptReFip
type: Concept
broader: cadastre
definition: Documentation composée d'une part de la documentation littérale (inscriptions foncières) renseignant sur les droits et les détenteurs de ces droits s'exerçant sur une propriété et, d'autre part, le plan cadastral, représentant la propriété foncière sous forme graphique et constituant le corollaire à la documentation littérale.
in scheme: FINANCES PUBLIQUES
in scheme: Cadastre
in scheme: Fiscalité
narrower: documentation foncière
narrower: plan cadastral
narrower: refip-REFIP7189
notation: REFIP1532

taxe sur les éditeurs et distributeurs de services de télévision (supprimé)
type: ConceptReFip
type: Concept
broader: ZZ
in scheme: FINANCES PUBLIQUES
notation: REFIP1534

garanties
type: ConceptReFip
type: Concept
broader: droit des obligations et contrats (non-descripteur)
definition: Moyens juridiques permettant de garantir le créancier contre le risque d'insolvabilité du débiteur.
in scheme: FINANCES PUBLIQUES
in scheme: Droit et Justice
in scheme: Divisions du Droit
in scheme: Droit Privé
narrower: garantie décennale
narrower: droit de suite
narrower: garantie d'emprunt
narrower: garantie conventionnelle de paiement
narrower: pacte commissoire
narrower: garantie biennale
narrower: dépôt de garantie
notation: REFIP1535

garantie décennale
type: ConceptReFip
type: Concept
alternative label: assurance de responsabilité décennale
alternative label: responsabilité décennale
broader: garanties
definition: Garantie d'une durée de 10 en matière de construction immobilière, le vendeur et les professionnels ayant exécuté les travaux sont responsables pendant cette période des dommages qui compromettent la solidité de l'ouvrage ou le rendent inhabitable.
in scheme: FINANCES PUBLIQUES
in scheme: Droit et Justice
in scheme: Divisions du Droit
in scheme: Droit Privé
notation: REFIP1536

retenue de garantie
type: ConceptReFip
type: Concept
broader: exécution d'un marché public
definition: Somme prélevée par fraction sur les acomptes versés au titulaire d’un marché, destinée à couvrir les éventuelles réserves formulées lors de l’admission ou de la réception des fournitures, services ou travaux, ainsi que celles pouvant surgir durant la période de garantie.
in scheme: FINANCES PUBLIQUES
in scheme: Commande publique
in scheme: Gestion Publique
notation: REFIP1537

qualité des données
type: ConceptReFip
type: Concept
broader: base de données
definition: Conformité des données aux usages prévus, dans les modes opératoires, les processus, les prises de décision, et la planification.
in scheme: FINANCES PUBLIQUES
in scheme: Informatique
in scheme: Communication Documentation Informatique
narrower: fiabilisation des données
narrower: doublon informatique
notation: REFIP1538

Caisse d'amortissement de la dette sociale
type: ConceptReFip
type: Concept
alternative label: CADES
broader: établissement public à caractère administratif
definition: Institution ayant pour objectif d’amortir la dette sociale, sa mission est de financer et d’apurer la dette cumulée du régime général de la Sécurité sociale. Elle émet des emprunts sur les marchés internationaux de capitaux en recherchant un financement au meilleur taux. La CADES est un établissement public placé sous la tutelle du ministère chargé du Budget et du ministère chargé des Affaires sociales.
in scheme: FINANCES PUBLIQUES
in scheme: Organisation Structurelle de l'Etat
in scheme: Opérateur de l'Etat
in scheme: Administration de L'Etat
notation: REFIP1539

Champagne-Ardenne (obsolète)
type: ConceptReFip
type: Concept
is replaced by: refip-REFIP7009
broader: ZZ
in scheme: FINANCES PUBLIQUES
notation: REFIP154

la Grenade
type: ConceptReFip
type: Concept
alternative label: Grenade
broader: Caraïbes
definition: Pays
in scheme: FINANCES PUBLIQUES
in scheme: Géographie
in scheme: Amérique
notation: REFIP1540

association de gestion et de comptabilité
type: ConceptReFip
type: Concept
alternative label: AGC
broader: refip-REFIP688
definition: Association loi 1901 qui succède aux Centres de gestion agréés et habilités (CGAH). L'AGC prend en charge l'ensemble des missions comptables allant de l'enregistrement des factures jusqu'à la réalisation du bilan et du compte de résultat. Elle peut également réaliser des missions juridiques telles la réalisation de statuts de sociétés ou prestations sociales telles que la rédaction de contrats de travail, bulletin de paie etc.
in scheme: FINANCES PUBLIQUES
in scheme: Entreprises
in scheme: Forme juridique
in scheme: Association
notation: REFIP1541

établissement public à caractère administratif
type: ConceptReFip
type: Concept
alternative label: EPA
broader: établissement public national
definition: Régime juridique d'un établissement public ayant une activité se service public administratif. Un EPA relève en principe du droit public administratif : son personnel est composé d’agents publics, ses décisions sont des actes administratifs et les conflits relèvent de la justice administrative sauf exception. Sont ainsi des EPA, les caisses nationales de la Sécurité sociale, Pôle Emploi ou quelques musées nationaux (ex : le musée du Louvre, le musée d’Orsay, le château de Versailles)
in scheme: FINANCES PUBLIQUES
in scheme: Organisation Structurelle de l'Etat
in scheme: Opérateur de l'Etat
in scheme: Administration de L'Etat
narrower: Météo France
narrower: fonds de réserve pour les retraites
narrower: Agence nationale des titres sécurisés
narrower: Caisse de garantie du logement locatif social
narrower: Caisse d'amortissement de la dette sociale
narrower: centre d'éducation populaire et de sport
narrower: Centre national de la fonction publique territoriale
narrower: association foncière de remembrement
narrower: Centre national pour le développement du sport
narrower: Agence nationale des fréquences
narrower: Agence de services et de paiement
narrower: Institut français du cheval et de l'équitation
narrower: conservatoire de l'espace littoral et des rivages lacustres
narrower: Office national de la chasse et de la faune sauvage
narrower: Institut d'émission d'outre-mer
narrower: Etablissement de retraite additionnelle de la fonction publique
narrower: Agence de gestion et de recouvrement des avoirs saisis et confisqués
narrower: association syndicale autorisée
narrower: Centre national des œuvres universitaires et scolaires
narrower: Fonds de financement de la protection complémentaire de la couverture universelle du risque maladie
narrower: Agence de l'eau
narrower: Office français de l'immigration et de l'intégration
narrower: Caisse nationale d'allocations familiales
narrower: Centre national du cinéma et de l'image animée
narrower: Caisse nationale de retraite des agents des collectivités locales
narrower: Ecole nationale d'administration
narrower: Caisse de la dette publique
narrower: Institut d'émission des départements d'outre-mer
narrower: voies navigables de France
narrower: Ecole nationale de la magistrature
narrower: fonds de solidarité vieillesse
narrower: Institut national de l'information géographique et forestière
narrower: Pôle Emploi
narrower: Centre des monuments nationaux
narrower: Institut national de prévention et d'éducation pour la santé
narrower: Agence nationale de la recherche
narrower: Agence régionale de santé
narrower: fonds de solidarité
narrower: FranceAgriMer
narrower: refip-REFIP655
narrower: refip-REFIP7079
narrower: refip-REFIP709
narrower: refip-REFIP781
narrower: refip-REFIP834
notation: REFIP1542

plus-value immobilière
type: ConceptReFip
type: Concept
broader: revenu du patrimoine
definition: Plus-value réalisée sur la vente d'un bien immobilier et imposable sous certaines conditions.
in scheme: FINANCES PUBLIQUES
in scheme: Champ d'Application
in scheme: Fiscalité
notation: REFIP1543

contrôle interne
type: ConceptReFip
type: Concept
broader: maîtrise des risques
definition: Ensemble des dispositifs ou processus organisés, formalisés et permanents, choisis par l’encadrement et mis en œuvre par les opérationnels de tous niveaux pour maîtriser le fonctionnement de leurs activités en vue de fournir une assurance raisonnable quant à la réalisation de leurs objectifs.
in scheme: FINANCES PUBLIQUES
in scheme: Missions Transverses des Finances publiques
in scheme: Maîtrise des risques
narrower: contrôle interne de deuxième niveau
narrower: contrôle interne budgétaire
narrower: contrôle interne bancaire
narrower: contrôle comptable
narrower: plan de contrôle
narrower: contrôle a priori
narrower: contrôle financier déconcentré
narrower: contrôle financier
narrower: axe de contrôle interne
narrower: contrôle interne comptable
narrower: contrôle interne comptable et financier
narrower: référentiel de contrôle interne
narrower: contrôle interne de premier niveau
narrower: contrôle budgétaire
narrower: diagnostic
narrower: refip-REFIP715
narrower: refip-REFIP7161
narrower: refip-REFIP7183
narrower: refip-REFIP954
notation: REFIP1544

unité opérationnelle
type: ConceptReFip
type: Concept
broader: exécution du budget
definition: Déclinaison d'un budget opérationnel de programme (BOP) mettant en œuvre les activités à mener pour les politiques publiques portées par le programme.
in scheme: FINANCES PUBLIQUES
in scheme: Exécution du budget
in scheme: Budget
notation: REFIP1546

indice national du coût de la construction
type: ConceptReFip
type: Concept
broader: économie générale (non-descripteur)
definition: Indicateur permettant de mesurer l'évolution des prix de construction des bâtiments neufs à usage principal d'habitation. Il sert à la révision de certains loyer et est publié chaque trimestre par l'Insee.
in scheme: FINANCES PUBLIQUES
in scheme: Questions Economiques
in scheme: Economie générale
notation: REFIP1547

régime suspensif douanier
type: ConceptReFip
type: Concept
broader: régime d'imposition
definition: Régime permettant de réaliser un certain nombre d'opérations à l'importation ou à l'exportation en suspension de TVA. Il remplace depuis le 1er janvier 2011 les trois régimes d'entrepôt fiscal suspensifs de TVA existant jusqu'ici : l'entrepôt national d'exportation (ENE), l'entrepôt national d'importation (ENI) et le régime du perfectionnement actif national (PAN).
in scheme: FINANCES PUBLIQUES
in scheme: Régime d'Imposition
in scheme: Fiscalité
notation: REFIP1549

centre d'éducation populaire et de sport
type: ConceptReFip
type: Concept
alternative label: CREPS
broader: établissement public à caractère administratif
definition: Etablissement public à caractère administratif placé sous la tutelle du ministère des Sports, qui participe à la formation d'animateurs et d'agents publics, ainsi qu'à l'entraînement et à l'accompagnement de sportifs de haut niveau.
in scheme: FINANCES PUBLIQUES
in scheme: Organisation Structurelle de l'Etat
in scheme: Opérateur de l'Etat
in scheme: Administration de L'Etat
notation: REFIP155

service annexe d'hébergement des établissements publics locaux d'enseignement
type: ConceptReFip
type: Concept
alternative label: hébergement des élèves
alternative label: internat
broader: établissement public local d'enseignement
definition: Service accueillant des élèves internes ou demi-pensionnaires, peut être annexé à un collège, à un lycée ou à un établissement d'éducation spéciale. Il concourt à l'amélioration des conditions de vie dans les établissements et est intégré au projet d'établissement. Les dépenses de fonctionnement du service annexe d'hébergement sont entièrement supportées par les familles et par l'Etat.
in scheme: FINANCES PUBLIQUES
in scheme: Organisation Territoriale
in scheme: Structures Territoriales
in scheme: Administration de L'Etat
notation: REFIP1550

sursis légal de paiement
type: ConceptReFip
type: Concept
broader: réclamation suspensive de paiement
definition: Droit du contribuable de différer le paiement des impositions qu'il conteste, sur demande expresse, dans le cadre d'une réclamation contentieuse régulière
in scheme: FINANCES PUBLIQUES
in scheme: Contentieux Fiscal
in scheme: Fiscalité
notation: REFIP1551

report d'imposition
type: ConceptReFip
type: Concept
broader: base d'imposition
definition: Différé d'imposition concernant les plus-values générées notamment lors d'opérations d'apport en société ou de restructuration de groupe.
in scheme: FINANCES PUBLIQUES
in scheme: Champ d'Application
in scheme: Fiscalité
notation: REFIP1552

comptabilité M 71
type: ConceptReFip
type: Concept
broader: comptabilité publique locale
definition: Instruction budgétaire et comptable M 71 applicable aux régions.
in scheme: FINANCES PUBLIQUES
in scheme: Secteur public local
in scheme: Gestion Publique
notation: REFIP1553

fonds social européen
type: ConceptReFip
type: Concept
alternative label: FSE
broader: fonds européens structurels et d'investissement
definition: Levier financier de l’Union européenne pour la promotion de l’emploi, dont l'objectif est de soutenir la création d’emplois de meilleure qualité dans l’UE et d’améliorer les perspectives professionnelles des citoyens (jeunes, demandeurs d’emploi, inactifs, handicapés, salariés étudiants etc.), prioritairement en direction des groupes les moins qualifiés et les plus exposés au chômage et à l’exclusion.
in scheme: FINANCES PUBLIQUES
in scheme: Dépenses publiques
in scheme: Gestion Publique
notation: REFIP1556

démembrement de propriété
type: ConceptReFip
type: Concept
alternative label: démembrement
alternative label: démembrement du droit de propriété
alternative label: morcellement
alternative label: morcellement du droit de propriété
broader: droit de propriété
definition: Situation caractérisée par la répartition des attributs du droit de propriété entre plusieurs titulaires de droits réels.
in scheme: FINANCES PUBLIQUES
in scheme: Droit et Justice
in scheme: Divisions du Droit
in scheme: Droit Privé
narrower: nue-propriété
narrower: usufruit
notation: REFIP1557

Hauts-de-Seine
type: ConceptReFip
type: Concept
broader: Ile-de-France
definition: Département français
in scheme: FINANCES PUBLIQUES
in scheme: Géographie
in scheme: Europe
notation: REFIP1558

droit de reproduction
type: ConceptReFip
type: Concept
broader: propriété intellectuelle
definition: Droit exclusif de l’auteur (ou de ses ayants droit pendant les 60 années suivant sa mort) d’autoriser la fixation matérielle de l’œuvre par tous procédés permettant de la communiquer au public de manière indirecte, et notamment par photocopie, imprimerie, dessin, photographie, enregistrement mécanique, magnétique ou cinématographique.
in scheme: FINANCES PUBLIQUES
in scheme: Droit et Justice
in scheme: Divisions du Droit
in scheme: Droit Privé
notation: REFIP1559

comptabilité matières
type: ConceptReFip
type: Concept
broader: comptabilité publique
definition: Type de comptabilité spéciale des matières, valeurs et titres ayant pour objet la description des existants et des mouvements concernant : les stocks de marchandises ; les matériels et objets mobiliers ; les titres nominatifs, au porteur ou à ordre et les valeurs diverses appartenant ou confiés aux organismes publics, ainsi que les objets qui leur sont remis en dépôt ; les formules, titres, tickets, cartes, timbres et vignettes destinés à l’émission et à la vente.
in scheme: FINANCES PUBLIQUES
in scheme: Comptabilité publique
in scheme: Comptabilité
narrower: valeurs inactives
notation: REFIP156

Direction interministérielle pour la modernisation de l'action publique (supprimé)
type: ConceptReFip
type: Concept
broader: ZZ
in scheme: FINANCES PUBLIQUES
notation: REFIP1560

mer
type: ConceptReFip
type: Concept
alternative label: milieu maritime
alternative label: océan
broader: milieu naturel
definition: Grande étendue d'eau salée.
in scheme: FINANCES PUBLIQUES
in scheme: Environnement
in scheme: Milieu Naturel
in scheme: Questions de Société
notation: REFIP1561

imposition forfaitaire sur les entreprises de réseaux
type: ConceptReFip
type: Concept
alternative label: IFER
broader: autres taxes, droits ou redevances (non-descripteur)
definition: Imposition annuelle perçue au profit des collectivités territoriales et de leurs EPCI, constituée de neuf composantes, chacune correspondant à une catégorie de biens, principalement dans le secteur de l'énergie, du transport ferroviaire et des télécommunications.
in scheme: FINANCES PUBLIQUES
in scheme: Fiscalité
in scheme: Impôt
narrower: imposition forfaitaire sur le matériel roulant utilisé sur le réseau ferré national pour les opérations de transport de voyageurs
narrower: imposition forfaitaire sur les stations radioélectriques
narrower: imposition forfaitaire sur les installations terrestres de production d'électricité utilisant l'énergie mécanique du vent
narrower: imposition forfaitaire sur les répartiteurs principaux de la boucle locale cuivre
narrower: imposition forfaitaire sur les transformateurs électriques
narrower: imposition forfaitaire sur les centrales de production d'énergie électrique d'origine photovoltaïque ou hydraulique
narrower: imposition forfaitaire sur les centrales de production d'énergie électrique d'origine nucléaire ou thermique à flamme
notation: REFIP1563

monument funéraire
type: ConceptReFip
type: Concept
alternative label: pierre tombale
alternative label: sépulture
alternative label: tombe
broader: refip-REFIP86
definition: Lieu où sont déposés les défunts après des obsèques.
in scheme: FINANCES PUBLIQUES
in scheme: Domaine
in scheme: Gestion Publique
notation: REFIP1566
related: concession funéraire

donation
type: ConceptReFip
type: Concept
broader: mutation à titre gratuit
definition: Libéralité devant être déclarée à l'administration fiscale par le bénéficiaire ou le notaire.
in scheme: FINANCES PUBLIQUES
in scheme: Champ d'Application
in scheme: Fiscalité
narrower: donation-partage
narrower: donation en pleine propriété
narrower: donation indirecte
narrower: refip-REFIP7171
narrower: refip-REFIP7172
notation: REFIP1567

contribution de sécurité immobilière
type: ConceptReFip
type: Concept
broader: droits d'enregistrement
definition: Due à l’État, auprès des services de publicité foncière, par toute personne qui requiert l'accomplissement des formalités civiles prévues pour la publicité des privilèges et des hypothèques ainsi que l'exécution de la formalité fusionnée de publicité foncière et d'enregistrement.
in scheme: FINANCES PUBLIQUES
in scheme: Fiscalité
in scheme: Impôt
notation: REFIP1568
scope note: Remplace le salaire du conservateur des hypothèques à compter du 1er janvier 2013

vente en l'état futur d'achèvement
type: ConceptReFip
type: Concept
alternative label: VEFA
alternative label: immeuble en état futur d'achèvement
broader: vente à terme
definition: Contrat par lequel le vendeur transfère immédiatement à l'acquéreur ses droits sur le sol ainsi que la propriété des constructions existantes. Les ouvrages à venir deviennent la propriété de l'acquéreur au fur et à mesure de leur exécution.
in scheme: FINANCES PUBLIQUES
in scheme: Droit et Justice
in scheme: Divisions du Droit
in scheme: Droit Privé
notation: REFIP157

Oise
type: ConceptReFip
type: Concept
broader: refip-REFIP7010
definition: Département français
in scheme: FINANCES PUBLIQUES
in scheme: Géographie
in scheme: Europe
notation: REFIP1571

Centre national de la fonction publique territoriale
type: ConceptReFip
type: Concept
alternative label: CNFPT
broader: établissement public à caractère administratif
definition: Etablissement public à caractère administratif chargé de construire et délivrer les formations obligatoires des agents territoriaux, de catégories A, B et C. Le CNFPT conçoit et dispense également des formations non obligatoires : les formations de perfectionnement, les formations diplômantes ou certifiantes, les préparations aux concours et examens professionnels de la fonction publique territoriale. Il organise également certains concours de la fonction publique territoriale.
in scheme: FINANCES PUBLIQUES
in scheme: Organisation Structurelle de l'Etat
in scheme: Opérateur de l'Etat
in scheme: Administration de L'Etat
notation: REFIP1572

entité sans personnalité morale
type: ConceptReFip
type: Concept
alternative label: fonds sans personnalité morale
alternative label: société créée de fait
alternative label: société de fait
alternative label: société en participation
alternative label: société sans personnalité morale
broader: société
definition: Type de société définie et régie par le Code Civil (art 1871 à 1873). Les associés peuvent convenir que la société ne sera point immatriculée. Elle n'est pas morale et n'est soumise à publicité. Elle peut être prouvée par tous moyens.
in scheme: FINANCES PUBLIQUES
in scheme: Société
in scheme: Entreprises
in scheme: Forme juridique
narrower: convention d'exercice conjoint
narrower: refip-REFIP7042
notation: REFIP1573

Niger
type: ConceptReFip
type: Concept
broader: Afrique
definition: Pays
in scheme: FINANCES PUBLIQUES
in scheme: Géographie
in scheme: Afrique
notation: REFIP1575

application REQUETES foncières
type: ConceptReFip
type: Concept
alternative label: application CATALOGUE
broader: applications fiscales (non-descripteur)
definition: Application permettant de produire des listes thématiques de données foncières.
in scheme: FINANCES PUBLIQUES
in scheme: Applications Informatiques
in scheme: Applications fiscales
notation: REFIP1577

conformité absolue
type: ConceptReFip
type: Concept
broader: publicité foncière
definition: Règle applicable pour la délivrance de renseignements selon laquelle le service de publicité foncière n'est tenu de révéler que les seules formalités concernant les entités (personnes/immeubles) entièrement concordantes avec celles de la réquisition.
in scheme: FINANCES PUBLIQUES
in scheme: Champ d'Application
in scheme: Fiscalité
notation: REFIP1578
scope note: Publicité foncière

convention de règlement
type: ConceptReFip
type: Concept
broader: paiement de la dépense (non-descripteur)
definition: Acte permettant l'exécution de dépenses récurrentes par l'intermédiaire d'une programmation financière établie dès l'engagement juridique.
in scheme: FINANCES PUBLIQUES
in scheme: Dépenses publiques
in scheme: Gestion Publique
narrower: plan de facturation
notation: REFIP1579

compte budgétaire
type: ConceptReFip
type: Concept
broader: comptabilité budgétaire
definition: Nature de dépense et de recette en comptabilité budgétaire. Chaque compte budgétaire est un regroupement de comptes comptables de charges et de produits.
in scheme: FINANCES PUBLIQUES
in scheme: Exécution du budget
in scheme: Budget
notation: REFIP158

fioul
type: ConceptReFip
type: Concept
alternative label: fuel
alternative label: mazout
broader: combustible
definition: Combustible dérivé du pétrole, utilisé notamment dans les chaudières.
in scheme: FINANCES PUBLIQUES
in scheme: Branche d'activité
in scheme: Questions Economiques
in scheme: Industrie
notation: REFIP1580

Caisse nationale d'assurance vieillesse des travailleurs salariés
type: ConceptReFip
type: Concept
alternative label: CNAV
alternative label: CNAVTS
alternative label: Caisse nationale de l'assurance vieillesse
broader: organisme de sécurité sociale
definition: Etablissement public à caractère administratif qui gère l'assurance vieillesse des travailleurs salariés (hors secteur agricole et fonction publique), plus couramment Caisse nationale de l'assurance vieillesse (CNAV). Il exerce une action sanitaire et sociale en faveur de ces derniers dans le cadre d'un programme fixé par arrêté ministériel.
in scheme: FINANCES PUBLIQUES
in scheme: Organisation Structurelle de l'Etat
in scheme: Organisme de Sécurité Sociale
in scheme: Administration de L'Etat
notation: REFIP1581

forces armées
type: ConceptReFip
type: Concept
alternative label: Armée de l'air
alternative label: Armée de terre
alternative label: Marine nationale
alternative label: armées
broader: refip-REFIP7076
definition: Force militaire chargée de la défense du pays et de la protection des intérêts nationaux de la France. Les forces armées sont composées de l'armée de terre, l'armée de l'air, la marine nationale, la gendarmerie nationale ainsi que les services de soutien et les organismes interarmées.
in scheme: FINANCES PUBLIQUES
in scheme: Organisation Structurelle de l'Etat
in scheme: Ministère
in scheme: Administration de L'Etat
notation: REFIP1583
related: gendarmerie nationale

aide pour la création d'entreprise nouvelle
type: ConceptReFip
type: Concept
alternative label: aide aux petites entreprises nouvellement créées
alternative label: aide aux petites entreprises nouvelles
broader: aide à finalité régionale
definition: Dispositif d'aides aux entreprises mis en place à l'initiative de l’État ou des collectivités territoriales. Les principales sont les aides financières, les allègements fiscaux, les exonérations de charges sociales, l'aide au conseil, la mise à disposition de locaux.
in scheme: FINANCES PUBLIQUES
in scheme: Dépenses publiques
in scheme: Gestion Publique
notation: REFIP1584

participation financière des salariés aux résultats de l'entreprise
type: ConceptReFip
type: Concept
alternative label: accord de participation
alternative label: participation aux résultats de l'entreprise
alternative label: participation des salariés
alternative label: participation des salariés aux résultats de l'entreprise
alternative label: prime de participation
broader: épargne salariale
definition: Dispositif prévoyant la redistribution d'une partie des bénéfices de l'entreprise au profit des salariés. Elle est obligatoire uniquement dans certaines entreprises. Le salarié perçoit une prime dont le montant dépend des règles fixées par l'accord de participation. Le salarié peut demander le versement immédiat des sommes. À défaut, elles sont indisponibles pendant 5 ans. L'accord indique comment les sommes peuvent être placées.
in scheme: FINANCES PUBLIQUES
in scheme: Gestion de l'Entreprise
in scheme: Entreprises
in scheme: Vie et Gestion de l'entreprise
narrower: intéressement aux bénéfices
notation: REFIP1585

barème kilométrique forfaitaire
type: ConceptReFip
type: Concept
alternative label: barème forfaitaire spécifique
broader: barème kilométrique
definition: Barème forfaitaire spécifique aux exploitants tenant une comptabilité super-simplifiée. Il est utilisé en cas d'utilisation mixte (professionnelle et personnelle) d'une voiture par les entrepreneurs individuels remplissant certaines conditions.
in scheme: FINANCES PUBLIQUES
in scheme: Liquidation de l'Impôt
in scheme: Fiscalité
narrower: refip-REFIP815
notation: REFIP1586

crédit d'impôt apprentissage
type: ConceptReFip
type: Concept
alternative label: crédit d'impôt en faveur de l'apprentissage
alternative label: crédit d'impôt pour emploi d'apprentis
broader: refip-REFIP849
definition: Dispositif dont peuvent bénéficier les entreprises imposées d'après leur bénéfice réel et qui emploient des apprentis.
in scheme: FINANCES PUBLIQUES
in scheme: Liquidation de l'Impôt
in scheme: Fiscalité
notation: REFIP1588

pièce comptable
type: ConceptReFip
type: Concept
broader: documents comptables
definition: Document qui justifie tout mouvement de fonds au sein d'une structure. Elle sert de base pour faire l’enregistrement d’une opération dans un journal comptable.
in scheme: FINANCES PUBLIQUES
in scheme: Documents comptables
in scheme: Comptabilité
narrower: document administratif unique
narrower: bon de livraison
narrower: bon de commande
narrower: facture
narrower: bon de réduction
notation: REFIP1589

déduction de la taxe sur la valeur ajoutée
type: ConceptReFip
type: Concept
alternative label: déduction de TVA
broader: refip-REFIP94
definition: En contrepartie de l'obligation des professionnels de collecter la TVA sur leurs ventes ou prestations, ils peuvent déduire la TVA payée sur les achats réalisés dans le cadre de leur activité professionnelle sous certaines conditions. Avec ce mécanisme de déduction, seule la TVA nette correspondant à la valeur ajoutée créée par l'entreprise est reversée.
in scheme: FINANCES PUBLIQUES
in scheme: Liquidation de l'Impôt
in scheme: Fiscalité
notation: REFIP159

Fonds national de développement et de modernisation de l'apprentissage
type: ConceptReFip
type: Concept
broader: fonds (non-descripteur)
definition: Fonds ayant pour mission d’assurer la péréquation inter-régionale entre les CFA et le financement des contrats d’objectifs et de moyens avec les Régions visant au développement de l’apprentissage.
in scheme: FINANCES PUBLIQUES
in scheme: Dépenses publiques
in scheme: Gestion Publique
notation: REFIP1592

amendement agricole
type: ConceptReFip
type: Concept
broader: travaux agricoles
definition: Apport d'un produit fertilisant ou d'un matériau destiné à améliorer la qualité des sols.
in scheme: FINANCES PUBLIQUES
in scheme: Branche d'activité
in scheme: Questions Economiques
in scheme: Agriculture
notation: REFIP1593

plan national de contrôle interne
type: ConceptReFip
type: Concept
alternative label: PNCI
broader: plan de contrôle
definition: Document formalisant les orientations nationales de contrôle interne de la DGFiP, définies au sein du Comité national de maîtrise des risques par le directeur général des finances publiques.
in scheme: FINANCES PUBLIQUES
in scheme: Missions Transverses des Finances publiques
in scheme: Maîtrise des risques
notation: REFIP1594

bénéfice net (supprimé)
type: ConceptReFip
type: Concept
broader: ZZ
in scheme: FINANCES PUBLIQUES
notation: REFIP1595

application FLORE
type: ConceptReFip
type: Concept
broader: applications missions transverses (non-descripteur)
definition: Outil de gestion de la formation de la DGFIP.
in scheme: FINANCES PUBLIQUES
in scheme: Applications missions transverses
in scheme: Applications Informatiques
notation: REFIP1597

contribution économique territoriale
type: ConceptReFip
type: Concept
broader: impôt direct local
definition: Composée de la cotisation foncière des entreprises (CFE) et de la cotisation sur la valeur ajoutée des entreprises (CVAE), elle remplace depuis 2010 la taxe professionnelle sur les équipements et biens mobiliers (TP), à laquelle étaient soumises les entreprises et les personnes physiques ou morales qui exercent une activité professionnelle non salariée.
in scheme: FINANCES PUBLIQUES
in scheme: Fiscalité
in scheme: Impôt
narrower: cotisation sur la valeur ajoutée des entreprises
narrower: cotisation foncière des entreprises
notation: REFIP1599
scope note: Remplace la taxe professionnelle par loi de finances pour 2010 n° 2009-1673 du 30/12/2009

opération de trésorerie
type: ConceptReFip
type: Concept
broader: procédures et techniques comptables (non-descripteur)
definition: Mouvement de numéraires, de valeurs mobilisables, de comptes de dépôts et de comptes courants et les opérations intéressant les comptes de créances et de dettes.
in scheme: FINANCES PUBLIQUES
in scheme: Procédures et Techniques Comptables
in scheme: Comptabilité
notation: REFIP160

Aube
type: ConceptReFip
type: Concept
broader: refip-REFIP7009
definition: Département français
in scheme: FINANCES PUBLIQUES
in scheme: Géographie
in scheme: Europe
notation: REFIP1600
scope note: Département

droit de suite
type: ConceptReFip
type: Concept
broader: garanties
definition: Prérogative qui appartient à un créancier hypothécaire ou privilégié d'exercer ses droits sur un bien en quelque main qu'il se trouve même entre les mains d'un tiers acquéreur.
in scheme: FINANCES PUBLIQUES
in scheme: Droit et Justice
in scheme: Divisions du Droit
in scheme: Droit Privé
notation: REFIP1601

créancier privilégié
type: ConceptReFip
type: Concept
broader: créancier
definition: Créancier qui, en raison de la nature de son droit personnel, peut obtenir paiement avant d'autres créanciers et bénéficie d'un rang déterminé par la loi (en opposition au créancier chirographaire).
in scheme: FINANCES PUBLIQUES
in scheme: Droit et Justice
in scheme: Divisions du Droit
in scheme: Droit Privé
narrower: créancier nanti
narrower: créancier hypothécaire
notation: REFIP1602

valeurs inactives
type: ConceptReFip
type: Concept
broader: comptabilité matières
definition: Valeurs, autres que le numéraire, qui sont déposées par des tiers et qui n'entrent pas, par conséquent, dans la situation patrimoniale de l’État, de la collectivité ou de l'établissement.
in scheme: FINANCES PUBLIQUES
in scheme: Comptabilité publique
in scheme: Comptabilité
notation: REFIP1603

droit d'accroissement (supprimé)
type: ConceptReFip
type: Concept
broader: ZZ
in scheme: FINANCES PUBLIQUES
notation: REFIP1604

déclaration des cotisations sociales (supprimé)
type: ConceptReFip
type: Concept
broader: ZZ
in scheme: FINANCES PUBLIQUES
notation: REFIP1606

association des régimes de retraites complémentaires
type: ConceptReFip
type: Concept
alternative label: ARRCO
broader: organisme de sécurité sociale
definition: Personne morale de droit privé à but non lucratif qui remplit une mission d’intérêt général gérant le régime de retraite complémentaire de l’ensemble des salariés du secteur privé de l’industrie, du commerce, des services et de l’agriculture, cadres compris. Elle a pour missions d’informer, de coordonner et de contrôler les institutions Arrco, de centraliser les résultats statistiques et financiers et de réaliser les prévisions.
in scheme: FINANCES PUBLIQUES
in scheme: Organisation Structurelle de l'Etat
in scheme: Organisme de Sécurité Sociale
in scheme: Administration de L'Etat
notation: REFIP1607

Ukraine
type: ConceptReFip
type: Concept
broader: Europe
definition: Pays
in scheme: FINANCES PUBLIQUES
in scheme: Géographie
in scheme: Europe
notation: REFIP1608

Hongrie
type: ConceptReFip
type: Concept
broader: Europe
definition: Pays
in scheme: FINANCES PUBLIQUES
in scheme: Géographie
in scheme: Europe
notation: REFIP1609

application EVCLI
type: ConceptReFip
type: Concept
alternative label: EVCLI
broader: applications gestion publique (non-descripteur)
definition: Application Banque de France de tenue de compte des clients institutionnels de la Banque.
in scheme: FINANCES PUBLIQUES
in scheme: Applications Informatiques
in scheme: Applications gestion publique
notation: REFIP1610

déclaration d'indisponibilité du certificat d'immatriculation (supprimé)
type: ConceptReFip
type: Concept
broader: ZZ
in scheme: FINANCES PUBLIQUES
notation: REFIP1611

loi
type: ConceptReFip
type: Concept
broader: législation
definition: Règle de droit écrite, générale et permanente, adoptée par le parlement dans son domaine de compétence, au sens strict.
in scheme: FINANCES PUBLIQUES
in scheme: Droit et Justice
in scheme: Sources du Droit
in scheme: Sources du Droit Objectif
narrower: loi d'orientation
narrower: loi de modernisation de l'économie
narrower: loi en faveur du travail de l'emploi et du pouvoir d'achat
narrower: loi constitutionnelle
narrower: loi-cadre
narrower: loi organique
notation: REFIP1614

évaluation forfaitaire
type: ConceptReFip
type: Concept
broader: liquidation de l'impôt
definition: Modalités d'évaluation selon des barèmes prévus dans certains cas (barème kilométrique, évaluation forfaitaire des éléments du train de vie etc.).
in scheme: FINANCES PUBLIQUES
in scheme: Liquidation de l'Impôt
in scheme: Fiscalité
narrower: élément du train de vie
narrower: barème kilométrique
narrower: barème de taxation
notation: REFIP1615

acte anormal de gestion
type: ConceptReFip
type: Concept
alternative label: acte de gestion
broader: fraude fiscale
definition: Acte de gestion apparaissant contraire aux intérêt s de l’entreprise. L’acte en question, sur le plan fiscal, peut se traduire par des charges imputées à l’entreprise sans contreparties suffisantes, imputation ayant pour effet de réduire le résultat imposable. L’administration peut contester telle ou telle déduction opérée qui ne paraît pas relever d’une gestion commerciale normale.
in scheme: FINANCES PUBLIQUES
in scheme: Droit de Contrôle de l'Administration
in scheme: Fiscalité
notation: REFIP1616

travailleur migrant (supprimé)
type: ConceptReFip
type: Concept
broader: ZZ
in scheme: FINANCES PUBLIQUES
notation: REFIP1617

application CORIOLIS
type: ConceptReFip
type: Concept
alternative label: CORIOLIS
broader: applications gestion publique (non-descripteur)
definition: Application permettant le suivi de la comptabilité des régies diplomatiques et consulaires dans le cadre de la trajectoire comptable CHORUS.
in scheme: FINANCES PUBLIQUES
in scheme: Applications Informatiques
in scheme: Applications gestion publique
notation: REFIP1618

application BDRP
type: ConceptReFip
type: Concept
alternative label: BDRP
alternative label: base de données des redevables professionnels
broader: applications fiscales (non-descripteur)
definition: Base de données des redevables professionnels permettant leur gestion. Cette application est progressivement remplacée par l'application « GESPRO ».
in scheme: FINANCES PUBLIQUES
in scheme: Applications Informatiques
in scheme: Applications fiscales
notation: REFIP1619

procès-verbal de réception des travaux
type: ConceptReFip
type: Concept
alternative label: EXE4
alternative label: formulaire EXE4
broader: réception de travaux
definition: Acte, daté et signé par le client, visé par l'entreprise par lequel le client déclare accepter l’ouvrage avec ou sans réserve. Il est obligatoire et essentiel pour tous les travaux relevant de l’assurance décennale.
in scheme: FINANCES PUBLIQUES
in scheme: Commande publique
in scheme: Gestion Publique
notation: REFIP162

propre assureur
type: ConceptReFip
type: Concept
broader: droit administratif
definition: Provision constituée par l'entreprise qui prend elle-même en charge la part de certains risques non couverte par une assurance
in scheme: FINANCES PUBLIQUES
in scheme: Droit et Justice
in scheme: Divisions du Droit
in scheme: Droit Public
notation: REFIP1620

régime déclaratif spécial
type: ConceptReFip
type: Concept
alternative label: micro BNC
broader: régime d'imposition
definition: Régime fiscal concernant les contribuables qui perçoivent des revenus non commerciaux dont les recettes annuelles n'excèdent pas la limite prévue au Code Général des Impôts et qui, lorsqu'ils exercent une activité soumise à la TVA, bénéficient de la franchise en base de TVA prévue au CGI.
in scheme: FINANCES PUBLIQUES
in scheme: Régime d'Imposition
in scheme: Fiscalité
notation: REFIP1622

Morbihan
type: ConceptReFip
type: Concept
broader: refip-REFIP957
definition: Département français
in scheme: FINANCES PUBLIQUES
in scheme: Géographie
in scheme: Europe
notation: REFIP1623

codification SAGES
type: ConceptReFip
type: Concept
alternative label: code SAGES
broader: codification
definition: Identification au moyen du code SAGES (Système Automatisé de Gestion des Emplois et des Services) des structures DGFiP.
in scheme: FINANCES PUBLIQUES
in scheme: Documentation
in scheme: Communication Documentation Informatique
notation: REFIP1625

commande hors marché
type: ConceptReFip
type: Concept
broader: commande publique
definition: Prestation due par les collectivités publiques qui, lorsqu'elles n'excèdent pas un certain seuil peuvent être réglées sur présentation de simples factures ou mémoires, sans conclure un marché.
in scheme: FINANCES PUBLIQUES
in scheme: Commande publique
in scheme: Gestion Publique
notation: REFIP1627
related: lettre de commande

Norvège
type: ConceptReFip
type: Concept
broader: Europe
definition: Pays
in scheme: FINANCES PUBLIQUES
in scheme: Géographie
in scheme: Europe
notation: REFIP1628

fusion de communes
type: ConceptReFip
type: Concept
broader: réforme de l'Etat
definition: Unification en une seule commune de plusieurs communes jusqu’alors distinctes. Elle ne peut intervenir qu’entre communes limitrophes et entraîne la disparition de la personnalité morale de l’ensemble des communes concernées pour donner naissance à une personne juridique nouvelle et différente. Elle peut prendre deux formes distinctes : celle de la fusion simple et celle de la fusion-association.
in scheme: FINANCES PUBLIQUES
in scheme: Etat
in scheme: Réforme de l'Etat
in scheme: Administration de L'Etat
notation: REFIP1629

radiation d'hypothèque
type: ConceptReFip
type: Concept
broader: hypothèque
definition: Opération consistant à supprimer l'inscription hypothécaire au moyen d'une mention en marge, à la diligence du responsable du Bureau des hypothèques.
in scheme: FINANCES PUBLIQUES
in scheme: Recouvrement
in scheme: Fiscalité
notation: REFIP163

illégalité
type: ConceptReFip
type: Concept
broader: droit général (non-descripteur)
definition: Caractère de ce qui est contraire à la loi.
in scheme: FINANCES PUBLIQUES
in scheme: Droit et Justice
in scheme: Droit Général
notation: REFIP1630

milieu naturel
type: ConceptReFip
type: Concept
broader: environnement (non-descripteur)
definition: Espace localisé qui possède des caractéristiques stables et qui héberge une population animale et végétale déterminée.
in scheme: FINANCES PUBLIQUES
in scheme: Environnement
in scheme: Milieu Naturel
in scheme: Questions de Société
narrower: mer
narrower: montagne
narrower: forêt
narrower: littoral
narrower: eau
narrower: cours d'eau
notation: REFIP1631

Lettonie
type: ConceptReFip
type: Concept
alternative label: République de Lettonie
broader: Europe
definition: Pays
in scheme: FINANCES PUBLIQUES
in scheme: Géographie
in scheme: Europe
notation: REFIP1632

octroi de mer
type: ConceptReFip
type: Concept
broader: droits de douane
definition: Imposition spécifique dans les départements d’Outre-mer de Guadeloupe, de Guyane, de Martinique, de Mayotte et de La Réunion : les opérations soumises à l’octroi de mer sont les importations de biens et les livraisons de biens, faites à titre onéreux, par des personnes qui y exercent des activités de production.
in scheme: FINANCES PUBLIQUES
in scheme: Fiscalité
in scheme: Impôt
notation: REFIP1633

automobile
type: ConceptReFip
type: Concept
alternative label: voiture
broader: véhicule terrestre à moteur
definition: Véhicule à moteur destiné au transport terrestre des personnes et des objets.
in scheme: FINANCES PUBLIQUES
in scheme: Branche d'activité
in scheme: Questions Economiques
in scheme: Transports
notation: REFIP1634

cession d'entreprise
type: ConceptReFip
type: Concept
broader: transfert d'entreprise
definition: Transmission de l'ensemble de l'exploitation par acte portant transfert de la propriété de l'entreprise. Ainsi, un acte, qu'il soit stipulé à titre onéreux ou à titre gratuit, peut, quelle que soit sa qualification, emporter cession d'entreprise, dès lors qu'il opère un transfert de la propriété d'une entreprise d'une personne physique ou morale à une autre personne physique ou morale. L'acte peut consister, notamment, en une vente pure et simple, un apport en société, une fusion ou une donation. La cession d'entreprise est considérée comme partielle lorsqu'un contribuable, ayant plusieurs branches d'activité ou plusieurs établissements, cède l'une de ces branches d'activité ou l'un de ces établissements.
in scheme: FINANCES PUBLIQUES
in scheme: Vie de l'Entreprise
in scheme: Entreprises
in scheme: Vie et Gestion de l'entreprise
narrower: cession de clientèle
narrower: transmission d'une entreprise
notation: REFIP1635

capacité pour agir
type: ConceptReFip
type: Concept
alternative label: capacité d'ester en justice
broader: principes généraux (non-descripteur)
definition: Capacité à avoir recours à la justice. Il faut distinguer la capacité de jouissance ouverte à toute personne physique ou morale, même étrangère, de la capacité d'exercice (mineurs, majeurs en tutelle ou curatelle en sont dépourvus), c'est-à-dire l'aptitude à faire valoir ses droits et intérêts en justice.
in scheme: FINANCES PUBLIQUES
in scheme: Principes Généraux
in scheme: Droit et Justice
in scheme: Procédure
notation: REFIP1638

subvention d'équipement
type: ConceptReFip
type: Concept
alternative label: aide publique à l'investissement
alternative label: subvention d'investissement
alternative label: subvention de l'Etat pour projets d'investissement
broader: subvention
definition: Aide financière octroyée à une entreprise à titre définitif par une institution publique ou privée. Elle est versée en vue de contribuer à l'acquisition d'une immobilisation ou à la réalisation d'un projet.
in scheme: FINANCES PUBLIQUES
in scheme: Dépenses publiques
in scheme: Gestion Publique
notation: REFIP1639

appel d'offres
type: ConceptReFip
type: Concept
broader: passation des marchés publics
definition: Procédure formalisée de passation des Marchés Publics par laquelle un acheteur choisit l’offre économiquement la plus avantageuse, sans négociation, sur la base de critères objectifs préalablement portés à la connaissance des candidats.
in scheme: FINANCES PUBLIQUES
in scheme: Commande publique
in scheme: Gestion Publique
narrower: avis d'appel public à concurrence
narrower: appel d'offres restreint
narrower: enchère électronique
narrower: offre économiquement la plus avantageuse
narrower: délai de réception
narrower: mise au point de marché
narrower: appel d'offres ouvert
narrower: appel d'offres infructueux
notation: REFIP1641

indemnité d'administration et de technicité
type: ConceptReFip
type: Concept
alternative label: IAT
broader: indemnité
definition: Rémunération accessoire attribuée aux fonctionnaires de catégorie C, ou de catégorie B sous conditions indiciaires, exerçant des fonctions administratives ou techniques, et instituée dans les administrations centrales de l’État, les services déconcentrés et les établissements publics à caractère administratif de l’État.
in scheme: FINANCES PUBLIQUES
in scheme: Gestion des ressources humaines
in scheme: Fonction Publique et Gestion des Ressources Humaines
notation: REFIP1642

énergie
type: ConceptReFip
type: Concept
broader: industrie
definition: Capacité à modifier un état, produire des actions comme fournir de la chaleur, de la lumière, ou mettre en mouvement un objet.
in scheme: FINANCES PUBLIQUES
in scheme: Branche d'activité
in scheme: Questions Economiques
in scheme: Industrie
narrower: combustible
narrower: énergie nucléaire
narrower: chauffage
narrower: climatisation
narrower: distribution de l'énergie
narrower: distribution de l'eau
narrower: énergie renouvelable
narrower: électricité
notation: REFIP1644

sanction financière
type: ConceptReFip
type: Concept
alternative label: sanction pécuniaire
broader: sanction
definition: Mesure pécuniaire qui vise à réprimer le non- respect de règle juridique.
in scheme: FINANCES PUBLIQUES
in scheme: Droit et Justice
in scheme: Sanction
in scheme: Infractions et Sanctions
narrower: pénalité de retard
narrower: astreinte pécuniaire
narrower: amende
notation: REFIP1646

Bangladesh
type: ConceptReFip
type: Concept
broader: Asie
definition: Pays
in scheme: FINANCES PUBLIQUES
in scheme: Géographie
in scheme: Asie
notation: REFIP1647

titre exécutoire
type: ConceptReFip
type: Concept
broader: caractère exécutoire
definition: Acte revêtu de la formule exécutoire, qui permet de recourir au recouvrement forcé de la dette, c'est-à-dire aux poursuites si le débiteur ne s'en acquitte pas spontanément.
in scheme: FINANCES PUBLIQUES
in scheme: Droit et Justice
in scheme: Droit Général
notation: REFIP1648
related: titre de recette

convention fiscale internationale
type: ConceptReFip
type: Concept
alternative label: convention fiscale
alternative label: convention internationale
broader: fiscalité internationale
definition: Traité conclu entre 2 pays visant à éviter la double imposition des personnes et des entreprises.
in scheme: FINANCES PUBLIQUES
in scheme: Champ d'Application
in scheme: Fiscalité
notation: REFIP1649

base de données
type: ConceptReFip
type: Concept
alternative label: banque de données
broader: informatique
definition: Ensemble d'informations stockées sur un serveur, de manière structurées, organisées afin d'en permettre un accès rapide et facile.
in scheme: FINANCES PUBLIQUES
in scheme: Informatique
in scheme: Communication Documentation Informatique
narrower: consultation de données informatiques
narrower: qualité des données
narrower: infocentre
narrower: donnée de base
narrower: stockage de données informatiques
notation: REFIP1651

contrôle interne budgétaire
type: ConceptReFip
type: Concept
broader: contrôle interne
definition: Ensemble des dispositifs formalisés et permanents ayant pour objet de maîtriser les risques afférents à la poursuite des objectifs de qualité de la comptabilité budgétaire et de soutenabilité de la programmation et de son exécution.
in scheme: FINANCES PUBLIQUES
in scheme: Missions Transverses des Finances publiques
in scheme: Maîtrise des risques
notation: REFIP1652

complicité
type: ConceptReFip
type: Concept
alternative label: complice
broader: refip-REFIP660
definition: Situation de celui qui, par aide ou assistance, facilite la préparation ou la consommation d’une infraction, sans en réaliser lui-même les éléments constitutifs, ou encore provoque à une infraction ou donne des instructions pour la commettre.
in scheme: FINANCES PUBLIQUES
in scheme: Droit et Justice
in scheme: Infractions et Sanctions
in scheme: Infraction
notation: REFIP1653

actif professionnel
type: ConceptReFip
type: Concept
broader: actif
definition: Élément du patrimoine de l' entreprise représenté par les biens immobilisés, acquis spécifiquement pour être utilisés dans le cadre de l'activité.
in scheme: FINANCES PUBLIQUES
in scheme: Documents comptables
in scheme: Comptabilité
narrower: frais d'études
notation: REFIP1654

fin de contrat
type: ConceptReFip
type: Concept
broader: contrat
definition: Terme d'un contrat liant deux parties.
in scheme: FINANCES PUBLIQUES
in scheme: Droit et Justice
in scheme: Divisions du Droit
in scheme: Droit Privé
narrower: résiliation
notation: REFIP1655

attribution de marché public
type: ConceptReFip
type: Concept
broader: passation des marchés publics
definition: Étape du processus marché public.
in scheme: FINANCES PUBLIQUES
in scheme: Commande publique
in scheme: Gestion Publique
narrower: ouverture des plis
narrower: bureau d'adjudication
narrower: exemplaire unique
narrower: commission d'appel d'offres
narrower: avis d'attribution de marché public
narrower: titulaire d'un marché public
narrower: refip-REFIP695
notation: REFIP1656

matrice
type: ConceptReFip
type: Concept
broader: document
definition: Liste, relevé, tableau, formulaire.
in scheme: FINANCES PUBLIQUES
in scheme: Documentation
in scheme: Communication Documentation Informatique
notation: REFIP1658

droit privé
type: ConceptReFip
type: Concept
broader: refip-REFIP7002
definition: Ensemble des règles régissant les rapports entre particuliers et les relations juridiques entre l’Administration et les particuliers lorsqu’elles ne sont pas exorbitantes du droit commun.
in scheme: FINANCES PUBLIQUES
in scheme: Droit et Justice
in scheme: Divisions du Droit
in scheme: Droit Privé
narrower: droit commercial
narrower: droit financier
narrower: droit social
narrower: droit des obligations et contrats (non-descripteur)
narrower: droit successoral
narrower: droit civil
notation: REFIP1659

Code des pensions civiles et militaires
type: ConceptReFip
type: Concept
alternative label: Code des pensions civiles et militaires de retraite
broader: documentation juridique (non-descripteur)
definition: Ensemble des lois relatives au droit des pensions civiles et militaires de retraire français. Rassemble principalement les dispositions relatives à la constitution du droit à pension, les conditions de la liquidation, et les dispositions particulières relatives à certaines catégories de retraites civiles et militaires. Précise aussi les dispositions relatives au paiement des pensions.
in scheme: FINANCES PUBLIQUES
in scheme: Droit et Justice
in scheme: Documentation Juridique
in scheme: Sources du Droit
notation: REFIP166

contrôle général économique et financier de l'Etat
type: ConceptReFip
type: Concept
alternative label: CGEFI
broader: Ministère de l'Economie et des Finances
definition: Service de l'Etat ayant pour mission d’optimiser la gestion de l’argent public. Il exerce le contrôle économique et financier des sociétés publiques, EPIC et GIP ou le contrôle financier des Etablissements publics de l'Etat. Le CGEFi est un acteur essentiel de l’audit interne de l’État. Il est mobilisé sur trois chantiers touchant son champ d’intervention et en particulier sur les opérateurs de l’État : la certification des comptes de l’État, l’amélioration de la qualité comptable et financière, la gouvernance et le contrôle interne. Enfin, dans ses missions de conseil, le CGEFi intervient sur des thèmes de gestion publique, de réforme de l’État, de politique économique.
in scheme: FINANCES PUBLIQUES
in scheme: Organisation Structurelle de l'Etat
in scheme: Ministère
in scheme: Administration de L'Etat
notation: REFIP1661
related: refip-REFIP7061

travaux agricoles
type: ConceptReFip
type: Concept
broader: agriculture
definition: Ensemble des travaux entrant dans le cycle de la production animale ou végétale, des travaux d'amélioration foncière agricole ainsi que des travaux accessoires nécessaires à l'exécution des travaux précédents. Les travaux de créations, restauration et entretien des parcs et jardins entrent dans cette catégorie là.
in scheme: FINANCES PUBLIQUES
in scheme: Branche d'activité
in scheme: Questions Economiques
in scheme: Agriculture
narrower: amendement agricole
narrower: récolte agricole
narrower: matériel agricole
notation: REFIP1663

unité de caisse
type: ConceptReFip
type: Concept
broader: comptabilité de caisse
definition: Principe comptable en vertu duquel l’ensemble des ressources financières de l’État (sa trésorerie) est déposé sur un seul compte courant. Les collectivités locales ont une obligation de dépôt au Trésor de toutes leurs disponibilités.
in scheme: FINANCES PUBLIQUES
in scheme: Comptabilité publique
in scheme: Comptabilité
notation: REFIP1664

application SQUADRA (supprimé)
type: ConceptReFip
type: Concept
broader: ZZ
in scheme: FINANCES PUBLIQUES
notation: REFIP1665

créancier chirographaire
type: ConceptReFip
type: Concept
broader: créancier
definition: Créancier simple, c'est-à-dire ne disposant d'aucune sûreté particulière.
in scheme: FINANCES PUBLIQUES
in scheme: Droit et Justice
in scheme: Divisions du Droit
in scheme: Droit Privé
notation: REFIP1666

relance des défaillants de paiement
type: ConceptReFip
type: Concept
broader: défaillant de paiement
definition: Procédure mise en œuvre après constat de la défaillance de paiement et à défaut d'une réclamation contentieuse assortie d'une demande de sursis de paiement. Elle se décline en procédure de relance progressive et procédure de relance directe.
in scheme: FINANCES PUBLIQUES
in scheme: Fiscalité - Autres notions
in scheme: Fiscalité
narrower: refip-REFIP6994
narrower: refip-REFIP6995
notation: REFIP1667

Calvados
type: ConceptReFip
type: Concept
broader: refip-REFIP7016
definition: Département français
in scheme: FINANCES PUBLIQUES
in scheme: Géographie
in scheme: Europe
notation: REFIP1668

rapport annuel de performances
type: ConceptReFip
type: Concept
broader: refip-REFIP982
definition: Document rendant compte, pour chaque programme, de l’exécution des engagements pris dans les projets annuels de performances (PAP) au moment de l’examen du projet de loi de finances. Il présente et explique les réalisations effectives concernant l’ensemble des moyens regroupés au sein d’une mission et alloués à une politique publique et permet ainsi d’apprécier la qualité de la gestion des politiques publiques.
in scheme: FINANCES PUBLIQUES
in scheme: Documentation budgétaire
in scheme: Budget
narrower: refip-REFIP7031
notation: REFIP1669

ordures ménagères
type: ConceptReFip
type: Concept
alternative label: déchets ménagers
broader: déchets
definition: Déchets issus de l'activité quotidienne des ménages et des activités économiques collectés dans les mêmes conditions.
in scheme: FINANCES PUBLIQUES
in scheme: Environnement
in scheme: Dégradation de l'Environnement
in scheme: Questions de Société
notation: REFIP167
related: redevance d'enlèvement des ordures ménagères
related: taxe d'enlèvement des ordures ménagères

revenu catégoriel
type: ConceptReFip
type: Concept
broader: revenu imposable
definition: Revenu entrant dans une des 8 catégories suivantes, chacune étant soumise à des règles d'imposition particulières : les traitements, salaires, pensions et rentes viagères ; les rémunérations des dirigeants de société ; les bénéfices industriels et commerciaux ( BIC) ; les bénéfices non commerciaux (BNC) ; les bénéfices agricoles (BA) ; les revenus fonciers ; les revenus mobiliers ; les plus-values immobilières, sur valeurs mobilières, sur biens meubles et professionnelles.
in scheme: FINANCES PUBLIQUES
in scheme: Champ d'Application
in scheme: Fiscalité
narrower: revenu de capitaux mobiliers
narrower: plus-value mobilière
narrower: bénéfice agricole
narrower: revenu foncier
narrower: bénéfice industriel et commercial
narrower: refip-REFIP696
narrower: refip-REFIP6997
notation: REFIP1670

pièces justificatives
type: ConceptReFip
type: Concept
broader: document
definition: Preuve écrite d’une écriture comptable ou d'une opération.
in scheme: FINANCES PUBLIQUES
in scheme: Documentation
in scheme: Communication Documentation Informatique
notation: REFIP1671

référé provision
type: ConceptReFip
type: Concept
broader: référé administratif
definition: Procédure permettant au juge des référés administratif d’accorder à un créancier de l’administration une provision.
in scheme: FINANCES PUBLIQUES
in scheme: Procédure Administrative
in scheme: Droit et Justice
in scheme: Procédure
notation: REFIP1673

intégration informatique
type: ConceptReFip
type: Concept
alternative label: système d'information intégré
alternative label: test d'intégration
broader: informatique
definition: Phase d'un projet durant laquelle on vérifie le produit par des tests d'intégration.
in scheme: FINANCES PUBLIQUES
in scheme: Informatique
in scheme: Communication Documentation Informatique
notation: REFIP1675

taux de référence
type: ConceptReFip
type: Concept
broader: mots outils (liste additive)
definition: Taux, publiquement disponible, pouvant être utilisé comme base de comparaison.
in scheme: FINANCES PUBLIQUES
in scheme: Mots Outils
notation: REFIP1676

autobus
type: ConceptReFip
type: Concept
alternative label: autocar
alternative label: bus
alternative label: car
broader: transports en commun
definition: Véhicule de transports en commun sur des lignes urbaines régulières.
in scheme: FINANCES PUBLIQUES
in scheme: Branche d'activité
in scheme: Questions Economiques
in scheme: Transports
notation: REFIP1677
related: transport routier

variante à un marché public
type: ConceptReFip
type: Concept
alternative label: appel d'offres avec variante
broader: candidature à un marché public
definition: Modification, dans le cadre de marché public, à l’initiative du candidat, de certaines spécifications des prestations décrites dans le cahier des charges ou plus généralement dans le dossier de consultation.
in scheme: FINANCES PUBLIQUES
in scheme: Commande publique
in scheme: Gestion Publique
notation: REFIP1678

Conseil supérieur de l'ordre des experts-comptables
type: ConceptReFip
type: Concept
broader: organisme consultatif et représentatif (non-descripteur)
definition: Regroupement professionnel représentant l'Ordre professionnel des Experts-Comptables. Il a seul qualité pour exercer, devant toutes les juridictions, tous les droits réservés à la partie civile, relativement aux faits portant un préjudice à l'intérêt collectif de la profession d'expert-comptable.
in scheme: FINANCES PUBLIQUES
in scheme: Organisation Structurelle de l'Etat
in scheme: Organisme Consultatif et Représentatif
in scheme: Administration de L'Etat
notation: REFIP1679

langue étrangère
type: ConceptReFip
type: Concept
broader: information
definition: Langue qui n'est pas la langue maternelle d'une personne qui doit en faire l'apprentissage pour pouvoir la maîtriser.
in scheme: FINANCES PUBLIQUES
in scheme: Communication
in scheme: Communication Documentation Informatique
narrower: traducteur-interprète
notation: REFIP168

Landes
type: ConceptReFip
type: Concept
broader: refip-REFIP7020
definition: Département français
in scheme: FINANCES PUBLIQUES
in scheme: Géographie
in scheme: Europe
notation: REFIP1681

valeur ajoutée
type: ConceptReFip
type: Concept
broader: solde intermédiaire de gestion
definition: Solde du compte de production. Elle est égale à la valeur de la production diminuée de la consommation intermédiaire.
in scheme: FINANCES PUBLIQUES
in scheme: Comptabilité
in scheme: Comptabilité analytique
notation: REFIP1682

personne morale de droit privé
type: ConceptReFip
type: Concept
broader: personnalité morale
definition: Ensemble des entreprises, sociétés civiles, groupements d'intérêt économique, associations. Certaines personnes morales de droit privé sont chargées de la gestion d'un service public. Parmi les personnes morales de droit privé, on fait encore une distinction entre personne morale de droit privé à but lucratif, et personne morale de droit privé à but non lucratif. La personne morale de droit privé à but lucratif a pour objectif de faire des bénéfices. Il s’agit notamment des sociétés (Société Anonyme, Société à Responsabilité Limitée, Entreprise Unipersonnelle à Responsabilité Limitée…). La personne morale de droit privé à but non lucratif poursuit un but autre que la recherche de bénéfices : les syndicats ont pour but de défendre les intérêts d’un groupe d’individus.
in scheme: FINANCES PUBLIQUES
in scheme: Droit et Justice
in scheme: Droit Général
notation: REFIP1683

Corse-du-Sud
type: ConceptReFip
type: Concept
broader: Corse
definition: Département français
in scheme: FINANCES PUBLIQUES
in scheme: Géographie
in scheme: Europe
notation: REFIP1685

référé liberté
type: ConceptReFip
type: Concept
broader: référé administratif
definition: Procédure permettant au juge des référés administratif, en cas d’urgence, d’ordonner les mesures nécessaires à la sauvegarde d’une liberté fondamentale à laquelle une collectivité publique ou un organisme chargé d’une mission de service public aurait porté une atteinte grave et manifestement illégale dans l’exercice d’un de ses pouvoirs.
in scheme: FINANCES PUBLIQUES
in scheme: Procédure Administrative
in scheme: Droit et Justice
in scheme: Procédure
notation: REFIP1686

titre de perception
type: ConceptReFip
type: Concept
broader: ordre de recette
definition: Document établissant le montant et la nature d'une créance de l'État ou d'une collectivité territoriale émis par l'ordonnateur.
in scheme: FINANCES PUBLIQUES
in scheme: Documentation budgétaire
in scheme: Budget
notation: REFIP1687

infirmier
type: ConceptReFip
type: Concept
broader: fonction publique hospitalière
definition: Fonctionnaire hospitalier de catégorie A
in scheme: FINANCES PUBLIQUES
in scheme: Personnels et fonctions
in scheme: Fonction Publique et Gestion des Ressources Humaines
notation: REFIP1689

contrôle interne bancaire
type: ConceptReFip
type: Concept
broader: contrôle interne
definition: Ensemble des dispositifs, organisés, formalisés et permanents, choisis par l’encadrement, mis en œuvre par les opérationnels de tous niveaux pour maîtriser le fonctionnement de leurs activités bancaires ; ces dispositifs sont destinés à fournir une assurance raisonnable quant à la réalisation de l’objectif de qualité bancaire, notamment le respect des normes réglementaires relatives au contrôle interne des établissements de crédit et des entreprises d’investissement.
in scheme: FINANCES PUBLIQUES
in scheme: Missions Transverses des Finances publiques
in scheme: Maîtrise des risques
notation: REFIP1691

brevet d'invention
type: ConceptReFip
type: Concept
broader: droit de la propriété industrielle
definition: Titre délivré par les pouvoirs publics (INPI) conférant un monopole temporaire d'exploitation sur une invention à celui qui la révèle, en donne une description suffisante et complète, et revendique ce monopole.
in scheme: FINANCES PUBLIQUES
in scheme: Droit et Justice
in scheme: Divisions du Droit
in scheme: Droit Privé
notation: REFIP1693

établissement public à caractère scientifique et technologique
type: ConceptReFip
type: Concept
alternative label: EPST
broader: établissement public national
definition: Personne morale de droit public dotée de l’autonomie administrative et financière. L'objectif des EPST est de contribuer au développement et au progrès de la recherche et d’en valoriser les résultats, d’assurer la diffusion des connaissances scientifiques et de favoriser la formation en matière de recherche.
in scheme: FINANCES PUBLIQUES
in scheme: Organisation Structurelle de l'Etat
in scheme: Opérateur de l'Etat
in scheme: Administration de L'Etat
narrower: Centre national de la recherche scientifique
notation: REFIP1694

ressource affectée
type: ConceptReFip
type: Concept
broader: principe budgétaire
definition: Dérogation au principe d’universalité du budget : les produits attribués à l’établissement avec une destination déterminée, les subventions des organismes publics et privés, les dons et legs, le revenu des fondations. L’ordonnateur de l’établissement public se trouve dans l’obligation de respecter l’affectation de ces crédits.
in scheme: FINANCES PUBLIQUES
in scheme: Élaboration du budget
in scheme: Budget
notation: REFIP1695

comptabilité patrimoniale
type: ConceptReFip
type: Concept
broader: exécution du budget
definition: Comptabilité fondée sur la mesure du patrimoine et de son évolution, introduite par la LOLF, en adaptant des normes d'informations comptables et financières venues du secteur privé.
in scheme: FINANCES PUBLIQUES
in scheme: Exécution du budget
in scheme: Budget
notation: REFIP1696

co-débiteur
type: ConceptReFip
type: Concept
alternative label: codébiteur
broader: refip-REFIP692
definition: Personne qui s'est engagée avec une ou plusieurs autres personnes à payer une dette ou à exécuter une prestation au profit d'un ou de plusieurs créanciers qui leur sont communs.
in scheme: FINANCES PUBLIQUES
in scheme: Droit et Justice
in scheme: Divisions du Droit
in scheme: Droit Privé
notation: REFIP1697

Code de la route
type: ConceptReFip
type: Concept
broader: documentation juridique (non-descripteur)
definition: Ensemble des dispositions législatives et réglementaires régissant la circulation sur la voie publique par les usagers (piétons, véhicules avec ou sans moteur, etc.).
in scheme: FINANCES PUBLIQUES
in scheme: Droit et Justice
in scheme: Documentation Juridique
in scheme: Sources du Droit
notation: REFIP1698

île de Man
type: ConceptReFip
type: Concept
broader: Grande-Bretagne
definition: Territoire de Grande-Bretagne
in scheme: FINANCES PUBLIQUES
in scheme: Géographie
in scheme: Europe
notation: REFIP1699

rôle général
type: ConceptReFip
type: Concept
broader: rôle d'imposition
definition: Regroupement des émissions faites pour l'ensemble des contribuables suivant un calendrier pré-établi.
in scheme: FINANCES PUBLIQUES
in scheme: Documentation Fiscale
in scheme: Fiscalité
notation: REFIP17

droit de retrait
type: ConceptReFip
type: Concept
broader: droit du travail
definition: Cessation temporaire d'activité d'un salarié sans retenue sur salaire lorsque ce dernier a un motif raisonnable de penser qu’une situation de travail présente un danger grave et imminent pour sa vie ou pour sa santé
in scheme: FINANCES PUBLIQUES
in scheme: Droit et Justice
in scheme: Divisions du Droit
in scheme: Droit Privé
notation: REFIP170

Conseil de l'immobilier de l'Etat
type: ConceptReFip
type: Concept
broader: refip-REFIP7061
definition: Organe consultatif placé auprès du ministre en charge du domaine, il suit et évalue l'avancement de la démarche de modernisation et l'évolution du parc immobilier de l'État. A ce titre, il formule au ministre des recommandations stratégiques et des avis pour améliorer la politique immobilière de l'État et de ses opérateurs.
in scheme: FINANCES PUBLIQUES
in scheme: Organisation Structurelle de l'Etat
in scheme: Ministère
in scheme: Administration de L'Etat
notation: REFIP1700

auto-entrepreneur
type: ConceptReFip
type: Concept
broader: entreprise
definition: Dénomination commune du régime micro-social. Il ne constitue pas une forme juridique, mais seulement un régime simplifié de déclaration et de versement des cotisations et contributions sociales par un prélèvement proportionnel au chiffre d'affaires, selon le principe « pas de chiffre d'affaires, pas de cotisations ».
in scheme: FINANCES PUBLIQUES
in scheme: Entreprise
in scheme: Entreprises
in scheme: Forme juridique
notation: REFIP1701

travailleur salarié
type: ConceptReFip
type: Concept
alternative label: activité salariée
alternative label: salarié
broader: refip-REFIP6950
definition: Personne qui exécute un travail pour le compte d'une entreprise (ou d'une autre personne) selon des conditions de travail négociées entre celles-ci et en échange d'un salaire ou d'une rétribution équivalente.
in scheme: FINANCES PUBLIQUES
in scheme: Entreprises
in scheme: Travail
in scheme: 212619
narrower: travailleur étranger
narrower: travailleur handicapé
narrower: travailleur frontalier
narrower: refip-REFIP814
notation: REFIP1702

ressources propres
type: ConceptReFip
type: Concept
broader: budget de l'Etat
definition: Dotations en fonds propres de l’État, à savoir les subventions d’investissement en nature allouées par l’État, et aux autres subventions.
in scheme: FINANCES PUBLIQUES
in scheme: Budget de l’État
in scheme: Budget
notation: REFIP1703
related: dotation
related: subvention

juridiction
type: ConceptReFip
type: Concept
broader: organisation juridictionnelle (non-descripteur)
definition: Organe doté du pouvoir dire le droit.
in scheme: FINANCES PUBLIQUES
in scheme: Droit et Justice
in scheme: Juridiction
in scheme: Organisation Juridictionnelle
narrower: Cour de justice de l'Union européenne
narrower: juridiction financière
narrower: tribunal des conflits
narrower: juridiction judiciaire
narrower: Cour européenne des droits de l'homme
narrower: greffe de juridiction
narrower: Conseil constitutionnel
narrower: juridiction administrative
notation: REFIP1704

créance irrécouvrable
type: ConceptReFip
type: Concept
alternative label: côte irrécouvrable
broader: admission en non-valeur
definition: Créance qui ne peut être recouvrée, et résultant notamment de la disparition, du décès ou de l'insolvabilité du débiteur.
in scheme: FINANCES PUBLIQUES
in scheme: Recouvrement
in scheme: Fiscalité
notation: REFIP1706

application TOPAD
type: ConceptReFip
type: Concept
alternative label: TOPAD
broader: applications fiscales (non-descripteur)
definition: Référentiel des constantes topographiques et administratives.
in scheme: FINANCES PUBLIQUES
in scheme: Applications Informatiques
in scheme: Applications fiscales
notation: REFIP1708

contravention de petite voirie
type: ConceptReFip
type: Concept
broader: contravention
definition: Sanction réprimant les atteintes au domaine public routier.
in scheme: FINANCES PUBLIQUES
in scheme: Droit et Justice
in scheme: Infractions et Sanctions
in scheme: Infraction
narrower: procès-verbal électronique
notation: REFIP171

Tunisie
type: ConceptReFip
type: Concept
broader: Afrique
definition: Pays
in scheme: FINANCES PUBLIQUES
in scheme: Géographie
in scheme: Afrique
notation: REFIP1712

emploi jeune
type: ConceptReFip
type: Concept
alternative label: NSEJ
alternative label: contrat emploi jeune
alternative label: nouveaux services emplois jeunes
broader: contrat de travail
definition: Contrats (CEJ, ou bien NSEJ pour « nouveaux services emplois jeunes ») créés en 1997 et destinés aux jeunes de moins de 26 ans sans emploi et à ceux de 26 à 30 ans non indemnisables par l'Unédic. Ils visent à développer des activités d'utilité sociale répondant à des besoins émergents ou non satisfaits. Ils peuvent être signés par les établissements scolaires, la Police nationale, les collectivités territoriales, les établissements publics et les associations. La rémunération du salarié est partiellement prise en charge par l'État (à hauteur de 80 % du SMIC). La création de nouveaux emplois dans le cadre des emplois jeunes n'est plus possible depuis fin 2002, ce qui entraîne à terme la suppression du dispositif ; le recrutement de nouveaux salariés reste possible dans le cadre du remplacement d'un salarié démissionnaire sur un poste existant. Des mesures ont été prises pour tenter de pérenniser ces emplois dans le secteur associatif.
in scheme: FINANCES PUBLIQUES
in scheme: Contrat de Travail
in scheme: Entreprises
in scheme: Travail
notation: REFIP1714
scope note: Dispositif remplacé par Nouveaux services emplois jeunes

délégation de paiement
type: ConceptReFip
type: Concept
broader: exécution du budget
definition: Convention par laquelle un débiteur ( le déléguant) donne à quelqu’un qui est débiteur à son égard ( le délégué) l’instruction de payer son créancier ( le délégataire).
in scheme: FINANCES PUBLIQUES
in scheme: Exécution du budget
in scheme: Budget
notation: REFIP1715

recouvrement amiable
type: ConceptReFip
type: Concept
alternative label: recouvrement spontané
broader: action en recouvrement
in scheme: FINANCES PUBLIQUES
in scheme: Recouvrement
in scheme: Fiscalité
notation: REFIP1716

plate-forme des achats de l'Etat
type: ConceptReFip
type: Concept
alternative label: place de marchés interministérielle
broader: marché public
definition: Infrastructure technique mise en place afin de procéder à la dématérialisation des procédures de marchés de l'État. Elle assure des fonctionnalités de recherche et de consultation des annonces émanant des services des ministères et des établissements publics administratifs. Elle permet notamment de télécharger des dossiers de consultation des entreprises (DCE) et de répondre en ligne aux consultations.
in scheme: FINANCES PUBLIQUES
in scheme: Commande publique
in scheme: Gestion Publique
notation: REFIP1718
scope note: Remplace la Place de Marchés interministérielle à compter du 12/01/2012

Mauritanie
type: ConceptReFip
type: Concept
broader: Afrique
definition: Pays
in scheme: FINANCES PUBLIQUES
in scheme: Géographie
in scheme: Afrique
notation: REFIP1719

détournement de fonds
type: ConceptReFip
type: Concept
broader: délit
definition: Appropriation ou soustraction frauduleuse par une personne, au préjudice d’autrui, pour son propre intérêt, de fonds (somme d'argent), de valeurs ou de biens mobiliers qui lui ont été remis et qu’elle a acceptés à charge de rendre, de représenter ou de faire un usage déterminé. L’abus de confiance est le délit sanctionnant le détournement de fonds.
in scheme: FINANCES PUBLIQUES
in scheme: Droit et Justice
in scheme: Infractions et Sanctions
in scheme: Infraction
notation: REFIP172

référentiel national indicatif
type: ConceptReFip
type: Concept
alternative label: RNI
broader: contrôle hiérarchisé de la dépense
definition: Document intégrant, dans le contrôle hiérarchisé de la dépense, les dépenses dont le paiement comporte un risque considéré comme acceptable. Il préconise un contrôle par sondage et offre la possibilité de moduler l'intensité du contrôle.
in scheme: FINANCES PUBLIQUES
in scheme: Dépenses publiques
in scheme: Gestion Publique
notation: REFIP1721

livraison intra-communautaire
type: ConceptReFip
type: Concept
broader: fiscalité des professionnels
definition: Transfert du pouvoir de disposer comme un propriétaire d'un bien meuble corporel expédié de France par un assujetti vers un autre État membre à destination d'un autre assujetti.
in scheme: FINANCES PUBLIQUES
in scheme: Champ d'Application
in scheme: Fiscalité
notation: REFIP1722
related: exportation

retard de déclaration fiscale
type: ConceptReFip
type: Concept
alternative label: retard de déclaration
broader: défaillant déclaratif
definition: Déclaration déposée après la date limite de dépôt.
in scheme: FINANCES PUBLIQUES
in scheme: Fiscalité - Autres notions
in scheme: Fiscalité
notation: REFIP1725

dotation globale d'équipement
type: ConceptReFip
type: Concept
alternative label: dotation globale d'équipement des départements
broader: dotation
definition: Dotation destinée à soutenir l’effort d'investissement des départements en matière d’équipement rural (infrastructures publiques en milieu rural, tourisme vert ou encore habitat rural).
in scheme: FINANCES PUBLIQUES
in scheme: Dépenses publiques
in scheme: Gestion Publique
narrower: dotation de solidarité rurale
narrower: dotation de développement rural
narrower: dotation d'équipement des territoires ruraux
notation: REFIP1726

civisme fiscal
type: ConceptReFip
type: Concept
alternative label: civisme de paiement
alternative label: civisme déclaratif
broader: fiscalité
definition: Accomplissement volontaire par les contribuables de leurs obligations fiscales.
in scheme: FINANCES PUBLIQUES
in scheme: Fiscalité - Autres notions
in scheme: Fiscalité
narrower: défaillant de paiement
narrower: obligation fiscale du contribuable
narrower: défaillant déclaratif
narrower: obligation comptable du contribuable
notation: REFIP1727

association foncière de remembrement
type: ConceptReFip
type: Concept
broader: établissement public à caractère administratif
definition: Etablissement public à caractère administratif regroupant la totalité des propriétaires situés à l’intérieur du périmètre de remembrement.
in scheme: FINANCES PUBLIQUES
in scheme: Organisation Structurelle de l'Etat
in scheme: Opérateur de l'Etat
in scheme: Administration de L'Etat
notation: REFIP1728

Direction des affaires juridiques
type: ConceptReFip
type: Concept
alternative label: DAJ
broader: Ministère de l'Economie et des Finances
definition: Direction des ministères économiques et financiers, la DAJ exerce une fonction de conseil, d'expertise et d'assistance juridique auprès des directions des ministères, des autres administrations de l'Etat et des établissements publics. Elle coordonne, à la demande des ministres, l'élaboration des textes législatifs et réglementaires. Elle assiste les directions dans l'élaboration des études précédant ces textes. Elle propose aux ministres des réformes de la législation ou de la réglementation. Elle analyse et élabore la réglementation relative à la commande publique, dont elle a la responsabilité au niveau interministériel. Elle assure également la coordination des mémoires en défense devant le Conseil constitutionnel pour les ministères économiques et financiers.
in scheme: FINANCES PUBLIQUES
in scheme: Organisation Structurelle de l'Etat
in scheme: Ministère
in scheme: Administration de L'Etat
notation: REFIP1729
related: refip-REFIP7061
scope note: Remplace la Commission centrale des marchés depuis le décret n°98-975 du 2/11/1998.

ouverture des plis
type: ConceptReFip
type: Concept
broader: attribution de marché public
definition: Opération, dans le cadre de marché public, au cours de laquelle le pouvoir adjudicateur ouvre les enveloppes et examine les candidatures.
in scheme: FINANCES PUBLIQUES
in scheme: Commande publique
in scheme: Gestion Publique
notation: REFIP173

bailleur
type: ConceptReFip
type: Concept
alternative label: loueur
broader: refip-REFIP95
definition: Personne physique ou morale qui s'engage à procurer au cocontractant (le locataire ou preneur) la jouissance d'une chose mobilière ou immobilière, contre une rémunération, dans un contrat de bail.
in scheme: FINANCES PUBLIQUES
in scheme: Droit et Justice
in scheme: Divisions du Droit
in scheme: Droit Privé
notation: REFIP1730

déclaration d'intention d'aliéner
type: ConceptReFip
type: Concept
broader: propriété des personnes publiques
definition: Formalité permettant au propriétaire d'un bien immobilier situé dans une zone de préemption, d'informer la commune de son intention de vendre.
in scheme: FINANCES PUBLIQUES
in scheme: Domaine
in scheme: Gestion Publique
notation: REFIP1733

excédent
type: ConceptReFip
type: Concept
broader: compte comptable
definition: Solde positif d'une balance de compte.
in scheme: FINANCES PUBLIQUES
in scheme: Documents comptables
in scheme: Comptabilité
notation: REFIP1734

avance facultative
type: ConceptReFip
type: Concept
broader: exécution d'un marché public
definition: Somme remboursée au titulaire relative aux dépenses engagées pour assurer la préparation du marché public. Contrairement aux acomptes, elle ne correspond pas et ne se trouve pas subordonnée à un début d’exécution des prestations.
in scheme: FINANCES PUBLIQUES
in scheme: Commande publique
in scheme: Gestion Publique
notation: REFIP1736
note: Notion abandonnée depuis le nouveau code des marchés publics 2006
related: avance de trésorerie

agrément
type: ConceptReFip
type: Concept
alternative label: autorisation
alternative label: retrait d'agrément
broader: droit général (non-descripteur)
definition: Permission, approbation émanant d'une autorité.
in scheme: FINANCES PUBLIQUES
in scheme: Droit et Justice
in scheme: Droit Général
notation: REFIP1737

métal précieux
type: ConceptReFip
type: Concept
alternative label: argent
alternative label: or
broader: métal
definition: Élément métallique rare de grande valeur économique.
in scheme: FINANCES PUBLIQUES
in scheme: Branche d'activité
in scheme: Questions Economiques
in scheme: Industrie
notation: REFIP1738

contrat administratif
type: ConceptReFip
type: Concept
broader: contrat
definition: Contrat conclu par au moins une personne publique et dont la connaissance appartient au juge administratif. Il peut être qualifié de tel par la loi, ou par la jurisprudence s'il porte sur l'exécution d'un service public ou comporte des clauses exorbitantes du droit commun.
in scheme: FINANCES PUBLIQUES
in scheme: Droit et Justice
in scheme: Divisions du Droit
in scheme: Droit Privé
narrower: clauses sociales et environnementales
narrower: refip-REFIP835
narrower: refip-REFIP914
notation: REFIP1739

immeuble de bureaux
type: ConceptReFip
type: Concept
broader: bâtiment de l'Etat
definition: Bâtiments à usage de bureaux du parc immobilier de l'État.
in scheme: FINANCES PUBLIQUES
in scheme: Domaine
in scheme: Gestion Publique
notation: REFIP1740

direction départementale des territoires
type: ConceptReFip
type: Concept
alternative label: DDAF
alternative label: DDE
alternative label: DDEA
alternative label: DDT
alternative label: Direction départementale de l'agriculture et des forêts
alternative label: Direction départementale de l'équipement
alternative label: Direction départementale de l'équipement et de l'agriculture
alternative label: Direction départementale des territoires et de la mer
broader: refip-REFIP99
definition: Service déconcentré de l'État prenant la forme d'une direction départementale interministérielle, placée sous l'autorité du préfet de département. Elle met en œuvre les politiques publiques d’aménagement et de développement durable des territoires.
in scheme: FINANCES PUBLIQUES
in scheme: Organisation Structurelle de l'Etat
in scheme: Ministère
in scheme: Administration de L'Etat
notation: REFIP1741

plan de sauvegarde de l'emploi
type: ConceptReFip
type: Concept
alternative label: plan social
broader: entreprise en difficulté
definition: Dispositif qui prévoit diverses mesures dans le but d'éviter ou de limiter les licenciements pour motif économique dans l'entreprise. Il doit faire l'objet d'une homologation ou, en cas d'accord majoritaire dans l'entreprise sur son contenu, d'une validation par la Direccte.
in scheme: FINANCES PUBLIQUES
in scheme: Vie de l'Entreprise
in scheme: Entreprises
in scheme: Vie et Gestion de l'entreprise
notation: REFIP1742
related: refip-REFIP911

application ECHO
type: ConceptReFip
type: Concept
broader: applications gestion publique (non-descripteur)
definition: Outil de suivi de l'activité dépôts de fonds au Trésor.
in scheme: FINANCES PUBLIQUES
in scheme: Applications Informatiques
in scheme: Applications gestion publique
notation: REFIP1743

concession funéraire
type: ConceptReFip
type: Concept
broader: contrat et mode de gestion (non-descripteur)
definition: Contrat administratif par lequel la commune attribue à un particulier, pour servir à sa sépulture et/ou à celle de sa famille, la jouissance d'un emplacement dans un cimetière pour une durée variable et moyennant le versement d'un capital.
in scheme: FINANCES PUBLIQUES
in scheme: Secteur public local
in scheme: Gestion Publique
notation: REFIP1744
related: monument funéraire

droit de grève
type: ConceptReFip
type: Concept
broader: droit du travail
definition: Droit pour chaque travailleur de participer à une interruption concertée et collective du travail afin d'assurer le succès de leurs revendications.
in scheme: FINANCES PUBLIQUES
in scheme: Droit et Justice
in scheme: Divisions du Droit
in scheme: Droit Privé
notation: REFIP1746
related: grève

sanction
type: ConceptReFip
type: Concept
broader: infractions et sanctions (non-descripteur)
definition: Mesure punitive, conséquence juridique du non-respect d'une règle de droit.
in scheme: FINANCES PUBLIQUES
in scheme: Droit et Justice
in scheme: Sanction
in scheme: Infractions et Sanctions
narrower: sanction administrative
narrower: sanction financière
narrower: sanction pénale
notation: REFIP1747

dépens
type: ConceptReFip
type: Concept
broader: frais de procédure
definition: Part des frais engendrés par le procès que le gagnant peut se faire rembourser par le perdant, à moins que le tribunal n'en décide autrement.
in scheme: FINANCES PUBLIQUES
in scheme: Principes Généraux
in scheme: Droit et Justice
in scheme: Procédure
notation: REFIP1748

requêtage
type: ConceptReFip
type: Concept
alternative label: requête informatique
broader: restitution de l'information
definition: Lancement d'une requête informatique.
in scheme: FINANCES PUBLIQUES
in scheme: Informatique
in scheme: Communication Documentation Informatique
notation: REFIP175

adresse fiscale de taxation
type: ConceptReFip
type: Concept
broader: domicile fiscal
definition: Lieu du domicile principal du contribuable. En matière d’impôt sur le revenu il s’agira de l’adresse de celui-ci au 1er janvier de l’année.
in scheme: FINANCES PUBLIQUES
in scheme: Champ d'Application
in scheme: Fiscalité
notation: REFIP1750

Bourgogne (obsolète)
type: ConceptReFip
type: Concept
broader: ZZ
in scheme: FINANCES PUBLIQUES
notation: REFIP1752

conservation des hypothèques
type: ConceptReFip
type: Concept
is replaced by: service de la publicité foncière
broader: direction départementale des finances publiques
definition: Structure qui effectuait l'accomplissement des formalités de publicité, la tenue à jour de la documentation et la délivrance de renseignements, sous l'autorité d'un conservateur des hypothèques, remplacée par le Service de la publicité foncière.
in scheme: FINANCES PUBLIQUES
in scheme: Organisation Structurelle de l'Etat
in scheme: Ministère
in scheme: Administration de L'Etat
notation: REFIP1754
scope note: Remplacée par SERVICE DE LA PUBLICITE FONCIERE à compter du 1er janvier 2013

prix ferme
type: ConceptReFip
type: Concept
broader: passation des marchés publics
definition: Prix invariable pendant la durée du marché, il est toutefois actualisable dans certains conditions.
in scheme: FINANCES PUBLIQUES
in scheme: Commande publique
in scheme: Gestion Publique
notation: REFIP1755

fiscalité internationale
type: ConceptReFip
type: Concept
broader: champ d'application
definition: Dispositions relatives aux accords fiscaux internationaux, avec pour triple objectif d'éliminer les doubles impositions, de lutter contre la fraude et l'évasion fiscale internationale, et de protéger les contribuables.
in scheme: FINANCES PUBLIQUES
in scheme: Champ d'Application
in scheme: Fiscalité
narrower: convention fiscale internationale
narrower: assistance administrative et fiscale internationale
narrower: opération triangulaire
narrower: échange automatique d'information
narrower: accord d'échange d'information fiscale
narrower: transfert intracommunautaire
narrower: FISCALIS
notation: REFIP1756

archives départementales
type: ConceptReFip
type: Concept
broader: refip-REFIP838
definition: Service de l'administration chargé de la gestion des archives produites au sein d'un département, officiellement dénommée service départemental d'archives.
in scheme: FINANCES PUBLIQUES
in scheme: Organisation Structurelle de l'Etat
in scheme: Ministère
in scheme: Administration de L'Etat
notation: REFIP1758

procédure contentieuse
type: ConceptReFip
type: Concept
broader: principes généraux (non-descripteur)
definition: Procédure suivie par une juridiction lorsqu'elle doit trancher un litige par un acte juridictionnel.
in scheme: FINANCES PUBLIQUES
in scheme: Principes Généraux
in scheme: Droit et Justice
in scheme: Procédure
narrower: refip-REFIP689
notation: REFIP1759

taxe d'aménagement
type: ConceptReFip
type: Concept
alternative label: TDCAUE
alternative label: taxe complémentaire à la taxe locale d'équipement en région Ile-de-France
alternative label: taxe d'urbanisme
alternative label: taxe départementale des espaces naturels sensibles
alternative label: taxe départementale pour le financement des conseils d'architecture d'urbanisme et de l'environnement
alternative label: taxe spéciale d'équipement du département de la Savoie
broader: taxes et redevance de nature immobilière (non-descripteur)
definition: Depuis le 1er mars 2012, taxe se substituant à la taxe locale d'équipement (TLE), la taxe départementale des espaces naturels et sensibles (TDENS) la taxe départementale pour le financement des conseils d'architecture, d'urbanisme et de l'environnement (TDCAUE), la taxe spéciale d'équipement du département de la Savoie, la taxe complémentaire à la TLE en région d'Île-de-France et au programme d'aménagement d'ensemble (PAE). Taxe liquidée et recouvrée par les comptables publics compétents comme des créances étrangères à l'impôt et au domaine
in scheme: FINANCES PUBLIQUES
in scheme: Fiscalité
in scheme: Impôt
notation: REFIP176
scope note: Entrée en vigueur le 01/03/2012

pécule modulable d'incitation à une seconde carrière (supprimé)
type: ConceptReFip
type: Concept
broader: ZZ
in scheme: FINANCES PUBLIQUES
notation: REFIP1760

répartition
type: ConceptReFip
type: Concept
broader: mots outils (liste additive)
definition: Partage, division, distribution.
in scheme: FINANCES PUBLIQUES
in scheme: Mots Outils
notation: REFIP1761

immeuble à usage mixte
type: ConceptReFip
type: Concept
broader: immeuble
definition: Bien immobilier servant à différents usages, un usage d’habitation et un usage commercial par exemple.
in scheme: FINANCES PUBLIQUES
in scheme: Droit et Justice
in scheme: Divisions du Droit
in scheme: Droit Privé
notation: REFIP1762

application COROL
type: ConceptReFip
type: Concept
broader: applications fiscales (non-descripteur)
definition: Application centralisant pour la Comptabilité des Rôles, les données émises par les rôles généraux et supplémentaires des impôts d'Etat et des impôts locaux, ainsi que des versements spontanés enregistrés par la comptabilité publique.
in scheme: FINANCES PUBLIQUES
in scheme: Applications Informatiques
in scheme: Applications fiscales
notation: REFIP1764

bâtiment agricole
type: ConceptReFip
type: Concept
alternative label: construction agricole
broader: exploitation agricole
definition: Bâtiment construit à des fins agricoles, à l’exception des bâtiments résidentiels.
in scheme: FINANCES PUBLIQUES
in scheme: Branche d'activité
in scheme: Questions Economiques
in scheme: Agriculture
notation: REFIP1765
related: refip-REFIP6899

privatisation
type: ConceptReFip
type: Concept
broader: économie générale (non-descripteur)
definition: Opération consistant à transférer par la vente d'actifs, une activité, un établissement ou une entreprise du secteur public au secteur privé. La privatisation est dite partielle si seulement une partie du capital est vendue.
in scheme: FINANCES PUBLIQUES
in scheme: Questions Economiques
in scheme: Economie générale
notation: REFIP1766

établissement public foncier
type: ConceptReFip
type: Concept
broader: établissement public à caractère industriel et commercial
definition: Etablissement public à caractère industriel et commercial qui négocie et mène les procédures permettant de constituer des réserves foncières en amont de la phase de réalisation de projet d'aménagement public. Il a pour compétence le « recyclage foncier », c'est-à-dire la maîtrise foncière, l'achat, le portage, la gestion, la remise en état des terrains (et donc leur possible dépollution), ainsi que la gestion de l'ensemble des études utiles à cette maîtrise foncière.
in scheme: FINANCES PUBLIQUES
in scheme: Organisation Structurelle de l'Etat
in scheme: Opérateur de l'Etat
in scheme: Administration de L'Etat
notation: REFIP1769

régime fiscal privilégié
type: ConceptReFip
type: Concept
broader: régime dérogatoire
definition: Régime fiscal dérogeant de façon favorable pour le contribuable au régime général.
in scheme: FINANCES PUBLIQUES
in scheme: Régime d'Imposition
in scheme: Fiscalité
notation: REFIP177

transfert de personnel
type: ConceptReFip
type: Concept
broader: transfert de compétence
definition: Transfert de moyens humains dans le cadre notamment d'un transfert de compétence.
in scheme: FINANCES PUBLIQUES
in scheme: Etat
in scheme: Réforme de l'Etat
in scheme: Administration de L'Etat
notation: REFIP1771

avantage acquis
type: ConceptReFip
type: Concept
broader: droit du travail
definition: Avantage consenti aux salariés d’une entreprise ou d’un établissement par l’application de conventions, d’accords ou d’usages, et dont le principe ne peut être remis en cause que sous réserve de compensations négociées entre l’employeur et les représentants du personnel.
in scheme: FINANCES PUBLIQUES
in scheme: Droit et Justice
in scheme: Divisions du Droit
in scheme: Droit Privé
notation: REFIP1772

dépréciation d'un élément d'actif
type: ConceptReFip
type: Concept
broader: actif
definition: Constatation que le bien (immobilisation, stock…) a perdu de sa valeur, sa Valeur Actuelle (VA) étant devenue inférieure à sa Valeur Nette Comptable (VNC) en fin d’exercice.
in scheme: FINANCES PUBLIQUES
in scheme: Documents comptables
in scheme: Comptabilité
notation: REFIP1774

Mutuelle générale de l'économie des finances et de l'industrie
type: ConceptReFip
type: Concept
alternative label: MGEFI
broader: administration centrale des finances publiques
definition: Organisme à but non lucratif dont la mission est de gérer le risque santé et prévoyance des agents des ministères économique et financier et de leurs proches.
in scheme: FINANCES PUBLIQUES
in scheme: Organisation Structurelle de l'Etat
in scheme: Ministère
in scheme: Administration de L'Etat
notation: REFIP1775

direction régionale des finances publiques
type: ConceptReFip
type: Concept
alternative label: DRFIP
broader: services déconcentrés des finances publiques
definition: Structure déconcentrée de la DGFIP, la direction régionale des finances publiques (DRFIP) assure notamment, dans le département où est situé le chef-lieu de région, la mise en œuvre des missions relevant des directions départementales. Chargée en outre, dans le ressort territorial de la région, du contrôle financier déconcentré des administrations de l'Etat, de l'expertise économique et financière des investissements publics, de la tutelle sur les ordres régionaux des experts-comptables, de la délivrance de l'agrément et du suivi de certains organismes qui ont leur siège dans la région, et de la sécurité économique. Elle assure également la mise en œuvre des missions liées à la gestion financière et comptable de la collectivité régionale et de ses établissements.
in scheme: FINANCES PUBLIQUES
in scheme: Organisation Structurelle de l'Etat
in scheme: Ministère
in scheme: Administration de L'Etat
narrower: centre prélèvement service
narrower: centre amendes service
narrower: trésorerie du contrôle automatisé
narrower: centre impôts service
narrower: brigade régionale foncière
narrower: centre d'encaissement
narrower: Pôle interrégional d'apurement administratif
narrower: cellule interrégionale de supervision des tiers
narrower: centre de services partagés
narrower: Autorité de gestion
narrower: recette générale des finances
narrower: Pôle de gestion des consignations
narrower: Autorité de certification
narrower: service facturier
narrower: fonction régionale de supervision des tiers
narrower: paierie régionale
narrower: mission d'expertise économique et financière
narrower: centre de contact
narrower: Pôle juridictionnel
narrower: service d'appui au réseau
narrower: centre éditique
narrower: refip-REFIP7082
narrower: refip-REFIP7083
narrower: refip-REFIP7094
notation: REFIP1777

opposition à poursuites
type: ConceptReFip
type: Concept
alternative label: opposition aux actes de poursuites
broader: contentieux du recouvrement
definition: Contestation relative au recouvrement des impôts lorsque les comptables ont mis en œuvre des mesures d'exécution forcée
in scheme: FINANCES PUBLIQUES
in scheme: Recouvrement
in scheme: Fiscalité
narrower: opposition à saisie
notation: REFIP1778

dotation départementale d'équipement des collèges
type: ConceptReFip
type: Concept
broader: dotation
definition: Dotation destinée à compenser le poids financier des compétences transférées aux départements dans le cadre de la décentralisation, concernant les charges d'investissement des collèges.
in scheme: FINANCES PUBLIQUES
in scheme: Dépenses publiques
in scheme: Gestion Publique
notation: REFIP1779

Cour des comptes
type: ConceptReFip
type: Concept
broader: juridiction financière
definition: Juridiction financière chargée de certifier la régularité (conformité aux règles), la sincérité (application de la bonne foi des règles) et la fidélité (rendant compte de la réalité) des comptes de l’État et des comptables publics des différents services de l’État. Assiste le Parlement et le gouvernement pour vérifier la bonne exécution des lois de finances de l’État et des lois de financement de la Sécurité sociale.
in scheme: FINANCES PUBLIQUES
in scheme: Droit et Justice
in scheme: Juridiction
in scheme: Organisation Juridictionnelle
narrower: chambre régionale des comptes
notation: REFIP178

Afrique
type: ConceptReFip
type: Concept
definition: Continent
in scheme: FINANCES PUBLIQUES
in scheme: Géographie
in scheme: Afrique
narrower: Maroc
narrower: Guinée-Bissau
narrower: Mali
narrower: Comores
narrower: Nigeria
narrower: Niger
narrower: Tunisie
narrower: Mauritanie
narrower: île Maurice
narrower: Sénégal
narrower: Algérie
narrower: Madagascar
narrower: Kenya
narrower: Burkina-Faso
narrower: République centrafricaine
narrower: République du Congo
narrower: République de Djibouti
narrower: Côte d'Ivoire
narrower: Egypte
narrower: Togo
narrower: Tchad
narrower: Guinée équatoriale
narrower: Bénin
narrower: République du Liberia
narrower: République de Guinée
narrower: Afrique du Sud
narrower: Gabon
narrower: refip-REFIP887
narrower: refip-REFIP951
notation: REFIP1780

déclaration de soupçon
type: ConceptReFip
type: Concept
broader: droit de contrôle de l'administration (non-descripteur)
definition: Compte tenu de leur activité professionnelle, certaines personnes (banquier, assureur, avocat, notaire, expert-comptable, agent sportif, etc.) sont tenues de participer à la lutte contre le blanchiment d'argent et le financement du terrorisme, en déclarant à la cellule TRACFIN, toutes les opérations suspectes qu'elles constatent.
in scheme: FINANCES PUBLIQUES
in scheme: Droit de Contrôle de l'Administration
in scheme: Fiscalité
notation: REFIP1781
related: TRACFIN

île Maurice
type: ConceptReFip
type: Concept
broader: Afrique
definition: Pays
in scheme: FINANCES PUBLIQUES
in scheme: Géographie
in scheme: Afrique
notation: REFIP1783

dépenses de personnel
type: ConceptReFip
type: Concept
alternative label: charges de personnel
alternative label: masse salariale
broader: dépenses de l'Etat
definition: Ensemble des rémunérations d'activité, des cotisations sociales patronales, des taxes et versements liés aux rémunération ainsi que les prestations sociales.
in scheme: FINANCES PUBLIQUES
in scheme: Dépenses publiques
in scheme: Gestion Publique
notation: REFIP1784

devis
type: ConceptReFip
type: Concept
broader: facturation
definition: Document écrit dans lequel un fournisseur informe le consommateur, avant l'achat d'un produit ou d'une prestation de service, de ses caractéristiques essentielles, du prix, de la date ou du délai de livraison du produit ou d'exécution du service. Ces informations précontractuelles sont souvent intégrées dans un devis. Sa délivrance est obligatoire dans certains cas.
in scheme: FINANCES PUBLIQUES
in scheme: Procédures et Techniques Comptables
in scheme: Comptabilité
notation: REFIP1785

consignation
type: ConceptReFip
type: Concept
broader: séquestre
definition: Dépôt de sommes, valeurs ou objets entre les mains d'une tierce personne en garantie des engagements par un contribuable envers le comptable public.
in scheme: FINANCES PUBLIQUES
in scheme: Recouvrement
in scheme: Fiscalité
notation: REFIP1786

régime simplifié d'imposition
type: ConceptReFip
type: Concept
alternative label: régime du réel simplifié
broader: régime réel d'imposition
definition: Régime fiscal pour les exploitants individuels ou les personnes morales soumises à l'IR ou à l'IS en matière de résultat et de TVA et dont le chiffre d'affaires est compris entre certains seuils, et qui comprend des obligations déclaratives allégées.
in scheme: FINANCES PUBLIQUES
in scheme: Régime d'Imposition
in scheme: Fiscalité
notation: REFIP1787

taxe professionnelle unique
type: ConceptReFip
type: Concept
broader: taxe professionnelle
definition: Instaurée depuis la loi du 12 juillet 1999, cette TPU existait obligatoirement pour les communautés d'agglomérations et sur option pour les communautés de communes. Elle se substituait à la TP des communes membres des EPCI. Supprimée avec la taxe professionnelle au 1er janvier 2010.
in scheme: FINANCES PUBLIQUES
in scheme: Fiscalité
in scheme: Impôt
notation: REFIP1788

exigibilité immédiate
type: ConceptReFip
type: Concept
broader: exigibilité
definition: Droit reconnu à l'Administration fiscale de réclamer le paiement de l'impôt dès la mise en recouvrement du titre, sous réserve que l'avis d'imposition ait été notifié au contribuable avant la date de mise en recouvrement, procédure applicable dans des cas limitativement prévus par la loi.
in scheme: FINANCES PUBLIQUES
in scheme: Recouvrement
in scheme: Fiscalité
notation: REFIP1789

créance conditionnelle (supprimé)
type: ConceptReFip
type: Concept
broader: ZZ
in scheme: FINANCES PUBLIQUES
notation: REFIP179

comptabilité M 61
type: ConceptReFip
type: Concept
broader: comptabilité publique locale
definition: Instruction budgétaire et comptable M 61 applicable aux services d'incendie et de secours.
in scheme: FINANCES PUBLIQUES
in scheme: Secteur public local
in scheme: Gestion Publique
notation: REFIP1790

droit fixe
type: ConceptReFip
type: Concept
broader: droits d'enregistrement
definition: Droit d’enregistrement perçu sur certains actes (ex : procuration, autorisation, etc.) ne constatant aucun mouvement de valeur; la contribution dépend uniquement de la nature de l’acte et non de la valeur des biens qui en font l’objet.
in scheme: FINANCES PUBLIQUES
in scheme: Fiscalité
in scheme: Impôt
notation: REFIP1792

contribution à la formation professionnelle des artisans au régime micro-social (supprimé)
type: ConceptReFip
type: Concept
broader: ZZ
in scheme: FINANCES PUBLIQUES
notation: REFIP1793

compensation contentieuse
type: ConceptReFip
type: Concept
broader: contentieux fiscal
definition: Droit offert aux contribuables ou à l'administration, au cours de l'instruction d'une réclamation ou d'une instance juridictionnelle, de demander une compensation dans la limite de l'imposition contestée, entre les dégrèvements reconnus justifiés et les insuffisances ou omissions de toute nature constatées dans l'assiette ou le calcul de l'imposition au cours de l'instruction de la demande.
in scheme: FINANCES PUBLIQUES
in scheme: Contentieux Fiscal
in scheme: Fiscalité
notation: REFIP1794

intérêt du service
type: ConceptReFip
type: Concept
alternative label: intérêt de service
broader: refip-REFIP6565
definition: Notion d'intérêt général justifiant l'action administrative et conduisant à imposer aux agents certaines obligations ou a leur refuser certains avantages.
in scheme: FINANCES PUBLIQUES
in scheme: Gestion des ressources humaines
in scheme: Fonction Publique et Gestion des Ressources Humaines
notation: REFIP1795

montagne
type: ConceptReFip
type: Concept
broader: milieu naturel
definition: Relief topographique mais aussi milieu économique et écosystème.
in scheme: FINANCES PUBLIQUES
in scheme: Environnement
in scheme: Milieu Naturel
in scheme: Questions de Société
notation: REFIP1796

déclaration européenne des services
type: ConceptReFip
type: Concept
broader: documentation fiscale (non-descripteur)
definition: Etat récapitulatif des clients auxquels des services ont été fournis sur le modèle de celui existant pour les biens, déposé mensuellement en complément des obligations déclaratives en matière de TVA, par les prestataires de services intracommunautaires.
in scheme: FINANCES PUBLIQUES
in scheme: Documentation Fiscale
in scheme: Fiscalité
notation: REFIP1797

fourgon funéraire (supprimé)
type: ConceptReFip
type: Concept
broader: ZZ
in scheme: FINANCES PUBLIQUES
notation: REFIP1798

application SRM (supprimé)
type: ConceptReFip
type: Concept
broader: ZZ
in scheme: FINANCES PUBLIQUES
notation: REFIP1799

magasin de grande surface
type: ConceptReFip
type: Concept
alternative label: grande surface
alternative label: hypermarché
alternative label: supermarché
broader: magasin
definition: Commerce de détail de biens de consommation et éventuellement des services associés dans des points disposant d'une grande surface, organisés pour la vente en libre-service.
in scheme: FINANCES PUBLIQUES
in scheme: Branche d'activité
in scheme: Questions Economiques
in scheme: Commerce
notation: REFIP18

frais de double résidence
type: ConceptReFip
type: Concept
broader: frais réels
definition: Frais supplémentaires de logement, nourriture ou de déplacement supportés par les salariés qui travaillent et habitent dans une commune différente de celle où réside leur famille, déductibles à condition que cette situation ne résulte pas de convenances personnelles et constitue au contraire une contrainte inhérente à l'emploi.
in scheme: FINANCES PUBLIQUES
in scheme: Liquidation de l'Impôt
in scheme: Fiscalité
notation: REFIP180

conciliation
type: ConceptReFip
type: Concept
broader: règlement amiable
definition: Procédure mise en place par loi de sauvegarde du 26/07/2005 pour les entreprises en difficulté afin de favoriser la conclusion d'un accord amiable entre le débiteur et ses principaux créanciers.
in scheme: FINANCES PUBLIQUES
in scheme: Procédure Civile
in scheme: Droit et Justice
in scheme: Procédure
notation: REFIP1800

droit d'usage et d'habitation
type: ConceptReFip
type: Concept
broader: droit de propriété
definition: Droit particulier, se caractérisant comme un droit d'usufruit plus restreint. Recouvre deux notions : le droit d'usage est le droit pour son titulaire d'utiliser le bien, mais aussi d'en percevoir les fruits éventuels (revenus…). Ce droit peut s'exercer sur des biens mobiliers ou immobiliers. Le droit d'habitation est le droit d'habiter le bien et de profiter de ses accessoires (ex : habiter une maison et profiter des jardins). Ce droit ne s'exerce que sur des logements.
in scheme: FINANCES PUBLIQUES
in scheme: Droit et Justice
in scheme: Divisions du Droit
in scheme: Droit Privé
notation: REFIP1804

impôt acquitté hors de France
type: ConceptReFip
type: Concept
broader: impôt
definition: Impôt payé dans un pays ou territoire autre que la France métropolitaine et les départements d'outre-mer, c'est-à-dire non seulement à l'étranger mais également dans les territoires français d'outre-mer.
in scheme: FINANCES PUBLIQUES
in scheme: Fiscalité
in scheme: Impôt
notation: REFIP1805

travail temporaire
type: ConceptReFip
type: Concept
alternative label: intérim
broader: refip-REFIP6950
definition: Exécution d’une tâche précise et temporaire, dénommée mission, dont le contrat n'est utilisable que dans les cas énumérés par la loi. Quel que soit le motif pour lequel il est conclu, un tel contrat ne peut avoir ni pour objet ni pour effet de pourvoir durablement un emploi lié à l’activité normale et permanente de l’entreprise utilisatrice. Conclu en dehors du cadre légal, le contrat peut être considéré comme un contrat à durée indéterminée.
in scheme: FINANCES PUBLIQUES
in scheme: Entreprises
in scheme: Travail
in scheme: 212619
narrower: entreprise de travail temporaire
notation: REFIP1807

fiche d'écriture
type: ConceptReFip
type: Concept
broader: documents comptables
definition: Document recensant les différentes opérations budgétaires et comptables de façon détaillées.
in scheme: FINANCES PUBLIQUES
in scheme: Documents comptables
in scheme: Comptabilité
notation: REFIP1809

Pays-Bas
type: ConceptReFip
type: Concept
alternative label: Hollande
broader: Europe
definition: Pays
in scheme: FINANCES PUBLIQUES
in scheme: Géographie
in scheme: Europe
notation: REFIP181
related: Antilles néerlandaises

capital social
type: ConceptReFip
type: Concept
alternative label: actif social
alternative label: capital
alternative label: capital comptable
alternative label: capital financier
broader: refip-REFIP998
definition: Ensemble des apports en numéraire et en nature que les associés mettent à la disposition de la société.
in scheme: FINANCES PUBLIQUES
in scheme: Gestion de l'Entreprise
in scheme: Entreprises
in scheme: Vie et Gestion de l'entreprise
notation: REFIP1810

annulation
type: ConceptReFip
type: Concept
broader: mots outils (liste additive)
definition: Action d'annuler quelque chose ; abolition, abrogation, résiliation.
in scheme: FINANCES PUBLIQUES
in scheme: Mots Outils
notation: REFIP1812

application OSC
type: ConceptReFip
type: Concept
alternative label: outil de suivi des cessions immobilières de l'Etat
broader: applications gestion publique (non-descripteur)
definition: Outil permettant de suivre l'état d’avancement des cessions des biens de l’État et des encaissements des produits de cessions.
in scheme: FINANCES PUBLIQUES
in scheme: Applications Informatiques
in scheme: Applications gestion publique
notation: REFIP1814

tiers provisionnel (obsolète)
type: ConceptReFip
type: Concept
is replaced by: bofip-BOFIP2395
broader: ZZ
in scheme: FINANCES PUBLIQUES
notation: REFIP1818

demande gracieuse
type: ConceptReFip
type: Concept
broader: juridiction gracieuse
definition: Demande par laquelle le contribuable ne conteste pas le bien fondé d'une imposition mais sollicite une mesure de bienveillance de la part de l'administration portant abandon ou modération des droits et/ou pénalités
in scheme: FINANCES PUBLIQUES
in scheme: Contentieux Fiscal
in scheme: Fiscalité
notation: REFIP1820
related: recours gracieux

offre à un marché public
type: ConceptReFip
type: Concept
broader: acte d'engagement
definition: Montant du marché porté sur l'acte d'engagement.
in scheme: FINANCES PUBLIQUES
in scheme: Commande publique
in scheme: Gestion Publique
notation: REFIP1822

reconnaissance de dettes
type: ConceptReFip
type: Concept
broader: droit des obligations et contrats (non-descripteur)
definition: Acte par lequel une personne reconnaît unilatéralement devoir une certaine somme d'argent ou un bien fongible à une autre personne.
in scheme: FINANCES PUBLIQUES
in scheme: Droit et Justice
in scheme: Divisions du Droit
in scheme: Droit Privé
notation: REFIP1823

inventaire
type: ConceptReFip
type: Concept
alternative label: recensement
broader: clôture de l'exercice
definition: Recensement exhaustif des éléments patrimoniaux de l'entreprise à la date d'arrêté des comptes, avec l'estimation de leur valeur d'actif ou de passif, repris dans un document qui récapitule cet état descriptif et estimatif.
in scheme: FINANCES PUBLIQUES
in scheme: Procédures et Techniques Comptables
in scheme: Comptabilité
narrower: écart de conversion
notation: REFIP1824

frais d'études
type: ConceptReFip
type: Concept
broader: actif professionnel
definition: Frais occasionnés notamment avant la réalisation de travaux ou lors d'un achat important, ils constituent normalement des charges d’exploitation de l’exercice au cours duquel ils sont encourus. Cependant, si certaines conditions sont remplies, certains frais sont immobilisables.
in scheme: FINANCES PUBLIQUES
in scheme: Documents comptables
in scheme: Comptabilité
notation: REFIP1825

dépenses provisoires
type: ConceptReFip
type: Concept
broader: refip-REFIP996
definition: Ensemble des règlements effectués temporairement par les services de l’État et qui n’ont pas le caractère de cession ou de trop-perçu.
in scheme: FINANCES PUBLIQUES
in scheme: Dépenses publiques
in scheme: Gestion Publique
notation: REFIP1826

procédure contradictoire
type: ConceptReFip
type: Concept
broader: procédure de contrôle fiscal
definition: Procédure dans laquelle les parties comparaissent en personne ou par mandataire selon les modalités propres à la juridiction devant laquelle la demande est portée.
in scheme: FINANCES PUBLIQUES
in scheme: Droit de Reprise de l'Administration
in scheme: Fiscalité
narrower: procédure de l'abus de droit
narrower: procédure de rectification contradictoire
notation: REFIP1827

badgeuse
type: ConceptReFip
type: Concept
alternative label: pointeuse
broader: matériel
definition: Système permettant d'enregistrer l'heure d'entrée et de sortie d'un salarié sur le lieu de travail. Une badgeuse est généralement composée d'un terminal où l'employé s'identifie (par badge) et d'un logiciel permettant de visualiser et de comptabiliser les heures de présence.
in scheme: FINANCES PUBLIQUES
in scheme: Lieu de Travail
in scheme: Entreprises
in scheme: Travail
notation: REFIP1828

pénalité d'assiette
type: ConceptReFip
type: Concept
broader: sanction fiscale
definition: Pénalité fiscale appliquée pour absence de déclaration, pour déclaration tardive ou pour déclaration inexacte ou pour redressement fiscal. Elle comprend l'intérêt de retard et les majorations applicables en cas de dépôt tardif ou en cas de découverte d'une activité occulte. On les distingue des pénalités de recouvrement.
in scheme: FINANCES PUBLIQUES
in scheme: Droit de Reprise de l'Administration
in scheme: Fiscalité
notation: REFIP1829

établissement pénitentiaire
type: ConceptReFip
type: Concept
alternative label: Centre pénitentiaire
alternative label: maison d'arrêt
alternative label: prison
broader: Ministère de la Justice
definition: Etablissement comprenant différents types de structures d'incarcération dont notamment les maisons d'arrêt, les centres de détention et les maisons centrales, chargé d'accueillir les prévenus et les condamnés en fonction de la durée de leur peine et de leur profil.
in scheme: FINANCES PUBLIQUES
in scheme: Organisation Structurelle de l'Etat
in scheme: Ministère
in scheme: Administration de L'Etat
notation: REFIP1830

relevé de forclusion
type: ConceptReFip
type: Concept
broader: forclusion
definition: Acte en vertu duquel celui qui avait encouru une forclusion est après coup dégagé de cette sanction et autorisé à accomplir la formalité qui lui incombait dans un nouveau délai.
in scheme: FINANCES PUBLIQUES
in scheme: Principes Généraux
in scheme: Droit et Justice
in scheme: Procédure
notation: REFIP1831

conflit de lois
type: ConceptReFip
type: Concept
broader: législation
definition: Situation juridique dans laquelle plusieurs lois sont susceptibles de s'appliquer. Cela peut consister en un conflit de lois dans l'espace ou dans le temps.
in scheme: FINANCES PUBLIQUES
in scheme: Droit et Justice
in scheme: Sources du Droit
in scheme: Sources du Droit Objectif
notation: REFIP1833

support de communication
type: ConceptReFip
type: Concept
alternative label: affiche
alternative label: brochure
alternative label: dépliant
alternative label: fascicule
alternative label: plaquette
alternative label: support de documentation
broader: information
definition: Vecteur de communication destiné à véhiculer un message.
in scheme: FINANCES PUBLIQUES
in scheme: Communication
in scheme: Communication Documentation Informatique
narrower: cédérom
narrower: microfiche
notation: REFIP1834
related: emplacement publicitaire
related: publicité commerciale
related: documentation

application MIRIAM
type: ConceptReFip
type: Concept
alternative label: MIRIAM
broader: applications fiscales (non-descripteur)
definition: Micro Informatique des Recettes des Impôts Associée à MEDOC aidant à la gestion de l'action en recouvrement, gestion des jugements, relance des défaillants déclaratifs des redevables professionnels.
in scheme: FINANCES PUBLIQUES
in scheme: Applications Informatiques
in scheme: Applications fiscales
notation: REFIP1835
scope note: Application remplacée par l'application RSP

retenue à la source
type: ConceptReFip
type: Concept
broader: prélèvement à la source
definition: Système de recouvrement de l'impôt et de prélèvements sociaux dont est redevable une personne, assuré par un tiers pour le compte de l'administration bénéficiaire.
in scheme: FINANCES PUBLIQUES
in scheme: Recouvrement
in scheme: Fiscalité
notation: REFIP1836

Dordogne
type: ConceptReFip
type: Concept
broader: refip-REFIP7020
definition: Département français
in scheme: FINANCES PUBLIQUES
in scheme: Géographie
in scheme: Europe
notation: REFIP1837

Principauté d'Andorre
type: ConceptReFip
type: Concept
alternative label: Andorre
broader: Europe
definition: Pays
in scheme: FINANCES PUBLIQUES
in scheme: Géographie
in scheme: Europe
notation: REFIP1839

centre de gestion de la fonction publique territoriale
type: ConceptReFip
type: Concept
broader: refip-REFIP973
definition: Etablissement public local à caractère administratif partenaire des collectivités locales pour la gestion des fonctionnaires. Leurs missions sont le suivi des carrières des agents, les offres et demandes d'emploi, l'organisation des concours et examens, le droit syndical, la prise en charge des fonctionnaires A+ privés d'emploi.
in scheme: FINANCES PUBLIQUES
in scheme: Organisation Territoriale
in scheme: Structures Territoriales
in scheme: Administration de L'Etat
notation: REFIP184

dotation de compensation
type: ConceptReFip
type: Concept
broader: dotation
definition: Dotation de l'Etat allouées aux collectivités territoriales visant à compenser les pertes de recettes fiscales ou d'imposition suite au transfert des nouvelles charges aux collectivités.
in scheme: FINANCES PUBLIQUES
in scheme: Dépenses publiques
in scheme: Gestion Publique
narrower: dotation de compensation de la réforme de la taxe professionnelle
notation: REFIP1840

cahier des clauses administratives particulières
type: ConceptReFip
type: Concept
alternative label: CCAP
broader: cahier des charges
definition: Document regroupant l’ensemble des stipulations d'ordre juridique et financières régissant l'exécution du marché public.
in scheme: FINANCES PUBLIQUES
in scheme: Commande publique
in scheme: Gestion Publique
notation: REFIP1841

distribution occulte
type: ConceptReFip
type: Concept
broader: fraude fiscale
definition: Part de résultat non déclaré dans la masse des revenus distribués d'une personne morale.
in scheme: FINANCES PUBLIQUES
in scheme: Droit de Contrôle de l'Administration
in scheme: Fiscalité
notation: REFIP1842
related: présomption de distribution

entente prohibée
type: ConceptReFip
type: Concept
broader: pratique restrictive de concurrence
definition: Action ayant pour objectif ou pouvant avoir pour effet d'empêcher, de restreindre ou de fausser le jeu de la concurrence sur un marché.
in scheme: FINANCES PUBLIQUES
in scheme: Droit et Justice
in scheme: Divisions du Droit
in scheme: Droit Privé
notation: REFIP1843

récolement
type: ConceptReFip
type: Concept
broader: vente domaniale
in scheme: FINANCES PUBLIQUES
in scheme: Domaine
in scheme: Gestion Publique
notation: REFIP1844

laboratoire
type: ConceptReFip
type: Concept
alternative label: laboratoire d'analyses médicales
alternative label: laboratoire de biologie
alternative label: laboratoire de recherche
broader: recherche scientifique
definition: Lieu d'exercice de chercheurs où sont réalisées des observations ou des expériences, ainsi que toute autre activité scientifique.
in scheme: FINANCES PUBLIQUES
in scheme: Branche d'activité
in scheme: Questions Economiques
in scheme: Industrie
notation: REFIP1845

application MEDOC
type: ConceptReFip
type: Concept
alternative label: MEDOC
alternative label: application MEDOC WEB
broader: applications fiscales (non-descripteur)
definition: Application permettant la gestion des redevables professionnels dans les SIE (recouvrement des différents impôts et taxes, comptabilité du recouvrement et des dépenses) ainsi que la gestion comptable de certains redevables particuliers.
in scheme: FINANCES PUBLIQUES
in scheme: Applications Informatiques
in scheme: Applications fiscales
notation: REFIP1846

confidentialité
type: ConceptReFip
type: Concept
broader: information
definition: Fait de s'assurer que l'information n'est accessible qu'à ceux dont l'accès est autorisé.
in scheme: FINANCES PUBLIQUES
in scheme: Communication
in scheme: Communication Documentation Informatique
notation: REFIP1848

machine multi-applicative
type: ConceptReFip
type: Concept
broader: informatique
definition: Serveur informatique local permettant d’accéder à différentes applications, chaque MMA dispose d’un nombre limité de connexions simultanées en fonction de son dimensionnement.
in scheme: FINANCES PUBLIQUES
in scheme: Informatique
in scheme: Communication Documentation Informatique
notation: REFIP1849

référendum
type: ConceptReFip
type: Concept
broader: droit constitutionnel
definition: Procédure exceptionnelle par laquelle le Président de la République soumet au vote des citoyens un projet de loi ordinaire ou constitutionnelle.
in scheme: FINANCES PUBLIQUES
in scheme: Droit et Justice
in scheme: Divisions du Droit
in scheme: Droit Public
notation: REFIP185

opérateur de l'Etat
type: ConceptReFip
type: Concept
broader: organisation structurelle de l'Etat (non-descripteur)
definition: Organismes distincts de l’État, de statut juridique public ou privé, auxquels sont confiés une mission de service public de l’État, c’est à dire qu’il leur revient d’exécuter la totalité ou une part significative de la politique d’un programme. On retrouve parmi les opérateurs notamment les grands établissements publics : universités, Météo France, CNRS, INSERM...
in scheme: FINANCES PUBLIQUES
in scheme: Organisation Structurelle de l'Etat
in scheme: Opérateur de l'Etat
in scheme: Administration de L'Etat
narrower: établissement public national
narrower: groupement d'intérêt public
notation: REFIP1851

application HYPOSCAN
type: ConceptReFip
type: Concept
alternative label: HYPOSCAN
broader: applications fiscales (non-descripteur)
definition: Application permettant la consultation des copies d'actes hypothécaires numérisés.
in scheme: FINANCES PUBLIQUES
in scheme: Applications Informatiques
in scheme: Applications fiscales
notation: REFIP1853

Haïti
type: ConceptReFip
type: Concept
alternative label: République d'Haïti
broader: Amérique
definition: Pays
in scheme: FINANCES PUBLIQUES
in scheme: Géographie
in scheme: Amérique
notation: REFIP1854

pylône
type: ConceptReFip
type: Concept
broader: électricité
definition: Structure verticale métallique ou en béton armé, servant de support à une construction (viaduc, etc.) ou aux conducteurs d'une ligne électrique.
in scheme: FINANCES PUBLIQUES
in scheme: Branche d'activité
in scheme: Questions Economiques
in scheme: Industrie
notation: REFIP1858

journaliste
type: ConceptReFip
type: Concept
broader: presse
definition: Personne qui a pour activité principale, régulière et rétribuée, l'exercice du journalisme dans un ou plusieurs organes de presse et qui en tire le principal de ses ressources.
in scheme: FINANCES PUBLIQUES
in scheme: Communication
in scheme: Communication Documentation Informatique
notation: REFIP1859

gestionnaire de la liquidation de la recette (supprimé)
type: ConceptReFip
type: Concept
broader: ZZ
in scheme: FINANCES PUBLIQUES
notation: REFIP186

comptabilité informatisée
type: ConceptReFip
type: Concept
definition: Comptabilité tenue sur un logiciel informatique. Les principes régissant la tenue d'une comptabilité informatisée concernent tous les contribuables astreints à tenir et à présenter des documents comptables, dès lors que leur comptabilité est tenue, en tout ou partie, au moyen de systèmes informatisés et également lorsque ces systèmes participent directement ou indirectement à la justification d’une écriture comptable.
in scheme: FINANCES PUBLIQUES
in scheme: Comptabilité informatisée
in scheme: Comptabilité
notation: REFIP1860

prime à l'arrachage de vignes
type: ConceptReFip
type: Concept
alternative label: prime d'arrachage de vignes
broader: prime (non-descripteur)
definition: Prime versée aux viticulteurs dans le cadre de restructuration ou reconversion du vignoble.
in scheme: FINANCES PUBLIQUES
in scheme: Dépenses publiques
in scheme: Gestion Publique
notation: REFIP1862

machine à affranchir
type: ConceptReFip
type: Concept
broader: matériel
definition: Outil de bureau qui calcule le poids des courriers et imprime de façon automatisée le montant du tarif d’affranchissement sur l’enveloppe ou le colis. Cette empreinte remplace le timbre-poste traditionnel.
in scheme: FINANCES PUBLIQUES
in scheme: Lieu de Travail
in scheme: Entreprises
in scheme: Travail
notation: REFIP1863
related: affranchissement

avis du service des domaines
type: ConceptReFip
type: Concept
broader: domaine public
definition: Avis rendu par le service des Domaines suite à consultation d'une collectivité territoriale ou des personnes qui en dépendent et concernant des demandes d'acquisition d'immeubles ou de droits réels immobiliers.
in scheme: FINANCES PUBLIQUES
in scheme: Domaine
in scheme: Gestion Publique
notation: REFIP1864

contentieux du recouvrement
type: ConceptReFip
type: Concept
broader: recouvrement
definition: Contestation des mesures de recouvrement forcé exercées par les comptables de la DGFiP, et comprenant l'opposition aux actes de poursuites et la revendication d'objets saisis.
in scheme: FINANCES PUBLIQUES
in scheme: Recouvrement
in scheme: Fiscalité
narrower: opposition à poursuites
narrower: revendication d'objets saisis
notation: REFIP1867

doctrine administrative
type: ConceptReFip
type: Concept
alternative label: doctrine fiscale
broader: documentation fiscale (non-descripteur)
definition: Ensemble des documents élaborés par l'administration fiscale pour l'interprétation des textes fiscaux ou de l'appréciation qu'elle porte sur des situations de faits. La doctrine fiscale opposable est celle publiée au BOFIP ou au Journal Officiel
in scheme: FINANCES PUBLIQUES
in scheme: Documentation Fiscale
in scheme: Fiscalité
notation: REFIP1868
related: Bulletin officiel des finances publiques

créance de l'Etat étrangère à l'impôt et aux domaines
type: ConceptReFip
type: Concept
broader: produits divers
definition: Recette de l'Etat autre que les impôts, les recettes domaniales et les amendes et autres condamnations pécuniaires.
in scheme: FINANCES PUBLIQUES
in scheme: Recouvrement
in scheme: Fiscalité
notation: REFIP1870

régie d'avances et de recettes
type: ConceptReFip
type: Concept
broader: régie
definition: Service permettant à un régisseur d'exécuter des opérations de dépenses et de recettes d'une collectivité territoriale ou d'un établissement public local au nom et pour le compte de son comptable public assignataire.
in scheme: FINANCES PUBLIQUES
in scheme: Secteur public local
in scheme: Gestion Publique
notation: REFIP1871

mission interministérielle sur les mutations économiques (supprimé)
type: ConceptReFip
type: Concept
broader: ZZ
in scheme: FINANCES PUBLIQUES
notation: REFIP1872

recettes fiscales de l'Etat
type: ConceptReFip
type: Concept
broader: recettes de l'Etat
definition: Recettes provenant des impôts qu’ils soient directs et indirects.
in scheme: FINANCES PUBLIQUES
in scheme: Budget de l’État
in scheme: Budget
narrower: frais d'assiette et de recouvrement
notation: REFIP1873

application CATLOC
type: ConceptReFip
type: Concept
alternative label: CATLOC
broader: applications gestion publique (non-descripteur)
definition: Application de gestion des comptes à terme des collectivités territoriales et de gestion des comptes de placement rémunérés.
in scheme: FINANCES PUBLIQUES
in scheme: Applications Informatiques
in scheme: Applications gestion publique
notation: REFIP1874

principe de régularité
type: ConceptReFip
type: Concept
alternative label: régularité comptable
alternative label: régularité des comptes
broader: refip-REFIP819
definition: Principe obligeant, tant dans les normes françaises qu'internationales, une entreprise à présenter des états comptables réguliers. La régularité des états comptables qui est obligatoire est obtenue en suivant les principes comptables en vigueur pour la société .
in scheme: FINANCES PUBLIQUES
in scheme: Principe comptable
in scheme: Comptabilité
notation: REFIP1875

Code des tribunaux administratifs et des cours administratives d'appel
type: ConceptReFip
type: Concept
broader: documentation juridique (non-descripteur)
definition: Ensemble des dispositions relatives à l'introduction de l'instance, aux délais, représentations des parties, procédures d'urgence, instructions des affaires, moyens d'investigation, voies de recours, voies d'exécution...
in scheme: FINANCES PUBLIQUES
in scheme: Droit et Justice
in scheme: Documentation Juridique
in scheme: Sources du Droit
notation: REFIP1877
scope note: Le code des tribunaux administratifs et des cours administratives d'appel a été remplacé par le code de justice administrative

convocation
type: ConceptReFip
type: Concept
broader: document
definition: Document demandant à une personne de se présenter.
in scheme: FINANCES PUBLIQUES
in scheme: Documentation
in scheme: Communication Documentation Informatique
notation: REFIP1878

compte technique (supprimé)
type: ConceptReFip
type: Concept
broader: ZZ
in scheme: FINANCES PUBLIQUES
notation: REFIP1879

crédit d'impôt pour adhésion à un groupement de prévention agréé
type: ConceptReFip
type: Concept
broader: refip-REFIP849
definition: Ouverte à toute entreprise, l'adhésion aux groupements de prévention agréés, qui ont pour mission de fournir à leurs adhérents, de façon confidentielle, une analyse des informations économiques comptables et financières transmises par ceux-ci, permet de bénéficier d'un crédit d'impôt.
in scheme: FINANCES PUBLIQUES
in scheme: Liquidation de l'Impôt
in scheme: Fiscalité
notation: REFIP188

obligation du tiers détenteur de fonds
type: ConceptReFip
type: Concept
broader: avis à tiers détenteur
definition: Obligation du tiers détenteur de payer au comptable des finances publiques le montant de la créance, ou des créances, dont le recouvrement est poursuivi, pour le montant figurant sur l'avis à tiers détenteur, à concurrence des fonds qu'il détient pour le compte du débiteur d'impôt désigné dans cet avis. A défaut de paiement, il peut être poursuivi sur ses biens personnels après avoir condamné par le juge de l'exécution dans le cadre d'une assignation engagée par le comptable public.
in scheme: FINANCES PUBLIQUES
in scheme: Recouvrement
in scheme: Fiscalité
notation: REFIP1882

Guyane
type: ConceptReFip
type: Concept
alternative label: Guyane française
broader: collectivités et territoires d'outre mer (non-descripteur)
definition: Département d'outre mer
in scheme: FINANCES PUBLIQUES
in scheme: Géographie
in scheme: Europe
notation: REFIP1883

dotation de péréquation
type: ConceptReFip
type: Concept
broader: dotation
definition: Mécanisme de redistribution qu vise à réduire les écarts de richesse donc les inégalités entre les différentes collectivités territoriales.
in scheme: FINANCES PUBLIQUES
in scheme: Dépenses publiques
in scheme: Gestion Publique
notation: REFIP1884

comité départemental d'examen des difficultés de financement des entreprises
type: ConceptReFip
type: Concept
alternative label: CODEFI
broader: structure locale (non-descripteur)
definition: Structure locale, présidée par le Préfet, ayant vocation à accueillir et à orienter les entreprises qui rencontrent des problèmes de financement. Elle aide les entreprises en difficulté à élaborer et à mettre en œuvre des solutions permettant d’assurer leur pérennité et leur développement.
in scheme: FINANCES PUBLIQUES
in scheme: Organisation Territoriale
in scheme: Structures Territoriales
in scheme: Administration de L'Etat
notation: REFIP1885
related: difficulté financière

contrôle fiscal externe
type: ConceptReFip
type: Concept
alternative label: contrôle sur place
broader: contrôle fiscal
definition: Forme de contrôle exercé dans les locaux des personnes morales ou examen approfondi de la situation fiscale personnelle des personnes physiques qui s'accompagne de l'engagement d'un débat oral et contradictoire avec le contribuable.
in scheme: FINANCES PUBLIQUES
in scheme: Droit de Contrôle de l'Administration
in scheme: Fiscalité
narrower: examen contradictoire de la situation fiscale personnelle
narrower: vérification de comptabilité
narrower: contrôle fiscal sur demande
notation: REFIP1888

paierie départementale
type: ConceptReFip
type: Concept
broader: direction départementale des finances publiques
definition: Structure chargée de l'encaissement des recettes et du paiement des dépenses du département. Les payeurs sont aussi responsables de la fiabilisation des comptes locaux, du contrôle hiérarchisé de la dépense. Il y en a une paierie départementale par département qui gère le budget du Conseil général (contrôle les mandats et paiement, les marchés publics; gère la paie des employés, les régies de recettes et d'avances, recouvre les impôts).
in scheme: FINANCES PUBLIQUES
in scheme: Organisation Structurelle de l'Etat
in scheme: Ministère
in scheme: Administration de L'Etat
notation: REFIP1889

Modernisation de l'action publique
type: ConceptReFip
type: Concept
broader: réforme de l'Etat
definition: Mission de modernisation de l'action publique ayant pour but, à moyen terme, la réforme de l’État, la baisse des dépenses publiques et l'amélioration des politiques publiques.
in scheme: FINANCES PUBLIQUES
in scheme: Etat
in scheme: Réforme de l'Etat
in scheme: Administration de L'Etat
notation: REFIP189

contrat unique d'insertion
type: ConceptReFip
type: Concept
alternative label: CUI
broader: contrat aide
definition: Contrat ayant pour objet de faciliter l'insertion professionnelle des personnes sans emploi rencontrant des difficultés sociales et professionnelles d'accès à l'emploi, et se déclinant sous deux formes : le Contrat Initiative Emploi (CUI-CIE) et le Contrat d'Accompagnement dans l'emploi (CUI-CAE).
in scheme: FINANCES PUBLIQUES
in scheme: Contrat de Travail
in scheme: Entreprises
in scheme: Travail
narrower: contrat initiative emploi
narrower: contrat d'accompagnement dans l'emploi
notation: REFIP1890

amortissement Borloo
type: ConceptReFip
type: Concept
broader: avantage fiscal
definition: Dispositif de défiscalisation mis en place depuis le 1er janvier 2006, sur option irrévocable du contribuable. Les logements donnés en location nue pendant une durée minimum de 9 ans, permettent de bénéficier d’une certaine déduction au titre de l’amortissement. Ensuite, un amortissement complémentaire est autorisé en cas de nouvel engagement de location pour une ou deux périodes de 3 ans.
in scheme: FINANCES PUBLIQUES
in scheme: Liquidation de l'Impôt
in scheme: Fiscalité
notation: REFIP1892

affectation de biens
type: ConceptReFip
type: Concept
alternative label: changement d'affectation de biens
broader: domaine public
definition: Décision unilatérale de transférer, en vue du fonctionnement d'un service public, à titre gratuit, à une autre personne publique ou à un service non personnalisé, la jouissance d'un bien, avec les droits et obligations qui s'y attachent.
in scheme: FINANCES PUBLIQUES
in scheme: Domaine
in scheme: Gestion Publique
narrower: rétrocession
narrower: transfert de biens droits et obligations
narrower: cession amiable
narrower: acquisition amiable
narrower: vente domaniale
narrower: refip-REFIP944
notation: REFIP1893

établissement stable
type: ConceptReFip
type: Concept
broader: droit de contrôle de l'administration (non-descripteur)
definition: Désigne une installation (entreprise étrangère) fixe d’affaires ayant une activité propre en France c'est-à-dire comportant les moyens humains et techniques nécessaires à la réalisation, de manière régulière, d'opérations imposables.
in scheme: FINANCES PUBLIQUES
in scheme: Droit de Contrôle de l'Administration
in scheme: Fiscalité
notation: REFIP1894

crédit de taxe sur la valeur ajoutée
type: ConceptReFip
type: Concept
alternative label: crédit de TVA
broader: refip-REFIP849
definition: Excédent de taxe sur la valeur ajoutée qui n'a pu être imputé, le montant de TVA déductible excédant le montant de TVA collectée.
in scheme: FINANCES PUBLIQUES
in scheme: Liquidation de l'Impôt
in scheme: Fiscalité
notation: REFIP1896

tiers solidaire
type: ConceptReFip
type: Concept
broader: solidarité au paiement
definition: Personne étrangère à un acte ou une convention mais néanmoins tenue de la dette en résultant.
in scheme: FINANCES PUBLIQUES
in scheme: Recouvrement
in scheme: Fiscalité
notation: REFIP1897

comptabilité d'analyse des coûts
type: ConceptReFip
type: Concept
broader: exécution du budget
definition: Comptabilité visant à améliorer la lisibilité de l’information financière relative aux ressources effectivement utilisées et permet de mettre en rapport cette consommation de ressources avec les objectifs et résultats attendus. Elle répond ainsi à la logique de performance de la gestion publique ainsi qu’à l’objectif de transparence de l’information financière institués par la LOLF.
in scheme: FINANCES PUBLIQUES
in scheme: Exécution du budget
in scheme: Budget
notation: REFIP1898
related: trajectoire comptable

relations avec le public
type: ConceptReFip
type: Concept
alternative label: relations avec les usagers
broader: qualité de service
definition: Relations de l’administration avec ses usagers personnes physiques ou personnes morales.
in scheme: FINANCES PUBLIQUES
in scheme: Missions Transverses des Finances publiques
in scheme: Qualité de service
narrower: accueil du public
narrower: anonymat
narrower: usager
narrower: réponse de l'administration
narrower: dissimulation du visage
notation: REFIP1899

sanction pénale
type: ConceptReFip
type: Concept
broader: sanction
definition: Peine infligée à l'auteur d'une infraction. La peine a une sanction d'expiation, d'intimidation et de réadaptation. Le Code Pénal fixe le quantum de la peine selon qu'elle est criminelle, correctionnelle ou contraventionnelle.
in scheme: FINANCES PUBLIQUES
in scheme: Droit et Justice
in scheme: Sanction
in scheme: Infractions et Sanctions
narrower: incarcération
narrower: confiscation
narrower: refip-REFIP844
notation: REFIP19

crédit d'impôt en faveur du développement durable
type: ConceptReFip
type: Concept
alternative label: crédit d'impôt en faveur de l'amélioration de la performance énergétique des logements anciens
alternative label: crédit d'impôt pour dépenses d'acquisition d'équipements d'énergie utilisant une source d'énergie renouvelable
alternative label: crédit d'impôt pour dépenses d'acquisition de matériaux d'isolation thermique et appareils de régulation de chauffage
broader: refip-REFIP849
definition: Dispositif accordé au titre des dépenses d’équipements en faveur des économies d’énergie et du développement durable supportées par les contribuables dans leur habitation principale, qu’ils en soient propriétaires, locataires ou occupants à titre gratuit, jusqu'au 01 septembre 2014.
in scheme: FINANCES PUBLIQUES
in scheme: Liquidation de l'Impôt
in scheme: Fiscalité
notation: REFIP190
scope note: Remplacé par le crédit d'impôt pour la transition énergétique à compter de septembre 2014

simplification administrative
type: ConceptReFip
type: Concept
broader: pilotage
definition: Ensemble de mesures visant à faciliter, en interne, la réalisation des process de travail ou, en externe, les relations entre l'administration et ses usagers ou partenaires.
in scheme: FINANCES PUBLIQUES
in scheme: Missions Transverses des Finances publiques
in scheme: Pilotage
narrower: simplification de service
notation: REFIP1900

suspension du délai global de paiement
type: ConceptReFip
type: Concept
broader: paiement de la dépense (non-descripteur)
definition: Le délai global de paiement ne peut être suspendu qu'une fois par l'ordonnateur, avant l'ordonnancement ou le mandatement. Cette suspension fait l'objet d'une notification au titulaire par tout moyen permettant d'attester une date certaine de réception. Cette notification précise les raisons qui, imputables au titulaire, s'opposent au paiement ainsi que les pièces à fournir ou à compléter. Le délai global de paiement est alors suspendu jusqu'à la remise par le titulaire de la totalité des justifications qui lui ont été réclamées.
in scheme: FINANCES PUBLIQUES
in scheme: Dépenses publiques
in scheme: Gestion Publique
notation: REFIP1901

Trésor public
type: ConceptReFip
type: Concept
broader: administration financière
definition: Réseau des comptables publics de la Direction générale des finances publiques.
in scheme: FINANCES PUBLIQUES
in scheme: Organisation Structurelle de l'Etat
in scheme: Ministère
in scheme: Administration de L'Etat
notation: REFIP1902

contribution pour une pêche durable
type: ConceptReFip
type: Concept
broader: refip-REFIP934
definition: Taxe s'appliquant, sous certaines conditions, sur les ventes en France métropolitaine à des personnes autres que des personnes assujetties à la taxe sur la valeur ajoutée agissant en tant que telles, de poissons, crustacés, mollusques et autres invertébrés marins, ainsi que de produits alimentaires dont le poids comporte pour plus de 30 % de tels produits de la mer. Taxe supprimée à compter du 01 janvier 2012.
in scheme: FINANCES PUBLIQUES
in scheme: Fiscalité
in scheme: Impôt
notation: REFIP1905

pratique restrictive de concurrence
type: ConceptReFip
type: Concept
broader: droit commercial
definition: Pratique entraînant une disproportion manifeste entre droits et obligations des parties consistant à soumettre un partenaire commercial à des obligations créant un déséquilibre significatif.
in scheme: FINANCES PUBLIQUES
in scheme: Droit et Justice
in scheme: Divisions du Droit
in scheme: Droit Privé
narrower: entente prohibée
notation: REFIP1906

valorisation des comptes
type: ConceptReFip
type: Concept
broader: refip-REFIP788
definition: Démarche d'analyse financière et de communication qui permet à partir des comptes d'effectuer un diagnostic de l'activité de l'entité.
in scheme: FINANCES PUBLIQUES
in scheme: Analyse financière
in scheme: Comptabilité
notation: REFIP1908

Journal officiel
type: ConceptReFip
type: Concept
alternative label: JO
alternative label: JORF
alternative label: journal officiel électronique
broader: document administratif
definition: Publication officielle diffusant les textes réglementaires ainsi que d'autres informations juridiques officielles en version dématérialisée et consultable en ligne.
in scheme: FINANCES PUBLIQUES
in scheme: Documentation
in scheme: Communication Documentation Informatique
narrower: Journal officiel de l'Union européenne
notation: REFIP1909

délégation de crédit de paiement
type: ConceptReFip
type: Concept
broader: crédit de paiement
definition: Acte par lequel un acteur central (responsable de programme ou responsable de BOP) met à la disposition d'un acteur de niveau déconcentré ( responsable de BOP ou responsable d’UO) un montant de crédits de paiement valant autorisation de mandater. Une délégation est gérée comme un transfert de crédits de paiement de l’ordonnateur principal vers l’ordonnateur Secondaire.
in scheme: FINANCES PUBLIQUES
in scheme: Exécution du budget
in scheme: Budget
notation: REFIP191

service public social et médico-social
type: ConceptReFip
type: Concept
broader: service public
definition: Secteur public étroitement lié aux dispositifs de l’aide sociale, en tant que droit lié à des besoins souvent vitaux, et de l’action sociale, qu’elle soit légale ou facultative.
in scheme: FINANCES PUBLIQUES
in scheme: Etat
in scheme: Mission de Service Public
in scheme: Administration de L'Etat
notation: REFIP1910

prérogative de puissance publique
type: ConceptReFip
type: Concept
broader: droit administratif
definition: Moyens reconnus juridiquement que peut utiliser l'Administration (ou d'autres organismes affiliés) afin de remplir les missions d'intérêt général et ce en dépit même du consentement des personnes intéressées. L'administration a le pouvoir d'imposer sa volonté à des personnes privées. En droit on appelle souvent ces actions des « prérogatives exorbitantes du droit commun ». Les personnes privées ne disposent pas de telles prérogatives.
in scheme: FINANCES PUBLIQUES
in scheme: Droit et Justice
in scheme: Divisions du Droit
in scheme: Droit Public
notation: REFIP1913

acte administratif
type: ConceptReFip
type: Concept
broader: droit administratif
definition: Acte juridique fait dans le cadre de l'administration et dans un but d'intérêt général. L'acte administratif unilatéral est le mode normal d'action de l'administration : c’est une décision émanant de la seule volonté de l'administration.
in scheme: FINANCES PUBLIQUES
in scheme: Droit et Justice
in scheme: Divisions du Droit
in scheme: Droit Public
narrower: retrait d'un acte administratif
narrower: annulation d'un acte administratif
narrower: motivation
narrower: abrogation d'un acte administratif
narrower: refip-REFIP756
notation: REFIP1914

concession de travaux publics
type: ConceptReFip
type: Concept
broader: délégation de service public
definition: Contrats administratifs dont l'objet est de faire réaliser tous travaux de bâtiment ou de génie civil par un concessionnaire dont la rémunération consiste soit dans le droit d'exploiter l'ouvrage, soit dans ce droit assorti d'un prix.
in scheme: FINANCES PUBLIQUES
in scheme: Commande publique
in scheme: Gestion Publique
notation: REFIP1915
related: travaux publics

application SIRHIUS-REC
type: ConceptReFip
type: Concept
alternative label: SIRIUS-REC
broader: applications fiscales (non-descripteur)
definition: Outil de pilotage de l'activité de recouvrement à partir des données de l'application RAR.
in scheme: FINANCES PUBLIQUES
in scheme: Applications Informatiques
in scheme: Applications fiscales
notation: REFIP1919

identifiant unique du contribuable
type: ConceptReFip
type: Concept
broader: fiscalité
definition: Identifiant principal attribué au contribuable également appelé numéro fiscal. Il est constitué du SPI pour les personnes physiques auquel est annexé une clé de contrôle et du SIREN pour les personnes morales.
in scheme: FINANCES PUBLIQUES
in scheme: Fiscalité - Autres notions
in scheme: Fiscalité
notation: REFIP192

contentieux indemnitaire
type: ConceptReFip
type: Concept
alternative label: contentieux de la responsabilité
broader: contentieux fiscal
definition: Droit offert aux contribuables de former un recours en dommages-intérêts pour mettre en cause la responsabilité de l'État, s'il prétend avoir subi un préjudice non couvert par les intérêts moratoires du fait des services des finances publiques.
in scheme: FINANCES PUBLIQUES
in scheme: Contentieux Fiscal
in scheme: Fiscalité
notation: REFIP1921

lots
type: ConceptReFip
type: Concept
broader: marché alloti
definition: Fraction de biens, en nature ou en valeur.
in scheme: FINANCES PUBLIQUES
in scheme: Commande publique
in scheme: Gestion Publique
notation: REFIP1922
related: groupement conjoint
scope note: Fraction de bien

jurisprudence
type: ConceptReFip
type: Concept
broader: sources du droit objectif (non-descripteur)
definition: Ensemble des décisions de justice rendues pendant une certaine période dans un domaine du droit ou dans l'ensemble du droit, au sens large. Au sens plus restreint, ensemble des décisions concordantes rendues par les juridictions sur une même question de droit.
in scheme: FINANCES PUBLIQUES
in scheme: Droit et Justice
in scheme: Sources du Droit
in scheme: Sources du Droit Objectif
notation: REFIP1923

intéressement aux bénéfices
type: ConceptReFip
type: Concept
alternative label: accord d'intéressement
alternative label: intéressement
alternative label: intéressement au chiffre d'affaires
alternative label: prime d'intéressement
broader: participation financière des salariés aux résultats de l'entreprise
definition: Mesure qui vise à associer les salariés aux résultats et performances de l’entreprise, en leur versant une prime. Cette rémunération a pour but de motiver le personnel, elle est facultative et peut être mise en place dans toutes les entreprises, et concerne tous les salariés. Le montant de la prime d’intéressement dépend des critères retenus par l’accord d’entreprise, il est calculé : soit en fonction des salaires, soit en fonction du temps de présence, soit uniformément réparti entre tous les salariés concernés, soit en combinant ces trois critères.
in scheme: FINANCES PUBLIQUES
in scheme: Gestion de l'Entreprise
in scheme: Entreprises
in scheme: Vie et Gestion de l'entreprise
notation: REFIP1924

étude de marché
type: ConceptReFip
type: Concept
broader: marché public
definition: Travail de collecte et d'analyse d'informations ayant pour but d'identifier les caractéristiques d'un marché.
in scheme: FINANCES PUBLIQUES
in scheme: Commande publique
in scheme: Gestion Publique
notation: REFIP1925

service public d'eau et d'assainissement
type: ConceptReFip
type: Concept
alternative label: service d'assainissement de l'eau
alternative label: service des eaux
alternative label: service public d'assainissement
alternative label: service public de l'eau
broader: service public
definition: Service public ayant pour mission d’acheminer l’eau potable jusqu’au robinet du consommateur puis de collecter et de traiter les eaux usées et les eaux pluviales avant leur retour au milieu naturel.
in scheme: FINANCES PUBLIQUES
in scheme: Etat
in scheme: Mission de Service Public
in scheme: Administration de L'Etat
notation: REFIP1926
related: distribution de l'eau

établissement de services informatiques
type: ConceptReFip
type: Concept
alternative label: CSI
alternative label: Centre des services informatiques
alternative label: DI
alternative label: ESI
alternative label: département informatique
alternative label: département informatique du Trésor
broader: services informatiques
definition: Etablissement informatique de la DGFIP au sein d'une même zone géographique regroupant notamment les métiers techniques d'hébergement, d'exploitation, de production et d'assistance.
in scheme: FINANCES PUBLIQUES
in scheme: Organisation Structurelle de l'Etat
in scheme: Ministère
in scheme: Administration de L'Etat
notation: REFIP1927

compte comptable
type: ConceptReFip
type: Concept
broader: plan comptable
definition: Plus petite unité retenue pour le classement et l'enregistrement des mouvements comptables. Les opérations sont enregistrées dans les comptes dont l'intitulé correspond à leur nature.
in scheme: FINANCES PUBLIQUES
in scheme: Documents comptables
in scheme: Comptabilité
narrower: solde comptable
narrower: excédent
notation: REFIP1928

réclamation amiable
type: ConceptReFip
type: Concept
broader: réclamation fiscale
definition: Demande adressée par un contribuable sur un problème de déclaration, de calcul ou de paiement de l'impôt auprès du service des impôts compétents ou auprès du conciliateur fiscal départemental.
in scheme: FINANCES PUBLIQUES
in scheme: Contentieux Fiscal
in scheme: Fiscalité
notation: REFIP1929

comité consultatif de la réglementation bancaire et financière (supprimé)
type: ConceptReFip
type: Concept
broader: ZZ
in scheme: FINANCES PUBLIQUES
notation: REFIP193

Agence pour l'informatique financière de l'Etat
type: ConceptReFip
type: Concept
alternative label: AIFE
broader: refip-REFIP7061
definition: Service à compétence nationale rattaché au Ministère des Finances, l'AIFE est chargée de mettre en œuvre la stratégie informatique financière de l'État. Ses missions sont le pilotage du système d'information financière de l'Etat; la gestion et la maintenance du système Chorus (gestion de la dépense, de la recette non fiscale et de la comptabilité de l'Etat); le pilotage de nouveaux projets interministériels ou ministériels et leur intégration dans le système d'information Chorus; et l'accompagnement du changement dans les ministères et auprès des utilisateurs.
in scheme: FINANCES PUBLIQUES
in scheme: Organisation Structurelle de l'Etat
in scheme: Ministère
in scheme: Administration de L'Etat
notation: REFIP1930

imprimante
type: ConceptReFip
type: Concept
broader: refip-REFIP757
definition: Périphérique de sortie de l'ordinateur permettant l'édition de documents sur papier.
in scheme: FINANCES PUBLIQUES
in scheme: Informatique
in scheme: Communication Documentation Informatique
notation: REFIP1931

Commission nationale des impôts directs et des taxes sur le chiffre d'affaires
type: ConceptReFip
type: Concept
broader: audition des contribuables
definition: Créée par la Loi de Finances de 2007, elle est compétente pour statuer sur les litiges résultant de propositions de rectifications adressées à des entreprises industrielles et commerciales dont le chiffre d’affaires excède un certain seuil. Elle se substitue alors aux commissions départementales et intervient dans les mêmes conditions que ces dernières.
in scheme: FINANCES PUBLIQUES
in scheme: Droit de Reprise de l'Administration
in scheme: Fiscalité
notation: REFIP1932

service des impôts des entreprises
type: ConceptReFip
type: Concept
alternative label: SIE
broader: direction départementale des finances publiques
definition: Service déconcentré de la DGFIP chargé de la gestion et du recouvrement des impôts dus par les usagers professionnels.
in scheme: FINANCES PUBLIQUES
in scheme: Organisation Structurelle de l'Etat
in scheme: Ministère
in scheme: Administration de L'Etat
narrower: interlocuteur fiscal unique
notation: REFIP1933

cartographie des processus
type: ConceptReFip
type: Concept
broader: maîtrise des risques
definition: Document décrivant de manière structurée et méthodique l’ensemble des processus de travail de la DGFiP.
in scheme: FINANCES PUBLIQUES
in scheme: Missions Transverses des Finances publiques
in scheme: Maîtrise des risques
notation: REFIP1935

privilège du Trésor
type: ConceptReFip
type: Concept
broader: sûreté réelle
definition: Sûreté réelle spécifique destinée à garantir le recouvrement de l'impôt. Le classement conféré par le privilège du Trésor est plus ou moins avantageux selon le rang accordé par la loi à la créance fiscale. Le rang est déterminé d'après la qualité attachée par la loi aux différentes sortes de créances fiscales privilégiées.
in scheme: FINANCES PUBLIQUES
in scheme: Recouvrement
in scheme: Fiscalité
narrower: publicité du privilège du Trésor
notation: REFIP1938

droit de mutation à titre gratuit
type: ConceptReFip
type: Concept
alternative label: DMTG
broader: droit de mutation
definition: Droit d'enregistrement perçu par l'État sur les donations et les successions.
in scheme: FINANCES PUBLIQUES
in scheme: Fiscalité
in scheme: Impôt
narrower: droits de succession
narrower: refip-REFIP7173
notation: REFIP1939

achat en franchise
type: ConceptReFip
type: Concept
alternative label: achat en franchise de TVA
alternative label: contingent d'achats en franchise
alternative label: franchise d'achat
alternative label: importation en franchise
alternative label: procédure Delta
broader: franchise de taxe
definition: Dispositif, sous conditions, autorisant les assujettis à recevoir ou importer en franchise de TVA les biens destinés à une livraison à l’exportation, à certaines livraisons exonérées ou à une livraison située hors de France ainsi que les services portant sur ces biens, dans la limite du montant des livraisons de cette nature qui ont été réalisées au cours de l'année précédente et qui portent sur des biens passibles de cette taxe.
in scheme: FINANCES PUBLIQUES
in scheme: Régime d'Imposition
in scheme: Fiscalité
notation: REFIP194

mutation cadastrale
type: ConceptReFip
type: Concept
broader: cadastre
definition: Mutation d'immeuble régulièrement enregistrée au fichier immobilier du Cadastre.
in scheme: FINANCES PUBLIQUES
in scheme: Cadastre
in scheme: Fiscalité
notation: REFIP1940

service en ligne
type: ConceptReFip
type: Concept
broader: site internet
definition: Prestation accessible via un réseau de télécommunication (site web, portail internet).
in scheme: FINANCES PUBLIQUES
in scheme: Communication
in scheme: Communication Documentation Informatique
notation: REFIP1942

aide en ligne
type: ConceptReFip
type: Concept
broader: assistance technique
definition: Fonction présentant les différentes fonctionnalités d'un logiciel et d'assister l'utilisateur.
in scheme: FINANCES PUBLIQUES
in scheme: Informatique
in scheme: Communication Documentation Informatique
notation: REFIP1943

compte de résultat
type: ConceptReFip
type: Concept
broader: documents comptables
definition: Document comptable synthétisant l'ensemble des charges et des produits d'une entreprise ou autre organisme ayant une activité marchande, pour une période donnée, appelée exercice comptable.
in scheme: FINANCES PUBLIQUES
in scheme: Documents comptables
in scheme: Comptabilité
narrower: chiffre d'affaires
notation: REFIP1944

application AFFICHAGE DES REMISES D'AVIS
type: ConceptReFip
type: Concept
alternative label: AFFICHAGE DES REMISES D'AVIS
alternative label: ARA
broader: applications fiscales (non-descripteur)
definition: Application permettant aux services d'accueil, d'informer les usagers notamment de la date de remise à la Poste des déclarations pré-remplies, des avis d'impôt sur le revenu, taxes d'habitation et taxes foncières.
in scheme: FINANCES PUBLIQUES
in scheme: Applications Informatiques
in scheme: Applications fiscales
notation: REFIP1947

établissement industriel
type: ConceptReFip
type: Concept
alternative label: bâtiment industriel
alternative label: local industriel
alternative label: usine
broader: industrie
definition: Usines et ateliers où s'effectue, à l'aide d'un outillage relativement important, la transformation des matières premières ainsi que la fabrication ou la réparation des objets; établissements n'ayant pas ce caractère mais où sont réalisées soit des opérations d'extraction (carrière de pierres, par exemple) ; soit des opérations de manipulation ou des prestations de services (marchand en gros utilisant notamment des engins de levage de grande puissance tels que grues, ponts roulants et monte-charge ou des installations de stockage de grande capacité telles que réservoirs et silos ; blanchisserie automatique ; teinturerie ; entreprise de conditionnement, etc) et dans lesquels le rôle de l'outillage et de la force motrice est prépondérant.
in scheme: FINANCES PUBLIQUES
in scheme: Branche d'activité
in scheme: Questions Economiques
in scheme: Industrie
notation: REFIP1948

application MAJIC-CONTENTIEUX
type: ConceptReFip
type: Concept
alternative label: MAJIC-CONTENTIEUX
broader: applications fiscales (non-descripteur)
definition: Module de l'application MAJIC permettant de gérer le contentieux
in scheme: FINANCES PUBLIQUES
in scheme: Applications Informatiques
in scheme: Applications fiscales
notation: REFIP1949

revenu professionnel
type: ConceptReFip
type: Concept
broader: revenu imposable
definition: Revenu provenant d'une activité professionnelle, imposés pour les entreprises individuelles dans la catégorie de revenus correspondante (bénéfices non commerciaux, bénéfices industriels et commerciaux ou bénéfices agricoles) ou à l'impôt sur les sociétés pour les personnes morales assujetties à cet impôt.
in scheme: FINANCES PUBLIQUES
in scheme: Champ d'Application
in scheme: Fiscalité
notation: REFIP195

centre impôts service
type: ConceptReFip
type: Concept
broader: direction régionale des finances publiques
definition: Plateforme d’accueil et de renseignement téléphonique chargé de répondre à toutes questions liées à l'impôt.
in scheme: FINANCES PUBLIQUES
in scheme: Organisation Structurelle de l'Etat
in scheme: Ministère
in scheme: Administration de L'Etat
notation: REFIP1950
related: Direction impôts service

mouvement de crédits
type: ConceptReFip
type: Concept
broader: exécution du budget
definition: Mécanisme comptable et budgétaire qui consiste en la répartition et l' attribution de transferts, virements annulations, avances gagées, des fonds de concours, des attributions de produit, des rétablissements de crédit, des rétablissements de crédits globaux.
in scheme: FINANCES PUBLIQUES
in scheme: Exécution du budget
in scheme: Budget
notation: REFIP1951

imputation budgétaire
type: ConceptReFip
type: Concept
broader: exécution du budget
definition: Rattachement des achats à une nature de dépense de fonctionnement ou d'investissement selon un plan de compte défini et normalisé par la nomenclature comptable et budgétaire de la collectivité.
in scheme: FINANCES PUBLIQUES
in scheme: Exécution du budget
in scheme: Budget
notation: REFIP1952

matériel de bureau
type: ConceptReFip
type: Concept
alternative label: fourniture de bureau
broader: matériel
definition: Petit équipement nécessaire au travail de bureau.
in scheme: FINANCES PUBLIQUES
in scheme: Lieu de Travail
in scheme: Entreprises
in scheme: Travail
notation: REFIP1953
related: refip-REFIP757

frais d'acte (supprimé)
type: ConceptReFip
type: Concept
broader: ZZ
in scheme: FINANCES PUBLIQUES
notation: REFIP1954

acquisition de clientèle (supprimé)
type: ConceptReFip
type: Concept
broader: ZZ
in scheme: FINANCES PUBLIQUES
notation: REFIP1955

mutation à titre onéreux
type: ConceptReFip
type: Concept
broader: fiscalité du patrimoine
definition: Transfert d'un bien d'un patrimoine dans un autre avec une contre-partie (vente, échange) soumis à droits d'enregistrement.
in scheme: FINANCES PUBLIQUES
in scheme: Champ d'Application
in scheme: Fiscalité
notation: REFIP1957

résiliation
type: ConceptReFip
type: Concept
alternative label: résiliation de contrat
broader: fin de contrat
definition: Anéantissement pour l'avenir d'un contrat successif, en raison de l'inexécution par l'une des parties de ses obligations.
in scheme: FINANCES PUBLIQUES
in scheme: Droit et Justice
in scheme: Divisions du Droit
in scheme: Droit Privé
narrower: clause de résiliation
narrower: indemnité de résiliation
notation: REFIP1959

taxe de séjour
type: ConceptReFip
type: Concept
broader: autres taxes, droits ou redevances (non-descripteur)
definition: Créée par une loi de 1910, taxe instituée à l’initiative des communes réalisant des dépenses favorisant l’accueil des touristes. Elle est devenue instituable par les établissements publics de coopération intercommunale (EPCI) qui respectent les conditions applicables aux communes à compter de l’année 1999. Taxe instituée de manière facultative par délibération du conseil municipal ou de l’organe délibérant d’un EPCI.
in scheme: FINANCES PUBLIQUES
in scheme: Fiscalité
in scheme: Impôt
notation: REFIP196

Pôle national dématérialisation dans le secteur public local
type: ConceptReFip
type: Concept
broader: Pôle national de soutien au réseau
definition: Structure ayant pour mission de permettre une dématérialisation cohérente et concertée des grands flux de documents papier qui transitent chaque année entre les trois acteurs de la chaîne comptable et financière des collectivités et établissements publics locaux : les ordonnateurs, les comptables publics et les Chambres régionales des comptes.
in scheme: FINANCES PUBLIQUES
in scheme: Organisation Structurelle de l'Etat
in scheme: Ministère
in scheme: Administration de L'Etat
notation: REFIP1960

Ouzbékistan
type: ConceptReFip
type: Concept
alternative label: République d'Ouzbékistan
broader: Asie
definition: Pays
in scheme: FINANCES PUBLIQUES
in scheme: Géographie
in scheme: Asie
notation: REFIP1961

contrat à durée déterminée
type: ConceptReFip
type: Concept
alternative label: CDD
broader: contrat de travail
definition: Contrat de travail affecté d'un terme,et ne pouvant être conclu que dans des hypothèses limitativement énumérées par la loi.
in scheme: FINANCES PUBLIQUES
in scheme: Contrat de Travail
in scheme: Entreprises
in scheme: Travail
notation: REFIP1962

préavis de licenciement
type: ConceptReFip
type: Concept
broader: licenciement
definition: Délai intervenant entre la notification de licenciement et la fin du contrat de travail. Pendant ce préavis, le salarié continue de travailler (sauf dispense).
in scheme: FINANCES PUBLIQUES
in scheme: Entreprises
in scheme: Travail
in scheme: 212619
notation: REFIP1963

obligation fiscale du contribuable
type: ConceptReFip
type: Concept
broader: civisme fiscal
definition: Ensemble des obligations déclaratives et contributives instituées par la loi en matière fiscale applicables à tout citoyen qui entre dans leur champ d'application.
in scheme: FINANCES PUBLIQUES
in scheme: Fiscalité - Autres notions
in scheme: Fiscalité
narrower: obligation de dépôt de déclaration
notation: REFIP1965

architecture
type: ConceptReFip
type: Concept
broader: activité libérale
definition: Art, science et technique de la construction, de la restauration, de l'aménagement des édifices.
in scheme: FINANCES PUBLIQUES
in scheme: Branche d'activité
in scheme: Questions Economiques
in scheme: Services et professions libérales
narrower: architecte
notation: REFIP1968
scope note: Secteur économique

cheval
type: ConceptReFip
type: Concept
broader: animal
definition: Grand mammifère herbivore appartenant aux espèces de la famille des Équidés.
in scheme: FINANCES PUBLIQUES
in scheme: Branche d'activité
in scheme: Questions Economiques
in scheme: Agriculture
narrower: cheval de course
notation: REFIP1969

Corse
type: ConceptReFip
type: Concept
broader: France métropolitaine
definition: Région française
in scheme: FINANCES PUBLIQUES
in scheme: Géographie
in scheme: Europe
narrower: Corse-du-Sud
narrower: Haute-Corse
notation: REFIP197

infocentre
type: ConceptReFip
type: Concept
broader: base de données
definition: Système logiciel permettant aux utilisateurs l'accès à des bases de données ayant agrégé des informations provenant de sources différentes, nécessaires à l’informatique décisionnelle.
in scheme: FINANCES PUBLIQUES
in scheme: Informatique
in scheme: Communication Documentation Informatique
notation: REFIP1971
related: stockage de données informatiques

comptabilité M 92
type: ConceptReFip
type: Concept
broader: comptabilité publique locale
definition: Plan comptable M 92 applicable aux chambre de l'agriculture.
in scheme: FINANCES PUBLIQUES
in scheme: Secteur public local
in scheme: Gestion Publique
notation: REFIP1973

autorité hiérarchique
type: ConceptReFip
type: Concept
broader: fonction de la Direction générale des finances publiques (non-descripteur)
definition: Autorité placée immédiatement au-dessus du supérieur hiérarchique direct. A ce titre, elle peut retirer ou réformer les actes pris par son subordonné.
in scheme: FINANCES PUBLIQUES
in scheme: Personnels et fonctions
in scheme: Fonction Publique et Gestion des Ressources Humaines
notation: REFIP1974

ingénierie publique
type: ConceptReFip
type: Concept
broader: aide aux entreprises
definition: Phase essentielle de l'acte de construire, dite publique lorsqu'elle est réalisée par une collectivité publique. L'ingénierie publique regroupe le champ de la maîtrise d'ouvrage (assistance à maîtrise d'ouvrage, conseil en amont, conduite d'opérations), le champ des études générales (diagnostic, analyse, dessins), pour aller jusqu'à la maîtrise d'oeuvre (direction de la maîtrise d'oeuvre, conduite des chantiers, réalisation des travaux, contrôle de l'exécution des travaux).
in scheme: FINANCES PUBLIQUES
in scheme: Dépenses publiques
in scheme: Gestion Publique
notation: REFIP1976

protocole transactionnel
type: ConceptReFip
type: Concept
broader: transaction
definition: Protocole encadrant le recours à une transaction afin de régler amiablement un conflit.
in scheme: FINANCES PUBLIQUES
in scheme: Procédure Civile
in scheme: Droit et Justice
in scheme: Procédure
notation: REFIP1977

force majeure
type: ConceptReFip
type: Concept
broader: droit des obligations et contrats (non-descripteur)
definition: Tout événement imprévisible et insurmontable empêchant le débiteur d’exécuter son obligation. La force majeure est exonératoire.
in scheme: FINANCES PUBLIQUES
in scheme: Droit et Justice
in scheme: Divisions du Droit
in scheme: Droit Privé
narrower: fait du prince
notation: REFIP1978

comité départemental de maîtrise des risques
type: ConceptReFip
type: Concept
alternative label: CDMR
broader: direction départementale des finances publiques
definition: Structure départementale chargée d’animer la politique locale de maîtrise des risques. Elle est le relais de la Mission nationale et veille pour chaque mission à l’élaboration de référentiels d’organisation, de procédure et de contrôles, notamment du contrôle interne.
in scheme: FINANCES PUBLIQUES
in scheme: Organisation Structurelle de l'Etat
in scheme: Ministère
in scheme: Administration de L'Etat
notation: REFIP1979

quotité saisissable
type: ConceptReFip
type: Concept
broader: refip-REFIP6880
definition: Fraction de la rémunération saisissable, calculée en fonction du montant de la rémunération annuelle et des charges de famille du contribuable selon un barème fixé par le code du travail.
in scheme: FINANCES PUBLIQUES
in scheme: Recouvrement
in scheme: Fiscalité
notation: REFIP198

travaux d'enfouissement
type: ConceptReFip
type: Concept
broader: travaux publics
definition: Travaux destinés à dissimuler les réseaux électriques aériens.
in scheme: FINANCES PUBLIQUES
in scheme: Branche d'activité
in scheme: Questions Economiques
in scheme: Construction
notation: REFIP1980

Caisse d'allocations familiales
type: ConceptReFip
type: Concept
alternative label: CAF
broader: Caisse nationale d'allocations familiales
definition: Organisme de droit privé à compétence territoriale chargé de verser aux particuliers des aides financières à caractère familial ou social. Chaque Caf assure en outre, à l’échelle locale, une action sociale essentiellement collective par une assistance technique et des subventions à des acteurs locaux de la vie sociale (mairies, crèches, centres de loisirs, etc.).
in scheme: FINANCES PUBLIQUES
in scheme: Organisation Structurelle de l'Etat
in scheme: Opérateur de l'Etat
in scheme: Administration de L'Etat
notation: REFIP1981

décentralisation
type: ConceptReFip
type: Concept
broader: réforme de l'Etat
definition: Processus d’aménagement de l’État unitaire qui consiste à transférer des compétences administratives de l’État vers des entités (ou des collectivités) locales distinctes de lui.
in scheme: FINANCES PUBLIQUES
in scheme: Etat
in scheme: Réforme de l'Etat
in scheme: Administration de L'Etat
narrower: Comité interministériel de l'administration territoriale
notation: REFIP1982

réparation du préjudice
type: ConceptReFip
type: Concept
broader: responsabilité civile
definition: Dédommagement d'un préjudice par la personne qui en est responsable civilement.
in scheme: FINANCES PUBLIQUES
in scheme: Droit et Justice
in scheme: Divisions du Droit
in scheme: Droit Privé
narrower: indemnisation
notation: REFIP1985

charges et offices
type: ConceptReFip
type: Concept
broader: profession juridique (non-descripteur)
definition: Fonctions publiques dont les titulaires, nommés en général par le garde des sceaux, jouissent du droit de présentation de leur successeur. Ce sont les avocats, notaires, huissiers, commissaires-priseurs, greffiers des tribunaux de commerce, courtiers interprètes et conducteurs de navires, courtiers d'assurances maritimes.
in scheme: FINANCES PUBLIQUES
in scheme: Profession Juridique
in scheme: Droit et Justice
in scheme: Organisation Juridictionnelle
narrower: avoué
narrower: huissier de justice
narrower: greffier
narrower: avocat
narrower: commissaire-priseur
narrower: notaire
notation: REFIP1987
scope note: Notaires, avoués, greffiers, huissiers, commissaires-priseurs et avocats.

certificat de situation administrative
type: ConceptReFip
type: Concept
broader: documentation fiscale (non-descripteur)
definition: Document permettant de savoir si le véhicule est gagé et s'il existe une opposition au transfert du certificat d'immatriculation.
in scheme: FINANCES PUBLIQUES
in scheme: Documentation Fiscale
in scheme: Fiscalité
notation: REFIP1989
related: opposition au transfert du certificat d'immatriculation

appel d'offres restreint
type: ConceptReFip
type: Concept
broader: appel d'offres
definition: Procédure de l'appel d'offres lorsque seuls les candidats sélectionnés par l'acheteur sont autorisés à soumissionner.
in scheme: FINANCES PUBLIQUES
in scheme: Commande publique
in scheme: Gestion Publique
notation: REFIP199

protocole d'accord
type: ConceptReFip
type: Concept
broader: droit des obligations et contrats (non-descripteur)
definition: Document établi pour préciser les bases d'une opération complexe encore à l'état de projet, que les parties se proposent de réaliser. Peut aussi désigner un contrat préparatoire à la conclusion d'un contrat important ou d'un groupe de contrats.
in scheme: FINANCES PUBLIQUES
in scheme: Droit et Justice
in scheme: Divisions du Droit
in scheme: Droit Privé
notation: REFIP1990

attestation de l'employeur
type: ConceptReFip
type: Concept
broader: employeur
definition: Document remis par l'employeur au salarié en cas de rupture ou de fin de contrat de travail, lui permettant ainsi de faire valoir ses droits aux allocations de chômage.
in scheme: FINANCES PUBLIQUES
in scheme: Entreprises
in scheme: Travail
in scheme: 212619
notation: REFIP1991

application RAR
type: ConceptReFip
type: Concept
alternative label: RAR
broader: applications fiscales (non-descripteur)
definition: Application servant à la gestion du recouvrement forcé de l'impôt et aide à l'apurement des restes à recouvrer.
in scheme: FINANCES PUBLIQUES
in scheme: Applications Informatiques
in scheme: Applications fiscales
notation: REFIP1992

contribution sociale généralisée
type: ConceptReFip
type: Concept
alternative label: CSG
broader: prélèvements sociaux
definition: Prélèvement destiné au financement de la sécurité sociale et assis sur les revenus d'activité ou de remplacement, du patrimoine et les produits de placements.
in scheme: FINANCES PUBLIQUES
in scheme: Fiscalité
in scheme: Impôt
notation: REFIP1993

îles Turques et Caïques
type: ConceptReFip
type: Concept
broader: Caraïbes
definition: Territoire du Royaume Uni
in scheme: FINANCES PUBLIQUES
in scheme: Géographie
in scheme: Amérique
notation: REFIP1994

impôt à payer
type: ConceptReFip
type: Concept
broader: liquidation de l'impôt
definition: Impôt dû, exigible.
in scheme: FINANCES PUBLIQUES
in scheme: Liquidation de l'Impôt
in scheme: Fiscalité
notation: REFIP1995

application NOMINOE
type: ConceptReFip
type: Concept
alternative label: NOMINOE
broader: applications missions transverses (non-descripteur)
definition: Application de gestion des structures comptables de la DGFIP, fermée en 2017.
in scheme: FINANCES PUBLIQUES
in scheme: Applications missions transverses
in scheme: Applications Informatiques
notation: REFIP1996

Italie
type: ConceptReFip
type: Concept
broader: Europe
definition: Pays
in scheme: FINANCES PUBLIQUES
in scheme: Géographie
in scheme: Europe
notation: REFIP1998

permission de voirie
type: ConceptReFip
type: Concept
alternative label: autorisation d'entreprendre des travaux
alternative label: autorisation de voirie
broader: domaine public routier
definition: Acte autorisant des travaux sur la voie publique ou l'occupation temporairement du domaine public routier, délivré par le gestionnaire, généralement le maire.
in scheme: FINANCES PUBLIQUES
in scheme: Domaine
in scheme: Gestion Publique
notation: REFIP2

ordre de réquisition
type: ConceptReFip
type: Concept
broader: réquisition de paiement
definition: Ordre écrit par lequel un ordonnateur contraint un comptable à affecter le paiement d'un mandat ou d'une ordonnance que celui-ci aurait refusé de payer pour irrégularité budgétaire.
in scheme: FINANCES PUBLIQUES
in scheme: Procédures et Techniques Comptables
in scheme: Comptabilité
notation: REFIP20

comité de l'abus de droit fiscal
type: ConceptReFip
type: Concept
alternative label: CADF
alternative label: CCRAD
alternative label: comité consultatif pour la répression des abus de droits
alternative label: comité d'abus de droit
broader: abus de droit fiscal
definition: Comité rendant son avis sur les litiges de la procédure de l'abus de droit fiscal.
in scheme: FINANCES PUBLIQUES
in scheme: Droit de Reprise de l'Administration
in scheme: Fiscalité
notation: REFIP2001

vente aux enchères
type: ConceptReFip
type: Concept
alternative label: adjudication
alternative label: enchère
alternative label: enchères publiques
alternative label: licitation
alternative label: vente par adjudication
alternative label: vente publique
broader: vente
definition: Forme de vente caractérisée par son ouverture au public et par l'adjudication du bien au plus offrant.
in scheme: FINANCES PUBLIQUES
in scheme: Droit et Justice
in scheme: Divisions du Droit
in scheme: Droit Privé
narrower: surenchère
notation: REFIP2002

aliénation de biens
type: ConceptReFip
type: Concept
alternative label: aliénation de biens immeubles
alternative label: aliénation de biens meubles
broader: droit civil
definition: Acte translatif de propriété ou de droit à titre gratuit ou onéreux (donation, legs, vente, cession).
in scheme: FINANCES PUBLIQUES
in scheme: Droit et Justice
in scheme: Divisions du Droit
in scheme: Droit Privé
narrower: cession
narrower: incessibilité
narrower: inaliénabilité
notation: REFIP2003

police judiciaire
type: ConceptReFip
type: Concept
broader: police nationale
definition: Direction active de la direction générale de la police nationale, la Direction Centrale de la Police Judiciaire, également désignée "Police Judiciaire" ou "P.J.", ayant pour objet, sous la direction, le contrôle et la surveillance de l'autorité judiciaire, de rechercher et de constater les infractions pénales, d'en rassembler les preuves, d'en rechercher les auteurs et leurs complices, de les arrêter et de les déférer aux autorités judiciaires compétentes.
in scheme: FINANCES PUBLIQUES
in scheme: Organisation Structurelle de l'Etat
in scheme: Ministère
in scheme: Administration de L'Etat
narrower: brigade nationale de répression de la délinquance fiscale
notation: REFIP2004

fonds européen pour la pêche
type: ConceptReFip
type: Concept
broader: fonds européens structurels et d'investissement
definition: Fonds de l'Union européenne dédié à la pêche et au milieu maritime. Instrument de la politique européenne de la pêche, il octroie une aide financière à ce secteur afin de l'aider à s'adapter à l'évolution des besoins.
in scheme: FINANCES PUBLIQUES
in scheme: Dépenses publiques
in scheme: Gestion Publique
notation: REFIP2005

application NDL AAR (supprimé)
type: ConceptReFip
type: Concept
broader: ZZ
in scheme: FINANCES PUBLIQUES
notation: REFIP2008

décision administrative gracieuse
type: ConceptReFip
type: Concept
broader: juridiction gracieuse
definition: Décision de l'administration statuant sur la réclamation gracieuse d'un contribuable. Cette décision peut consister en une admission totale, partielle ou un rejet.
in scheme: FINANCES PUBLIQUES
in scheme: Contentieux Fiscal
in scheme: Fiscalité
narrower: remise gracieuse
notation: REFIP2009

accueil fiscal de proximité
type: ConceptReFip
type: Concept
broader: guichet fiscal unique
definition: Accueil réalisé sur l'ensemble du territoire, dans chaque service de la DGFIP compétent en matière d'impôts des particuliers, permettant aux usagers d'obtenir une réponse à leurs principales questions et de déposer tous leurs dossiers fiscaux en une seule démarche.
in scheme: FINANCES PUBLIQUES
in scheme: Missions Transverses des Finances publiques
in scheme: Qualité de service
notation: REFIP201

entité adjudicatrice
type: ConceptReFip
type: Concept
broader: personne responsable du marché
definition: Pouvoir adjudicateur exerçant des activités d’opérateurs de réseau (production, transport ou distribution d’électricité, gaz, chaleur, eau, fourniture d’un service public dans le domaine des transports, etc…).
in scheme: FINANCES PUBLIQUES
in scheme: Commande publique
in scheme: Gestion Publique
notation: REFIP2010

indivision
type: ConceptReFip
type: Concept
broader: droit de propriété
definition: Situation juridique qui se caractérise par la concurrence de droits de même nature exercés sur un même bien ou sur une même masse de biens par des personnes différentes (les co-indivisaires), sans qu'il y ait division matérielle de leurs parts.
in scheme: FINANCES PUBLIQUES
in scheme: Droit et Justice
in scheme: Divisions du Droit
in scheme: Droit Privé
narrower: indivisaire
narrower: droit indivis
narrower: partage
notation: REFIP2012

réforme administrative
type: ConceptReFip
type: Concept
broader: réforme de l'Etat
definition: Changement introduit dans un organisme ou un système public en vue d'améliorer sa structure, son fonctionnement ou la qualité de son personnel.
in scheme: FINANCES PUBLIQUES
in scheme: Etat
in scheme: Réforme de l'Etat
in scheme: Administration de L'Etat
notation: REFIP2013

lieu d'imposition
type: ConceptReFip
type: Concept
broader: fiscalité des particuliers
definition: Résidence principale du contribuable ou lieu du principal établissement. Il est apprécié au 31 décembre de l'année de perception des revenus pour l'impôt sur le revenu. Il détermine le service administratif compétent pour recevoir les déclarations fiscales.
in scheme: FINANCES PUBLIQUES
in scheme: Champ d'Application
in scheme: Fiscalité
narrower: domicile fiscal
narrower: refip-REFIP7176
notation: REFIP2015

contribution à l'audiovisuel public
type: ConceptReFip
type: Concept
alternative label: redevance audiovisuelle
alternative label: redevance télé
broader: contribution
definition: Taxe instituée au profit des organismes publics de télévision et de radiodiffusion. Adossée à la taxe d'habitation pour les particuliers, son fait générateur est constitué par la détention d'appareil au 1er janvier. Elle est adossée à la TVA pour les professionnels qui utilisent des appareils de réception de télévision ou un dispositif assimilé.
in scheme: FINANCES PUBLIQUES
in scheme: Fiscalité
in scheme: Impôt
notation: REFIP2016

direction interrégionale des services informatiques
type: ConceptReFip
type: Concept
alternative label: DISI
broader: services informatiques
definition: Service à compétence nationale rattachés au chef du service des systèmes d'information de la direction générale des finances publiques (DGFIP). La DISI exerce un ensemble de missions de développement, d'intégration, de qualification, d'exploitation et de maintenance d'applications, d'assistance et d'expertise technique ; Elle assure l'assistance téléphonique et de proximité pour les utilisateurs, ainsi que la prise en charge, d'impression, de finition et d'expédition de documents.
in scheme: FINANCES PUBLIQUES
in scheme: Organisation Structurelle de l'Etat
in scheme: Ministère
in scheme: Administration de L'Etat
notation: REFIP2017

centre de gestion des retraites
type: ConceptReFip
type: Concept
alternative label: CGR
alternative label: Centre de retraites
alternative label: Centre régional de pensions
broader: administration centrale des finances publiques
definition: Centre rattaché à une direction régionale ou départementale des finances publiques, chargé du règlement des pensions de l'État, des émoluments divers et du suivi du dossier des pensionnés.
in scheme: FINANCES PUBLIQUES
in scheme: Organisation Structurelle de l'Etat
in scheme: Ministère
in scheme: Administration de L'Etat
notation: REFIP2019

loi d'orientation
type: ConceptReFip
type: Concept
broader: loi
definition: Loi qui, pour l'ensemble d'une matière, fixe une politique globale à réaliser en un temps plus ou moins long et prend les dispositions législatives nécessaires.
in scheme: FINANCES PUBLIQUES
in scheme: Droit et Justice
in scheme: Sources du Droit
in scheme: Sources du Droit Objectif
notation: REFIP202

application AIDA
type: ConceptReFip
type: Concept
alternative label: AIDA
broader: applications fiscales (non-descripteur)
definition: Outil donnant accès à l'ensemble de la documentation fiscale mise en ligne. Fermeture définitive de l'application AIDA en juin 2013.
in scheme: FINANCES PUBLIQUES
in scheme: Applications Informatiques
in scheme: Applications fiscales
notation: REFIP2020

véhicule hors d'usage
type: ConceptReFip
type: Concept
alternative label: VHU
broader: véhicule terrestre à moteur
definition: Véhicule particulier ou véhicule utilitaire de moins de 3,5 tonnes de l'État et de ses opérateurs atteint par la limite d'âge (9 ans et plus).
in scheme: FINANCES PUBLIQUES
in scheme: Branche d'activité
in scheme: Questions Economiques
in scheme: Transports
notation: REFIP2021

administrateur judiciaire
type: ConceptReFip
type: Concept
broader: procédure collective
definition: Auxiliaire de justice désigné par le tribunal lorsqu'une entreprise fait l’objet d’une procédure de redressement judiciaire ou d'une procédure de sauvegarde. Il est chargé de défendre les intérêts de la société, face au mandataire judiciaire, défenseur des intérêts des créanciers.
in scheme: FINANCES PUBLIQUES
in scheme: Vie de l'Entreprise
in scheme: Entreprises
in scheme: Vie et Gestion de l'entreprise
notation: REFIP2023

service des impôts des particuliers
type: ConceptReFip
type: Concept
alternative label: Centre des impôts
alternative label: SIP
broader: direction départementale des finances publiques
definition: Service déconcentré de la DGFIP compétent pour l'assiette et le recouvrement des impôts dus par les usagers particuliers.
in scheme: FINANCES PUBLIQUES
in scheme: Organisation Structurelle de l'Etat
in scheme: Ministère
in scheme: Administration de L'Etat
notation: REFIP2024

gros oeuvre
type: ConceptReFip
type: Concept
broader: travaux de construction
definition: Ensemble des études de sol, l’acheminement des voiries et réseaux divers, le terrassement, la construction des fondations, l’élévation des murs, la réalisation de la charpente et de la couverture, la pose des grosses menuiseries. Une fois ces différentes opérations effectuées on déclare le bâtiment « hors d’eau et hors d’air ».
in scheme: FINANCES PUBLIQUES
in scheme: Branche d'activité
in scheme: Questions Economiques
in scheme: Construction
notation: REFIP2025

carte
type: ConceptReFip
type: Concept
broader: document
definition: Document regroupant des informations.
in scheme: FINANCES PUBLIQUES
in scheme: Documentation
in scheme: Communication Documentation Informatique
notation: REFIP2026

prélèvement obligatoire
type: ConceptReFip
type: Concept
broader: impôt
definition: Ensemble des impôts et cotisations sociales prélevés par les administrations publiques et les institutions européennes ( organismes divers d’administration centrale, administrations publiques locales, administrations de Sécurité sociale). Les charges à financer sont les dépenses prévues par le budget de l’État, des collectivités et les prestations sociales.
in scheme: FINANCES PUBLIQUES
in scheme: Fiscalité
in scheme: Impôt
notation: REFIP2028

rescrit
type: ConceptReFip
type: Concept
alternative label: rescrit fiscal
alternative label: réponse à une demande de rescrit
broader: garantie accordée à l'usager
definition: Prise de position formelle de l'administration fiscale saisie par un contribuable.
in scheme: FINANCES PUBLIQUES
in scheme: Droit de Reprise de l'Administration
in scheme: Fiscalité
narrower: rescrit valeur
notation: REFIP2029

Marne
type: ConceptReFip
type: Concept
broader: refip-REFIP7009
definition: Département français
in scheme: FINANCES PUBLIQUES
in scheme: Géographie
in scheme: Europe
notation: REFIP203

Gibraltar
type: ConceptReFip
type: Concept
broader: Grande-Bretagne
definition: Territoire d'outre-mer de la Grande Bretagne
in scheme: FINANCES PUBLIQUES
in scheme: Géographie
in scheme: Europe
notation: REFIP2030

revue analytique
type: ConceptReFip
type: Concept
broader: contrôle de supervision
definition: Technique d'audit utilisée notamment lors de l'examen de comptes annuels d'une entité publique ou privée et reposant sur le contrôle partiel ou total de chaque cycle comptable et financier (actif et inventaire des immobilisations, état des stocks, état des dettes, etc) en vue d'avoir une assurance raisonnable sur la qualité des comptes et d'apporter les corrections nécessaires aux anomalies constatées.
in scheme: FINANCES PUBLIQUES
in scheme: Missions Transverses des Finances publiques
in scheme: Maîtrise des risques
notation: REFIP2031

application MIRE
type: ConceptReFip
type: Concept
alternative label: MIRE
broader: applications fiscales (non-descripteur)
definition: Module d'interrogation des référentiels permettant l'accès aux e-services professionnels.
in scheme: FINANCES PUBLIQUES
in scheme: Applications Informatiques
in scheme: Applications fiscales
notation: REFIP2033

procès-verbal électronique
type: ConceptReFip
type: Concept
alternative label: PV électronique
broader: contravention de petite voirie
definition: Procès verbal réalisé sous forme numérique. Il donne lieu à l'envoi d'un avis de contravention au domicile du contrevenant.
in scheme: FINANCES PUBLIQUES
in scheme: Droit et Justice
in scheme: Infractions et Sanctions
in scheme: Infraction
notation: REFIP2034

marché complémentaire
type: ConceptReFip
type: Concept
broader: marché public
definition: Nouveau marché dont le montant cumulé ne doit pas dépasser 50 % du montant du marché initial.
in scheme: FINANCES PUBLIQUES
in scheme: Commande publique
in scheme: Gestion Publique
notation: REFIP2035

frais réels
type: ConceptReFip
type: Concept
alternative label: régime des frais réels
broader: frais déductibles
definition: Régime de déduction des frais inhérents à l'emploi utilisé dans le cadre de l'imposition des revenus salariaux et qui repose sur la justification des dépenses réellement exposées. Le salarié doit opter expressément pour ce régime.
in scheme: FINANCES PUBLIQUES
in scheme: Liquidation de l'Impôt
in scheme: Fiscalité
narrower: frais de double résidence
narrower: refip-REFIP744
notation: REFIP2036

acte détachable (supprimé)
type: ConceptReFip
type: Concept
broader: ZZ
in scheme: FINANCES PUBLIQUES
notation: REFIP2037

Moselle
type: ConceptReFip
type: Concept
broader: refip-REFIP7009
definition: Département français
in scheme: FINANCES PUBLIQUES
in scheme: Géographie
in scheme: Europe
notation: REFIP204

Sénat
type: ConceptReFip
type: Concept
broader: Parlement
definition: Chambre haute du Parlement français, le sénat détient le pouvoir législatif avec l'Assemblée nationale. Il est le représentant des collectivités territoriales et, avec l'Assemblée nationale, des Français établis hors de France. Il siège au palais du Luxembourg.
in scheme: FINANCES PUBLIQUES
in scheme: Organisation Structurelle de l'Etat
in scheme: Pouvoirs Publics
in scheme: Administration de L'Etat
notation: REFIP2043

Espagne
type: ConceptReFip
type: Concept
broader: Europe
definition: Pays
in scheme: FINANCES PUBLIQUES
in scheme: Géographie
in scheme: Europe
notation: REFIP2044

conseil de prud'hommes
type: ConceptReFip
type: Concept
broader: juridiction civile
definition: Juridiction d'exception paritaire chargée de concilier et, à défaut, de juger les litiges individuels qui peuvent s'élever à l'occasion de tout contrat de travail,
in scheme: FINANCES PUBLIQUES
in scheme: Droit et Justice
in scheme: Juridiction
in scheme: Organisation Juridictionnelle
notation: REFIP2045

loi de règlement
type: ConceptReFip
type: Concept
alternative label: apurement législatif
broader: refip-REFIP978
definition: Texte arrêtant le montant définitif des dépenses et des recettes de l’État et le résultat budgétaire (déficit ou excédent) qui en découle.
in scheme: FINANCES PUBLIQUES
in scheme: Élaboration du budget
in scheme: Budget
notation: REFIP2047

dépenses d'investissement
type: ConceptReFip
type: Concept
broader: dépenses de l'Etat
definition: Ensemble des dépenses pour immobilisations corporelles de l'État et dépenses pour immobilisations incorporelles de l'État. Il s'agit des achats de biens durables permettant la production de services par l'État.
in scheme: FINANCES PUBLIQUES
in scheme: Dépenses publiques
in scheme: Gestion Publique
narrower: bien mobilier d'investissement
narrower: investissements d'avenir
narrower: restes à réaliser
narrower: dépenses d'équipement
notation: REFIP2048

Pôle de recouvrement spécialisé
type: ConceptReFip
type: Concept
alternative label: PRS pôle recouvrement spécialisé
broader: direction départementale des finances publiques
definition: Poste comptable à compétence départementale dont le coeur de mission est le recouvrement forcé des créances fiscales des particuliers, des professionnels, ainsi que des droits d’enregistrement.
in scheme: FINANCES PUBLIQUES
in scheme: Organisation Structurelle de l'Etat
in scheme: Ministère
in scheme: Administration de L'Etat
notation: REFIP2049

avance
type: ConceptReFip
type: Concept
alternative label: versement anticipé
broader: facturation
definition: Paiement partiel effectué préalablement à l'exécution d'une prestation convenue.
in scheme: FINANCES PUBLIQUES
in scheme: Procédures et Techniques Comptables
in scheme: Comptabilité
narrower: avance à régulariser
narrower: refip-REFIP879
notation: REFIP205

transfert de biens droits et obligations
type: ConceptReFip
type: Concept
broader: affectation de biens
definition: Transfert des immeubles et meubles faisant partie du domaine public des communes appartenant à l'agglomération et qui sont affectés de plein droit à la communauté urbaine, dès son institution, dans la cadre de transfert de compétence notamment, dans la mesure où ils sont nécessaires à l'exercice des compétences de la communauté.
in scheme: FINANCES PUBLIQUES
in scheme: Domaine
in scheme: Gestion Publique
notation: REFIP2050

imposition supplémentaire
type: ConceptReFip
type: Concept
broader: impôt
definition: Imposition qui s'ajoute à l'imposition primitive. Alors que celle-ci est réalisée à partir des éléments déclarés initialement par le contribuable, l'imposition supplémentaire résulte généralement d'un contrôle fiscal ou d'une déclaration rectificative.
in scheme: FINANCES PUBLIQUES
in scheme: Fiscalité
in scheme: Impôt
notation: REFIP2051

marché de conception-réalisation
type: ConceptReFip
type: Concept
alternative label: marché de maintenance
broader: refip-REFIP708
definition: Marché de travaux permettant à un acheteur public de confier à un groupement d'opérateurs économiques ou, pour les seuls ouvrages d'infrastructure, à un seul opérateur économique, une mission portant à la fois sur l'établissement des études (conception) et l'exécution des travaux (réalisation).
in scheme: FINANCES PUBLIQUES
in scheme: Commande publique
in scheme: Gestion Publique
notation: REFIP2052

entreprise unipersonnelle à responsabilité limitée
type: ConceptReFip
type: Concept
alternative label: EURL
broader: refip-REFIP813
definition: Société à responsabilité limitée à associé unique.
in scheme: FINANCES PUBLIQUES
in scheme: Société
in scheme: Entreprises
in scheme: Forme juridique
notation: REFIP2053

prix révisable
type: ConceptReFip
type: Concept
broader: révision de prix
definition: Prix qui peut être modifié pour tenir compte des variations économiques
in scheme: FINANCES PUBLIQUES
in scheme: Commande publique
in scheme: Gestion Publique
notation: REFIP2054

vigne
type: ConceptReFip
type: Concept
broader: viticulture
definition: Terrain planté de vigne cultivée et espèce cultivée qui produit du raisin.
in scheme: FINANCES PUBLIQUES
in scheme: Branche d'activité
in scheme: Questions Economiques
in scheme: Agriculture
notation: REFIP2056
related: vin

moins-value à long terme
type: ConceptReFip
type: Concept
broader: moins-value
definition: Moins-value provenant de la cession d' éléments non amortissables détenus depuis au moins 2 ans.
in scheme: FINANCES PUBLIQUES
in scheme: Documents comptables
in scheme: Comptabilité
notation: REFIP2057

apport à titre gratuit
type: ConceptReFip
type: Concept
alternative label: apport pur et simple
broader: refip-REFIP998
definition: Apports pur et simple, que les associés ou actionnaires, personnes physiques ou morales, mettent au profit de leur entreprise, d’un élément d’actif à la société nouvellement constituée sans lui transmettre simultanément un passif. En contrepartie de cet apport, l’associé reçoit des parts sociales (actions).
in scheme: FINANCES PUBLIQUES
in scheme: Gestion de l'Entreprise
in scheme: Entreprises
in scheme: Vie et Gestion de l'entreprise
notation: REFIP2058

impôt sur le revenu
type: ConceptReFip
type: Concept
alternative label: IR
alternative label: IRPP
broader: impôt direct
definition: Impôt établi sur l'ensemble des revenus catégoriels dont bénéficient les personnes physiques au cours d'une année déterminée.
in scheme: FINANCES PUBLIQUES
in scheme: Fiscalité
in scheme: Impôt
notation: REFIP2059

Fichier national des immatriculations
type: ConceptReFip
type: Concept
broader: immatriculation de véhicule
definition: Système recensant tous les véhicules en circulation et pour lesquels une immatriculation est nécessaire.
in scheme: FINANCES PUBLIQUES
in scheme: Branche d'activité
in scheme: Questions Economiques
in scheme: Transports
notation: REFIP206

régie intéressée
type: ConceptReFip
type: Concept
broader: régie
definition: Contrat par lequel le contractant, le régisseur, s'engage à gérer un service public contre une rémunération substantiellement liée aux résultats de l’exploitation. Le régisseur exploite les ouvrages construits par la personne publique mais il n'en assume pas les risques.
in scheme: FINANCES PUBLIQUES
in scheme: Secteur public local
in scheme: Gestion Publique
notation: REFIP2061

application ANCRAGES
type: ConceptReFip
type: Concept
broader: applications fiscales (non-descripteur)
definition: Application permettant le contrôle de la redevance audiovisuelle et la gestion des sanctions ainsi que la restitution de statistiques et d'indicateurs sous la responsabilité de l'Application REDEVANCE.
in scheme: FINANCES PUBLIQUES
in scheme: Applications Informatiques
in scheme: Applications fiscales
notation: REFIP2062

transport ferroviaire
type: ConceptReFip
type: Concept
broader: refip-REFIP766
definition: Activité de transport de voyageurs ou de marchandises par voie ferrée.
in scheme: FINANCES PUBLIQUES
in scheme: Branche d'activité
in scheme: Questions Economiques
in scheme: Transports
notation: REFIP2063
related: infrastructure ferroviaire

saisie
type: ConceptReFip
type: Concept
broader: poursuites
definition: Mesure exécutoire ou conservatoire permettant d'appréhender – mettre sous main de justice-,un bien corporel ou incorporel appartenant au débiteur.
in scheme: FINANCES PUBLIQUES
in scheme: Recouvrement
in scheme: Fiscalité
narrower: saisie à tiers détenteur
narrower: saisie immobilière
narrower: saisie mobilière
narrower: insaisissabilité
narrower: saisie-vente
narrower: refip-REFIP6880
narrower: refip-REFIP6882
narrower: refip-REFIP7135
notation: REFIP2064
related: procédure civile d'exécution

revenu de capitaux mobiliers
type: ConceptReFip
type: Concept
alternative label: revenu de valeurs mobilières
alternative label: revenu mobilier
broader: revenu catégoriel
definition: Revenus tirés des investissements en capitaux mobiliers et consistant d'une part en produits de placements à revenu variable (revenus des actions et parts sociales) et d'autre part en produits de placement à revenu fixe (revenus des obligations etc.).
in scheme: FINANCES PUBLIQUES
in scheme: Champ d'Application
in scheme: Fiscalité
narrower: revenu distribué
notation: REFIP2065

budget général
type: ConceptReFip
type: Concept
broader: refip-REFIP982
definition: Principale composante du budget de l’État. Il s’agit du budget dans lequel l’ensemble des recettes et des dépenses sont reportées.
in scheme: FINANCES PUBLIQUES
in scheme: Documentation budgétaire
in scheme: Budget
notation: REFIP2066

dotation globale des hôpitaux
type: ConceptReFip
type: Concept
broader: dotation
definition: Mécanisme de financement mis à disposition des hôpitaux publics et des hôpitaux privés participant au service public hospitalier et hôpitaux privés ayant opté pour ce mode de financement. Le budget est fixé pour une année en fonction du budget précédent auquel est appliqué un taux directeur.
in scheme: FINANCES PUBLIQUES
in scheme: Dépenses publiques
in scheme: Gestion Publique
notation: REFIP2067

dépenses sans ordonnancement
type: ConceptReFip
type: Concept
broader: refip-REFIP996
definition: Procédure dérogatoire d'exécution, sans phase d'ordonnancement. Le comptable public procède directement au paiement sans formalité préalable, sur présentation du titre détenu par le créancier ou au vu de décisions administratives particulières, sans intervention de l'ordonnateur.
in scheme: FINANCES PUBLIQUES
in scheme: Dépenses publiques
in scheme: Gestion Publique
narrower: dépenses sans ordonnancement préalable
notation: REFIP2068

fonds libres des offices d'habitation à loyer modéré (supprimé)
type: ConceptReFip
type: Concept
broader: ZZ
in scheme: FINANCES PUBLIQUES
notation: REFIP2069

réserve foncière
type: ConceptReFip
type: Concept
broader: domaine public
definition: Acquisition de terrains ou d'Immeubles que peuvent acquérir par voie d'expropriation, et dans l'intérêt général, les collectivités ou les EPL en prévision de l'extension des agglomérations, de l'aménagement des espaces naturels, de la créations de villes nouvelles ou de stations de tourisme.
in scheme: FINANCES PUBLIQUES
in scheme: Domaine
in scheme: Gestion Publique
notation: REFIP207

parcelle
type: ConceptReFip
type: Concept
broader: représentation parcellaire cadastrale unique
definition: Unité foncière cadastrale se définissant comme l'ensemble des terrains d'un seul tenant, appartenant à un même propriétaire et situés dans un même lieu-dit.
in scheme: FINANCES PUBLIQUES
in scheme: Cadastre
in scheme: Fiscalité
notation: REFIP2070

langue des signes française
type: ConceptReFip
type: Concept
alternative label: LSF
broader: information
definition: Langue visuelle à part entière permettant le dialogue avec des personnes souffrant d'une défaillance auditive.
in scheme: FINANCES PUBLIQUES
in scheme: Communication
in scheme: Communication Documentation Informatique
notation: REFIP2071

livre
type: ConceptReFip
type: Concept
alternative label: manuscrit
alternative label: ouvrage
broader: document
broader: éditeur
definition: Document écrit formant une unité.
in scheme: FINANCES PUBLIQUES
in scheme: Documentation
in scheme: Communication Documentation Informatique
notation: REFIP2072
related: éditeur

ingénieur
type: ConceptReFip
type: Concept
broader: industrie
definition: Personne que ses connaissances rendent apte à occuper des fonctions scientifiques ou techniques actives en vue de prévoir, créer, organiser, diriger, contrôler les travaux qui en découlent, ainsi qu'à y tenir un rôle de cadre.
in scheme: FINANCES PUBLIQUES
in scheme: Branche d'activité
in scheme: Questions Economiques
in scheme: Industrie
notation: REFIP2073

recouvrement
type: ConceptReFip
type: Concept
definition: Ensemble des opérations qui concourent à la perception des sommes dues par les débiteurs.
in scheme: FINANCES PUBLIQUES
in scheme: Recouvrement
in scheme: Fiscalité
narrower: phase comminatoire amiable
narrower: déclaration de créances
narrower: poursuites
narrower: créance spéciale du Trésor
narrower: action en recouvrement
narrower: créance chirographaire
narrower: contentieux du recouvrement
narrower: abandon de créance
narrower: restitution de garantie
narrower: exigibilité
narrower: mainlevée
narrower: paiement de l'impôt
narrower: recouvrement des produits locaux
narrower: assistance internationale au recouvrement
narrower: créance sur l'Etat
narrower: restitution de crédit d'impôt
narrower: délai de paiement
narrower: restes à recouvrer
narrower: prise en charge
narrower: transfert du recouvrement
narrower: mise en recouvrement
narrower: créance certaine
narrower: produits divers
narrower: créance privilégiée
narrower: débiteur international
narrower: déclaration d'insaisissabilité
narrower: pénalité de recouvrement
narrower: débiteur public
narrower: opposition
narrower: prescription de l'action en recouvrement
narrower: solidarités diverses et actions patrimoniales (non-descripteur)
narrower: refip-REFIP7072
narrower: refip-REFIP7073
narrower: refip-REFIP7074
narrower: refip-REFIP7112
narrower: refip-REFIP811
narrower: refip-REFIP877
notation: REFIP2074

volume immobilier
type: ConceptReFip
type: Concept
alternative label: division en volumes
broader: domaine public
definition: Technique contractuelle de division de la propriété. Utilisée en présence d'ensemble immobiliers complexes (pas de parties communes entre les lots ou en cas de coexistence d'espaces publics et privés etc...).
in scheme: FINANCES PUBLIQUES
in scheme: Domaine
in scheme: Gestion Publique
notation: REFIP2076

amortissement différé
type: ConceptReFip
type: Concept
alternative label: ARD
alternative label: amortissement pratique en période déficitaire
alternative label: amortissement réputé différé
alternative label: amortissement réputé différé en période déficitaire
broader: amortissement comptable
definition: Amortissement comptabilisé au cours d'un exercice dont le résultat fiscal est déficitaire, et que l'entreprise décide de reporter sur les exercices suivants.
in scheme: FINANCES PUBLIQUES
in scheme: Procédures et Techniques Comptables
in scheme: Comptabilité
notation: REFIP2077

travaux en régie
type: ConceptReFip
type: Concept
broader: régie
definition: Immobilisation que la collectivité créée pour elle-même. Ces travaux sont réalisés par son personnel avec des matériaux qu'elle achète. Les travaux doivent être de véritables immobilisations créées et non de simples travaux d'entretien.
in scheme: FINANCES PUBLIQUES
in scheme: Secteur public local
in scheme: Gestion Publique
notation: REFIP2078

Australie
type: ConceptReFip
type: Concept
broader: Océanie
definition: Pays
in scheme: FINANCES PUBLIQUES
in scheme: Géographie
in scheme: Océanie
notation: REFIP2079

principe d'annualité budgétaire
type: ConceptReFip
type: Concept
alternative label: annualité budgétaire
alternative label: annualité du budget de l'Etat
alternative label: principe d'annualité du budget de l'Etat
broader: principe budgétaire
definition: Norme fixant pour une année la durée de l'exercice budgétaire.
in scheme: FINANCES PUBLIQUES
in scheme: Élaboration du budget
in scheme: Budget
notation: REFIP208

évasion fiscale
type: ConceptReFip
type: Concept
broader: droit de contrôle de l'administration (non-descripteur)
definition: Action visant à soustraire à l'impôt tout ou partie de la matière imposable sans contrevenir formellement à la loi. En ce sens, elle se distingue de la fraude fiscale, qui implique un comportement, actif ou passif, en infraction avec les règles fiscales.
in scheme: FINANCES PUBLIQUES
in scheme: Droit de Contrôle de l'Administration
in scheme: Fiscalité
narrower: paradis fiscal
notation: REFIP2080

droit commercial
type: ConceptReFip
type: Concept
broader: droit privé
definition: Ensemble des règles juridiques applicables aux commerçants dans l'exercice de leur profession et à l'activité commerciale (actes de commerce).
in scheme: FINANCES PUBLIQUES
in scheme: Droit et Justice
in scheme: Divisions du Droit
in scheme: Droit Privé
narrower: conjoint de l'exploitant
narrower: pratique restrictive de concurrence
narrower: coexploitant
narrower: droit des sociétés
narrower: action en comblement de passif
narrower: indemnité d'éviction
narrower: droit d'entrée
narrower: propriété intellectuelle
narrower: registre du commerce et des sociétés
narrower: indemnité d'occupation
narrower: non-concurrence
narrower: fonds de commerce
narrower: acte de commerce
narrower: droit au bail
notation: REFIP2081

reconstitution de recettes
type: ConceptReFip
type: Concept
broader: vérification de comptabilité
definition: Méthode utilisée par les vérificateurs pour les entreprises de taille modeste afin de s'assurer de la sincérité des recettes déclarées ou, à défaut, de présentation de comptabilité. Consiste bien souvent à évaluer un montant de recettes à partir des factures d'achat, des dosages et des tarifs fournis ou retenus par le service.
in scheme: FINANCES PUBLIQUES
in scheme: Droit de Contrôle de l'Administration
in scheme: Fiscalité
notation: REFIP2082

accueil téléphonique
type: ConceptReFip
type: Concept
broader: accueil du public
definition: Réception et gestion des appels téléphoniques avec les usagers.
in scheme: FINANCES PUBLIQUES
in scheme: Missions Transverses des Finances publiques
in scheme: Qualité de service
notation: REFIP2083

achat courant
type: ConceptReFip
type: Concept
broader: frais de fonctionnement
definition: Acquisition portant sur les besoins communs à plusieurs ministères.
in scheme: FINANCES PUBLIQUES
in scheme: Dépenses publiques
in scheme: Gestion Publique
notation: REFIP2084

territorialité
type: ConceptReFip
type: Concept
broader: droit général (non-descripteur)
definition: Vocation d'un droit à s'appliquer uniformément sur l'ensemble du territoire, seul applicable sur ce territoire et sans effet hors de ce territoire.
in scheme: FINANCES PUBLIQUES
in scheme: Droit et Justice
in scheme: Droit Général
notation: REFIP2085

péréquation
type: ConceptReFip
type: Concept
broader: fiscalité directe locale
definition: Mécanisme de redistribution qui vise à réduire les écarts de richesse donc les inégalités entre les différentes collectivités territoriales.
in scheme: FINANCES PUBLIQUES
in scheme: Secteur public local
in scheme: Gestion Publique
notation: REFIP2087

centre hospitalier spécialisé en psychiatrie
type: ConceptReFip
type: Concept
alternative label: CHSP
alternative label: hôpital psychiatrique
broader: établissement public de santé
definition: Etablissement public de santé et unités de soin, qui reçoit les personnes souffrant de troubles psychiatriques, des déficients mentaux, des personnes souffrant d'addictions et certaines personnes âgées dont l'état nécessite un suivi médical et infirmier lourd que ne peuvent assurer les maisons de retraites.
in scheme: FINANCES PUBLIQUES
in scheme: Organisation Territoriale
in scheme: Structures Territoriales
in scheme: Administration de L'Etat
notation: REFIP2088

service de liaison rémunération
type: ConceptReFip
type: Concept
alternative label: SLR
alternative label: service liaison rémunération
broader: direction départementale des finances publiques
definition: Ordonnateur de la procédure de versement de la paye des fonctionnaires, de récupération des acomptes, et du recouvrement hors paye suite à indu de rémunération.
in scheme: FINANCES PUBLIQUES
in scheme: Organisation Structurelle de l'Etat
in scheme: Ministère
in scheme: Administration de L'Etat
notation: REFIP2089

immobilisation financière
type: ConceptReFip
type: Concept
alternative label: actif financier
broader: immobilisation
definition: Actif financier d'utilisation durable
in scheme: FINANCES PUBLIQUES
in scheme: Documents comptables
in scheme: Comptabilité
notation: REFIP2090

marché d'enlèvement
type: ConceptReFip
type: Concept
broader: marché de services
definition: Type de marché de service qui concerne les marchés passés pour les enlèvements (successifs) de véhicules hors d'usage, de graffitis, de déchets...
in scheme: FINANCES PUBLIQUES
in scheme: Commande publique
in scheme: Gestion Publique
notation: REFIP2091

contrôleur territorial de travaux (obsolète)
type: ConceptReFip
type: Concept
is replaced by: refip-REFIP6930
broader: ZZ
in scheme: FINANCES PUBLIQUES
notation: REFIP2092

bureau d'adjudication
type: ConceptReFip
type: Concept
broader: attribution de marché public
definition: Instance qui statue sur les éventuelles réclamations, puis donne lecture, avant la mise en adjudication de chaque lot, de la liste des amateurs dont la candidature a été retenue, dans le cadre des marchés publics.
in scheme: FINANCES PUBLIQUES
in scheme: Commande publique
in scheme: Gestion Publique
notation: REFIP2094

port
type: ConceptReFip
type: Concept
alternative label: port de plaisance
alternative label: port de pêche
alternative label: port fluvial
alternative label: port maritime
broader: transport maritime
definition: Infrastructure située sur le littoral maritime, sur les berges d'un lac ou d'un cours d'eau, et destinée à accueillir des bateaux et des navires.
in scheme: FINANCES PUBLIQUES
in scheme: Branche d'activité
in scheme: Questions Economiques
in scheme: Transports
notation: REFIP2096
related: pêche

épave
type: ConceptReFip
type: Concept
broader: navire
definition: Reste d'un navire en mer, sur le rivage ou au fond de la mer, après qu'il a été abandonné, qu'il s'est échoué ou a coulé, à la suite d'un « événement de mer » ou d'un sabordage.
in scheme: FINANCES PUBLIQUES
in scheme: Branche d'activité
in scheme: Questions Economiques
in scheme: Transports
notation: REFIP2097

Direction spécialisée des finances publiques pour l'assistance publique hôpitaux de Paris
type: ConceptReFip
type: Concept
alternative label: DSFP-AP-HP
broader: refip-REFIP895
definition: Poste comptable hospitalier du réseau de la DGFiP chargé du recouvrement des recettes, du contrôle et du paiement des dépenses, et de la tenue de la comptabilité de l’Assistance Publique - Hôpitaux de Paris.
in scheme: FINANCES PUBLIQUES
in scheme: Organisation Structurelle de l'Etat
in scheme: Ministère
in scheme: Administration de L'Etat
notation: REFIP2099
scope note: A succédé à la trésorerie générale pour l'AP-HP qui avait elle-même été créée par le décret du 27/07/1979

Sénégal
type: ConceptReFip
type: Concept
broader: Afrique
definition: Pays
in scheme: FINANCES PUBLIQUES
in scheme: Géographie
in scheme: Afrique
notation: REFIP2101

droit de préemption
type: ConceptReFip
type: Concept
alternative label: préemption
broader: droit administratif
definition: droit reconnu dans certains cas à l’Administration et à certains organismes de droit privé, en droit administratif, accomplissant une mission de service public, d’acquérir la propriété d’un bien lors de son aliénation par préférence à tout autre acheteur.
in scheme: FINANCES PUBLIQUES
in scheme: Droit et Justice
in scheme: Divisions du Droit
in scheme: Droit Public
notation: REFIP2102

entraide agricole
type: ConceptReFip
type: Concept
broader: agriculture
definition: Forme simple et traditionnelle de coopération entre agriculteurs voisins. Forme de contrat d’échange de services, à titre gratuit.
in scheme: FINANCES PUBLIQUES
in scheme: Branche d'activité
in scheme: Questions Economiques
in scheme: Agriculture
notation: REFIP2103

charges permanentes de l'Etat
type: ConceptReFip
type: Concept
broader: dépenses de l'Etat
definition: Dépenses de l'Etat , comprenant les dépenses ordinaires, les dépenses en capital ainsi que les dépenses liées aux prêts et avances de l'État.
in scheme: FINANCES PUBLIQUES
in scheme: Dépenses publiques
in scheme: Gestion Publique
notation: REFIP2104

question prioritaire de constitutionnalité
type: ConceptReFip
type: Concept
alternative label: QPC
broader: droit constitutionnel
definition: Saisine du Conseil Constitutionnel lors d'une instance devant la juridiction administrative ou judiciaire pour contester la conformité à la Constitution d'une loi déjà en vigueur. Cette procédure vise à vérifier que la disposition législative ne porte pas atteinte aux droits et libertés garantis par la Constitution.
in scheme: FINANCES PUBLIQUES
in scheme: Droit et Justice
in scheme: Divisions du Droit
in scheme: Droit Public
notation: REFIP2105

compte collectif
type: ConceptReFip
type: Concept
broader: CHORUS (non-descripteur)
definition: Compte lié à une comptabilité auxiliaire native dans CHORUS (fournisseurs, clients, immobilisations, stocks).
in scheme: FINANCES PUBLIQUES
in scheme: Comptabilité publique
in scheme: Comptabilité
notation: REFIP2106

saisie à tiers détenteur
type: ConceptReFip
type: Concept
alternative label: STD
broader: saisie
definition: Dénomination donnée à la saisie-attribution pratiquée pour le recouvrement des créances de l'État qui font l'objet d'un titre de perception. Les personnes physiques ou morales qui détiennent des fonds pour le compte du débiteur doivent se libérer des sommes saisies dans les 30 jours suivant la réception de la saisie.
in scheme: FINANCES PUBLIQUES
in scheme: Recouvrement
in scheme: Fiscalité
notation: REFIP2107

application SCG
type: ConceptReFip
type: Concept
alternative label: SCG
alternative label: suivi de la centralisation des comptes de gestion
broader: applications gestion publique (non-descripteur)
definition: Outil de suivi de la centralisation des balances comptables mensuelles et définitives dans l'application CCI.
in scheme: FINANCES PUBLIQUES
in scheme: Applications Informatiques
in scheme: Applications gestion publique
notation: REFIP2109

aviation civile
type: ConceptReFip
type: Concept
alternative label: Direction générale de l'aviation civile
broader: transport aérien
definition: Aviation non militaire qui englobe le transport civil de passagers et de marchandises.
in scheme: FINANCES PUBLIQUES
in scheme: Branche d'activité
in scheme: Questions Economiques
in scheme: Transports
narrower: compagnie de navigation aérienne
notation: REFIP211

grève
type: ConceptReFip
type: Concept
broader: refip-REFIP6950
definition: Cessation collective et concertée du travail en vue d'appuyer des revendications professionnelles. La grève peut aussi être décidée dans un but de solidarité avec d'autres entreprises même si les protestataires n'appartiennent pas au même employeur, pour exprimer la crainte d'une décision future ou dans un but politique. Elle est exercée tant par le personnel des entreprises privées que par les agents des services publics.
in scheme: FINANCES PUBLIQUES
in scheme: Entreprises
in scheme: Travail
in scheme: 212619
narrower: gréviste
narrower: préavis de grève
notation: REFIP2111
related: droit de grève

groupement de coopération sanitaire
type: ConceptReFip
type: Concept
alternative label: GCS
broader: coopération intercommunale
definition: Personne morale de droit public ou de droit privé ; il est l’outil de coopération privilégié dans le cadre des coopérations entre le secteur public et privé, mais également entre la ville et l’hôpital. Il permet d’associer des établissements de santé publics comme privés, des centres de santé, des maisons de santé et des professionnels médicaux libéraux à titre individuel ou collectif, ou encore les acteurs du secteur médico-social.
in scheme: FINANCES PUBLIQUES
in scheme: Secteur public local
in scheme: Gestion Publique
notation: REFIP2114

écriture comptable
type: ConceptReFip
type: Concept
alternative label: omission d'écritures comptables
broader: comptabilisation
definition: Inscription sur un livre comptable comportant plusieurs éléments, montant, date, libellé, etc…La comptabilité en partie simple se contente d'une seule écriture, en partie double elle associe deux écritures symétriques et de même montant sur deux comptes.
in scheme: FINANCES PUBLIQUES
in scheme: Procédures et Techniques Comptables
in scheme: Comptabilité
notation: REFIP2115

imposition forfaitaire sur les stations radioélectriques
type: ConceptReFip
type: Concept
alternative label: IFSR
broader: imposition forfaitaire sur les entreprises de réseaux
definition: Imposition qui s'applique aux stations radioélectriques dont la puissance impose un avis, un accord ou une déclaration à l'Agence nationale des fréquences. Constitue une composante de l'IFER.
in scheme: FINANCES PUBLIQUES
in scheme: Fiscalité
in scheme: Impôt
notation: REFIP2116

dépenses imprévues
type: ConceptReFip
type: Concept
broader: dépenses du secteur public local
definition: Crédits pour dépenses imprévues ou crédits budgétaires inscrits tant en section d'investissement qu'en section de fonctionnement, pouvant être employés par l'ordonnateur pour faire face à des dépenses pour lesquelles aucune dotation n'est inscrite. Ces dépenses sont votées par l'assemblée délibérante.
in scheme: FINANCES PUBLIQUES
in scheme: Secteur public local
in scheme: Gestion Publique
notation: REFIP2117

aérodrome
type: ConceptReFip
type: Concept
alternative label: aérodrome civil
alternative label: aérodrome militaire
alternative label: base aérienne
alternative label: terrain d'aviation
broader: transport aérien
definition: Terrain aménagé pour le décollage et l'atterrissage des avions.
in scheme: FINANCES PUBLIQUES
in scheme: Branche d'activité
in scheme: Questions Economiques
in scheme: Transports
narrower: aéroport
notation: REFIP2118

taxe sur les installations de production d'énergie éolienne
type: ConceptReFip
type: Concept
broader: autres taxes, droits ou redevances (non-descripteur)
definition: Taxe annuelle sur les installations de production d'électricité utilisant l'énergie mécanique du vent situées dans les eaux intérieures ou la mer territoriale, acquittée par l'exploitant de l'unité de production au profit des communes et des usagers de la mer.
in scheme: FINANCES PUBLIQUES
in scheme: Fiscalité
in scheme: Impôt
notation: REFIP212

contrôle comptable
type: ConceptReFip
type: Concept
alternative label: contrôle d'ajustement
alternative label: contrôle d'analyse
alternative label: contrôle d'inspection
alternative label: contrôle de rapprochement
alternative label: contrôle de reconstitution
broader: contrôle interne
definition: Vérification de l'information comptable pour s'assurer de sa régularité et de sa conformité aux critères de qualité comptable.
in scheme: FINANCES PUBLIQUES
in scheme: Missions Transverses des Finances publiques
in scheme: Maîtrise des risques
narrower: refip-REFIP7100
notation: REFIP2120

application GESPRO
type: ConceptReFip
type: Concept
alternative label: GESPRO
broader: applications fiscales (non-descripteur)
definition: Application de gestion des redevables professionnels, de leurs obligations fiscales.
in scheme: FINANCES PUBLIQUES
in scheme: Applications Informatiques
in scheme: Applications fiscales
notation: REFIP2123

droits civiques
type: ConceptReFip
type: Concept
broader: liberté fondamentale
definition: Protections et privilèges de liberté individuelles accordés à tous les citoyens par la loi contre toutes les discriminations.
in scheme: FINANCES PUBLIQUES
in scheme: Droit et Justice
in scheme: Divisions du Droit
in scheme: Droit Public
narrower: droit de vote
notation: REFIP2124

affouage
type: ConceptReFip
type: Concept
alternative label: coupe affouagère
broader: exploitation forestière
definition: Possibilité pour les habitants d'une commune de recevoir une partie de la production des forêts appartenant à celle-ci.
in scheme: FINANCES PUBLIQUES
in scheme: Branche d'activité
in scheme: Questions Economiques
in scheme: Agriculture
notation: REFIP2125
related: domaine public
related: forêt

référentiel national obligatoire
type: ConceptReFip
type: Concept
alternative label: RNO
broader: contrôle hiérarchisé de la dépense
definition: Document intégrant, dans le contrôle hiérarchisé de la dépense, la catégorie des dépenses présentant les risques potentiels et les enjeux financiers les plus importants.
in scheme: FINANCES PUBLIQUES
in scheme: Dépenses publiques
in scheme: Gestion Publique
notation: REFIP2126

comptabilité M 42
type: ConceptReFip
type: Concept
broader: comptabilité publique locale
definition: Instruction comptable M 42 applicable aux services publics des abattoirs.
in scheme: FINANCES PUBLIQUES
in scheme: Secteur public local
in scheme: Gestion Publique
notation: REFIP2127

tontine
type: ConceptReFip
type: Concept
broader: droit des obligations et contrats (non-descripteur)
definition: Contrat aléatoire correspondant au financement collectif de l'achat d'un actif financier ou d'un bien dont la propriété revient à une partie seulement des souscripteurs.
in scheme: FINANCES PUBLIQUES
in scheme: Droit et Justice
in scheme: Divisions du Droit
in scheme: Droit Privé
notation: REFIP2129
related: clause d'accroissement

obligation alimentaire
type: ConceptReFip
type: Concept
broader: droit civil
definition: Les personnes unies par un lien de parenté (ascendants et descendants) ou d'alliance à un certain degré de proximité (beau-père, belle-mère, gendre, belle-fille …) se doivent mutuellement secours. Le code civil leur impose une obligation alimentaire dont l'exécution a lieu généralement en argent sous forme d'une pension alimentaire versée périodiquement au créancier.
in scheme: FINANCES PUBLIQUES
in scheme: Droit et Justice
in scheme: Divisions du Droit
in scheme: Droit Privé
narrower: pension alimentaire
notation: REFIP213

résolution de vente
type: ConceptReFip
type: Concept
broader: vente
definition: Sanction consistant dans l'effacement rétroactif des obligations nées d'un contrat synallagmatique, lorsque l'une des parties n'exécute pas ses prestations.
in scheme: FINANCES PUBLIQUES
in scheme: Droit et Justice
in scheme: Divisions du Droit
in scheme: Droit Privé
notation: REFIP2130

céréale
type: ConceptReFip
type: Concept
broader: denrée alimentaire
definition: Plante cultivée principalement pour ses grains utilisée en alimentation humaine et animale.
in scheme: FINANCES PUBLIQUES
in scheme: Branche d'activité
in scheme: Questions Economiques
in scheme: Industrie
notation: REFIP2131

écart de conversion
type: ConceptReFip
type: Concept
broader: inventaire
definition: Poste comptable résultant de la conversion de comptes en fonction de la valeur des monnaies étrangères à une date donnée. En comptabilité, les postes du bilan et ceux du compte de résultat peuvent être convertis à des taux différents induisant un déséquilibre qui est rétabli par l'intermédiaire du poste écart de conversion.
in scheme: FINANCES PUBLIQUES
in scheme: Procédures et Techniques Comptables
in scheme: Comptabilité
notation: REFIP2132

application TP CDA
type: ConceptReFip
type: Concept
alternative label: TP CDA
broader: applications fiscales (non-descripteur)
definition: Application servant à la taxation des professionnels dans les services de fiscalité directe locale.
in scheme: FINANCES PUBLIQUES
in scheme: Applications Informatiques
in scheme: Applications fiscales
notation: REFIP2135

feuille de tête de rôle
type: ConceptReFip
type: Concept
broader: documentation fiscale (non-descripteur)
definition: Résumé indiquant les bases, taux, produits et bénéficiaires. Document revêtu de la formule d'homologation.
in scheme: FINANCES PUBLIQUES
in scheme: Documentation Fiscale
in scheme: Fiscalité
notation: REFIP2136

accident du travail
type: ConceptReFip
type: Concept
broader: refip-REFIP6950
definition: Accident survenu par le fait ou à l'occasion du travail de toute personne salariée, contractuelle ou travaillant à quelque titre ou en quelque lieu que ce soit.
in scheme: FINANCES PUBLIQUES
in scheme: Entreprises
in scheme: Travail
in scheme: 212619
notation: REFIP2137
scope note: Personnel de droit privé - agents contractuels

assujetti partiel
type: ConceptReFip
type: Concept
broader: assujetti
definition: Assujetti qui, parallèlement à l'activité économique placée dans le champ d'application de la TVA, réalise Des opérations exclues de ce champ d'application.
in scheme: FINANCES PUBLIQUES
in scheme: Champ d'Application
in scheme: Fiscalité
notation: REFIP2138

encaisse
type: ConceptReFip
type: Concept
broader: comptabilité de caisse
definition: Totalité de la monnaie fiduciaire détenue dans la caisse en billets et pièces métalliques.
in scheme: FINANCES PUBLIQUES
in scheme: Comptabilité publique
in scheme: Comptabilité
notation: REFIP2139

schéma départemental de coopération intercommunale
type: ConceptReFip
type: Concept
alternative label: SDCI
broader: coopération intercommunale
definition: Document, établi dans chaque département, destiné à servir de cadre de référence à l'évolution de la carte intercommunale.
in scheme: FINANCES PUBLIQUES
in scheme: Secteur public local
in scheme: Gestion Publique
notation: REFIP214

tarif
type: ConceptReFip
type: Concept
broader: tarification
definition: Tableau des prix.
in scheme: FINANCES PUBLIQUES
in scheme: Questions Economiques
in scheme: Economie générale
notation: REFIP2140

dépenses obligatoires
type: ConceptReFip
type: Concept
broader: dépenses du secteur public local
definition: Dépenses expressément prévues par la loi, notamment les dépenses de personnel et le règlement de la dette, et qui doivent être inscrites au budget de la commune. Le préfet peut les inscrire d'office.
in scheme: FINANCES PUBLIQUES
in scheme: Secteur public local
in scheme: Gestion Publique
notation: REFIP2143

signalétique
type: ConceptReFip
type: Concept
alternative label: enseigne
broader: information
definition: Ensemble des éléments d'une signalisation propre à faire reconnaître quelque chose ou quelqu'un.
in scheme: FINANCES PUBLIQUES
in scheme: Communication
in scheme: Communication Documentation Informatique
notation: REFIP2145

bien spécifique
type: ConceptReFip
type: Concept
broader: domaine public
definition: Bien immobilier qui, en raison de sa nature particulière sans équivalent sur le marché ou de son caractère historique et culturel, est inscrit au bilan de l’État à leur valeur symbolique.
in scheme: FINANCES PUBLIQUES
in scheme: Domaine
in scheme: Gestion Publique
notation: REFIP2147

indicateur de la qualité des comptes locaux
type: ConceptReFip
type: Concept
alternative label: IASQCL
alternative label: IQCL
broader: indicateur de performance
definition: Indicateur de performance permettant de rendre compte des actions de fiabilisation des comptes des organismes du secteur public local.
in scheme: FINANCES PUBLIQUES
in scheme: Missions Transverses des Finances publiques
in scheme: Pilotage
notation: REFIP2148

congé sabbatique (supprimé)
type: ConceptReFip
type: Concept
broader: ZZ
in scheme: FINANCES PUBLIQUES
notation: REFIP2149

association de gestion agréée
type: ConceptReFip
type: Concept
alternative label: AGA
broader: refip-REFIP7154
definition: Organisme à but non lucratif agréé par l’Administration fiscale et à usage exclusif des membres des professions libérales. Sa mission est de développer l’usage de la comptabilité et de faciliter l’accomplissement des obligations administratives et fiscales de ses adhérents. Elle vérifie et contrôle les déclarations fiscales des professions libérales et assiste les professionnels dans la réalisation de ces obligations.
in scheme: FINANCES PUBLIQUES
in scheme: Entreprises
in scheme: Forme juridique
in scheme: Association
notation: REFIP215

rapport
type: ConceptReFip
type: Concept
broader: document
definition: Document décrivant une situation, des événements.
in scheme: FINANCES PUBLIQUES
in scheme: Documentation
in scheme: Communication Documentation Informatique
notation: REFIP2150

prescription
type: ConceptReFip
type: Concept
broader: droit général (non-descripteur)
definition: Moyen légal d'acquérir un droit ou de se libérer d’une obligation par l’écoulement d’un certain délai. La prescription peut être suspendue ou interrompue.
in scheme: FINANCES PUBLIQUES
in scheme: Droit et Justice
in scheme: Droit Général
narrower: prescription trentenaire
narrower: prescription décennale
narrower: prescription extinctive
narrower: prescription triennale
narrower: prescription quinquennale
narrower: prescription quadriennale
narrower: prescription biennale
narrower: prescription acquisitive
narrower: refip-REFIP7124
notation: REFIP2151

taux
type: ConceptReFip
type: Concept
broader: mots outils (liste additive)
definition: Rapport entre deux grandeurs, exprimé en valeur absolue et souvent en pourcentage.
in scheme: FINANCES PUBLIQUES
in scheme: Mots Outils
notation: REFIP2153

obligation déclarative du tiers saisi (supprimé)
type: ConceptReFip
type: Concept
in scheme: FINANCES PUBLIQUES
notation: REFIP2155

département du contrôle budgétaire
type: ConceptReFip
type: Concept
broader: service de contrôle budgétaire et comptable ministériel
definition: Service chargé au sein de chaque ministère du contrôle budgétaire.
in scheme: FINANCES PUBLIQUES
in scheme: Organisation Structurelle de l'Etat
in scheme: Ministère
in scheme: Administration de L'Etat
notation: REFIP2157

imposition forfaitaire sur les installations terrestres de production d'électricité utilisant l'énergie mécanique du vent
type: ConceptReFip
type: Concept
alternative label: IFEMV
broader: imposition forfaitaire sur les entreprises de réseaux
definition: Imposition qui s'applique aux installations terrestres de production d'électricité utilisant l'énergie mécanique du vent et aux installations de production d'électricité utilisant l'énergie mécanique hydraulique des courants situés dans les eaux intérieures ou dans la mer territoriale, dont la puissance électrique installée est supérieure ou égale à 100 kilowatts. Constitue une composante de l'IFER.
in scheme: FINANCES PUBLIQUES
in scheme: Fiscalité
in scheme: Impôt
notation: REFIP2158

cession de créance
type: ConceptReFip
type: Concept
broader: cession
definition: Contrat par lequel le créancier cédant transmet, à titre onéreux ou gratuit, tout ou partie de sa créance contre le débiteur cédé à un tiers appelé le cessionnaire.
in scheme: FINANCES PUBLIQUES
in scheme: Droit et Justice
in scheme: Divisions du Droit
in scheme: Droit Privé
narrower: bordereau Dailly
notation: REFIP216

Autriche
type: ConceptReFip
type: Concept
broader: Europe
definition: Pays
in scheme: FINANCES PUBLIQUES
in scheme: Géographie
in scheme: Europe
notation: REFIP2160

contribuable professionnel
type: ConceptReFip
type: Concept
broader: contribuable
definition: Contribuable disposant de revenus professionnels.
in scheme: FINANCES PUBLIQUES
in scheme: Champ d'Application
in scheme: Fiscalité
notation: REFIP2161

centre intercommunal d'action sociale
type: ConceptReFip
type: Concept
alternative label: CIAS
broader: refip-REFIP821
definition: Etablissement public administratif intercommunal ayant pour rôle d'animer une action générale de prévention et de développement social au sein de l'intercommunalité.
in scheme: FINANCES PUBLIQUES
in scheme: Organisation Territoriale
in scheme: Structures Territoriales
in scheme: Administration de L'Etat
notation: REFIP2165

pièce budgétaire
type: ConceptReFip
type: Concept
broader: paiement de la dépense (non-descripteur)
definition: Pièce justificative des dépenses de l’État.
in scheme: FINANCES PUBLIQUES
in scheme: Dépenses publiques
in scheme: Gestion Publique
notation: REFIP2167

application ICAM
type: ConceptReFip
type: Concept
alternative label: ICAM
broader: applications fiscales (non-descripteur)
definition: Application Infocentre Amendes servant d'outil de pilotage de l'activité de gestion des amendes et condamnations pécuniaires.
in scheme: FINANCES PUBLIQUES
in scheme: Applications Informatiques
in scheme: Applications fiscales
notation: REFIP2168

taxe sur les boues d'épuration urbaines et industrielles
type: ConceptReFip
type: Concept
broader: refip-REFIP934
definition: Taxe s'appliquant à la production en France de boues d'épuration, urbaines ou industrielles, quelle que soit l'utilisation finale qui en sera faite : valorisation agricole par épandage, élimination par incinération ou par mise en décharge en tant que déchets ultimes, etc...Taxe supprimée à l'occasion de la Loi de finances 2017.
in scheme: FINANCES PUBLIQUES
in scheme: Fiscalité
in scheme: Impôt
notation: REFIP2170

rescrit valeur
type: ConceptReFip
type: Concept
alternative label: rescrit fiscal en matière de donation d'entreprise
broader: rescrit
definition: Dispositif permettant au dirigeant, soucieux de transmettre son entreprise, de faire valider par l'administration fiscale la valeur de son entreprise.
in scheme: FINANCES PUBLIQUES
in scheme: Droit de Reprise de l'Administration
in scheme: Fiscalité
notation: REFIP2171

commission départementale de conciliation
type: ConceptReFip
type: Concept
broader: structure locale (non-descripteur)
definition: Commission appelée à connaître des litiges pouvant survenir à l'occasion d'insuffisances de prix ou d'évaluation relevées en matière de droits d'enregistrement, de taxe de publicité foncière et d'impôt de solidarité sur la fortune. Il existe également une commission départementale de conciliation qui aide les bailleurs et les locataires à trouver des solutions amiables à leurs litiges.
in scheme: FINANCES PUBLIQUES
in scheme: Organisation Territoriale
in scheme: Structures Territoriales
in scheme: Administration de L'Etat
notation: REFIP2172

établissement d'hébergement pour personnes âgées dépendantes
type: ConceptReFip
type: Concept
alternative label: EHPAD
alternative label: maison de retraite privée
alternative label: maison de retraite publique
broader: structures territoriales (non-descripteur)
definition: Etablissement également connu sous la dénomination de "maison de retraite", dédié à l'accueil des personnes âgées de plus de 60 ans en situation de perte d'autonomie physique et/ou psychique et qui ne peuvent plus être maintenues à domicile.
in scheme: FINANCES PUBLIQUES
in scheme: Organisation Territoriale
in scheme: Structures Territoriales
in scheme: Administration de L'Etat
notation: REFIP2175

intranet
type: ConceptReFip
type: Concept
broader: internet
definition: Réseau télématique interne à une entreprise, mettant à la disposition du personnel et des partenaires d'une entreprise, les technologies d'échange d'informations issues d'Internet.
in scheme: FINANCES PUBLIQUES
in scheme: Communication
in scheme: Communication Documentation Informatique
notation: REFIP2178

société
type: ConceptReFip
type: Concept
broader: forme juridique
definition: Entité dotée de la personnalité juridique. Elle est créée dans un but marchand, à savoir, produire des biens ou des services pour le marché, qui peut être une source de profit ou d'autres gains financiers pour son ou ses propriétaires; elle est la propriété collective de ses actionnaires, qui ont le pouvoir de désigner les administrateurs responsables de sa direction générale. Les sociétés exercent leur activité sous de nombreuses formes juridiques.
in scheme: FINANCES PUBLIQUES
in scheme: Société
in scheme: Entreprises
in scheme: Forme juridique
narrower: entité sans personnalité morale
narrower: société étrangère
narrower: société commerciale
narrower: société concessionnaire
narrower: société civile
narrower: refip-REFIP707
notation: REFIP2179

prix de transfert
type: ConceptReFip
type: Concept
broader: fiscalité des professionnels
definition: Prix pratiqué à l'intérieur de groupes multinationaux lors des transactions portant sur des marchandises, des transferts de techniques et de marques, des prestations de services et des opérations financières, ce qui implique des entreprises associées situées au sein d'Etats différents.
in scheme: FINANCES PUBLIQUES
in scheme: Champ d'Application
in scheme: Fiscalité
notation: REFIP2180

compte général (supprimé)
type: ConceptReFip
type: Concept
broader: ZZ
in scheme: FINANCES PUBLIQUES
notation: REFIP2181

aéronautique
type: ConceptReFip
type: Concept
alternative label: aérospatiale
alternative label: industrie aéronautique
broader: industrie
definition: Secteur secondaire d'activité économique issu de la science de la navigation aérienne et de la technique des avions et des engins aériens.
in scheme: FINANCES PUBLIQUES
in scheme: Branche d'activité
in scheme: Questions Economiques
in scheme: Industrie
notation: REFIP2182

marché à tranches (obsolète)
type: ConceptReFip
type: Concept
is replaced by: refip-REFIP7149
broader: ZZ
in scheme: FINANCES PUBLIQUES
notation: REFIP2183

établissement public à caractère scientifique culturel et professionnel
type: ConceptReFip
type: Concept
alternative label: EPSCP
broader: établissement public national
definition: Un des statuts que peuvent choisir les établissements d'enseignement supérieur et de recherche. Les EPSCP assurent la recherche et l'enseignement supérieur et jouissent de la personnalité morale et de l'autorité pédagogique et scientifique et financière.
in scheme: FINANCES PUBLIQUES
in scheme: Organisation Structurelle de l'Etat
in scheme: Opérateur de l'Etat
in scheme: Administration de L'Etat
narrower: université
narrower: Ecole normale supérieure
notation: REFIP2185

service départemental d'incendie et de secours
type: ConceptReFip
type: Concept
alternative label: SDIS
broader: refip-REFIP973
definition: Établissement public à caractère administratif doté d’une assemblée délibérante gérant les sapeurs-pompiers au niveau du département. Le SDIS est soumis à une double autorité. La première est une autorité opérationnelle gérée par le préfet et le maire en collaboration dans leur pouvoir de police respectif. La seconde est une autorité administrative gérée par un conseil d’administration, le CASDIS, qui comprend des conseillers départementaux, des maires et des élus des EPCI.
in scheme: FINANCES PUBLIQUES
in scheme: Organisation Territoriale
in scheme: Structures Territoriales
in scheme: Administration de L'Etat
notation: REFIP2187

aide juridictionnelle
type: ConceptReFip
type: Concept
alternative label: aide judiciaire
alternative label: aide juridique
broader: principes généraux (non-descripteur)
definition: Aide financière accordée par l'Etat destinée au plaideur dont les ressources ne dépassent pas une certaine somme, Elle lui permet de bénéficier totalement ou partiellement du concours gratuit d'un avocat, ainsi que de la dispense du paiement, de l'avance ou de la consignation des frais afférents aux instances, procédures ou actes pour lesquels elle a été accordée.
in scheme: FINANCES PUBLIQUES
in scheme: Principes Généraux
in scheme: Droit et Justice
in scheme: Procédure
notation: REFIP2188

Lituanie
type: ConceptReFip
type: Concept
alternative label: République de Lituanie
broader: Europe
definition: Pays
in scheme: FINANCES PUBLIQUES
in scheme: Géographie
in scheme: Europe
notation: REFIP2189

cession amiable
type: ConceptReFip
type: Concept
broader: affectation de biens
definition: Procédure de cession amiable avec appel à la concurrence permetant à l'Etat de susciter des offres d'achat pour un immeuble déterminé sans être contraint dès le départ à s'engager sur une offre ferme de mise à prix. Elle permet aussi à l'Etat de conserver, s'il l'estime conforme à ses intérêts (financiers ou autres) la possibilité de ne pas donner suite aux propositions formulées.
in scheme: FINANCES PUBLIQUES
in scheme: Domaine
in scheme: Gestion Publique
notation: REFIP219

régime simplifié de l'agriculture
type: ConceptReFip
type: Concept
broader: régime de la taxe sur la valeur ajoutée agricole
definition: Régime fiscal de TVA pour les exploitants agricoles assujettis dont le chiffre d'affaires calculé sur 2 années civiles consécutives selon certaines modalités, dépasse un certain montant.
in scheme: FINANCES PUBLIQUES
in scheme: Régime d'Imposition
in scheme: Fiscalité
notation: REFIP2190

enregistrement d'acte
type: ConceptReFip
type: Concept
broader: fiscalité du patrimoine
definition: Formalité accomplie à l'occasion de certains actes ou événements juridiques par l'administration fiscale qui à cette occasion, liquide et perçoit les droits d'enregistrements.
in scheme: FINANCES PUBLIQUES
in scheme: Champ d'Application
in scheme: Fiscalité
notation: REFIP2191

services techniques
type: ConceptReFip
type: Concept
broader: direction départementale des finances publiques
definition: Services techniques présents dans les DDFIP et qui assurent des missions dévolues aux personnels des filières techniques.
in scheme: FINANCES PUBLIQUES
in scheme: Organisation Structurelle de l'Etat
in scheme: Ministère
in scheme: Administration de L'Etat
notation: REFIP2192

clauses sociales et environnementales
type: ConceptReFip
type: Concept
broader: contrat administratif
definition: Les conditions d'exécution d'un marché ou d'un accord-cadre peuvent comporter des éléments à caractère social ou environnemental qui prennent en compte les objectifs de développement durable, en conciliant développement économique, protection et mise en valeur de l'environnement, ainsi que le progrès social.
in scheme: FINANCES PUBLIQUES
in scheme: Droit et Justice
in scheme: Divisions du Droit
in scheme: Droit Privé
notation: REFIP2193
scope note: Concerne les marchés publics

contrôle des entrepôts fiscaux
type: ConceptReFip
type: Concept
broader: droit de contrôle de l'administration (non-descripteur)
definition: Contrôle des activités et des opérations qui bénéficient du régime de l’entrepôt fiscal.
in scheme: FINANCES PUBLIQUES
in scheme: Droit de Contrôle de l'Administration
in scheme: Fiscalité
notation: REFIP2195

réseau d'alerte
type: ConceptReFip
type: Concept
broader: finances locales (non-descripteur)
definition: Instrument strictement interne à l'administration, destiné à améliorer la prévention des difficultés financières des collectivités locales et des groupements à fiscalité propre (GFP). Il concerne le bloc communal et selon des modalités spécifiques, les départements et les régions.
in scheme: FINANCES PUBLIQUES
in scheme: Secteur public local
in scheme: Gestion Publique
notation: REFIP2196

régulation budgétaire
type: ConceptReFip
type: Concept
broader: exécution du budget
definition: Ensemble de techniques d'ajustement des dépenses qui permettent au gouvernement de maîtriser l'évolution des finances de l'Etat en cours d'année.
in scheme: FINANCES PUBLIQUES
in scheme: Exécution du budget
in scheme: Budget
notation: REFIP2197

moteur de recherche
type: ConceptReFip
type: Concept
broader: internet
definition: Système d'exploitation de banque de données, et, par extension, serveur spécialisé permettant d'accéder sur un réseau informatique à des ressources et des données à partir de mots clés.
in scheme: FINANCES PUBLIQUES
in scheme: Communication
in scheme: Communication Documentation Informatique
notation: REFIP2199
related: restitution de l'information

application DFT-NET
type: ConceptReFip
type: Concept
alternative label: DFT-NET
broader: applications gestion publique (non-descripteur)
definition: Application internet de consultation des comptes de dépôts de fonds.
in scheme: FINANCES PUBLIQUES
in scheme: Applications Informatiques
in scheme: Applications gestion publique
notation: REFIP22

Nord
type: ConceptReFip
type: Concept
broader: refip-REFIP7010
definition: Département français
in scheme: FINANCES PUBLIQUES
in scheme: Géographie
in scheme: Europe
notation: REFIP220
scope note: Département

rôle supplémentaire
type: ConceptReFip
type: Concept
broader: rôle d'imposition
definition: Rôle qui ne concerne que l'imposition particulière d'un contribuable faisant suite, par exemple, à une rectification pour insuffisance de base déclarée.
in scheme: FINANCES PUBLIQUES
in scheme: Documentation Fiscale
in scheme: Fiscalité
notation: REFIP2200

escroquerie
type: ConceptReFip
type: Concept
broader: délit
definition: Délit consistant à l’usage d’un faux nom ou d’une fausse qualité, soit par l’abus d’une qualité vraie, soit par l’emploi de manœuvres frauduleuses, de tromper une personne physique ou morale et de la déterminer ainsi, à son préjudice ou au préjudice d’un tiers, à remettre des fonds, des valeurs ou un bien quelconque, à fournir un service ou à consentir un acte opérant obligation ou décharge.
in scheme: FINANCES PUBLIQUES
in scheme: Droit et Justice
in scheme: Infractions et Sanctions
in scheme: Infraction
notation: REFIP2201

ayant droit
type: ConceptReFip
type: Concept
broader: droit civil
definition: Personne titulaire d'un droit.
in scheme: FINANCES PUBLIQUES
in scheme: Droit et Justice
in scheme: Divisions du Droit
in scheme: Droit Privé
notation: REFIP2202

dotation de solidarité communautaire
type: ConceptReFip
type: Concept
broader: dotation
definition: Versement effectué par les EPCI à taxe professionnelle unique (TPU) au profit de leurs communes membres, en plus de l'attribution de compensation. Elle est assise sur le recours à deux types de critères : la péréquation sociale et la compensation économique.
in scheme: FINANCES PUBLIQUES
in scheme: Dépenses publiques
in scheme: Gestion Publique
notation: REFIP2203

droit public
type: ConceptReFip
type: Concept
broader: refip-REFIP7002
definition: Ensemble des règles organisant l'État et ses démembrements, et régissant les rapports entre la puissance publique et les particuliers.
in scheme: FINANCES PUBLIQUES
in scheme: Droit et Justice
in scheme: Divisions du Droit
in scheme: Droit Public
narrower: droit administratif
narrower: droit pénal
narrower: droit constitutionnel
narrower: droit budgétaire
notation: REFIP2204

affiliation
type: ConceptReFip
type: Concept
broader: droit social
definition: Situation de droit qui consacre le rattachement d'un assuré social à une caisse déterminée. Le critère d'affiliation est, en principe, le lieu de résidence habituelle de l'assuré, cependant le lieu de travail reste utilisé pour certaines professions (relève du Code de la Sécurité sociale).
in scheme: FINANCES PUBLIQUES
in scheme: Droit et Justice
in scheme: Divisions du Droit
in scheme: Droit Privé
notation: REFIP2205

Autorité qualifiée à la sécurité des systèmes d'information
type: ConceptReFip
type: Concept
alternative label: AQSSI
broader: structure rattachée au Premier Ministre (non-descripteur)
definition: Autorité responsable de la sécurité des systèmes d'information dans les administrations centrales et les services déconcentrés de l'État, ainsi que dans les établissements publics et dans les organismes et opérateurs ayant conclu avec l'administration des marchés ou des contrats.
in scheme: FINANCES PUBLIQUES
in scheme: Organisation Structurelle de l'Etat
in scheme: Ministère
in scheme: Administration de L'Etat
notation: REFIP2206

centre de documentation
type: ConceptReFip
type: Concept
broader: documentation
definition: Structure chargée de mettre ses documents et sa capacité d'information à la disposition d'un public.
in scheme: FINANCES PUBLIQUES
in scheme: Documentation
in scheme: Communication Documentation Informatique
narrower: consultation sur place
narrower: bibliothèque
notation: REFIP2208

droit européen
type: ConceptReFip
type: Concept
alternative label: droit communautaire
alternative label: droit de l'union européenne
broader: refip-REFIP7002
definition: Droit constitué de traités, tels que modifiés au fil des années (le droit primaire), des actes pris par le Conseil, le Parlement ou la Commission (droit dérivé : règlements, directives, décisions, avis et recommandations) et du droit issu des accords externes conclu avec des États ou des organisations tiers. Complété par des accords inter étatiques et par la jurisprudence de la Cour de Justice.
in scheme: FINANCES PUBLIQUES
in scheme: Droit et Justice
in scheme: Divisions du Droit
in scheme: Droit Européen
narrower: procédure d'insolvabilité
narrower: libre circulation des biens et des personnes
narrower: procédure européenne d'injonction de payer
notation: REFIP2209

vente en consignation
type: ConceptReFip
type: Concept
broader: vente
definition: Type de vente courante à l'exportation. Le dépositaire remet au consignataire (souvent un grossiste) des marchandises à garder, et celui-ci se réserve généralement le droit de les vendre et d'en rembourser la valeur au dépositaire.
in scheme: FINANCES PUBLIQUES
in scheme: Droit et Justice
in scheme: Divisions du Droit
in scheme: Droit Privé
notation: REFIP221

application ACCORD
type: ConceptReFip
type: Concept
broader: applications gestion publique (non-descripteur)
definition: Application interministérielle de gestion de la dépense des administrations centrales.
in scheme: FINANCES PUBLIQUES
in scheme: Applications Informatiques
in scheme: Applications gestion publique
notation: REFIP2212
related: système d'information financière de l'Etat

sursis de versement
type: ConceptReFip
type: Concept
broader: refip-REFIP7041
definition: Demande de suspension du versement des sommes réclamées au comptable public, dont la responsabilité pécuniaire est mise en jeu par le juge des comptes ou par le ministre, à compter de la notification de l'ordre de versement ou du jugement, adressée au ministre chargé du budget.
in scheme: FINANCES PUBLIQUES
in scheme: Responsabilité des comptables
in scheme: Missions Transverses des Finances publiques
notation: REFIP2213

pension alimentaire
type: ConceptReFip
type: Concept
alternative label: créance alimentaire
broader: obligation alimentaire
definition: Somme d'argent versée par une personne à une autre en exécution d'une obligation alimentaire. Elle se distingue de la prestation compensatoire qui vise à compenser les disparités de niveaux de vie des époux engendrées par le divorce.
in scheme: FINANCES PUBLIQUES
in scheme: Droit et Justice
in scheme: Divisions du Droit
in scheme: Droit Privé
notation: REFIP2214

application TOPAD2
type: ConceptReFip
type: Concept
alternative label: TOPAD2
broader: applications fiscales (non-descripteur)
definition: Référentiel des constantes topographiques et administratives.
in scheme: FINANCES PUBLIQUES
in scheme: Applications Informatiques
in scheme: Applications fiscales
notation: REFIP2215

amendes.gouv
type: ConceptReFip
type: Concept
broader: applications fiscales (non-descripteur)
definition: Site internet sécurisé permettant le télé-paiement des amendes routières.
in scheme: FINANCES PUBLIQUES
in scheme: Applications Informatiques
in scheme: Applications fiscales
notation: REFIP2217

comptabilité M 31
type: ConceptReFip
type: Concept
broader: comptabilité publique locale
definition: Instruction comptable M31 applicable aux offices publics de l'habitat à comptabilité publique.
in scheme: FINANCES PUBLIQUES
in scheme: Secteur public local
in scheme: Gestion Publique
notation: REFIP2218

propriété bâtie
type: ConceptReFip
type: Concept
alternative label: immeuble bâti
broader: cadastre
definition: Construction fixée au sol à perpétuelle demeure et présentant le caractère d'un véritable bâtiment.
in scheme: FINANCES PUBLIQUES
in scheme: Cadastre
in scheme: Fiscalité
notation: REFIP222

Code de justice administrative
type: ConceptReFip
type: Concept
broader: documentation juridique (non-descripteur)
definition: Ensemble des dispositions de droit français relatives à la justice administrative (Conseil d'État, Cours administratives d'appel, tribunaux administratifs, Tribunal des conflits).
in scheme: FINANCES PUBLIQUES
in scheme: Droit et Justice
in scheme: Documentation Juridique
in scheme: Sources du Droit
notation: REFIP2220

revenu agricole (supprimé)
type: ConceptReFip
type: Concept
in scheme: FINANCES PUBLIQUES
notation: REFIP2221

clôture des comptes
type: ConceptReFip
type: Concept
broader: fin de gestion
definition: Processus de clôture qui permet d'établir le bilan comptable, le compte de résultat, l'annexe et la liasse fiscale.
in scheme: FINANCES PUBLIQUES
in scheme: Procédures et Techniques Comptables
in scheme: Comptabilité
narrower: dossier de clôture
notation: REFIP2222
scope note: Comptabilité

mémoire
type: ConceptReFip
type: Concept
broader: document
definition: Document écrit concernant un sujet donné en s'appuyant logiquement sur une série de faits pour en arriver à une recommandation ou une conclusion.
in scheme: FINANCES PUBLIQUES
in scheme: Documentation
in scheme: Communication Documentation Informatique
notation: REFIP2223

taux réduit
type: ConceptReFip
type: Concept
broader: taux d'imposition
definition: Taux inférieur au taux de référence dans certaines conditions pour certains impôts.
in scheme: FINANCES PUBLIQUES
in scheme: Liquidation de l'Impôt
in scheme: Fiscalité
notation: REFIP2224

capital appelé
type: ConceptReFip
type: Concept
alternative label: capital libéré
broader: refip-REFIP998
definition: Partie du capital souscrit dont la société a demandé la libération à ses associés.
in scheme: FINANCES PUBLIQUES
in scheme: Gestion de l'Entreprise
in scheme: Entreprises
in scheme: Vie et Gestion de l'entreprise
notation: REFIP2225

coexploitant
type: ConceptReFip
type: Concept
broader: droit commercial
definition: Statut de personnes qui exploitent en commun, avec relations égalitaires une activité indépendante.
in scheme: FINANCES PUBLIQUES
in scheme: Droit et Justice
in scheme: Divisions du Droit
in scheme: Droit Privé
notation: REFIP2227

Code général des collectivités territoriales
type: ConceptReFip
type: Concept
alternative label: CGCT
broader: documentation juridique (non-descripteur)
definition: Ensemble des lois relatives au droit général des collectivités territoriales français. Ce code organise la répartition des compétences sur le principe de la décentralisation et de la libre administration. Le CGCT traite des biens des collectivités territoriales, des relations avec l'État, des services publiques locaux et de l’organisation de chaque collectivité, avec parfois des dispositions spécifiques à une région ou un territoire.
in scheme: FINANCES PUBLIQUES
in scheme: Droit et Justice
in scheme: Documentation Juridique
in scheme: Sources du Droit
notation: REFIP2229

prélèvements sociaux
type: ConceptReFip
type: Concept
broader: impôt direct
definition: Prélèvements destinés à financer le système de protection sociale.
in scheme: FINANCES PUBLIQUES
in scheme: Fiscalité
in scheme: Impôt
narrower: contribution sociale généralisée
narrower: contribution pour le remboursement de la dette sociale
narrower: refip-REFIP7174
notation: REFIP2230

dotation de développement urbain
type: ConceptReFip
type: Concept
broader: dotation
definition: Dotation attribuée aux communes éligibles par le représentant de l’État en fonction des projets d’investissement ou de fonctionnement dans le domaine économique ou social ou en rénovation urbaine.
in scheme: FINANCES PUBLIQUES
in scheme: Dépenses publiques
in scheme: Gestion Publique
notation: REFIP2231

intempéries
type: ConceptReFip
type: Concept
alternative label: gel
alternative label: gelée
alternative label: givre
alternative label: grêle
alternative label: neige
alternative label: orage
alternative label: pluie
broader: dégradation de l'environnement
definition: Phénomène atmosphérique naturel, comme la pluie, la neige, la grêle, ou encore le vent, qui perturbe les activités humaines.
in scheme: FINANCES PUBLIQUES
in scheme: Environnement
in scheme: Dégradation de l'Environnement
in scheme: Questions de Société
notation: REFIP2232
related: calamité agricole
related: catastrophe naturelle
related: refip-REFIP6861

délai
type: ConceptReFip
type: Concept
broader: mots outils (liste additive)
definition: Temps laissé pour faire quelque chose, pour l'obtenir.
in scheme: FINANCES PUBLIQUES
in scheme: Mots Outils
notation: REFIP2233

protection de l'environnement
type: ConceptReFip
type: Concept
broader: environnement (non-descripteur)
definition: Dispositifs et politiques visant à la protection de l’atmosphère et des ressources naturelles par la lutte contre la pollution, l’élimination des déchets, le maintien de la qualité de l’air, la maîtrise de l’énergie.
in scheme: FINANCES PUBLIQUES
in scheme: Environnement
in scheme: Protection de l'Environnement
in scheme: Questions de Société
narrower: assainissement
narrower: écoconditionnalité
narrower: économie d'énergie
narrower: installation classée
narrower: refip-REFIP6757
notation: REFIP2234
related: refip-REFIP986

contrat de plan (obsolète)
type: ConceptReFip
type: Concept
is replaced by: contrat de projets Etat-région
broader: ZZ
in scheme: FINANCES PUBLIQUES
notation: REFIP2235

conjoint survivant
type: ConceptReFip
type: Concept
broader: droit successoral
definition: L'époux qui survit à l'autre. Il a des droits dans la succession, des droits de jouissance quand à l'habitation principale et aux meubles qu'il contient.
in scheme: FINANCES PUBLIQUES
in scheme: Droit et Justice
in scheme: Divisions du Droit
in scheme: Droit Privé
notation: REFIP2238

exemplaire unique
type: ConceptReFip
type: Concept
broader: attribution de marché public
definition: Copie certifiée conforme du marché public revêtue de la mention d’exemplaire unique signée par l’autorité contractante.
in scheme: FINANCES PUBLIQUES
in scheme: Commande publique
in scheme: Gestion Publique
notation: REFIP2240

service du domaine
type: ConceptReFip
type: Concept
broader: direction départementale des finances publiques
definition: Service chargé de la gestion domaniale au sein des directions départementales des finances publiques.
in scheme: FINANCES PUBLIQUES
in scheme: Organisation Structurelle de l'Etat
in scheme: Ministère
in scheme: Administration de L'Etat
notation: REFIP2241

droit de passage
type: ConceptReFip
type: Concept
alternative label: servitude de passage
broader: servitude
definition: Droit accordé par la loi au propriétaire d'un fonds enclavé (dit fonds dominant) de passer sur la propriété du fonds servant pour accéder à sa propriété,
in scheme: FINANCES PUBLIQUES
in scheme: Droit et Justice
in scheme: Divisions du Droit
in scheme: Droit Privé
notation: REFIP2242

plus-value mobilière
type: ConceptReFip
type: Concept
broader: revenu catégoriel
definition: Plus-value réalisée sur les cessions de titres, valeurs mobilières et droits sociaux.
in scheme: FINANCES PUBLIQUES
in scheme: Champ d'Application
in scheme: Fiscalité
notation: REFIP2243

permis de conduire
type: ConceptReFip
type: Concept
broader: document administratif
definition: Document délivré suite à l'autorisation administrative de circuler sur les voies ouvertes ou non à la circulation publique. Son obtention est soumise notamment à des conditions d'âge, de formation et de réussite à un examen.
in scheme: FINANCES PUBLIQUES
in scheme: Documentation
in scheme: Communication Documentation Informatique
notation: REFIP2244

abandon de créance
type: ConceptReFip
type: Concept
broader: recouvrement
definition: Renonciation à exercer les droits conférés par l'existence d'une créance.
in scheme: FINANCES PUBLIQUES
in scheme: Recouvrement
in scheme: Fiscalité
notation: REFIP2245

chapitre budgétaire
type: ConceptReFip
type: Concept
broader: exécution du budget
definition: Ancienne répartition des crédits du budget général de l’État.
in scheme: FINANCES PUBLIQUES
in scheme: Exécution du budget
in scheme: Budget
narrower: Fonds national de l'emploi
notation: REFIP2246

immeuble type
type: ConceptReFip
type: Concept
alternative label: immeuble de référence
alternative label: local de référence
alternative label: local type
broader: cadastre
definition: Immeuble de référence servant de base à la détermination des valeurs locatives, par comparaison.
in scheme: FINANCES PUBLIQUES
in scheme: Cadastre
in scheme: Fiscalité
notation: REFIP2248

droit à l'information
type: ConceptReFip
type: Concept
broader: droit civil
definition: Liberté d'accès aux documents administratifs au sens large ou obligation d'information en droit privé.
in scheme: FINANCES PUBLIQUES
in scheme: Droit et Justice
in scheme: Divisions du Droit
in scheme: Droit Privé
notation: REFIP2249
related: accès aux documents administratifs
related: refip-REFIP852

hiérarchie des normes
type: ConceptReFip
type: Concept
alternative label: normes juridiques
broader: législation
definition: Classement hiérarchisé de l’ensemble des normes constituant le système juridique d’un Etat de droit. En vertu du principe de légalité, chaque norme juridique doit se conformer à l'ensemble des règles en vigueur ayant une force supérieure dans la hiérarchie des normes, ou du moins être compatible avec ces normes.
in scheme: FINANCES PUBLIQUES
in scheme: Droit et Justice
in scheme: Sources du Droit
in scheme: Sources du Droit Objectif
notation: REFIP225

service de la trésorerie aux armées
type: ConceptReFip
type: Concept
alternative label: bureau de liaison de la trésorerie aux armées
alternative label: paierie générale des armées
alternative label: trésorerie aux armées
broader: refip-REFIP7076
definition: Service qui assure, pour le soutien des forces armées à l'étranger ou, le cas échéant, intervenant sur le territoire national, des missions relatives au recouvrement de recettes publiques, au paiement de dépenses publiques, à la gestion de la trésorerie ainsi qu'à la gestion financière et comptable. Il est également chargé de percevoir des droits de chancellerie pour le compte du comptable public chargé des recettes de la grande chancellerie de la Légion d'honneur ; d'exécuter les recettes et les dépenses confiées par d'autres comptables publics et par les correspondants du Trésor ; d'exercer, pour les armées en opération, les compétences attribuées en matière domaniale au directeur départemental des finances publiques dans les conditions prévues par le code général de la propriété des personnes publiques ; Des opérations d'appropriation des biens des forces ennemies ; des opérations d'appropriation des biens des forces ennemies ; De la comptabilité et du paiement des traites de la marine.
in scheme: FINANCES PUBLIQUES
in scheme: Organisation Structurelle de l'Etat
in scheme: Ministère
in scheme: Administration de L'Etat
notation: REFIP2250

classement des postes comptables
type: ConceptReFip
type: Concept
broader: pilotage
definition: Technique de mesure qui permet de comparer les postes comptables entre eux en fonction de leurs charges et enjeux dans le but de déterminer le niveau d'encadrement du responsable de chaque poste.
in scheme: FINANCES PUBLIQUES
in scheme: Missions Transverses des Finances publiques
in scheme: Pilotage
notation: REFIP2252

traducteur-interprète
type: ConceptReFip
type: Concept
alternative label: interprète
broader: langue étrangère
definition: Individu qui transpose un texte dans une autre langue, ou traduit verbalement des propos tenus par un orateur.
in scheme: FINANCES PUBLIQUES
in scheme: Communication
in scheme: Communication Documentation Informatique
notation: REFIP2253

évaluation
type: ConceptReFip
type: Concept
alternative label: estimation
broader: mots outils (liste additive)
definition: Action d'évaluer, de déterminer la valeur de quelque chose.
in scheme: FINANCES PUBLIQUES
in scheme: Mots Outils
notation: REFIP2254

réparations locatives
type: ConceptReFip
type: Concept
broader: frais déductibles
definition: Travaux d’entretien courant et menues réparations, y compris des remplacements d’éléments assimilables aux dites réparations, consécutifs à l’usage normal des locaux et équipements à usage privatif.
in scheme: FINANCES PUBLIQUES
in scheme: Liquidation de l'Impôt
in scheme: Fiscalité
notation: REFIP2255

domaine public maritime
type: ConceptReFip
type: Concept
broader: domaine public
definition: Ensemble du domaine public maritime naturel (constitué du sol et du sous-sol de la mer, des étangs salés en communication directe, naturelle et permanente avec la mer, des lais (parcelles dont la mer s’est définitivement retirée) et relais (dépôts alluvionnaires) de la mer, des parties non aliénées de la zone dite de cinquante pas géométriques dans les départements d’outre-mer, depuis le loi du 3 janvier 1986 dite « loi littoral ») et du domaine public maritime artificiel (composé des équipements et installation portuaires, ainsi que les ouvrages et installations relatifs à la sécurité et la facilité de la navigation maritime).
in scheme: FINANCES PUBLIQUES
in scheme: Domaine
in scheme: Gestion Publique
notation: REFIP2257
related: transport maritime

Centre national pour le développement du sport
type: ConceptReFip
type: Concept
broader: établissement public à caractère administratif
definition: Etablissement public administratif ayant pour missions notamment de soutenir le développement de la pratique sportive par tous les publics, de contribuer à l’aménagement du territoire, de soutenir les grands événements sportifs internationaux se déroulant en France.
in scheme: FINANCES PUBLIQUES
in scheme: Organisation Structurelle de l'Etat
in scheme: Opérateur de l'Etat
in scheme: Administration de L'Etat
notation: REFIP2258

balance comptable mensuelle
type: ConceptReFip
type: Concept
alternative label: balance mensuelle
broader: balance comptable
definition: État mensuel, établi à partir de la liste de tous les comptes du grand livre et regroupant tous les totaux en débit et crédit et tous les soldes débiteurs et créditeurs.
in scheme: FINANCES PUBLIQUES
in scheme: Documents comptables
in scheme: Comptabilité
notation: REFIP2259

Fonds d'investissement des départements d'outre mer
type: ConceptReFip
type: Concept
alternative label: FIDOM
broader: Agence française de développement
definition: Fonds d'intervention ayant pour missions de concourir, par l’octroi d’aides et de subventions, d'une part, au développement économique et, d'autre part, à l'aménagement du territoire des départements d'outre-mer. Il s'inscrit dans le cadre plus large de la politique d'investissement outre-mer en appuyant des programmes d'investissement ou en agissant en complémentarité avec d'autres départements ministériels.
in scheme: FINANCES PUBLIQUES
in scheme: Organisation Structurelle de l'Etat
in scheme: Opérateur de l'Etat
in scheme: Administration de L'Etat
notation: REFIP226

Commission nationale de l'informatique et des libertés
type: ConceptReFip
type: Concept
alternative label: CNIL
broader: autorité administrative indépendante
definition: Autorité administrative indépendante, la CNIL a pour mission générale de veiller à ce que l’informatique ne porte atteinte ni au droits de l’homme, ni à la vie privée, ni aux libertés individuelles ou publiques. Dans ce cadre, elle peut proposer au gouvernement des mesures législatives ou réglementaires pour adapter la protection des personnes à l’évolution des techniques, elle est obligatoirement consultée pour tous les projets de loi créant un traitement automatisé de données nominatives (son avis n’est que consultatif).
in scheme: FINANCES PUBLIQUES
in scheme: Organisation Structurelle de l'Etat
in scheme: Autorité Administrative
in scheme: Administration de L'Etat
notation: REFIP2260

services déconcentrés des administrations civiles de l'Etat
type: ConceptReFip
type: Concept
broader: ministère
definition: Service assurant le relais, sur le plan local, des décisions prises par l’administration centrale et gérant les services de l’État au niveau local.
in scheme: FINANCES PUBLIQUES
in scheme: Organisation Structurelle de l'Etat
in scheme: Ministère
in scheme: Administration de L'Etat
notation: REFIP2261

congé individuel de formation
type: ConceptReFip
type: Concept
alternative label: CIF
broader: formation en milieu professionnel
definition: Dispositif permettant au salarié de s'absenter de son poste afin de suivre une formation pour se qualifier, évoluer ou se reconvertir. La formation suivie dans le cadre du CIF doit permettre d'accéder à un niveau de qualification supérieure; de changer de profession ou de secteur d'activité; d'enrichir ses connaissances dans le domaine culturel et social, de se préparer à l'exercice de responsabilités associatives bénévoles; ou de préparer un examen pour l’obtention d'un titre ou diplôme à finalité professionnelle enregistré dans le répertoire national des certifications professionnelles.
in scheme: FINANCES PUBLIQUES
in scheme: Entreprises
in scheme: Travail
in scheme: 212619
notation: REFIP2262

entreprise en difficulté
type: ConceptReFip
type: Concept
broader: vie de l'entreprise (non-descripteur)
definition: Entreprise qui a du mal à faire face à ses échéances financières, ou dont les perspectives de développement sont incertaines.
in scheme: FINANCES PUBLIQUES
in scheme: Vie de l'Entreprise
in scheme: Entreprises
in scheme: Vie et Gestion de l'entreprise
narrower: procédure collective
narrower: plan de sauvegarde de l'emploi
narrower: faillite personnelle
narrower: plan de restructuration
narrower: insuffisance d'actif
notation: REFIP2263
related: chômage partiel

outil de suivi des fluides
type: ConceptReFip
type: Concept
alternative label: OSF
broader: applications missions transverses (non-descripteur)
definition: Outil de suivi des consommations et des facturations de fluides par bâtiment et aide à la décision d'investissements immobiliers afin d'inscrire l'Etat dans une démarche d'exemplarité au regard du développement durable dans le fonctionnement de ses services.
in scheme: FINANCES PUBLIQUES
in scheme: Applications missions transverses
in scheme: Applications Informatiques
notation: REFIP2264

pénalité de retard
type: ConceptReFip
type: Concept
broader: sanction financière
definition: Compensation financière sanctionnant le non-respect d'un délai de paiement ou le retard dans l'exécution d'une prestation.
in scheme: FINANCES PUBLIQUES
in scheme: Droit et Justice
in scheme: Sanction
in scheme: Infractions et Sanctions
narrower: intérêts moratoires
narrower: intérêts de retard
notation: REFIP2265

année civile
type: ConceptReFip
type: Concept
broader: mots outils (liste additive)
definition: Année qui commence le 1er janvier et se termine le 31 décembre et compte pour 365 jours.
in scheme: FINANCES PUBLIQUES
in scheme: Mots Outils
notation: REFIP2266

certificat de propriété
type: ConceptReFip
type: Concept
broader: droit successoral
definition: Acte par lequel un officier public atteste l'existence d'un droit de propriété sur un bien.
in scheme: FINANCES PUBLIQUES
in scheme: Droit et Justice
in scheme: Divisions du Droit
in scheme: Droit Privé
notation: REFIP2268

budget primitif
type: ConceptReFip
type: Concept
broader: finances locales (non-descripteur)
definition: Budget voté par l'assemblée locale en début d'exercice. Il fixe les enveloppes de crédits permettant d'engager les dépenses pendant la durée de l'exercice. Il détermine aussi les recettes attendues, notamment en matière de fiscalité.
in scheme: FINANCES PUBLIQUES
in scheme: Secteur public local
in scheme: Gestion Publique
notation: REFIP2269

droit pénal
type: ConceptReFip
type: Concept
broader: droit public
definition: Ensemble des règles de droit ayant pour objet la définition des infractions ainsi que des sanctions qui leur sont applicables. On parle encore de droit criminel.
in scheme: FINANCES PUBLIQUES
in scheme: Droit et Justice
in scheme: Divisions du Droit
in scheme: Droit Public
narrower: amnistie
narrower: casier judiciaire
narrower: responsabilité pénale
narrower: immunité
notation: REFIP227

agrégation territorialisée des comptes
type: ConceptReFip
type: Concept
alternative label: agrégation territorialisée
alternative label: agrégation territorialisée des données financières et comptables
broader: agrégation des comptes
definition: Technique comptable qui vise à regrouper certaines données comptables et financières correspondant à plusieurs niveaux de structures territoriales déduction faite des opérations réciproques et sans définir d'entité consolidante.
in scheme: FINANCES PUBLIQUES
in scheme: Procédures et Techniques Comptables
in scheme: Comptabilité
notation: REFIP2270

énergie nucléaire
type: ConceptReFip
type: Concept
alternative label: nucléaire
broader: énergie
definition: Énergie libérée lors des réactions de fission ou de fusion du noyau atomique et produite par les réacteurs des centrales nucléaires.
in scheme: FINANCES PUBLIQUES
in scheme: Branche d'activité
in scheme: Questions Economiques
in scheme: Industrie
notation: REFIP2271

la Dominique
type: ConceptReFip
type: Concept
alternative label: Dominique
broader: Caraïbes
definition: Pays
in scheme: FINANCES PUBLIQUES
in scheme: Géographie
in scheme: Amérique
notation: REFIP2272

application ETR
type: ConceptReFip
type: Concept
broader: applications missions transverses (non-descripteur)
definition: Application permettant le paiement des traitements, salaires, et accessoires aux fonctionnaires et agents de budgets civils et militaires de l'État à l'Étranger.
in scheme: FINANCES PUBLIQUES
in scheme: Applications missions transverses
in scheme: Applications Informatiques
notation: REFIP2273

Direction des vérifications nationales et internationales
type: ConceptReFip
type: Concept
alternative label: DVNI
broader: service à compétence nationale
definition: Service à compétence nationale de la DGFIP chargé de réaliser le contrôle fiscal des très grandes entreprises. La direction comporte des brigades de vérification générale (BVG) ainsi que des brigades de vérification des comptabilités informatisées (BVCI).
in scheme: FINANCES PUBLIQUES
in scheme: Organisation Structurelle de l'Etat
in scheme: Ministère
in scheme: Administration de L'Etat
notation: REFIP2274

Conseil supérieur de la fonction publique de l'Etat
type: ConceptReFip
type: Concept
broader: organisme consultatif et représentatif (non-descripteur)
definition: Conseil consulté sur toutes les questions d'ordre général concernant la fonction publique de l'État. Il est l'organe supérieur de recours en matière disciplinaire. Il émet des avis ou des recommandations.
in scheme: FINANCES PUBLIQUES
in scheme: Organisation Structurelle de l'Etat
in scheme: Organisme Consultatif et Représentatif
in scheme: Administration de L'Etat
notation: REFIP2278
related: refip-REFIP6578

organisation d'achats
type: ConceptReFip
type: Concept
broader: CHORUS (non-descripteur)
definition: Structure organisationnelle de référence pour les achats au sein d'un ministère et le circuit de validation des engagements juridiques.
in scheme: FINANCES PUBLIQUES
in scheme: Comptabilité publique
in scheme: Comptabilité
notation: REFIP2280

brigade régionale foncière
type: ConceptReFip
type: Concept
alternative label: BRF
alternative label: brigade nationale foncière
broader: direction régionale des finances publiques
definition: Structure rattachée à une Direction régionale des finances publiques se composant de géomètre, d'aide géomètre et d'agent administratif placés sous la responsabilité d'un inspecteur du cadastre. Elle est en charge de l'exécution des opérations à caractère technique telles que les grands chantiers de remaniement et de géoréférencement des plans cadastraux.
in scheme: FINANCES PUBLIQUES
in scheme: Organisation Structurelle de l'Etat
in scheme: Ministère
in scheme: Administration de L'Etat
notation: REFIP2281

viande
type: ConceptReFip
type: Concept
broader: denrée alimentaire
definition: Chair des animaux destinée à la consommation.
in scheme: FINANCES PUBLIQUES
in scheme: Branche d'activité
in scheme: Questions Economiques
in scheme: Industrie
notation: REFIP2282

application BNDP
type: ConceptReFip
type: Concept
alternative label: BNDP
alternative label: base nationale des données patrimoniales
broader: applications fiscales (non-descripteur)
definition: Application permettant la consultation des informations patrimoniales dématérialisées du dossier fiscal de chaque contribuable.
in scheme: FINANCES PUBLIQUES
in scheme: Applications Informatiques
in scheme: Applications fiscales
notation: REFIP2285

acte spécial
type: ConceptReFip
type: Concept
broader: sources des droits subjectifs (non-descripteur)
definition: Acte signé des deux parties constatant l'acceptation du sous-traitant et l'agrément des conditions de paiement, dans la cadre de la sous traitance.
in scheme: FINANCES PUBLIQUES
in scheme: Droit et Justice
in scheme: Sources du Droit
in scheme: Sources des Droits Subjectifs
notation: REFIP2287

bien vacant et sans maître
type: ConceptReFip
type: Concept
alternative label: immeuble vacant
broader: immeuble
definition: Bien abandonné par son propriétaire et susceptible d'être acquis par un tiers par occupation.
in scheme: FINANCES PUBLIQUES
in scheme: Droit et Justice
in scheme: Divisions du Droit
in scheme: Droit Privé
notation: REFIP2288

budget opérationnel de programme
type: ConceptReFip
type: Concept
alternative label: BOP
broader: exécution du budget
definition: Document regroupant les crédits d’un programme mis à la disposition d’un responsable identifié pour un périmètre (une partie des actions du programme ) ou pour un territoire donnés. Le BOP a les mêmes attributs que le programme : c’est un ensemble globalisé de moyens associés à des objectifs mesurés par des indicateurs de résultats.
in scheme: FINANCES PUBLIQUES
in scheme: Exécution du budget
in scheme: Budget
narrower: refip-REFIP7022
notation: REFIP2289
related: refip-REFIP6729

application SCOUP
type: ConceptReFip
type: Concept
alternative label: SCOUP
broader: applications fiscales (non-descripteur)
definition: Application de gestion des courriels adressés aux usagers. Fermeture au 01/01/15.
in scheme: FINANCES PUBLIQUES
in scheme: Applications Informatiques
in scheme: Applications fiscales
notation: REFIP2291

infrastructure ferroviaire
type: ConceptReFip
type: Concept
alternative label: chemin de fer
alternative label: chemin de fer secondaire
alternative label: réseau ferroviaire
broader: refip-REFIP754
definition: Ensemble des installations permettant la circulation de trains (notamment les voies ferrées, caténaires, équipements de transport de l'énergie, système de signalisation ferroviaire, bâtiments, ouvrages d'art, système de communication radio sol-train et télécommunications).
in scheme: FINANCES PUBLIQUES
in scheme: Domaine
in scheme: Gestion Publique
notation: REFIP2294
related: transport ferroviaire

société publique locale
type: ConceptReFip
type: Concept
broader: société anonyme
definition: Société anonyme à la disposition des collectivités locales françaises pour la gestion de leurs services public. Cette société est compétente pour réaliser des opérations d’aménagement, des opérations de construction ou pour exploiter des services publics à caractère industriel et commercial ou toutes autres activités d’intérêt général.
in scheme: FINANCES PUBLIQUES
in scheme: Société
in scheme: Entreprises
in scheme: Forme juridique
notation: REFIP2295

Conseil supérieur de la fonction publique territoriale
type: ConceptReFip
type: Concept
broader: organisme consultatif et représentatif (non-descripteur)
definition: Instance de dialogue social de la fonction publique territoriale. Il examine les textes législatifs et réglementaires proposés par le Gouvernement en étroite collaboration avec la Direction générale des collectivités locales. Il dispose par ailleurs d'une compétence d'auto saisine. Il est paritairement composé de 20 élus locaux (40 suppléants) et 20 représentants des organisations syndicales (40 suppléants). Il est présidé par un élu local. Il est organisé en 5 formations spécialisées qui examinent et amendent les textes en vue de leur passage en séance plénière.
in scheme: FINANCES PUBLIQUES
in scheme: Organisation Structurelle de l'Etat
in scheme: Organisme Consultatif et Représentatif
in scheme: Administration de L'Etat
notation: REFIP2296

application ESCALE
type: ConceptReFip
type: Concept
alternative label: plateforme ESCALE
alternative label: échange de fichiers sécurisés
broader: applications missions transverses (non-descripteur)
definition: Interface permettant l'échange de documents volumineux sur une connexion sécurisée.
in scheme: FINANCES PUBLIQUES
in scheme: Applications missions transverses
in scheme: Applications Informatiques
notation: REFIP2297

industrie
type: ConceptReFip
type: Concept
broader: branche d'activité
definition: Activité économique combinant des facteurs de production (installations, approvisionnements, travail, savoir) pour produire des biens matériels destinés au marché.
in scheme: FINANCES PUBLIQUES
in scheme: Branche d'activité
in scheme: Questions Economiques
in scheme: Industrie
narrower: agroalimentaire
narrower: énergie
narrower: établissement industriel
narrower: ingénieur
narrower: aéronautique
narrower: recherche scientifique
narrower: matières premières
narrower: textile
narrower: refip-REFIP75
notation: REFIP230

cadeau
type: ConceptReFip
type: Concept
broader: fiscalité des professionnels
definition: Présent dont la qualification fiscale s'apprécie au cas par cas.
in scheme: FINANCES PUBLIQUES
in scheme: Champ d'Application
in scheme: Fiscalité
narrower: cadeau d'affaire
notation: REFIP2303

garantie d'emprunt
type: ConceptReFip
type: Concept
broader: garanties
definition: Engagement par lequel l'État va garantir au prêteur le remboursement du capital et des intérêts en cas de défaillance du débiteur. Cette garantie implicite est automatiquement accordée à tous les établissements publics, car l'État est indéfiniment responsable de leurs dettes.
in scheme: FINANCES PUBLIQUES
in scheme: Droit et Justice
in scheme: Divisions du Droit
in scheme: Droit Privé
notation: REFIP2304

service de consultation du plan cadastral
type: ConceptReFip
type: Concept
alternative label: SCPC
broader: applications fiscales (non-descripteur)
definition: Service Internet proposant aux usagers une consultation gratuite du plan cadastral sur tout le territoire national.
in scheme: FINANCES PUBLIQUES
in scheme: Applications Informatiques
in scheme: Applications fiscales
notation: REFIP2307

déclaration des non-résidents
type: ConceptReFip
type: Concept
broader: refip-REFIP804
definition: Déclaration de retenue à la source (imprimés 2494-SD et 2777-SD) sur certaines sommes payées par des débiteurs domiciliés en France à des personnes domiciliées hors de France.
in scheme: FINANCES PUBLIQUES
in scheme: Documentation Fiscale
in scheme: Fiscalité
notation: REFIP2308

logiciel d'initiative locale
type: ConceptReFip
type: Concept
broader: refip-REFIP98
definition: Logiciel développé en local, non labellisé par les services informatiques de la DGFiP.
in scheme: FINANCES PUBLIQUES
in scheme: Informatique
in scheme: Communication Documentation Informatique
notation: REFIP2309

budget annexe
type: ConceptReFip
type: Concept
broader: finances locales (non-descripteur)
definition: Budget établi pour certains services locaux spécialisés (eau, assainissement, etc), qui permet d'établir le coût réel d'un service et de déterminer avec précision le prix à payer par ses seuls utilisateurs pour équilibrer leurs comptes.
in scheme: FINANCES PUBLIQUES
in scheme: Secteur public local
in scheme: Gestion Publique
notation: REFIP2310

calamité agricole
type: ConceptReFip
type: Concept
alternative label: dégâts des cultures
alternative label: sécheresse
broader: agriculture
definition: Dommage non assurable, d'importance exceptionnelle, dû à des variations anormales d'intensité d'un agent naturel, lorsque les moyens techniques de lutte préventive ou curative employés habituellement dans l'agriculture se sont révélés insuffisants ou inopérants.
in scheme: FINANCES PUBLIQUES
in scheme: Branche d'activité
in scheme: Questions Economiques
in scheme: Agriculture
notation: REFIP2311
related: intempéries
related: catastrophe naturelle
related: refip-REFIP6861

caravane
type: ConceptReFip
type: Concept
alternative label: camping-car
broader: camping
definition: Type de remorque destiné à être habitée, de manière temporaire (pour du camping, par exemple) ou permanente.
in scheme: FINANCES PUBLIQUES
in scheme: Branche d'activité
in scheme: Questions Economiques
in scheme: Tourisme
notation: REFIP2312

avoué
type: ConceptReFip
type: Concept
broader: charges et offices
definition: Officier ministériel chargé devant les cours d'appel de faire tous les actes nécessaires à la procédure et de faire connaître les prétentions de son client. Les avoués sont supprimés et leur fonction intégrée au sein de la profession d'avocat au 1er janvier 2012.
in scheme: FINANCES PUBLIQUES
in scheme: Profession Juridique
in scheme: Droit et Justice
in scheme: Organisation Juridictionnelle
notation: REFIP2314

certificat de dégrèvement
type: ConceptReFip
type: Concept
broader: documentation fiscale (non-descripteur)
definition: Document faisant état de la décision de dégrèvement, total ou partielle.
in scheme: FINANCES PUBLIQUES
in scheme: Documentation Fiscale
in scheme: Fiscalité
notation: REFIP2316

enquête de satisfaction
type: ConceptReFip
type: Concept
broader: enquête
definition: Enquête réalisée en externe par un organisme indépendant ou en interne auprès d'usagers représentatifs, destinée à évaluer la satisfaction des usagers ainsi que leurs attentes afin de mettre en place des actions correctrices pour mieux répondre à leurs besoins.
in scheme: FINANCES PUBLIQUES
in scheme: Missions Transverses des Finances publiques
in scheme: Qualité de service
notation: REFIP2317

Ministère des Affaires étrangères et du Développement international (obsolète)
type: ConceptReFip
type: Concept
is replaced by: refip-REFIP7066
broader: ZZ
in scheme: FINANCES PUBLIQUES
notation: REFIP2318

Fonds national d'aménagement de développement du territoire
type: ConceptReFip
type: Concept
alternative label: FNADT
broader: structure rattachée au Premier Ministre (non-descripteur)
definition: Organisme français constituant l’un des éléments de la politique d’aménagement du territoire. Il soutient en investissement comme en fonctionnement les actions qui concourent à la mise en œuvre des choix stratégiques de cette politique.
in scheme: FINANCES PUBLIQUES
in scheme: Organisation Structurelle de l'Etat
in scheme: Ministère
in scheme: Administration de L'Etat
notation: REFIP2319

avis d'imposition
type: ConceptReFip
type: Concept
alternative label: avis de non-imposition
broader: documentation fiscale (non-descripteur)
definition: Extrait du rôle établi au nom de chaque contribuable figurant au rôle, il mentionne notamment le total par nature d'impôt des sommes à acquitter, les conditions d'exigibilité ainsi que la date de mise en recouvrement et la date limite de paiement.
in scheme: FINANCES PUBLIQUES
in scheme: Documentation Fiscale
in scheme: Fiscalité
notation: REFIP2320

indemnité d'expropriation
type: ConceptReFip
type: Concept
broader: indemnités (non-descripteur)
definition: Somme versée lorsqu'une une collectivité oblige une personne privée, particulier ou société, à lui céder ses droits immobiliers.
in scheme: FINANCES PUBLIQUES
in scheme: Dépenses publiques
in scheme: Gestion Publique
notation: REFIP2321

apurement des comptes
type: ConceptReFip
type: Concept
alternative label: apurement comptable
broader: responsabilité des comptables
definition: Opération de vérification des comptes, menée par la Cour des comptes et les tribunaux administratifs. L'apurement des comptes de comptables publics justiciables de la Cour des comptes comme l'État ou les établissements publics nationaux se fait uniquement par voie juridictionnelle (voie de justice). S'agissant des comptables publics justiciables des CRC tels que les collectivités territoriales et les établissements publics locaux, ils disposent de deux voies d'apurement : l'apurement juridictionnel et l'apurement administratif.
in scheme: FINANCES PUBLIQUES
in scheme: Responsabilité des comptables
in scheme: Missions Transverses des Finances publiques
narrower: apurement juridictionnel
narrower: refip-REFIP77
notation: REFIP2322

Agence nationale pour la gestion des déchets radioactifs
type: ConceptReFip
type: Concept
alternative label: ANDRA
broader: établissement public à caractère industriel et commercial
definition: Etablissement public à caractère industriel et commercial, l'Andra est chargée de la gestion à long terme des déchets radioactifs produits en France.
in scheme: FINANCES PUBLIQUES
in scheme: Organisation Structurelle de l'Etat
in scheme: Opérateur de l'Etat
in scheme: Administration de L'Etat
notation: REFIP2324

établissement public à caractère industriel et commercial
type: ConceptReFip
type: Concept
alternative label: EPIC
broader: établissement public national
definition: Régime juridique d'un établissement public ayant une activité se service public industriel et commercial. Un EPIC est largement régi par le droit privé : son personnel est soumis en principe au Code du travail et s’assimile très largement aux salariés du secteur privé, et les contrats qu’ils passent avec leurs usagers relèvent du droit privé. Sont ainsi des EPIC, la RATP ou encore les théâtres nationaux.
in scheme: FINANCES PUBLIQUES
in scheme: Organisation Structurelle de l'Etat
in scheme: Opérateur de l'Etat
in scheme: Administration de L'Etat
narrower: Office public de l'habitat
narrower: Centre national d'études spatiales
narrower: établissement public foncier
narrower: Agence nationale pour la gestion des déchets radioactifs
narrower: Agence française de développement
narrower: grand port maritime
narrower: réunion des musées nationaux Grand Palais
narrower: Union des groupements d'achats publics
narrower: établissement public d'aménagement
narrower: Office national d'études et de recherches aérospatiales
narrower: Office national des forêts
narrower: Agence de l'environnement et de la maîtrise de l'énergie
narrower: Agence nationale pour la rénovation urbaine
narrower: Agence nationale pour les chèques vacances
narrower: société nationale des chemins de fer français
narrower: BPIFRANCE
narrower: refip-REFIP894
narrower: refip-REFIP994
notation: REFIP2325

fusion DGI-DGCP
type: ConceptReFip
type: Concept
broader: réforme de l'Etat
definition: Unification en une seule et même Direction, la Direction générale des finances publiques,suite à la fusion de la Direction générale des Impôts et de la Direction générale de la Comptabilité publique, en 2008.
in scheme: FINANCES PUBLIQUES
in scheme: Etat
in scheme: Réforme de l'Etat
in scheme: Administration de L'Etat
notation: REFIP2326

diligence
type: ConceptReFip
type: Concept
alternative label: diligence du comptable
broader: responsabilité des comptables
definition: Ensemble des actions en recouvrement réalisées par le comptable public, qui doivent être adéquates, complètes et rapides.
in scheme: FINANCES PUBLIQUES
in scheme: Responsabilité des comptables
in scheme: Missions Transverses des Finances publiques
notation: REFIP2327

indice des fermages
type: ConceptReFip
type: Concept
broader: économie générale (non-descripteur)
definition: Indice national déterminant le loyer des terres nues et des bâtiments d'exploitation agricole.
in scheme: FINANCES PUBLIQUES
in scheme: Questions Economiques
in scheme: Economie générale
notation: REFIP2328

sauvegarde de justice
type: ConceptReFip
type: Concept
broader: protection juridique
definition: Régime de protection le plus léger applicable aux personnes majeures présentant certaines altérations de leurs facultés personnelles. Il ne prive pas la personne de l'exercice de ses droits mais ouvre la possibilité d'agir en rescision pour lésion ou en réduction pour excès relativement aux actes passés.
in scheme: FINANCES PUBLIQUES
in scheme: Droit et Justice
in scheme: Divisions du Droit
in scheme: Droit Privé
notation: REFIP233

service de la publicité foncière
type: ConceptReFip
type: Concept
replaces: conservation des hypothèques
alternative label: SPF
alternative label: bureau des hypothèques
broader: direction départementale des finances publiques
definition: Service de la DGFIP chargé de l'exécution des formalités civiles prescrites pour la publicité des privilèges et des hypothèques, de la formalité fusionnée de publicité foncière et d'enregistrement, de la perception des taxes et de la contribution de sécurité immobilière.
in scheme: FINANCES PUBLIQUES
in scheme: Organisation Structurelle de l'Etat
in scheme: Ministère
in scheme: Administration de L'Etat
notation: REFIP2331
scope note: Remplace la Conservation des hypothèques à compter du 01/01/2013

application OSTENDE
type: ConceptReFip
type: Concept
alternative label: OSTENDE
broader: applications gestion publique (non-descripteur)
definition: Outil permettant d'aider au visa dans CHORUS (contrôle et ajustement comptable) des flux importants de "dépenses" de l'ensemble des ministères.
in scheme: FINANCES PUBLIQUES
in scheme: Applications Informatiques
in scheme: Applications gestion publique
notation: REFIP2333

vigile
type: ConceptReFip
type: Concept
alternative label: agent de sécurité
broader: gardiennage
definition: Personne qui surveille une zone définie ou en contrôle l'accès et empêche l'introduction d'objets illicites ou dangereux.
in scheme: FINANCES PUBLIQUES
in scheme: Branche d'activité
in scheme: Questions Economiques
in scheme: Services et professions libérales
notation: REFIP2335

achat déductible (obsolète)
type: ConceptReFip
type: Concept
is replaced by: charge déductible
broader: ZZ
in scheme: FINANCES PUBLIQUES
notation: REFIP2336

circuit de gestion
type: ConceptReFip
type: Concept
broader: paiement de la dépense (non-descripteur)
definition: Processus de gestion listant les taches et leurs séquencements, le rôle des acteurs et la liste des échanges à réaliser.
in scheme: FINANCES PUBLIQUES
in scheme: Dépenses publiques
in scheme: Gestion Publique
notation: REFIP2338

contribution exceptionnelle et temporaire de retraite des cadres (supprimé)
type: ConceptReFip
type: Concept
broader: ZZ
in scheme: FINANCES PUBLIQUES
notation: REFIP2339

retrait d'un acte administratif
type: ConceptReFip
type: Concept
alternative label: retrait d'une décision administrative
broader: acte administratif
definition: Disparition de l'acte administratif pour l'avenir mais aussi pour le passé.
in scheme: FINANCES PUBLIQUES
in scheme: Droit et Justice
in scheme: Divisions du Droit
in scheme: Droit Public
notation: REFIP234

succession en déshérence
type: ConceptReFip
type: Concept
broader: succession
definition: État d'une succession qui à défaut de tout héritier est dévolue à l'État.
in scheme: FINANCES PUBLIQUES
in scheme: Domaine
in scheme: Gestion Publique
notation: REFIP2340

entreprise de construction
type: ConceptReFip
type: Concept
broader: construction
definition: Entreprise réalisant tous les travaux dans tous les corps d’état, du gros-oeuvre à la peinture.
in scheme: FINANCES PUBLIQUES
in scheme: Branche d'activité
in scheme: Questions Economiques
in scheme: Construction
narrower: contremaitre
notation: REFIP2341

application WINCIP
type: ConceptReFip
type: Concept
alternative label: WINCIP
broader: applications gestion publique (non-descripteur)
definition: Application permettant le suivi en détail des comptes dont dont le suivi n'était pas assuré par les applications de comptabilité auxiliaire. Arrêt de l'application en mars 2013 , le suivi des comptes étant réalisé dans CHORUS.
in scheme: FINANCES PUBLIQUES
in scheme: Applications Informatiques
in scheme: Applications gestion publique
notation: REFIP2342

provision pour fluctuation des cours (supprimé)
type: ConceptReFip
type: Concept
broader: ZZ
in scheme: FINANCES PUBLIQUES
notation: REFIP2343

ajustement comptable
type: ConceptReFip
type: Concept
alternative label: redressement comptable
alternative label: retraitement comptable
broader: comptabilisation
definition: Technique consistant à effectuer une correction, un redressement ou modification de chiffres visant à établir une situation d'équilibre.
in scheme: FINANCES PUBLIQUES
in scheme: Procédures et Techniques Comptables
in scheme: Comptabilité
notation: REFIP2345

fongibilité des crédits
type: ConceptReFip
type: Concept
broader: exécution du budget
definition: Possibilité pour chaque gestionnaire d’utiliser librement les crédits ouverts pour mettre en oeuvre de manière performante et optimale les actions du programme, sous réserve de la soutenabilité dans la durée des choix de gestion et du respect de l’autorisation parlementaire accordée. Cette liberté porte sur la destination et sur la nature des dépenses : les crédits ouverts sur un programme ne sont répartis par action et par nature de dépense qu’à titre indicatif (sous réserve de la distinction entre les dépenses de personnel et les autres dépenses).
in scheme: FINANCES PUBLIQUES
in scheme: Exécution du budget
in scheme: Budget
notation: REFIP2346

immobilier
type: ConceptReFip
type: Concept
broader: services et professions libérales (non-descripteur)
definition: Toute activité commerciale ou privée ayant trait aux biens immobiliers. Le terme désigne les activités de gestion et transaction s'opérant sur ces biens, mais il touche également de nombreuses activités connexes telles que le logement, la construction, la promotion, le conseil, l'urbanisme, l'architecture, la gérance, etc.
in scheme: FINANCES PUBLIQUES
in scheme: Branche d'activité
in scheme: Questions Economiques
in scheme: Services et professions libérales
narrower: agence immobilière
narrower: marchand de biens
narrower: opération immobilière
notation: REFIP2347
scope note: Secteur d'activité

preuve testimoniale
type: ConceptReFip
type: Concept
broader: droit civil
definition: Preuve par témoins, librement admissible pour les faits juridiques, recevable sous certaines conditions pour les actes juridiques.
in scheme: FINANCES PUBLIQUES
in scheme: Droit et Justice
in scheme: Divisions du Droit
in scheme: Droit Privé
notation: REFIP2349

acte notarié
type: ConceptReFip
type: Concept
alternative label: acte notarial
alternative label: attestation notariée
broader: acte authentique
definition: Document, parfois appelé acte notarial, rédigé par un notaire à la demande de son client.
in scheme: FINANCES PUBLIQUES
in scheme: Droit et Justice
in scheme: Sources du Droit
in scheme: Sources des Droits Subjectifs
notation: REFIP235

commission des chefs des services financiers et des représentants des organismes de recouvrement des cotisations de sécurité sociale et de l'assurance chômage
type: ConceptReFip
type: Concept
alternative label: CCSF
broader: structure locale (non-descripteur)
definition: Structure accordant aux entreprises qui rencontrent des difficultés financières des délais de paiement pour leurs dettes fiscales et sociales.
in scheme: FINANCES PUBLIQUES
in scheme: Organisation Territoriale
in scheme: Structures Territoriales
in scheme: Administration de L'Etat
notation: REFIP2350

service public d'assainissement non collectif
type: ConceptReFip
type: Concept
alternative label: SPANC
broader: service public
definition: Service public local chargé de conseiller et accompagner les particuliers dans la mise en place de leur installation d’assainissement non collectif ; chargé également de contrôler les installations d’assainissement non collectif. Il fait l’objet d’une redevance qui en assure ainsi l’équilibre financier.
in scheme: FINANCES PUBLIQUES
in scheme: Etat
in scheme: Mission de Service Public
in scheme: Administration de L'Etat
notation: REFIP2354
related: assainissement

bon de souscription de part de créateur d'entreprise
type: ConceptReFip
type: Concept
broader: participation financière
definition: Bons qui confèrent à leurs bénéficiaires le droit de souscrire une part du capital de leur entreprise à un prix définitivement fixé lors de l'attribution. Les intéressés se voient ainsi offrir la perspective de réaliser un gain, dans des conditions fiscales et sociales favorables, qui sera la contrepartie de la part active qu'ils auront personnellement prise dans la valorisation des actions ou parts de leur entreprise. Les bons de souscription sont incessibles. Les sociétés concernées sont les sociétés par actions dont les titres ne sont pas cotés.
in scheme: FINANCES PUBLIQUES
in scheme: Gestion de l'Entreprise
in scheme: Entreprises
in scheme: Vie et Gestion de l'entreprise
notation: REFIP2355
related: refip-REFIP6862

Alpes-de-Haute-Provence
type: ConceptReFip
type: Concept
broader: Provence-Alpes-Côte d'Azur
definition: Département français
in scheme: FINANCES PUBLIQUES
in scheme: Géographie
in scheme: Europe
notation: REFIP2356

logistique
type: ConceptReFip
type: Concept
broader: gestion de l'entreprise (non-descripteur)
definition: Ensemble de méthodes et de moyens relatifs à l'organisation d'un service, d'une entreprise et comprenant les manutentions, les transports, les conditionnements et parfois les approvisionnements.
in scheme: FINANCES PUBLIQUES
in scheme: Gestion de l'Entreprise
in scheme: Entreprises
in scheme: Vie et Gestion de l'entreprise
narrower: gestion du matériel
notation: REFIP2357

exploit d'huissier
type: ConceptReFip
type: Concept
broader: procédure civile
definition: Acte rédigé et signifié par un huissier de justice.
in scheme: FINANCES PUBLIQUES
in scheme: Procédure Civile
in scheme: Droit et Justice
in scheme: Procédure
notation: REFIP2358

rupture de contrat
type: ConceptReFip
type: Concept
broader: refip-REFIP6950
definition: Cessation du contrat de travail à l'initiative du salarié ou de l'employeur. Il en existe différents types comme par exemple la démission; le départ à la retraite; les ruptures anticipées (rupture anticipée du CDD; rupture anticipée du contrat d'apprentissage; rupture anticipée du contrat de professionnalisation); le départ négocié (rupture conventionnelle homologuée ou la prise d'acte de la rupture du contrat : démission licenciement).
in scheme: FINANCES PUBLIQUES
in scheme: Entreprises
in scheme: Travail
in scheme: 212619
narrower: départ négocié
narrower: licenciement
notation: REFIP2359
scope note: Contrat de travail

établissement public de coopération scientifique (supprimé)
type: ConceptReFip
type: Concept
broader: ZZ
in scheme: FINANCES PUBLIQUES
notation: REFIP236

neutralisation des opérations réciproques
type: ConceptReFip
type: Concept
alternative label: flux croisés
alternative label: neutralisation comptable
alternative label: neutralisation des flux croisés
alternative label: neutralisation des écritures réciproques
alternative label: écritures réciproques
broader: consolidation des comptes
definition: Opération visant à neutraliser les opérations réciproques dans le cadre de la consolidation des comptes, elle s'effectue notamment entre budgets si l'on s'inscrit dans une démarche de consolidation des données entre budget annexe et budget principal ou entre collectivités si l'on se place dans une optique d'addition des données produites sur le territoire considéré.
in scheme: FINANCES PUBLIQUES
in scheme: Procédures et Techniques Comptables
in scheme: Comptabilité
notation: REFIP2360

réseau collaboratif
type: ConceptReFip
type: Concept
alternative label: réseau social d'entreprise
alternative label: réseau social professionnel
broader: outil collaboratif
definition: Plate-forme de communication permettant de réaliser en commun un travail collaboratif où chaque membre du groupe interagit pour accomplir l’objectif fixé.
in scheme: FINANCES PUBLIQUES
in scheme: Communication
in scheme: Communication Documentation Informatique
notation: REFIP2361
related: WIFIP

indice des prix à la consommation
type: ConceptReFip
type: Concept
broader: consommation
definition: Indicateur permettant de mesurer l'évolution du niveau moyen des prix des biens et services consommés par les ménages, pondérés par leur part dans la consommation moyenne des ménages.
in scheme: FINANCES PUBLIQUES
in scheme: Questions Economiques
in scheme: Economie générale
notation: REFIP2362

annualité de l'impôt
type: ConceptReFip
type: Concept
broader: fiscalité
definition: Principe selon lequel un impôt est établi pour l'année entière d'après les faits existant au premier jour de l'année d'imposition.
in scheme: FINANCES PUBLIQUES
in scheme: Fiscalité - Autres notions
in scheme: Fiscalité
notation: REFIP2363

clause de résiliation
type: ConceptReFip
type: Concept
alternative label: clause résolutoire
broader: résiliation
definition: Clause prévoyant qu'en cas de manquement à une obligation contractuelle de l'une des parties, le contrat sera résilié de plein droit,sans recours à la justice.
in scheme: FINANCES PUBLIQUES
in scheme: Droit et Justice
in scheme: Divisions du Droit
in scheme: Droit Privé
notation: REFIP2364

acceptation
type: ConceptReFip
type: Concept
broader: mots outils (liste additive)
definition: Action d'accepter, de recevoir, d'agréer quelque chose ; consentement, accord.
in scheme: FINANCES PUBLIQUES
in scheme: Mots Outils
notation: REFIP2365

passif successoral
type: ConceptReFip
type: Concept
alternative label: passif de succession
broader: fiscalité du patrimoine
definition: Ensemble des dettes qui peuvent être retranchées de l'actif successoral pour obtenir l'actif net de succession.
in scheme: FINANCES PUBLIQUES
in scheme: Champ d'Application
in scheme: Fiscalité
notation: REFIP2366

patrimoine personnel
type: ConceptReFip
type: Concept
alternative label: patrimoine privé
broader: patrimoine
definition: Ensemble des biens d'une personne physique, en opposition avec le patrimoine de l'entreprise, patrimoine professionnel.
in scheme: FINANCES PUBLIQUES
in scheme: Droit et Justice
in scheme: Divisions du Droit
in scheme: Droit Privé
notation: REFIP2367

application THEMIS
type: ConceptReFip
type: Concept
alternative label: THEMIS
broader: applications fiscales (non-descripteur)
definition: Gestion de l'activité des Huissiers des Finances Publiques et des contrôleurs commissionnés.
in scheme: FINANCES PUBLIQUES
in scheme: Applications Informatiques
in scheme: Applications fiscales
notation: REFIP2368

centre d'encaissement
type: ConceptReFip
type: Concept
broader: direction régionale des finances publiques
definition: Structure chargée de recouvrer les impôts directs non mensualisés ni prélevés à échéance, les taxes, les produits divers, les produits du SPL et les amendes. Egalement chargé de traiter les chèques des déposants de fonds au Trésor et de la Caisse des Dépôts et Consignations.
in scheme: FINANCES PUBLIQUES
in scheme: Organisation Structurelle de l'Etat
in scheme: Ministère
in scheme: Administration de L'Etat
notation: REFIP2369

Caisse autonome nationale de la sécurité sociale dans les mines (supprimé)
type: ConceptReFip
type: Concept
broader: ZZ
in scheme: FINANCES PUBLIQUES
notation: REFIP237

application AGORA
type: ConceptReFip
type: Concept
alternative label: AGORA
broader: applications missions transverses (non-descripteur)
definition: Application de gestion des ressources humaines des agents de la DGFiP.
in scheme: FINANCES PUBLIQUES
in scheme: Applications missions transverses
in scheme: Applications Informatiques
notation: REFIP2370

établissement public national
type: ConceptReFip
type: Concept
alternative label: EPN
broader: opérateur de l'Etat
definition: Personne morale relevant du droit public et disposant d'une autonomie administrative et financière pour accomplir une mission d'intérêt général. Cette mission qui est définie de manière précise s'exerce sous le contrôle de l'Etat pour un établissement public national. En fonction de leur activité, les établissements publics se répartissent principalement entre EPA (établissements publics administratifs) et EPIC (établissements publics à caractère industriel ou commercial).
in scheme: FINANCES PUBLIQUES
in scheme: Organisation Structurelle de l'Etat
in scheme: Opérateur de l'Etat
in scheme: Administration de L'Etat
narrower: établissement public d'enseignement supérieur et de recherche
narrower: établissement public à caractère administratif
narrower: établissement public à caractère scientifique et technologique
narrower: établissement public à caractère scientifique culturel et professionnel
narrower: établissement public à caractère industriel et commercial
narrower: établissement public économique (non-descripteur)
notation: REFIP2372

taxe générale sur les activités polluantes
type: ConceptReFip
type: Concept
alternative label: TGAP
broader: autres taxes, droits ou redevances (non-descripteur)
definition: Taxe applicable aux entreprises qui réalisent certaines opérations telles que le stockage et traitement des déchets, la livraison ou utilisation de lubrifiants, l'émission de substances polluantes dans l'atmosphère, etc.
in scheme: FINANCES PUBLIQUES
in scheme: Fiscalité
in scheme: Impôt
notation: REFIP2373

système du quotient
type: ConceptReFip
type: Concept
alternative label: régime du quotient
broader: liquidation de l'impôt
definition: Modalités d'imposition des revenus exceptionnels et différés imposés d'après le barème progressif de l'impôt et permettant d'atténuer la progressivité de l'impôt.
in scheme: FINANCES PUBLIQUES
in scheme: Liquidation de l'Impôt
in scheme: Fiscalité
notation: REFIP2374

contrainte judiciaire
type: ConceptReFip
type: Concept
broader: procédure pénale
definition: Incarcération ou maintien en détention une personne solvable qui n’est pas acquittée de certaines amendes, auxquelles elle a été condamnée par le Trésor Public ou l’administration des douanes. Se substitue à la contrainte par corps depuis 2004.
in scheme: FINANCES PUBLIQUES
in scheme: Procédure Pénale
in scheme: Droit et Justice
in scheme: Procédure
notation: REFIP2375
scope note: Se substitue à la contrainte par corps à compter de 2004

fourniture de logement
type: ConceptReFip
type: Concept
broader: commerce
definition: Activité professionnelle dont l'objet est la fourniture de logement notamment les chambres d'hôtes, hôtels, gîtes ruraux, meublés de tourisme...
in scheme: FINANCES PUBLIQUES
in scheme: Branche d'activité
in scheme: Questions Economiques
in scheme: Commerce
narrower: résidence hôtelière à vocation sociale
narrower: refip-REFIP901
notation: REFIP2376

indicateur financier
type: ConceptReFip
type: Concept
broader: refip-REFIP788
definition: Élément caractéristique retenu pour suivre l'évolution de la situation financière de l'entité.
in scheme: FINANCES PUBLIQUES
in scheme: Analyse financière
in scheme: Comptabilité
notation: REFIP2377

état financier
type: ConceptReFip
type: Concept
broader: documents comptables
definition: Partie visible pour les tiers des comptes annuels d’une entreprise. Les états financiers comprennent le bilan comptable, image de son patrimoine; le compte de résultat qui récapitule l’activité de l’exercice; et les annexes qui complètent les informations chiffrées du bilan et du compte de résultat.
in scheme: FINANCES PUBLIQUES
in scheme: Documents comptables
in scheme: Comptabilité
narrower: flux financier
notation: REFIP2378

taxe sur la valeur vénale des immeubles possédés en France
type: ConceptReFip
type: Concept
broader: autres taxes, droits ou redevances (non-descripteur)
definition: Taxe fixée sur la valeur vénale des biens et droits immobiliers possédés en France et comprenant plusieurs possibilités d'exonérations. La taxe s’applique à toutes les entités juridiques : personnes morales, organismes, fiducies ou toutes autres institutions comparables.
in scheme: FINANCES PUBLIQUES
in scheme: Fiscalité
in scheme: Impôt
notation: REFIP238

preuve par écrit
type: ConceptReFip
type: Concept
broader: droit civil
definition: Preuve administrée au moyen de la production d'un écrit.
in scheme: FINANCES PUBLIQUES
in scheme: Droit et Justice
in scheme: Divisions du Droit
in scheme: Droit Privé
narrower: signature
notation: REFIP2380

fiscalité du patrimoine
type: ConceptReFip
type: Concept
alternative label: fiscalité patrimoniale
broader: champ d'application
definition: Dispositions relatives à la détention du patrimoine (ISF...) et à la transmission du patrimoine (droits d'enregistrement, droits de succession etc.). Les revenus du patrimoine (intérêts, loyers, dividendes,,,) font en revanche partie de l'assiette de l'impôt sur le revenu.
in scheme: FINANCES PUBLIQUES
in scheme: Champ d'Application
in scheme: Fiscalité
narrower: mutation à titre onéreux
narrower: enregistrement d'acte
narrower: passif successoral
narrower: publicité foncière
narrower: affirmation de sincérité
narrower: mutation à titre gratuit
narrower: mutation d'immeuble
narrower: don manuel
narrower: actif de succession
notation: REFIP2381

Conseil économique social et environnemental
type: ConceptReFip
type: Concept
alternative label: Conseil économique et social
broader: institutions (non-descripteur)
definition: Assemblée consultative qui favorise la collaboration des différentes catégories socioprofessionnelles entre elles et assure leur participation à la définition et l’évaluation des politiques publiques. Le CESE conseille le Gouvernement et le Parlement sur l'élaboration des lois et les orientations des politiques publiques. Au-delà de son rôle de conseil, le CESE permet de favoriser le dialogue entre toutes les catégories socioprofessionnelles, pour qu'elles aillent dans le sens de l'intérêt général. Et enfin, il collabore avec ses homologues au niveau territorial et international.
in scheme: FINANCES PUBLIQUES
in scheme: Organisation Structurelle de l'Etat
in scheme: Institutions
in scheme: Administration de L'Etat
notation: REFIP2382

application PAY
type: ConceptReFip
type: Concept
alternative label: PAY
broader: applications missions transverses (non-descripteur)
definition: Application permettant le paiement des traitements, salaires, et accessoires aux fonctionnaires et agents des budgets civils de l’État.
in scheme: FINANCES PUBLIQUES
in scheme: Applications missions transverses
in scheme: Applications Informatiques
notation: REFIP2383
related: Projet paysage

marchand de biens
type: ConceptReFip
type: Concept
broader: immobilier
definition: Personne qui, de façon habituelle et afin d'en tirer un bénéfice, achète en son nom, en vue de les revendre, des immeubles, fonds de commerce, actions ou parts de sociétés immobilières.
in scheme: FINANCES PUBLIQUES
in scheme: Branche d'activité
in scheme: Questions Economiques
in scheme: Services et professions libérales
notation: REFIP2384

application ARAMIS
type: ConceptReFip
type: Concept
alternative label: ARAMIS
broader: applications gestion publique (non-descripteur)
definition: Application permettant la gestion des fiches de marchés publics des collectivités locales à fin de statistiques et de pilotage des marchés publics des collectivités locale par l'Observatoire Économique des achats publics.
in scheme: FINANCES PUBLIQUES
in scheme: Applications Informatiques
in scheme: Applications gestion publique
notation: REFIP2385

action récursoire
type: ConceptReFip
type: Concept
broader: action en justice
definition: Recours en justice exercé contre le véritable débiteur d'une obligation juridique par celui qui est tenu de l'exécuter en tant que débiteur solidaire, garant ou responsable du fait d'autrui.
in scheme: FINANCES PUBLIQUES
in scheme: Principes Généraux
in scheme: Droit et Justice
in scheme: Procédure
notation: REFIP2387

Ecole normale supérieure
type: ConceptReFip
type: Concept
alternative label: ENS
broader: établissement public à caractère scientifique culturel et professionnel
definition: Etablissement public à caractère scientifique, culturel et professionnel, l'Ecole normale supérieure est une institution universitaire assurant la formation de chercheurs et d'enseignants dans les disciplines littéraires, scientifiques et technologiques.
in scheme: FINANCES PUBLIQUES
in scheme: Organisation Structurelle de l'Etat
in scheme: Opérateur de l'Etat
in scheme: Administration de L'Etat
notation: REFIP2388

Opérateur national de paye (supprimé)
type: ConceptReFip
type: Concept
broader: ZZ
in scheme: FINANCES PUBLIQUES
notation: REFIP239

centre de profit
type: ConceptReFip
type: Concept
broader: CHORUS (non-descripteur)
definition: Structure au sein de laquelle sont effectués les flux de gestion dans Chorus. Le centre de profit modélise un service ou le ministère à des fins de suivi de la recette non fiscale.
in scheme: FINANCES PUBLIQUES
in scheme: Comptabilité publique
in scheme: Comptabilité
notation: REFIP2391

syndicat d'agglomération nouvelle
type: ConceptReFip
type: Concept
broader: refip-REFIP821
definition: Organisme de coopération intercommunale à fiscalité propre qui regroupent les communes comprises dans le périmètre des villes nouvelles. Les SAN exercent les compétences déterminées par la loi aux lieu et place des communes, le statut d’agglomération nouvelle a un caractère temporaire. Lorsque les opérations de construction et d’aménagement sont terminées, un décret en Conseil d’État détermine la date d’achèvement. Le SAN se transforme alors en communauté d’agglomération.
in scheme: FINANCES PUBLIQUES
in scheme: Organisation Territoriale
in scheme: Structures Territoriales
in scheme: Administration de L'Etat
notation: REFIP2392

mandat de représentation
type: ConceptReFip
type: Concept
broader: droit des obligations et contrats (non-descripteur)
definition: Acte par lequel une personne, le mandant, donne à une autre, le mandataire, le pouvoir de la représenter en vue d'accomplir en son nom un ou plusieurs actes juridiques.
in scheme: FINANCES PUBLIQUES
in scheme: Droit et Justice
in scheme: Divisions du Droit
in scheme: Droit Privé
narrower: mandataire
notation: REFIP2394

opposition à tiers détenteur
type: ConceptReFip
type: Concept
alternative label: OTD
broader: poursuites
definition: Acte de poursuite permettant de recouvrer les créances non fiscales des collectivités locales et d'autres catégories d'organismes (établissement public à caractère industriel, association syndicale de Propriétaires, organisme HLM, établissement public de santé et établissement public social et médico-social). L'OTD permet au comptable direct du Trésor de se retourner vers les personnes physiques et morales qui détiennent des fonds pour le compte des redevables. Elle peut grever les pensions de vieillesse dans les mêmes conditions et limites que les salaires.
in scheme: FINANCES PUBLIQUES
in scheme: Recouvrement
in scheme: Fiscalité
notation: REFIP2395

comptabilité d'exercice
type: ConceptReFip
type: Concept
definition: Type de comptabilité par laquelle les revenus et les charges s'identifient à l'exercice financier et non à la date d'encaissement ou du débours de l'argent.
in scheme: FINANCES PUBLIQUES
in scheme: Comptabilité d'exercice
in scheme: Comptabilité
narrower: exercice comptable
notation: REFIP2396

prime d'aménagement du territoire
type: ConceptReFip
type: Concept
broader: aide aux entreprises
definition: Dispositif d'aide dont l'objectif est de soutenir la création d'emplois durables et le développement d'activités économiques dans certaines zones prioritaires du territoire national. Il en définit les conditions d'attribution, de versement et le montant maximum. Les entreprises éligibles peuvent bénéficier de la prime pour des programmes de création, d'extension ou de diversification d'activité et, à titre exceptionnel, pour des programmes de reprise d'activité.
in scheme: FINANCES PUBLIQUES
in scheme: Dépenses publiques
in scheme: Gestion Publique
notation: REFIP2397

acceptation partielle
type: ConceptReFip
type: Concept
alternative label: admission partielle
broader: dégrèvement
definition: Décision de l'administration consistant à n'admettre qu'une partie des demandes d'un contribuable dans le cadre d'une réclamation contentieuse ou gracieuse.
in scheme: FINANCES PUBLIQUES
in scheme: Contentieux Fiscal
in scheme: Fiscalité
narrower: dégrèvement partiel
notation: REFIP2398

déclaration de succession
type: ConceptReFip
type: Concept
alternative label: absence de déclaration de succession
broader: refip-REFIP804
definition: Formulaire 2705 (Cerfa n° 11277) déposé par les héritiers, légataires ou donataires, leurs tuteurs et curateurs, sauf en cas de dispense , permettant la liquidation et le paiement des droits de mutation par décès.
in scheme: FINANCES PUBLIQUES
in scheme: Documentation Fiscale
in scheme: Fiscalité
notation: REFIP2399

réforme budgétaire
type: ConceptReFip
type: Concept
broader: réforme de l'Etat
definition: Réforme en profondeur du cadre budgétaire de l'Etat visant à en améliorer le fonctionnement.
in scheme: FINANCES PUBLIQUES
in scheme: Etat
in scheme: Réforme de l'Etat
in scheme: Administration de L'Etat
notation: REFIP24

relevé de condamnation pécuniaire (obsolète)
type: ConceptReFip
type: Concept
is replaced by: relevé de condamnation pénale
broader: ZZ
in scheme: FINANCES PUBLIQUES
notation: REFIP240

Agence nationale des fréquences
type: ConceptReFip
type: Concept
alternative label: ANFR
broader: établissement public à caractère administratif
definition: Etablissement public administratif exerçant des missions de planification, de gestion de l’implantation des émetteurs, de contrôle et enfin de délivrance de certaines autorisations et certificats radio.
in scheme: FINANCES PUBLIQUES
in scheme: Organisation Structurelle de l'Etat
in scheme: Opérateur de l'Etat
in scheme: Administration de L'Etat
notation: REFIP2401

chauffage
type: ConceptReFip
type: Concept
broader: énergie
definition: Énergie thermique.
in scheme: FINANCES PUBLIQUES
in scheme: Branche d'activité
in scheme: Questions Economiques
in scheme: Industrie
notation: REFIP2402

statistique
type: ConceptReFip
type: Concept
broader: pilotage
definition: Ensemble de données recueillies visant à traiter et à interpréter un ensemble d'informations afférentes aux missions de la DGFIP.
in scheme: FINANCES PUBLIQUES
in scheme: Missions Transverses des Finances publiques
in scheme: Pilotage
notation: REFIP2404

catégorie de dépenses
type: ConceptReFip
type: Concept
broader: titre de dépense
definition: Subdivision d'une charge budgétaire de l'Etat
in scheme: FINANCES PUBLIQUES
in scheme: Exécution du budget
in scheme: Budget
notation: REFIP2405

opposition au transfert du certificat d'immatriculation
type: ConceptReFip
type: Concept
alternative label: OTCI
broader: opposition administrative
definition: Procédure réservée au comptable public en charge du recouvrement des amendes forfaitaires majorées de s'opposer au transfert d'un certificat d'immatriculation.
in scheme: FINANCES PUBLIQUES
in scheme: Recouvrement
in scheme: Fiscalité
notation: REFIP2406
related: certificat de situation administrative
related: refip-REFIP960

revenu du patrimoine
type: ConceptReFip
type: Concept
broader: revenu imposable
definition: Revenus perçus par une personne via les les loyers, les dividendes, les intérêts de placements, les plus-values mobilières ou plus-values immobilières, et donnant lieu à versement de prélèvements sociaux.
in scheme: FINANCES PUBLIQUES
in scheme: Champ d'Application
in scheme: Fiscalité
narrower: plus-value immobilière
narrower: revenu immobilier
notation: REFIP2407

mandataire
type: ConceptReFip
type: Concept
broader: mandat de représentation
definition: Celui qui, dans le mandat, reçoit du mandant pouvoir et mission d'agir au nom de ce dernier.
in scheme: FINANCES PUBLIQUES
in scheme: Droit et Justice
in scheme: Divisions du Droit
in scheme: Droit Privé
notation: REFIP2408

Algérie
type: ConceptReFip
type: Concept
broader: Afrique
definition: Pays
in scheme: FINANCES PUBLIQUES
in scheme: Géographie
in scheme: Afrique
notation: REFIP241

documentation administrative
type: ConceptReFip
type: Concept
broader: documentation
definition: Documents produits ou reçus par l’administration qu’ils se présentent sous forme écrite, sous forme d’enregistrement sonore ou visuel ou sous forme numérique ou informatique.
in scheme: FINANCES PUBLIQUES
in scheme: Documentation
in scheme: Communication Documentation Informatique
narrower: document administratif
notation: REFIP2410

Fonds structurels européens (obsolète)
type: ConceptReFip
type: Concept
is replaced by: fonds européens structurels et d'investissement
broader: ZZ
in scheme: FINANCES PUBLIQUES
notation: REFIP2412

sigle
type: ConceptReFip
type: Concept
broader: nomenclature
definition: Ensemble de lettres initiales formant un mot servant d'abréviation.
in scheme: FINANCES PUBLIQUES
in scheme: Documentation
in scheme: Communication Documentation Informatique
notation: REFIP2413

commerce électronique
type: ConceptReFip
type: Concept
alternative label: achat en ligne
alternative label: e-commerce
alternative label: vente en ligne
alternative label: vente à distance
broader: commerce
definition: Echange de biens et de services sur les réseaux informatiques et notamment Internet.
in scheme: FINANCES PUBLIQUES
in scheme: Branche d'activité
in scheme: Questions Economiques
in scheme: Commerce
notation: REFIP2414

plan de redressement
type: ConceptReFip
type: Concept
broader: redressement judiciaire
definition: Programme arrêté par le tribunal dans le cadre d'une procédure collective lorsqu'il existe une possibilité sérieuse pour l'entreprise d'être sauvegardée. Le tribunal nomme l'administrateur ou le mandataire judiciaire en qualité de commissaire chargé de veiller à l'exécution du plan. Le tribunal peut, en cas de nécessité, nommer plusieurs commissaires. Ce plan met fin à la période d'observation. Il détermine les perspectives de redressement en fonction des possibilités et des modalités d'activités, il définit les modalités de règlement du passif et les garanties éventuelles que le chef d'entreprise doit souscrire pour en assurer l'exécution, il expose et justifie le niveau et les perspectives d'emploi ainsi que les conditions sociales envisagées pour la poursuite d'activité, il recense, annexe et analyse les offres d'acquisition portant sur une ou plusieurs activités, présentées par des tiers. La durée du plan est fixée par le tribunal. Elle ne peut excéder dix ans.
in scheme: FINANCES PUBLIQUES
in scheme: Vie de l'Entreprise
in scheme: Entreprises
in scheme: Vie et Gestion de l'entreprise
notation: REFIP2415
related: plan de cession

livraison de bien meuble corporel (obsolète)
type: ConceptReFip
type: Concept
is replaced by: refip-REFIP7091
broader: ZZ
in scheme: FINANCES PUBLIQUES
notation: REFIP2416

Autorité de régulation des communications électroniques et des postes
type: ConceptReFip
type: Concept
alternative label: ARCEP
broader: autorité administrative indépendante
definition: Autorité administrative indépendante chargée de réguler la concurrence et d’accompagner la libéralisation des secteurs des télécommunications et des activités postales.
in scheme: FINANCES PUBLIQUES
in scheme: Organisation Structurelle de l'Etat
in scheme: Autorité Administrative
in scheme: Administration de L'Etat
notation: REFIP2417

taxe de publicité foncière
type: ConceptReFip
type: Concept
broader: droits d'enregistrement
definition: Les actes constatant des mutations à titre onéreux d'immeubles donnent lieu, en principe, à la formalité unique, fusion de la formalité de l'enregistrement avec celle de la publicité foncière. Sous réserve de divers régimes d'exonérations, ils sont soumis à une taxe de publicité foncière perçue au profit du département.
in scheme: FINANCES PUBLIQUES
in scheme: Fiscalité
in scheme: Impôt
notation: REFIP2418

convention
type: ConceptReFip
type: Concept
broader: droit des obligations et contrats (non-descripteur)
definition: Accord de volonté (contrat) destiné à produire un effet de droit quelconque.
in scheme: FINANCES PUBLIQUES
in scheme: Droit et Justice
in scheme: Divisions du Droit
in scheme: Droit Privé
narrower: privilège
narrower: convention simulée
notation: REFIP2419

infocentre atlas
type: ConceptReFip
type: Concept
broader: applications missions transverses (non-descripteur)
definition: Infocentre décisionnel qui contient l’ensemble des données « rémunérations » de la DGFiP à des fins d'analyse des composantes de la masse salariale et de contrôle interne des rémunérations.
in scheme: FINANCES PUBLIQUES
in scheme: Applications missions transverses
in scheme: Applications Informatiques
notation: REFIP242

certification des comptes
type: ConceptReFip
type: Concept
alternative label: certification comptable
alternative label: certification des comptes de l'Etat
broader: procédures et techniques comptables (non-descripteur)
definition: Mission d’audit externe des comptes qui consiste à exprimer une opinion sur la conformité des comptes au référentiel comptable qui leur est applicable. Cette opinion ne se limite pas à la régularité des comptes, elle conduit à se prononcer également sur leur sincérité, ce qui la distingue de la vérification. Cela donne au Parlement et aux ministères une assurance supplémentaire de disposer d’une comptabilité générale fiabilisée.
in scheme: FINANCES PUBLIQUES
in scheme: Procédures et Techniques Comptables
in scheme: Comptabilité
notation: REFIP2420
related: audit externe

date d'exigibilité
type: ConceptReFip
type: Concept
broader: exigibilité
definition: Date à laquelle le Trésor public peut réclamer le paiement de l'impôt.
in scheme: FINANCES PUBLIQUES
in scheme: Recouvrement
in scheme: Fiscalité
notation: REFIP2423

décompte général et définitif
type: ConceptReFip
type: Concept
alternative label: DGD
broader: exécution d'un marché public
definition: Document financier établi pour chaque marché public, c'est-à-dire pour chaque lot et qui récapitule l'ensemble des dettes et des créances des parties. Il permet d'arrêter le solde du marché.
in scheme: FINANCES PUBLIQUES
in scheme: Commande publique
in scheme: Gestion Publique
notation: REFIP2425

indice des loyers des activités tertiaires
type: ConceptReFip
type: Concept
alternative label: ILAT
broader: économie générale (non-descripteur)
definition: Indicateur servant de référence à la révision des baux professionnels autres que les loyers commerciaux
in scheme: FINANCES PUBLIQUES
in scheme: Questions Economiques
in scheme: Economie générale
notation: REFIP2427

vêtement de travail
type: ConceptReFip
type: Concept
broader: équipement de sécurité
definition: Vêtement porté dans le cadre du travail pour protéger contre un ou plusieurs risques susceptibles de menacer sa santé et sa sécurité.
in scheme: FINANCES PUBLIQUES
in scheme: Lieu de Travail
in scheme: Entreprises
in scheme: Travail
notation: REFIP2428

commerce de détail
type: ConceptReFip
type: Concept
alternative label: vente au détail
broader: commerce
definition: Activité consistant à la revente de la marchandise à l'unité ou par petite quantité à un client dans un magasin, une boutique ou par correspondance.
in scheme: FINANCES PUBLIQUES
in scheme: Branche d'activité
in scheme: Questions Economiques
in scheme: Commerce
narrower: boulangerie
narrower: débit de boissons
narrower: pompes funèbres
narrower: débit de tabac
narrower: opticien
notation: REFIP2429

société en nom collectif
type: ConceptReFip
type: Concept
alternative label: SNC
broader: société de personnes
definition: Société commerciale par la forme, constituée entre deux ou plusieurs personnes ayant la qualité de commerçantes, tenues personnellement et solidairement de toutes les dettes sociales et auxquelles sont attribuées des parts d'intérêts qui ne peuvent être cédées qu'avec le consentement de tous les associés.
in scheme: FINANCES PUBLIQUES
in scheme: Société
in scheme: Entreprises
in scheme: Forme juridique
notation: REFIP243

comité consultatif règlement amiable des différends ou litiges
type: ConceptReFip
type: Concept
alternative label: CCRA
broader: exécution d'un marché public
definition: Organisme consultatif de conciliation, qui peut être saisi de tout différend ou litige survenu au cours de l'exécution d'un marché public.
in scheme: FINANCES PUBLIQUES
in scheme: Commande publique
in scheme: Gestion Publique
notation: REFIP2430

droit financier
type: ConceptReFip
type: Concept
broader: droit privé
definition: Droit régissant la finance de marché et plus généralement, les activités liées à l'expansion de la sphère financière dans le monde moderne des affaires.
in scheme: FINANCES PUBLIQUES
in scheme: Droit et Justice
in scheme: Divisions du Droit
in scheme: Droit Privé
notation: REFIP2432

fusion de sociétés
type: ConceptReFip
type: Concept
alternative label: absorption d'entreprise
alternative label: fusion absorption
alternative label: fusion d'entreprises
broader: transfert d'entreprise
definition: Mise en commun des patrimoines de deux ou plusieurs sociétés, qui aboutit à la constitution d'une nouvelle entreprise ou à une prise de contrôle.
in scheme: FINANCES PUBLIQUES
in scheme: Vie de l'Entreprise
in scheme: Entreprises
in scheme: Vie et Gestion de l'entreprise
narrower: boni de fusion
narrower: transfert d'actif
narrower: valeur d'apport
narrower: mali de fusion
notation: REFIP2434
related: apport partiel d'actif

taxe sur la valeur ajoutée
type: ConceptReFip
type: Concept
alternative label: TVA
alternative label: taxe sur le chiffre d'affaires
broader: refip-REFIP934
definition: Impôt général sur la consommation qui s'applique aux livraisons de biens et prestations de services situées en France. L'assujettissement à la taxe est déterminé par la nature des opérations effectuées ou des produits concernés, indépendamment de la situation personnelle de l'assujetti ou de son client. La taxe est liquidée de telle sorte qu'à l'issue du circuit économique qui met les biens ou les services à la disposition de l'acquéreur la charge fiscale correspond à la taxe calculée sur le prix de vente final exigé de celui-ci. La taxe afférente à une opération est calculée en appliquant à la base hors TVA, quel que soit son montant, un taux proportionnel de TVA.
in scheme: FINANCES PUBLIQUES
in scheme: Fiscalité
in scheme: Impôt
narrower: taxe sur la valeur ajoutée intracommunautaire
narrower: taxe sur la valeur ajoutée immobilière
narrower: refip-REFIP7215
narrower: refip-REFIP7220
notation: REFIP2435

huissier de justice
type: ConceptReFip
type: Concept
alternative label: huissier
broader: charges et offices
definition: Officier ministériel et officier public chargé des significations, de l'exécution forcée des actes publics, du recouvrement amiable ou judiciaire de toutes créances.
in scheme: FINANCES PUBLIQUES
in scheme: Profession Juridique
in scheme: Droit et Justice
in scheme: Organisation Juridictionnelle
notation: REFIP2436

application ORCHIDEE
type: ConceptReFip
type: Concept
broader: applications gestion publique (non-descripteur)
definition: Outil de recensement des opérations d’inventaire relatives aux charges, immobilisations et produits de l’Etat. Fermeture définitive en juillet 2013.
in scheme: FINANCES PUBLIQUES
in scheme: Applications Informatiques
in scheme: Applications gestion publique
notation: REFIP2437
scope note: Fermeture définitive de l’application Orchidée en juillet 2013 – Remplacée par fonctionnalité CHORUS

Monaco
type: ConceptReFip
type: Concept
alternative label: Principauté de Monaco
broader: Europe
definition: Principauté
in scheme: FINANCES PUBLIQUES
in scheme: Géographie
in scheme: Europe
notation: REFIP2439

fichier immobilier
type: ConceptReFip
type: Concept
broader: documentation fiscale (non-descripteur)
definition: Documentation tenue à jour par les services de publicité foncière, recensant les éléments juridiques relatifs à l'ensemble des propriétés bâties et non bâties. Il est constitué des fiches personnelles de propriétaire, des fiches d'immeuble et des fiches parcellaires.
in scheme: FINANCES PUBLIQUES
in scheme: Documentation Fiscale
in scheme: Fiscalité
notation: REFIP244

application PORTAIL
type: ConceptReFip
type: Concept
alternative label: PMR
alternative label: portail métiers recouvrement
broader: applications fiscales (non-descripteur)
definition: Application comprenant un volet "agents" qui permet l'accès aux applications et à la documentation et un volet "usagers" qui leur permet d'accéder notamment à leur dossier fiscal en ligne.
in scheme: FINANCES PUBLIQUES
in scheme: Applications Informatiques
in scheme: Applications fiscales
notation: REFIP2440

preuve comptable
type: ConceptReFip
type: Concept
broader: procédures et techniques comptables (non-descripteur)
definition: Tout élément physique, écrit ou numérique, permettant de contrôler la qualité des écritures comptables enregistrées ou à enregistrer.
in scheme: FINANCES PUBLIQUES
in scheme: Procédures et Techniques Comptables
in scheme: Comptabilité
notation: REFIP2441

agrément cadastral
type: ConceptReFip
type: Concept
alternative label: retrait d'agrément cadastral
broader: cadastre
definition: Accord donné aux géomètres remplissant certaines conditions pour l'exécution de travaux cadastraux et/ou l'établissement de documents d'arpentage.
in scheme: FINANCES PUBLIQUES
in scheme: Cadastre
in scheme: Fiscalité
notation: REFIP2442

droit de reprise de l'administration
type: ConceptReFip
type: Concept
definition: Droit de l’administration fiscale de rectifier les erreurs ou les omissions qu’elle a constatées dans l’assiette ou le calcul de l’impôt, pendant le délai de reprise.
in scheme: FINANCES PUBLIQUES
in scheme: Droit de Reprise de l'Administration
in scheme: Fiscalité
narrower: redressement fiscal
narrower: garantie accordée à l'usager
narrower: procédure de contrôle fiscal
narrower: délai de reprise
narrower: sanction fiscale
narrower: refip-REFIP7089
narrower: refip-REFIP7090
narrower: refip-REFIP7131
notation: REFIP2443

application APTERA
type: ConceptReFip
type: Concept
alternative label: APTERA
broader: applications missions transverses (non-descripteur)
definition: Application permettant la gestion des habilitations des agents aux applications de l'ex DG-CP. Supprimée en 2013 et remplacée par MADRHAS.
in scheme: FINANCES PUBLIQUES
in scheme: Applications missions transverses
in scheme: Applications Informatiques
notation: REFIP2444

injonction de payer
type: ConceptReFip
type: Concept
broader: injonction
definition: Ordre de s'acquitter d'une dette de somme d'argent donné par le juge au débiteur.
in scheme: FINANCES PUBLIQUES
in scheme: Principes Généraux
in scheme: Droit et Justice
in scheme: Procédure
notation: REFIP2445

comité technique de service déconcentré
type: ConceptReFip
type: Concept
alternative label: CTL
alternative label: Comité technique local
broader: organisme consultatif et représentatif (non-descripteur)
definition: Instance de concertation de proximité visant à renforcer la qualité du dialogue social. Le comité est consulté sur des questions d’ordre collectif concernant les services déconcentrés des administrations de l'Etat.
in scheme: FINANCES PUBLIQUES
in scheme: Organisation Structurelle de l'Etat
in scheme: Organisme Consultatif et Représentatif
in scheme: Administration de L'Etat
notation: REFIP2446

droit de communication
type: ConceptReFip
type: Concept
broader: droit de contrôle de l'administration (non-descripteur)
definition: Droit reconnu à l'administration fiscale de prendre connaissance et, au besoin, copie de documents détenus par des tiers.
in scheme: FINANCES PUBLIQUES
in scheme: Droit de Contrôle de l'Administration
in scheme: Fiscalité
notation: REFIP2447
scope note: Fiscalité

recettes de l'Etat
type: ConceptReFip
type: Concept
broader: refip-REFIP880
definition: Ensemble des ressources à la disposition de l’État pour la mise en œuvre des politiques publiques. Chaque année, elles sont synthétisées dans le budget de l’État. L’essentiel de ces ressources vient des recettes fiscales - constituées d’impôts directs ou indirects prélevés à la fois sur les citoyens et les entreprises. Ses autres recettes proviennent de recettes non fiscales telles que le produit des amendes ou des jeux et de l’emprunt.
in scheme: FINANCES PUBLIQUES
in scheme: Budget de l’État
in scheme: Budget
narrower: recettes fiscales de l'Etat
narrower: recettes non fiscales de l'Etat
narrower: recettes de l'Etat étrangères à l'impôt et au domaine
notation: REFIP2448

bénéfice agricole
type: ConceptReFip
type: Concept
alternative label: BA
broader: revenu catégoriel
definition: Résultat net taxable de l'exploitation de biens ruraux.
in scheme: FINANCES PUBLIQUES
in scheme: Champ d'Application
in scheme: Fiscalité
notation: REFIP2450

défaillant déclaratif
type: ConceptReFip
type: Concept
broader: civisme fiscal
definition: Contribuable ne déposant pas sa déclaration dans les délais légaux.
in scheme: FINANCES PUBLIQUES
in scheme: Fiscalité - Autres notions
in scheme: Fiscalité
narrower: retard de déclaration fiscale
narrower: relance des défaillants déclaratifs
narrower: refip-REFIP7015
notation: REFIP2452

barème kilométrique
type: ConceptReFip
type: Concept
alternative label: barème fiscal des indemnités kilométriques
alternative label: barème indemnités kilométriques
alternative label: frais kilométriques
broader: évaluation forfaitaire
definition: Grille permettant de calculer les frais kilométriques du contribuable, en fonction de formules préétablies qui prennent en compte le nombre de kilomètres parcourus et la puissance fiscale du véhicule.
in scheme: FINANCES PUBLIQUES
in scheme: Liquidation de l'Impôt
in scheme: Fiscalité
narrower: barème kilométrique forfaitaire
notation: REFIP2453

Code des communes
type: ConceptReFip
type: Concept
broader: documentation juridique (non-descripteur)
definition: Ensemble des lois relatives au droit des communes françaises. Il traite de l'organisation des communes, de l'emploi du personnel communal, notamment en cas de fusion de communes, mais également des cas particuliers concernant, par exemple, les communes des départements de la Moselle, du Bas-Rhin et du Haut-Rhin, ou la commune de Paris.
in scheme: FINANCES PUBLIQUES
in scheme: Droit et Justice
in scheme: Documentation Juridique
in scheme: Sources du Droit
notation: REFIP2454

Géorgie
type: ConceptReFip
type: Concept
broader: Asie
definition: Pays
in scheme: FINANCES PUBLIQUES
in scheme: Géographie
in scheme: Asie
notation: REFIP2455

Bulletin officiel des impôts
type: ConceptReFip
type: Concept
alternative label: BOI
broader: bulletin officiel
definition: Ancienne publication périodique rédigée et éditée par la Direction générale des Impôts remplacée par le Bulletin Officiel des Finances Publiques-Impôts (BOFiP-Impôts).
in scheme: FINANCES PUBLIQUES
in scheme: Documentation
in scheme: Communication Documentation Informatique
notation: REFIP2457
scope note: Remplacé par BOFIPI à compter du 12/09/2012

situation mensuelle des recettes
type: ConceptReFip
type: Concept
alternative label: SMR
broader: refip-REFIP982
definition: Document présentant les recettes du budget général et des comptes spéciaux au niveau le plus fin de la nomenclature,
in scheme: FINANCES PUBLIQUES
in scheme: Documentation budgétaire
in scheme: Budget
notation: REFIP2458

groupement de communes
type: ConceptReFip
type: Concept
broader: coopération intercommunale
definition: Structure intercommunale à fiscalité propre ayant la possibilité de lever l'impôt (taxe d'habitation, taxe sur le foncier bâti et le foncier non bâti, taxe professionnelle jusqu'en 2009 et la taxe d'enlèvement des ordures ménagères).
in scheme: FINANCES PUBLIQUES
in scheme: Secteur public local
in scheme: Gestion Publique
notation: REFIP2459

subdélégation d'autorisation de programme individualisée (supprimé)
type: ConceptReFip
type: Concept
broader: ZZ
in scheme: FINANCES PUBLIQUES
notation: REFIP2460

trafic de stupéfiants
type: ConceptReFip
type: Concept
alternative label: drogue
alternative label: stupéfiants
alternative label: trafic de drogue
broader: délit
definition: Commerce international illicite comprenant la culture, la fabrication, la distribution et la vente de substances psychotropes interdites par la loi.
in scheme: FINANCES PUBLIQUES
in scheme: Droit et Justice
in scheme: Infractions et Sanctions
in scheme: Infraction
notation: REFIP2461
related: blanchiment
related: TRACFIN

actif immatériel
type: ConceptReFip
type: Concept
alternative label: capital immatériel
alternative label: patrimoine immatériel
broader: actif
definition: Actif identifiable séparément et participant à la rentabilité présente et future de l'entreprise. Il existe différentes catégories de facteurs d’appréciation, le capital humain et le capital relationnel qui représente le capital généré par les relations vers l’extérieur de l’entreprise, avec les clients, les actionnaires, les partenaires, les fournisseurs.
in scheme: FINANCES PUBLIQUES
in scheme: Documents comptables
in scheme: Comptabilité
notation: REFIP2462
related: immobilisation incorporelle

plan de contrôle
type: ConceptReFip
type: Concept
broader: contrôle interne
definition: Document formalisant les choix en matière d'opérations de contrôle.
in scheme: FINANCES PUBLIQUES
in scheme: Missions Transverses des Finances publiques
in scheme: Maîtrise des risques
narrower: plan national de contrôle interne
narrower: plan départemental de contrôle interne
notation: REFIP2463

concurrence déloyale
type: ConceptReFip
type: Concept
broader: concurrence
definition: Ensemble de procédés commerciaux contraires à la loi ou aux usages, constitutifs d'une faute intentionnelle ou non et de nature à causer un préjudice aux concurrents.
in scheme: FINANCES PUBLIQUES
in scheme: Questions Economiques
in scheme: Economie générale
notation: REFIP2465

société civile de placements immobiliers
type: ConceptReFip
type: Concept
alternative label: SCPI
broader: société civile
definition: Entité ayant pour objet de gérer exclusivement un patrimoine immobilier locatif.
in scheme: FINANCES PUBLIQUES
in scheme: Société
in scheme: Entreprises
in scheme: Forme juridique
notation: REFIP247

contrôle a priori
type: ConceptReFip
type: Concept
alternative label: contrôle contemporain
broader: contrôle interne
definition: Contrôle intégré au déroulement d'une procédure pouvant conduire au rejet d'une opération avant sa validation. Ces opérations de contrôle prennent deux formes : une validation informatique des opérations et une validation de documents au vu des pièces justificatives.
in scheme: FINANCES PUBLIQUES
in scheme: Missions Transverses des Finances publiques
in scheme: Maîtrise des risques
notation: REFIP2470

dépenses publiques
type: ConceptReFip
type: Concept
broader: gestion publique
definition: Ensemble des dépenses effectuées par l’État, les administrations de Sécurité sociale, les collectivités territoriales et les administrations et organismes qui leur sont rattachés
in scheme: FINANCES PUBLIQUES
in scheme: Dépenses publiques
in scheme: Gestion Publique
narrower: dépenses de l'Etat
narrower: contrôle hiérarchisé de la dépense
narrower: aide publique
narrower: investissement public
narrower: exécution de la dépense (non-descripteur)
narrower: refip-REFIP697
notation: REFIP2471

groupement de prévention agréé
type: ConceptReFip
type: Concept
broader: refip-REFIP688
definition: Groupement fournit à ses adhérents, de façon confidentielle, une analyse comptable et financière des informations que ceux-ci s'engagent à lui transmettre. Lorsqu'il détecte des indices de difficultés, il en informe l'adhérent et peut lui proposer l'intervention d'un expert.Les administrations prêtent leur concours aux groupements de prévention agréés. La Banque de France peut aussi être appelée à donner des avis sur la situation financière des adhérents.Les groupements de prévention agréés sont habilités à conclure des conventions au profit de leurs adhérents, notamment avec les banques et les assurances.
in scheme: FINANCES PUBLIQUES
in scheme: Entreprises
in scheme: Forme juridique
in scheme: Association
notation: REFIP2473

Creuse
type: ConceptReFip
type: Concept
broader: refip-REFIP7020
definition: Département français
in scheme: FINANCES PUBLIQUES
in scheme: Géographie
in scheme: Europe
notation: REFIP2476

rénovation du cadastre
type: ConceptReFip
type: Concept
alternative label: rénovation cadastrale
broader: remaniement du cadastre
definition: Opérations effectuées soit par voie de révision lorsqu'il peut être procédé à une simple mise à jour du plan cadastral, soit par voie de réfection reposant sur un nouvel arpentage parcellaire.
in scheme: FINANCES PUBLIQUES
in scheme: Cadastre
in scheme: Fiscalité
notation: REFIP2478

frais d'hébergement
type: ConceptReFip
type: Concept
broader: refip-REFIP6766
definition: Frais d'hébergement faisant l'objet d'une prise en charge totale ou partielle par l'administration, occasionnés lors de déplacements des personnels de la Fonction publique.
in scheme: FINANCES PUBLIQUES
in scheme: Gestion des ressources humaines
in scheme: Fonction Publique et Gestion des Ressources Humaines
notation: REFIP2479

fraude carrousel
type: ConceptReFip
type: Concept
broader: fraude fiscale
definition: Montage frauduleux en matière de TVA apparu sous diverses formes avec l'émergence des échanges intracommunautaires de biens. Consiste par exemple à insérer au sein d'une chaîne de transactions opérées entre plusieurs États membres, une entreprise éphémère dont la fonction est d'acquérir des biens en exonération de TVA et de facturer de la TVA lors de la revente de ces mêmes biens, sans la déclarer ni la reverser à l'administration fiscale. L'acheteur de l'entreprise éphémère bénéficie, dans les conditions de droit commun, d'un droit à déduction de TVA à hauteur de la TVA facturée par la société éphémère et ce, alors que cette dernière n'a ni déclaré ni reversé de TVA sur cette opération.
in scheme: FINANCES PUBLIQUES
in scheme: Droit de Contrôle de l'Administration
in scheme: Fiscalité
notation: REFIP2480

falsification
type: ConceptReFip
type: Concept
broader: fraude
definition: Altération, dénaturation, modification intentionnelle d'une chose ou d'un document en vue de tromper.
in scheme: FINANCES PUBLIQUES
in scheme: Droit et Justice
in scheme: Infractions et Sanctions
in scheme: Infraction
narrower: fausse monnaie
notation: REFIP2481

application UTAH
type: ConceptReFip
type: Concept
alternative label: UTAH
alternative label: outil d'analyse des OPH
broader: applications gestion publique (non-descripteur)
definition: Élaboration du tableau de bord financier des Offices Publics de l'Habitat.
in scheme: FINANCES PUBLIQUES
in scheme: Applications Informatiques
in scheme: Applications gestion publique
notation: REFIP2482

droit social
type: ConceptReFip
type: Concept
broader: droit privé
definition: Ensemble des règles régissant les relations individuelles et collectives de travail : droit du travail, droit de la Sécurité Sociale et de la mutualité et droit de l'action sociale de l'État (l'aide sociale).
in scheme: FINANCES PUBLIQUES
in scheme: Droit et Justice
in scheme: Divisions du Droit
in scheme: Droit Privé
narrower: affiliation
narrower: droit du travail
notation: REFIP2484

taxe intérieure de consommation sur les produits énergétiques
type: ConceptReFip
type: Concept
alternative label: TICPE
alternative label: TIPP
alternative label: taxe intérieure sur les produits pétroliers
broader: autres taxes, droits ou redevances (non-descripteur)
definition: Taxe supportée par les produits pétroliers, visant un certain nombre de produits dont la liste est commune à tous les Etats membres de l'Union européenne. Seuls sont taxés les usages en tant que carburant ou combustible de chauffage. La TICPE s'applique aussi à tout produit qui est destiné à être utilisé, qui est mis en vente ou qui est utilisé comme carburant pour moteur, comme additif ou en vue d'accroître le volume final des carburants pour moteur; et à tout hydrocarbure qui est destiné à être utilisé, qui est utilisé ou qui est mis en vente pour le chauffage, à l'exception des hydrocarbures solides tels que le charbon, la tourbe ou le lignite, et à l'exception du gaz naturel.
in scheme: FINANCES PUBLIQUES
in scheme: Fiscalité
in scheme: Impôt
notation: REFIP2485
scope note: Loi de finances du 29/12/2010

application SATELIT
type: ConceptReFip
type: Concept
alternative label: SATELIT
broader: applications fiscales (non-descripteur)
definition: Système d'adhésion et de modification aux prélèvements automatiques (mensualisation et prélèvement à l'échéance) et de télérèglement de l'impôt.
in scheme: FINANCES PUBLIQUES
in scheme: Applications Informatiques
in scheme: Applications fiscales
notation: REFIP2486

commission d'organisation et de contrôle des opérations électorales
type: ConceptReFip
type: Concept
broader: autorité administrative indépendante
definition: Commission de contrôle chargée de vérifier la régularité de la composition des bureaux de vote ainsi que celle des opérations de vote, de dépouillement des bulletins et de dénombrement des suffrages et de garantir aux électeurs ainsi qu'aux candidats ou listes en présence le libre exercice de leurs droits, instituée dans toutes les communes de plus de 20 000 habitants.
in scheme: FINANCES PUBLIQUES
in scheme: Organisation Structurelle de l'Etat
in scheme: Autorité Administrative
in scheme: Administration de L'Etat
notation: REFIP2487

avis
type: ConceptReFip
type: Concept
broader: mots outils (liste additive)
definition: Information émanant d'une autorité officielle ou d'un particulier.
in scheme: FINANCES PUBLIQUES
in scheme: Mots Outils
notation: REFIP2489

Indonésie
type: ConceptReFip
type: Concept
broader: Asie
definition: Pays
in scheme: FINANCES PUBLIQUES
in scheme: Géographie
in scheme: Asie
notation: REFIP249

taxe parafiscale
type: ConceptReFip
type: Concept
broader: autres taxes, droits ou redevances (non-descripteur)
definition: Impôt prélevé au profit d’un établissement public d’intérêt social ou économique. Cette imposition a été supprimée en 2004.
in scheme: FINANCES PUBLIQUES
in scheme: Fiscalité
in scheme: Impôt
notation: REFIP2491
scope note: Supprimée en 2004

gage
type: ConceptReFip
type: Concept
broader: sûreté réelle
definition: Convention par laquelle le constituant accorde à un créancier le droit de se faire payer par préférence à ses autres créanciers sur un bien mobilier, sur un ensemble de biens mobiliers corporels présents ou futurs ou sur un bien immobilier.
in scheme: FINANCES PUBLIQUES
in scheme: Recouvrement
in scheme: Fiscalité
notation: REFIP2493

association pour la formation professionnelle des adultes
type: ConceptReFip
type: Concept
alternative label: AFPA
broader: organisme privé assurant service public (non-descripteur)
definition: Organisme de formation professionnelle régie par la loi du 1er juillet 1901, sa gouvernance est assurée paritairement par l’Etat, les Régions, les partenaires sociaux et des personnalités qualifiées. Les formations de l’AFPA sont ouvertes aux demandeurs d’emploi et aux salariés, sanctionnées par un titre Professionnel, délivré par le ministère de l’Emploi.
in scheme: FINANCES PUBLIQUES
in scheme: Organisation Structurelle de l'Etat
in scheme: Organisme Privé Assurant Service Public
in scheme: Administration de L'Etat
notation: REFIP2494

responsabilité personnelle
type: ConceptReFip
type: Concept
broader: responsabilité civile
definition: Tout fait d'une personne qui cause à autrui un dommage, oblige celle-ci à le réparer. Chacun est responsable du dommage qu'il a causé non seulement par son fait, mais encore par sa négligence ou par son imprudence.
in scheme: FINANCES PUBLIQUES
in scheme: Droit et Justice
in scheme: Divisions du Droit
in scheme: Droit Privé
notation: REFIP2495

décision modificative
type: ConceptReFip
type: Concept
broader: finances locales (non-descripteur)
definition: Décision de l'assemblée délibérante d'une collectivité territoriale permettant de corriger des prévisions budgétaires qui se révèlent inadaptées après l'ajustement opéré par le budget supplémentaire.
in scheme: FINANCES PUBLIQUES
in scheme: Secteur public local
in scheme: Gestion Publique
notation: REFIP2496

Finlande
type: ConceptReFip
type: Concept
broader: Europe
definition: Pays
in scheme: FINANCES PUBLIQUES
in scheme: Géographie
in scheme: Europe
notation: REFIP2497

prescription extinctive
type: ConceptReFip
type: Concept
broader: prescription
definition: Mode d’extinction d’un droit résultant de l’inaction de son titulaire dans un délai précis.
in scheme: FINANCES PUBLIQUES
in scheme: Droit et Justice
in scheme: Droit Général
notation: REFIP2498

cessation d'activité
type: ConceptReFip
type: Concept
broader: vie de l'entreprise (non-descripteur)
definition: Abandon de l'ensemble de l'activité industrielle et commerciale d'une entreprise. Elle peut résulter, notamment de la fermeture définitive du ou des établissements dans lesquels était exercée l'activité ou en ce qui concerne les sociétés, de leur dissolution ou de leur transformation entraînant la création d'une personne morale nouvelle. La cessation d'entreprise est considérée comme partielle lorsqu'un contribuable, ayant plusieurs branches d'activité ou plusieurs établissements, abandonne l'une de ces branches d'activité ou l'un de ces établissements.
in scheme: FINANCES PUBLIQUES
in scheme: Vie de l'Entreprise
in scheme: Entreprises
in scheme: Vie et Gestion de l'entreprise
notation: REFIP2499

quorum
type: ConceptReFip
type: Concept
broader: droit général (non-descripteur)
definition: Nombre minimal de membres d'un corps délibératif nécessaire à la validité d'une décision.
in scheme: FINANCES PUBLIQUES
in scheme: Droit et Justice
in scheme: Droit Général
notation: REFIP25

comptabilité générale de l'Etat
type: ConceptReFip
type: Concept
alternative label: comptabilité de l'Etat
definition: Comptabilité fondée sur le principe de la constatation des droits et des obligations, les opérations sont prises en compte au titre de l'exercice auquel elles se rattachent.
in scheme: FINANCES PUBLIQUES
in scheme: Comptabilité générale de l'Etat
in scheme: Comptabilité
narrower: compte d'avance
narrower: trajectoire comptable
narrower: comptabilité auxiliaire
narrower: refip-REFIP968
notation: REFIP250

Ministère de l'Economie et des Finances
type: ConceptReFip
type: Concept
alternative label: Ministère de l'Economie de l'Industrie et de l'Emploi
alternative label: Ministère de l'Economie de l'Industrie et du Numérique
alternative label: Ministère de l'Economie du Redressement productif et du Numérique
alternative label: Ministère de l'Economie et de l'Industrie
alternative label: Ministère de l'Industrie
alternative label: Ministère des Finances
alternative label: ministère de l'Economie
alternative label: ministère de l'Economie des Finances et de l'Industrie
alternative label: ministère des Finances et des Comptes publics
broader: ministère
definition: Administration chargée de préparer et de mettre en œuvre la politique du Gouvernement en matière économique, financière, de consommation et de répression des fraudes ainsi qu'en matière d'industrie, de services, de petites et moyennes entreprises, d'artisanat, de commerce, de postes et communications électroniques, de suivi et de soutien des activités touristiques. A ce titre, le ministre définit les mesures propres à promouvoir la croissance et la compétitivité de l'économie française et à encourager et orienter l'investissement. Il est responsable de la préparation des scénarios macro-économiques pour la France et son environnement international. Il est compétent pour le financement des entreprises en dette et en fonds propres, en particulier des petites et moyennes entreprises et des entreprises de taille intermédiaire. Il est responsable de la politique en faveur de la création d'entreprises et de la simplification des formalités leur incombant. Il exerce la tutelle des établissements des réseaux des chambres de métiers et de l'artisanat et des chambres de commerce et d'industrie.
in scheme: FINANCES PUBLIQUES
in scheme: Organisation Structurelle de l'Etat
in scheme: Ministère
in scheme: Administration de L'Etat
narrower: Inspection générale des finances
narrower: Direction de la législation fiscale
narrower: contrôle général économique et financier de l'Etat
narrower: Direction des affaires juridiques
narrower: Agence du patrimoine immatériel de l'Etat
narrower: commission centrale des impôts directs
narrower: commission des infractions fiscales
narrower: Institut national de la statistique et des études économiques
narrower: Comité du contentieux fiscal douanier et des changes
narrower: association française de cautionnement mutuel
narrower: Direction générale des entreprises
narrower: médiateur des ministères économiques et financiers
narrower: Direction générale du Trésor
narrower: service de contrôle budgétaire et comptable ministériel
narrower: Autorité des normes comptables
narrower: secrétariat général des ministères économiques et financiers
narrower: refip-REFIP7012
narrower: refip-REFIP775
notation: REFIP2500
scope note: Du 21/06/2012 au 31/03/2014 et depuis le 30/08/2016

société étrangère
type: ConceptReFip
type: Concept
alternative label: entreprise étrangère
broader: société
definition: Entreprise dont le siège social est à l’étranger. Les démarches à effectuer pour exercer une activité en France sont différentes selon qu'elle possède un établissement stable ou qu'elle emploie des salariés.
in scheme: FINANCES PUBLIQUES
in scheme: Société
in scheme: Entreprises
in scheme: Forme juridique
notation: REFIP2501

situation intermédiaire des comptes de l'Etat
type: ConceptReFip
type: Concept
alternative label: arrêté intermédiaire des comptes de l'Etat
alternative label: situation intermédiaire
broader: refip-REFIP968
definition: Arrêté de compte réalisé pendant l'exercice comptable.
in scheme: FINANCES PUBLIQUES
in scheme: Comptabilité générale de l'Etat
in scheme: Comptabilité
notation: REFIP2502

application SAFI
type: ConceptReFip
type: Concept
alternative label: SAFI
alternative label: SAFID
alternative label: SAFIEPSMS
alternative label: SAFIR
alternative label: SAFISDIS
alternative label: application SAFID
alternative label: application SAFIEPSMS
alternative label: application SAFIR
alternative label: application SAFISDIS
alternative label: outil de simplification de l'analyse financière
broader: applications gestion publique (non-descripteur)
definition: Outil permettant la réalisation d'analyse financière rétrospective par catégorie de collectivités et la réalisation d'analyse consolidée sous réserve de retraitement des opérations réciproques.
in scheme: FINANCES PUBLIQUES
in scheme: Applications Informatiques
in scheme: Applications gestion publique
notation: REFIP2503

lexique
type: ConceptReFip
type: Concept
broader: document
definition: Ensemble de termes d'un domaine de la connaissance, classés dans l'ordre alphabétique.
in scheme: FINANCES PUBLIQUES
in scheme: Documentation
in scheme: Communication Documentation Informatique
notation: REFIP2504

sûreté réelle
type: ConceptReFip
type: Concept
broader: refip-REFIP877
definition: Garantie offrant au créancier un droit sur un bien, meuble ou immeuble, qui lui permet d'obtenir paiement de sa créance, sur le produit de la vente de ce bien, en cas de défaillance du débiteur.
in scheme: FINANCES PUBLIQUES
in scheme: Recouvrement
in scheme: Fiscalité
narrower: privilège du Trésor
narrower: gage
narrower: hypothèque
narrower: nantissement
notation: REFIP2505

dénonciation du forfait agricole
type: ConceptReFip
type: Concept
broader: régime d'imposition au forfait
definition: Dénonciation par le service des finances publiques en vue de substituer le régime du forfait agricole au régime simplifié d'imposition (régime supérieur) d'après le bénéfice réel, pour l'ensemble des exploitations agricoles du contribuable. La dénonciation - qui n’est pas rétroactive - reste valable tant que les faits qui l’ont motivée subsistent. L’administration doit informer l’exploitant avant le 1er janvier de l’année d’imposition (à titre conservatoire) et la dénonciation ne devient effective que si les conditions qui l’ont motivée sont bien remplies au cours de l’année d’imposition.
in scheme: FINANCES PUBLIQUES
in scheme: Régime d'Imposition
in scheme: Fiscalité
notation: REFIP2506

taxe sur les véhicules de sociétés
type: ConceptReFip
type: Concept
alternative label: TVS
alternative label: TVTS
alternative label: taxe sur les voitures particulières des sociétés
broader: autres taxes, droits ou redevances (non-descripteur)
definition: Taxe due chaque année par les sociétés qui possèdent ou utilisent des voitures particulières (destinées au transport de passagers) ou à usage multiple (destinées principalement au transport de personnes). Le montant de la taxe diffère selon le type de véhicules.
in scheme: FINANCES PUBLIQUES
in scheme: Fiscalité
in scheme: Impôt
notation: REFIP2507

organisation d'insolvabilité
type: ConceptReFip
type: Concept
broader: fraude fiscale
definition: Manœuvre destinée à permettre à un contribuable de faire échec au recouvrement des impôts qu'il doit, en dissimulant son patrimoine.
in scheme: FINANCES PUBLIQUES
in scheme: Droit de Contrôle de l'Administration
in scheme: Fiscalité
narrower: insolvabilité
notation: REFIP251

mission interministérielle d'inspection du logement social (supprimé)
type: ConceptReFip
type: Concept
broader: ZZ
in scheme: FINANCES PUBLIQUES
notation: REFIP2510

recueil des actes administratifs
type: ConceptReFip
type: Concept
broader: document administratif
definition: Bulletin officiel d’une préfecture ou d’une collectivité locale qui regroupe les documents administratifs émanant des services de l’État dans ce département ainsi que les actes réglementaires pris par les assemblées délibérantes et leurs exécutifs, dans les communes de 3500 habitants et plus.
in scheme: FINANCES PUBLIQUES
in scheme: Documentation
in scheme: Communication Documentation Informatique
notation: REFIP2511

restitution de garantie
type: ConceptReFip
type: Concept
broader: recouvrement
definition: Remise des garanties prises par l'administration auprès d'un redevable reliquataire.
in scheme: FINANCES PUBLIQUES
in scheme: Recouvrement
in scheme: Fiscalité
notation: REFIP2512

Autorité publique indépendante
type: ConceptReFip
type: Concept
alternative label: API
broader: autorité administrative
definition: Autorité administrative indépendante (AAI) dotée de la personnalité morale, institution de l’État, chargée par le législateur d'une mission de service d'intérêt général, par exemple celle de la protection des œuvres sur internet.
in scheme: FINANCES PUBLIQUES
in scheme: Organisation Structurelle de l'Etat
in scheme: Autorité Administrative
in scheme: Administration de L'Etat
narrower: Haute autorité de santé
narrower: Autorité des marchés financiers
notation: REFIP2513

Agence de services et de paiement
type: ConceptReFip
type: Concept
alternative label: ASP
alternative label: CNASEA
alternative label: Centre national pour l'aménagement des structures des exploitations agricoles
broader: établissement public à caractère administratif
definition: Etablissement public à caractère administratif interministériel contribuant à la mise en œuvre de politiques publiques locales, nationales et européennes, en appuyant les décideurs publics. Il assure la gestion administrative et financière des aides publiques. A ce titre, il peut instruire les demandes d'aides, vérifier leur éligibilité, contrôler le respect des engagements pris par les bénéficiaires, exécuter les paiements, le recouvrement et l'apurement des indus.
in scheme: FINANCES PUBLIQUES
in scheme: Organisation Structurelle de l'Etat
in scheme: Opérateur de l'Etat
in scheme: Administration de L'Etat
notation: REFIP2514

document administratif unique
type: ConceptReFip
type: Concept
alternative label: DAU
broader: pièce comptable
definition: Formulaire obligatoire qui doit être rempli, aussi bien à l'import qu'à l'export, pour toutes les opérations entre l'Union européenne, dans les pays de l'AELE (Islande, Liechtenstein, Norvège et Suisse), dans les parties du territoire douanier de l'Union exclues du territoire fiscal (les DOM français, les îles finlandaises d'Aland, Anglo-Normandes, Canaries et l'île de Man), les pays en union douanière avec la Communauté (Andorre et Saint-Marin) et un pays tiers.
in scheme: FINANCES PUBLIQUES
in scheme: Documents comptables
in scheme: Comptabilité
notation: REFIP2515

impôts et taxes affectés
type: ConceptReFip
type: Concept
alternative label: ITAF
alternative label: impositions et taxes affectées
broader: impôt
definition: Ressources fiscales affectées au financement des prestations sociales ou au financement des dépenses spécifiques de certains régimes d’assurances sociales.
in scheme: FINANCES PUBLIQUES
in scheme: Fiscalité
in scheme: Impôt
narrower: contribution additionnelle de solidarité pour l'autonomie
narrower: contribution solidarité autonomie
narrower: contribution additionnelle au prélèvement social
notation: REFIP2519

charges constatées d'avance
type: ConceptReFip
type: Concept
broader: actif
definition: Charges enregistrées au cours de l'exercice mais qui correspondent à des achats de biens ou services dont la fourniture ou la prestation doit intervenir ultérieurement.
in scheme: FINANCES PUBLIQUES
in scheme: Documents comptables
in scheme: Comptabilité
notation: REFIP252

Institut français du cheval et de l'équitation
type: ConceptReFip
type: Concept
alternative label: haras national
broader: établissement public à caractère administratif
definition: Etablissement public à caractère administratif, l'Institut français du cheval et de l'équitation est issu de la fusion de deux établissements publics, les Haras nationaux et l'École nationale d'équitation. L'établissement a pour mission de transférer les savoirs relatifs au cheval et à l’équitation ; de soutenir l’équitation et le sport de haut niveau ; d'assurer la traçabilité et l’information sur le cheval. L’institut constitue l’opérateur public pour toute la filière équine, de l’élevage du cheval à l’équitation et au sport de haut niveau. Il intervient aussi bien au niveau national, qu’européen et international.
in scheme: FINANCES PUBLIQUES
in scheme: Organisation Structurelle de l'Etat
in scheme: Opérateur de l'Etat
in scheme: Administration de L'Etat
notation: REFIP2521

publicité foncière
type: ConceptReFip
type: Concept
broader: fiscalité du patrimoine
definition: Ensemble des règles, des techniques et des modalités de mise en œuvre concourant, en vue, généralement, de la production d'effets de droit, à assurer la collecte, la conservation et la délivrance d'informations juridiques sur les immeubles (droits réels, principaux ou accessoires, et certains droits personnels représentant des charges importantes).
in scheme: FINANCES PUBLIQUES
in scheme: Champ d'Application
in scheme: Fiscalité
narrower: conformité absolue
narrower: dépôt d'acte
notation: REFIP2525

Drôme
type: ConceptReFip
type: Concept
broader: Auvergne-Rhône-Alpes
definition: Département français
in scheme: FINANCES PUBLIQUES
in scheme: Géographie
in scheme: Europe
notation: REFIP2526

Banque de France
type: ConceptReFip
type: Concept
alternative label: BDF
broader: institutions (non-descripteur)
definition: Institution indépendante régie par le droit public français et européen, membre de l’Eurosystème, système fédéral qui regroupe la Banque centrale européenne et des banques centrales nationales de la zone euro. Elle est régie par les dispositions du code monétaire et financier. Les conditions dans lesquelles elle exerce ses missions sur le territoire national sont définies par le Contrat de service public.Ses trois grandes missions sont la stratégie monétaire, la stabilité financière et le service économique à la collectivité.
in scheme: FINANCES PUBLIQUES
in scheme: Organisation Structurelle de l'Etat
in scheme: Institutions
in scheme: Administration de L'Etat
narrower: commission de surendettement des particuliers
narrower: Fichier national des incidents de remboursement des crédits aux particuliers
notation: REFIP2527

exigibilité
type: ConceptReFip
type: Concept
broader: recouvrement
definition: Droit reconnu à l'Administration fiscale d'obtenir ou de réclamer le paiement de la taxe ou de l'impôt à une date donnée.
in scheme: FINANCES PUBLIQUES
in scheme: Recouvrement
in scheme: Fiscalité
narrower: exigibilité immédiate
narrower: date d'exigibilité
narrower: suspension de l'exigibilité des créances
notation: REFIP2528

portail de la gestion publique
type: ConceptReFip
type: Concept
alternative label: PIGP
alternative label: portail gestion publique
broader: applications missions transverses (non-descripteur)
definition: Portail internet dédié aux collectivités permettant l'accès à différents services offerts par la DGFiP.
in scheme: FINANCES PUBLIQUES
in scheme: Applications missions transverses
in scheme: Applications Informatiques
notation: REFIP2529

nullité
type: ConceptReFip
type: Concept
broader: droit général (non-descripteur)
definition: Sanction prononcée par le juge et consistant dans la disparition rétroactive de l'acte juridique qui ne remplit pas les conditions requises pour sa formation.
in scheme: FINANCES PUBLIQUES
in scheme: Droit et Justice
in scheme: Droit Général
notation: REFIP2530

Madagascar
type: ConceptReFip
type: Concept
broader: Afrique
definition: Pays
in scheme: FINANCES PUBLIQUES
in scheme: Géographie
in scheme: Afrique
notation: REFIP2532

autorité administrative indépendante
type: ConceptReFip
type: Concept
broader: autorité administrative
definition: Institution de l’État chargée, en son nom, d’assurer la régulation de secteurs considérés comme essentiels et pour lesquels le Gouvernement veut éviter d’intervenir trop directement. Les AAI sont une catégorie juridique relativement nouvelle car, contrairement à la tradition administrative française, elles ne sont pas soumises à l’autorité hiérarchique d’un ministre.
in scheme: FINANCES PUBLIQUES
in scheme: Organisation Structurelle de l'Etat
in scheme: Autorité Administrative
in scheme: Administration de L'Etat
narrower: Commission nationale de l'informatique et des libertés
narrower: Autorité de régulation des communications électroniques et des postes
narrower: commission d'organisation et de contrôle des opérations électorales
narrower: Défenseur des droits
narrower: Autorité de contrôle prudentiel
narrower: Commission d'accès aux documents administratifs
narrower: refip-REFIP907
notation: REFIP2533

commission consultative des services publics locaux (supprimé)
type: ConceptReFip
type: Concept
broader: ZZ
in scheme: FINANCES PUBLIQUES
notation: REFIP2534

taxe d'habitation
type: ConceptReFip
type: Concept
alternative label: TH
broader: impôt direct local
definition: Impôt direct établi d’après la situation au 1er janvier de l’année d’imposition au nom des personnes physiques ou morales qui ont, à quelque titre que ce soit, la disposition ou la jouissance à titre privatif des locaux imposables.
in scheme: FINANCES PUBLIQUES
in scheme: Fiscalité
in scheme: Impôt
notation: REFIP2536

liste de diffusion
type: ConceptReFip
type: Concept
broader: outil collaboratif
definition: Carnet d'adresses permettant à un expéditeur de diffuser des informations par une messagerie électronique au sein d’un groupe d’utilisateurs identifiés à travers une seule adresse électronique.
in scheme: FINANCES PUBLIQUES
in scheme: Communication
in scheme: Communication Documentation Informatique
notation: REFIP2537
related: application SYMPA

rénovation de bâtiments
type: ConceptReFip
type: Concept
alternative label: rénovation énergétique
alternative label: rénovation énergétique des bâtiments publics
alternative label: travaux de rénovation
broader: construction
definition: Opération par laquelle un bâtiment ou l'un de ses éléments voit sa condition améliorée, par l'utilisation de matériaux neufs, modernes en remplacement des parties endommagées.
in scheme: FINANCES PUBLIQUES
in scheme: Branche d'activité
in scheme: Questions Economiques
in scheme: Construction
narrower: travaux d'amélioration
notation: REFIP254
related: refip-REFIP6549

fiabilisation des comptes
type: ConceptReFip
type: Concept
alternative label: fiabilisation comptable
broader: procédures et techniques comptables (non-descripteur)
definition: Action, autorisée par la réglementation budgétaire et comptable en vigueur, qui accroît la régularité et la sincérité des comptes, ainsi que la fidélité de l'image du résultat de la gestion, du patrimoine et de la situation financière des collectivités territoriales ou de leurs établissements publics.
in scheme: FINANCES PUBLIQUES
in scheme: Procédures et Techniques Comptables
in scheme: Comptabilité
notation: REFIP2540

bon de livraison
type: ConceptReFip
type: Concept
broader: pièce comptable
definition: Document contractuel qui atteste que le vendeur a bien respecté son obligation de mettre à disposition de l’acheteur le bien vendu. Il engage l’acheteur par une pièce essentielle pour se faire payer dans le cadre d’une procédure judiciaire.
in scheme: FINANCES PUBLIQUES
in scheme: Documents comptables
in scheme: Comptabilité
notation: REFIP2541

République Dominicaine
type: ConceptReFip
type: Concept
broader: Caraïbes
definition: Pays
in scheme: FINANCES PUBLIQUES
in scheme: Géographie
in scheme: Amérique
notation: REFIP2542

investissements d'avenir
type: ConceptReFip
type: Concept
alternative label: dépenses d'avenir
alternative label: programme d'investissements d'avenir
broader: dépenses d'investissement
definition: Grands emprunts lancés par l’État français sur les marchés financiers. Le programme d'avenir (PIA) piloté par le commissariat général à l'investissement a été mis en place par l’État pour financer des investissements innovants et prometteurs sur le territoire, avec un principe de co-financement pour chaque projet.
in scheme: FINANCES PUBLIQUES
in scheme: Dépenses publiques
in scheme: Gestion Publique
notation: REFIP2543

Finistère
type: ConceptReFip
type: Concept
broader: refip-REFIP957
definition: Département français
in scheme: FINANCES PUBLIQUES
in scheme: Géographie
in scheme: Europe
notation: REFIP2544

rétroactivité
type: ConceptReFip
type: Concept
broader: droit général (non-descripteur)
definition: Caractère d'un acte ou d'un fait produisant ses effets dans le passé, à une date antérieure à son accomplissement ou à sa survenance.
in scheme: FINANCES PUBLIQUES
in scheme: Droit et Justice
in scheme: Droit Général
notation: REFIP2545

table de correspondance
type: ConceptReFip
type: Concept
alternative label: table de transcodification
alternative label: transcodage
alternative label: transcodification
broader: informatique
definition: Liste d'associations de valeurs permettant d'établir une correspondance entre différentes applications informatiques.
in scheme: FINANCES PUBLIQUES
in scheme: Informatique
in scheme: Communication Documentation Informatique
notation: REFIP2546

brigade nationale d'enquêtes économiques
type: ConceptReFip
type: Concept
alternative label: BNEE
broader: administration centrale des finances publiques
definition: Service rattaché au ministère de l'Intérieur, les agents originaires de la direction générale des finances publiques sont tous issus de la sphère du contrôle fiscal, avec une solide expérience et expertise en matière de contrôle fiscal externe. Ils sont mis à la disposition de la direction centrale de la police judiciaire et de la Préfecture de Police de Paris. Ils exercent une mission d'assistance à la police judiciaire, de programmation du contrôle fiscal, mais aussi de contrôle économique.
in scheme: FINANCES PUBLIQUES
in scheme: Organisation Structurelle de l'Etat
in scheme: Ministère
in scheme: Administration de L'Etat
notation: REFIP2547
related: Ministère de l'Intérieur

équipement de sécurité
type: ConceptReFip
type: Concept
alternative label: matériel anti-agression
alternative label: matériel de sécurité
alternative label: équipement anti-agression
alternative label: équipement de protection
broader: aménagement du lieu de travail
definition: Equipement individuel ou collectif destiné à être porté ou tenu par le travailleur pour le protéger des risques au travail Tout employeur est tenu de supprimer ou de réduire les risques professionnels afin d’assurer la sécurité et de protéger la santé physique et mentale des travailleurs de son établissement, y compris les travailleurs temporaires.
in scheme: FINANCES PUBLIQUES
in scheme: Lieu de Travail
in scheme: Entreprises
in scheme: Travail
narrower: vêtement de travail
narrower: coffre-fort
narrower: alarme
notation: REFIP2548
related: bien d'équipement
related: refip-REFIP6822

fonds spécial des pensions des ouvriers des Etablissements industriels de l'Etat
type: ConceptReFip
type: Concept
alternative label: FSPOEIE
broader: Caisse des dépôts et consignations
definition: Fonds assurant, selon le principe de la répartition, la couverture des risques vieillesse et invalidité des ouvriers des établissements industriels de l’Etat.
in scheme: FINANCES PUBLIQUES
in scheme: Organisation Structurelle de l'Etat
in scheme: Institutions
in scheme: Administration de L'Etat
notation: REFIP255

rabais
type: ConceptReFip
type: Concept
alternative label: remise
alternative label: ristourne
broader: facturation
definition: Réduction pratiquée exceptionnellement sur le prix de vente préalablement convenu pour tenir compte, par exemple, d'un défaut de qualité ou de conformité des objets vendus.
in scheme: FINANCES PUBLIQUES
in scheme: Procédures et Techniques Comptables
in scheme: Comptabilité
notation: REFIP2551

travail dominical (supprimé)
type: ConceptReFip
type: Concept
broader: ZZ
in scheme: FINANCES PUBLIQUES
notation: REFIP2552

avenant de transfert
type: ConceptReFip
type: Concept
broader: passation des marchés publics
definition: Document consacrant la cession et la reprise des obligations contractuelles d’un marché par une personnalité juridique différente du titulaire initial.
in scheme: FINANCES PUBLIQUES
in scheme: Commande publique
in scheme: Gestion Publique
notation: REFIP2553

Cour d'appel
type: ConceptReFip
type: Concept
broader: juridiction judiciaire
definition: Juridiction qui traite tous les appels interjetés contre les décisions juridictionnelles des juridictions judiciaires de première instance, ainsi que les appels contre les décisions des juges d'instruction. Dans ce dernier cas, elle siège dans une formation appelée chambre de l'instruction.
in scheme: FINANCES PUBLIQUES
in scheme: Droit et Justice
in scheme: Juridiction
in scheme: Organisation Juridictionnelle
notation: REFIP2555

requête
type: ConceptReFip
type: Concept
broader: principes généraux (non-descripteur)
definition: Demande écrite adressée au juge, sans mise en cause d'un adversaire, dans le cas où la situation à régler est urgente et où le contexte de l'affaire ne nécessite pas que s'instaure un débat contradictoire.
in scheme: FINANCES PUBLIQUES
in scheme: Principes Généraux
in scheme: Droit et Justice
in scheme: Procédure
notation: REFIP2556
scope note: Procédure de droit

contribuable
type: ConceptReFip
type: Concept
broader: foyer fiscal
definition: Personne physique ou morale soumise à l'impôt.
in scheme: FINANCES PUBLIQUES
in scheme: Champ d'Application
in scheme: Fiscalité
narrower: contribuable professionnel
narrower: contribuable particulier
notation: REFIP2558
scope note: Personne physique ou morale soumise à l'impôt

établissement de crédit
type: ConceptReFip
type: Concept
broader: système bancaire et financier (non-descripteur)
definition: Personne morale qui effectue à titre de profession habituelle des opérations de banque.
in scheme: FINANCES PUBLIQUES
in scheme: Systeme bancaire et financier
in scheme: Finance
narrower: banque
narrower: courtier
narrower: Caisse de Crédit municipal
notation: REFIP2559

convention de sauvegarde des droits de l'homme et des libertés fondamentales
type: ConceptReFip
type: Concept
alternative label: convention européenne des droits de l'homme
broader: traité européen
definition: Adoptée à Rome le 4 novembre 1950 par les États membres du Conseil de l'Europe pour imposer aux États signataires le respect des principaux droits fondamentaux. Cette convention a institué un mécanisme de contrôle et de sanction propre à assurer le respect de ces droits par les États signataires.
in scheme: FINANCES PUBLIQUES
in scheme: Droit et Justice
in scheme: Sources du Droit
in scheme: Sources du Droit Objectif
notation: REFIP2560

délai d'exécution
type: ConceptReFip
type: Concept
broader: exécution d'un marché public
definition: Temps requis à compter de la date de notification du marché, sauf stipulations contraires.
in scheme: FINANCES PUBLIQUES
in scheme: Commande publique
in scheme: Gestion Publique
notation: REFIP2561

non-imposition
type: ConceptReFip
type: Concept
alternative label: non imposition
broader: liquidation de l'impôt
definition: Situation fiscale d'une personne qui entre dans le champ d'application de l'impôt mais ne supporte pas effectivement l'impôt, soit du fait de revenus inférieurs à un certain seuil d'imposition pour l'impôt sur le revenu par exemple, soit du fait de certains agissements (fraude fiscale).
in scheme: FINANCES PUBLIQUES
in scheme: Liquidation de l'Impôt
in scheme: Fiscalité
notation: REFIP2563

indicateur de qualité de service
type: ConceptReFip
type: Concept
alternative label: IQS
broader: indicateur de performance
definition: Indicateur national de performance mesurant la qualité des services rendus dans le cadre du référentiel Marianne.
in scheme: FINANCES PUBLIQUES
in scheme: Missions Transverses des Finances publiques
in scheme: Pilotage
notation: REFIP2564

conseil juridique
type: ConceptReFip
type: Concept
alternative label: conseiller juridique
broader: profession juridique (non-descripteur)
definition: Fonction incombant aux avocats. Le conseiller exerce en libéral à la différence du juriste d'entreprise rémunéré par sa société. Ses 3 principales missions : l'établissement de consultations (commerciales, financières etc,,,), la rédaction d'actes, la possibilité d'être mandaté par son client pour agir ou signer des documents en son nom,
in scheme: FINANCES PUBLIQUES
in scheme: Profession Juridique
in scheme: Droit et Justice
in scheme: Organisation Juridictionnelle
notation: REFIP2565

application RSP
type: ConceptReFip
type: Concept
alternative label: RSP
broader: applications fiscales (non-descripteur)
definition: Application permettant de traiter les actions en recouvrement forcé et leur suivi pour l'ensemble des impôts sur rôle comme auto-liquidés.
in scheme: FINANCES PUBLIQUES
in scheme: Applications Informatiques
in scheme: Applications fiscales
notation: REFIP2566

comptes publics
type: ConceptReFip
type: Concept
broader: budget de l'Etat
definition: Budget de l'ensemble des administrations françaises. Les quatre composantes des comptes publics sont les recettes (cotisations sociales et ressources fiscales), les dépenses (se déclinant en missions dont les plus conséquentes sont l'enseignement et la charge de la dette), le solde (différence entre recettes et dépenses) et la dette.
in scheme: FINANCES PUBLIQUES
in scheme: Budget de l’État
in scheme: Budget
notation: REFIP2567

bilan
type: ConceptReFip
type: Concept
alternative label: bilan comptable
alternative label: bilan financier
broader: documents comptables
definition: Document qui synthétise à une date donnée ce que l'entreprise possède, appelé l'« actif » (terrains, immeubles, etc.) et ses ressources, appelées le « passif » (capital, réserves, crédits, etc.).
in scheme: FINANCES PUBLIQUES
in scheme: Documents comptables
in scheme: Comptabilité
narrower: bilan d'ouverture
narrower: actif
narrower: passif
notation: REFIP2568

bordereau de dépôt
type: ConceptReFip
type: Concept
broader: document
definition: Document attestant que l'on a déposé quelque chose.
in scheme: FINANCES PUBLIQUES
in scheme: Documentation
in scheme: Communication Documentation Informatique
notation: REFIP2569

application SOLON (supprimé)
type: ConceptReFip
type: Concept
broader: ZZ
in scheme: FINANCES PUBLIQUES
notation: REFIP2571

organisme sans but lucratif
type: ConceptReFip
type: Concept
alternative label: OBNL
alternative label: OSBL
alternative label: organisme à but non lucratif
broader: association
definition: Entité dotée de la personnalité morale qui n'a pas pour but la recherche de bénéfices pécuniaires à partager entre ses membres.
in scheme: FINANCES PUBLIQUES
in scheme: Entreprises
in scheme: Forme juridique
in scheme: Association
narrower: association de la loi de 1901
narrower: refip-REFIP74
notation: REFIP2572

Nord-Pas-de-Calais (obsolète)
type: ConceptReFip
type: Concept
is replaced by: refip-REFIP7010
broader: ZZ
in scheme: FINANCES PUBLIQUES
notation: REFIP2573

Observatoire économique de l'achat public (obsolète)
type: ConceptReFip
type: Concept
is replaced by: refip-REFIP7046
broader: ZZ
in scheme: FINANCES PUBLIQUES
notation: REFIP2574

juge des tutelles
type: ConceptReFip
type: Concept
broader: juge judiciaire
definition: Magistrat du siège du tribunal d’instance spécialisé dans la surveillance des administrations légales et de tutelles relatives aux personnes majeures protégées résidant dans son ressort.
in scheme: FINANCES PUBLIQUES
in scheme: Profession Juridique
in scheme: Droit et Justice
in scheme: Organisation Juridictionnelle
notation: REFIP2575

compte courant du Trésor à la Banque de France
type: ConceptReFip
type: Concept
broader: plan comptable de l'Etat
definition: Compte d'opération permettant de retracer toutes les opérations de trésorerie effectuées par les comptables publics et figurant sur le relevé bancaire.
in scheme: FINANCES PUBLIQUES
in scheme: Documents comptables
in scheme: Comptabilité
notation: REFIP2576

préfet
type: ConceptReFip
type: Concept
alternative label: commissaire de la République
broader: préfecture
definition: Dépositaire de l’autorité de l’État dans le département, il demeure responsable de l’ordre public et détient des pouvoirs de police qui font de lui une autorité de police administrative. Il est le représentant direct du Premier ministre et de chaque ministre dans le département. Il met en œuvre les politiques gouvernementales de développement et d’aménagement du territoire à l’échelle du département. Il exerce un contrôle « a posteriori » et ne peut que déférer les actes concernés au tribunal administratif, qui apprécie s’il doit en prononcer l’annulation en tant qu’actes "contraires à la légalité".
in scheme: FINANCES PUBLIQUES
in scheme: Organisation Territoriale
in scheme: Structures Territoriales
in scheme: Administration de L'Etat
notation: REFIP2577
related: sous-préfet

Charente-Maritime
type: ConceptReFip
type: Concept
broader: refip-REFIP7020
definition: Département français
in scheme: FINANCES PUBLIQUES
in scheme: Géographie
in scheme: Europe
notation: REFIP2578

délégation d'emploi (supprimé)
type: ConceptReFip
type: Concept
broader: ZZ
in scheme: FINANCES PUBLIQUES
notation: REFIP2579

loi de modernisation de l'économie
type: ConceptReFip
type: Concept
alternative label: loi LME
broader: loi
definition: Loi du 04/08/2008 constituée de 4 grands volets : encourager les entrepreneurs tout au long de leur parcours, relancer la concurrence, renforcer l'attractivité du territoire et améliorer le financement de l'économie.
in scheme: FINANCES PUBLIQUES
in scheme: Droit et Justice
in scheme: Sources du Droit
in scheme: Sources du Droit Objectif
notation: REFIP258

comptabilité des délégations et subdélégations
type: ConceptReFip
type: Concept
broader: exécution du budget
definition: Comptabilité permettant de faire apparaître, à chaque niveau d'intervention, des décisions relatives à leur mise en place, le montant des autorisations de programme disponibles et celui des AP transmises à un niveau d’intervention différent.
in scheme: FINANCES PUBLIQUES
in scheme: Exécution du budget
in scheme: Budget
notation: REFIP2580

loi organique relative aux lois de finances
type: ConceptReFip
type: Concept
alternative label: LOLF
broader: refip-REFIP978
definition: La loi organique relative aux lois de finances (Lolf) du 1er août 2001 réforme en profondeur la gestion de l'État. Elle est entrée en vigueur par étapes et s'applique à toute l'administration depuis le premier janvier 2006. La Lolf consiste en une nouvelle architecture du budget général de l'État, non plus définie par ministère mais par missions, programmes et actions.
in scheme: FINANCES PUBLIQUES
in scheme: Élaboration du budget
in scheme: Budget
notation: REFIP2581

conservatoire de l'espace littoral et des rivages lacustres
type: ConceptReFip
type: Concept
alternative label: CELRL
broader: établissement public à caractère administratif
definition: Etablissement public qui mène une politique foncière visant à la protection définitive des espaces naturels et des paysages sur les rivages maritimes et lacustres.
in scheme: FINANCES PUBLIQUES
in scheme: Organisation Structurelle de l'Etat
in scheme: Opérateur de l'Etat
in scheme: Administration de L'Etat
notation: REFIP2582

remise de placement (supprimé)
type: ConceptReFip
type: Concept
broader: ZZ
in scheme: FINANCES PUBLIQUES
notation: REFIP2583

servitude
type: ConceptReFip
type: Concept
alternative label: servitude d'utilité publique
broader: droit de propriété
definition: Concept juridique qui impose une nécessité, une charge ou une restriction au droit de propriété immobilière, qui est instituée au nom de l'intérêt général.
in scheme: FINANCES PUBLIQUES
in scheme: Droit et Justice
in scheme: Divisions du Droit
in scheme: Droit Privé
narrower: droit de passage
notation: REFIP2584

mainlevée
type: ConceptReFip
type: Concept
broader: recouvrement
definition: Acte qui met fin aux effets d’une saisie, d’une opposition ou d’une hypothèque.
in scheme: FINANCES PUBLIQUES
in scheme: Recouvrement
in scheme: Fiscalité
notation: REFIP2585

accessoire du salaire
type: ConceptReFip
type: Concept
alternative label: complément de salaire
broader: refip-REFIP868
definition: Compléments de salaire tels que les gratifications, primes, indemnités, avantages en nature ou pourboires.
in scheme: FINANCES PUBLIQUES
in scheme: Entreprises
in scheme: Travail
in scheme: 212619
narrower: pourboire
narrower: avantage en nature
notation: REFIP2586

société de valorisation foncière et immobilière
type: ConceptReFip
type: Concept
alternative label: SOVAFIM
broader: entreprise publique
definition: Entreprise publique sous la forme d’une société anonyme dont l’État est l’unique actionnaire ayant pour mission d'acquérir tous biens auprès de l’État ou de tout établissement public, de gérer, valoriser et céder les biens et droits immobiliers qu'elle détient.
in scheme: FINANCES PUBLIQUES
in scheme: Organisation Structurelle de l'Etat
in scheme: Entreprise Publique
in scheme: Administration de L'Etat
notation: REFIP2587

Tarn
type: ConceptReFip
type: Concept
broader: refip-REFIP7036
definition: Département français
in scheme: FINANCES PUBLIQUES
in scheme: Géographie
in scheme: Europe
notation: REFIP2589

restitution d'avoir fiscal (obsolète)
type: ConceptReFip
type: Concept
is replaced by: restitution de crédit d'impôt
broader: ZZ
in scheme: FINANCES PUBLIQUES
notation: REFIP2591

astreinte pécuniaire
type: ConceptReFip
type: Concept
broader: sanction financière
definition: Condamnation à une pénalité financière fixé par le juge par jour de retard pour contraindre à l'exécution d'une obligation.
in scheme: FINANCES PUBLIQUES
in scheme: Droit et Justice
in scheme: Sanction
in scheme: Infractions et Sanctions
narrower: astreinte d'urbanisme
notation: REFIP2592

flux rss
type: ConceptReFip
type: Concept
broader: site internet
definition: Fichiers dont l’objectif est de stocker une liste de contenus ou de pages web selon une méthode de description standardisée qui permet à des abonnés de recevoir en temps réel la liste des derniers contenus publiés.
in scheme: FINANCES PUBLIQUES
in scheme: Communication
in scheme: Communication Documentation Informatique
notation: REFIP2594

équarrissage (supprimé)
type: ConceptReFip
type: Concept
broader: ZZ
in scheme: FINANCES PUBLIQUES
notation: REFIP2595

annuaire
type: ConceptReFip
type: Concept
broader: document
definition: Liste, répertoire mis à jour régulièrement qui regroupe des informations (nom, adresse, coordonnées, etc.) sur les membres d’une association, d'une entreprise, d'un établissement d'enseignement ou d'un organisme professionnel.
in scheme: FINANCES PUBLIQUES
in scheme: Documentation
in scheme: Communication Documentation Informatique
notation: REFIP2596

application RTA
type: ConceptReFip
type: Concept
broader: applications fiscales (non-descripteur)
definition: Application permettant le recouvrement de la taxe d'archéologie préventive.
in scheme: FINANCES PUBLIQUES
in scheme: Applications Informatiques
in scheme: Applications fiscales
notation: REFIP2597

invariant
type: ConceptReFip
type: Concept
broader: informatique
definition: Numéro séquentiel attribué automatiquement en informatique.
in scheme: FINANCES PUBLIQUES
in scheme: Informatique
in scheme: Communication Documentation Informatique
notation: REFIP2598

avis à tiers détenteur
type: ConceptReFip
type: Concept
alternative label: ATD
broader: poursuites
definition: Mesure de poursuite, propre au droit fiscal, qui permet au comptable, sur simple demande, d'obliger un tiers à lui verser les sommes dont il est dépositaire, détenteur ou débiteur à l'égard du redevable à concurrence des impositions dues par ce redevable
in scheme: FINANCES PUBLIQUES
in scheme: Recouvrement
in scheme: Fiscalité
narrower: obligation du tiers détenteur de fonds
narrower: tiers saisi
notation: REFIP2599

canicule
type: ConceptReFip
type: Concept
broader: catastrophe naturelle
definition: Épisode de températures élevées pendant plusieurs jours consécutifs, de jour comme de nuit.
in scheme: FINANCES PUBLIQUES
in scheme: Environnement
in scheme: Dégradation de l'Environnement
in scheme: Questions de Société
notation: REFIP26

dépôt d'acte
type: ConceptReFip
type: Concept
alternative label: refus de dépôt d'acte
alternative label: refus de la formalité
broader: publicité foncière
definition: Dépôt de document auprès des services de la publicité foncière en vue leur publication.
in scheme: FINANCES PUBLIQUES
in scheme: Champ d'Application
in scheme: Fiscalité
notation: REFIP260

demi-part
type: ConceptReFip
type: Concept
broader: quotient familial
definition: Nombre à prendre en considération lors de la division du revenu imposable à l'impôt sur le revenu. Des demi-parts supplémentaires peuvent être accordées dans certains cas précis.
in scheme: FINANCES PUBLIQUES
in scheme: Liquidation de l'Impôt
in scheme: Fiscalité
notation: REFIP2600

égalité de traitement
type: ConceptReFip
type: Concept
broader: déontologie
definition: Principe d'égalité de traitement dans la carrière qui découle de l'article 6 de la Déclaration de 1789, ne s'applique qu'aux fonctionnaires appartenant à un même corps ou cadre d'emplois.
in scheme: FINANCES PUBLIQUES
in scheme: Gestion des ressources humaines
in scheme: Statut du fonctionnaire
in scheme: Fonction Publique et Gestion des Ressources Humaines
notation: REFIP2601

engagement juridique
type: ConceptReFip
type: Concept
broader: refip-REFIP996
definition: Acte par lequel un organisme public crée ou constate à son encontre une obligation de laquelle résultera une charge financière. Cette obligation résulte Notamment d’un contrat, d’un marché, d’une convention, d’une lettre de commande, d'un acte de vente, d’une délibération …. Il est saisi dans la comptabilité d’engagement pour son montant total et fera l’objet éventuellement de mandatements successifs. L’engagement juridique doit rester dans les limites des autorisations budgétaires (crédits limitatifs en dépense).
in scheme: FINANCES PUBLIQUES
in scheme: Dépenses publiques
in scheme: Gestion Publique
notation: REFIP2604
related: refip-REFIP872

inscription
type: ConceptReFip
type: Concept
alternative label: immatriculation
broader: droit administratif
definition: Formalité administrative.
in scheme: FINANCES PUBLIQUES
in scheme: Droit et Justice
in scheme: Divisions du Droit
in scheme: Droit Public
notation: REFIP2606
scope note: Démarche administrative

application REP
type: ConceptReFip
type: Concept
alternative label: REP
broader: applications fiscales (non-descripteur)
definition: Application permettant la gestion du recouvrement des créances de l'Etat étrangères à l'impôt et au domaine.
in scheme: FINANCES PUBLIQUES
in scheme: Applications Informatiques
in scheme: Applications fiscales
notation: REFIP2607

principe de sincérité budgétaire
type: ConceptReFip
type: Concept
alternative label: principe de sincérité du budget de l'Etat
alternative label: sincérité budgétaire
alternative label: sincérité du budget de l'Etat
broader: principe budgétaire
definition: Principe impliquant l’exhaustivité, la cohérence et l’exactitude des informations financières fournies par l’État.
in scheme: FINANCES PUBLIQUES
in scheme: Élaboration du budget
in scheme: Budget
notation: REFIP2608

prime pour l'emploi
type: ConceptReFip
type: Concept
alternative label: PPE
broader: refip-REFIP849
definition: Aide au retour à l’emploi et au maintien de l’activité professionnelle, attribuée aux personnes exerçant une activité professionnelle salariée ou non salariée, sous conditions de ressources. Son montant est calculé en pourcentage du revenu d’activité. Elle est déduite de l’impôt sur le revenu. Elle est supprimée à compter du 1 janvier 2016 et une nouvelle prestation dénommée "prime d'activité" est mise en place.
in scheme: FINANCES PUBLIQUES
in scheme: Liquidation de l'Impôt
in scheme: Fiscalité
notation: REFIP2609
scope note: Supprimée à compter du 1er janvier 2016 et une nouvelle prestation dénommée "prime d'activité" est mise en place

forme juridique
type: ConceptReFip
type: Concept
alternative label: changement de forme juridique
alternative label: structure juridique
definition: Statut juridique de l'entreprise. Les principales formes juridiques sont l'entreprise individuelle,l'entreprise universelle à responsabilité limitée, la société de capitaux et la societé en nom collectif.
in scheme: FINANCES PUBLIQUES
in scheme: Entreprises
in scheme: Forme juridique
narrower: association
narrower: société
narrower: entreprise
narrower: groupement d'intérêt économique
narrower: refip-REFIP7175
notation: REFIP261

déclaration de taxe d'apprentissage (supprimé)
type: ConceptReFip
type: Concept
in scheme: FINANCES PUBLIQUES
notation: REFIP2610

application DDPAC
type: ConceptReFip
type: Concept
alternative label: DDPAC
broader: applications fiscales (non-descripteur)
definition: Outil de recouvrement des produits locaux et hospitaliers utilisé dans les collectivités d'outre mer de Nouvelle Calédonie, Polynésie Française, Wallis et Futuna dans la phase amiable.
in scheme: FINANCES PUBLIQUES
in scheme: Applications Informatiques
in scheme: Applications fiscales
notation: REFIP2611

reversement de fonds sur dépenses des ministères
type: ConceptReFip
type: Concept
broader: recettes de l'Etat étrangères à l'impôt et au domaine
definition: Versement au budget général des sommes encaissées non employées figurant en solde créditeur des comptes. Il s'agit notamment du remboursement de dépenses payées à tort ou à titre provisoire, prestations de services rendues entre administrations.
in scheme: FINANCES PUBLIQUES
in scheme: Budget de l’État
in scheme: Budget
notation: REFIP2612

prélèvement sur les recettes de l'Etat
type: ConceptReFip
type: Concept
broader: refip-REFIP880
definition: Prélèvement opéré sur les recettes du budget général de l’État et versés à des organismes tiers.
in scheme: FINANCES PUBLIQUES
in scheme: Budget de l’État
in scheme: Budget
notation: REFIP2613

centrale d'achat
type: ConceptReFip
type: Concept
broader: commerce
definition: Groupement de commerçants qui effectue des achats pour le compte de ses membres.
in scheme: FINANCES PUBLIQUES
in scheme: Branche d'activité
in scheme: Questions Economiques
in scheme: Commerce
notation: REFIP2614
related: Union des groupements d'achats publics

droit de garde
type: ConceptReFip
type: Concept
alternative label: droit de garde des enfants
broader: filiation
definition: Prérogative essentielle de l'autorité parentale, Elle confère à son titulaire le pouvoir de contraindre ses enfants mineurs à vivre sous son toit, mais aussi de décider plus généralement du mode de vie de l'enfant, de ses relations et de ses activités.
in scheme: FINANCES PUBLIQUES
in scheme: Droit et Justice
in scheme: Divisions du Droit
in scheme: Droit Privé
narrower: garde alternée
notation: REFIP2615

certificat de libération définitive
type: ConceptReFip
type: Concept
broader: responsabilité des comptables
definition: Certificat permettant de libérer le cautionnement du comptable public ayant cessé définitivement ses fonctions. Le certificat de libération totale est délivré au comptable pour l'ensemble de sa gestion s'il a obtenu, soit un arrêt ou jugement de quitus prononcé par le juge des comptes, soit un arrêté de quitus prononcé par l'autorité compétente de l'Etat en matière d'apurement administratif, soit la reconnaissance du bénéfice de la prescription extinctive de 5 ans.
in scheme: FINANCES PUBLIQUES
in scheme: Responsabilité des comptables
in scheme: Missions Transverses des Finances publiques
notation: REFIP2616

assemblée nationale
type: ConceptReFip
type: Concept
alternative label: Chambre des députés
broader: Parlement
definition: Institution formant avec le Sénat, le parlement ayant pour missions de représenter le peuple français, de légiférer et de contrôler l’action du Gouvernement.
in scheme: FINANCES PUBLIQUES
in scheme: Organisation Structurelle de l'Etat
in scheme: Pouvoirs Publics
in scheme: Administration de L'Etat
notation: REFIP2617

taxe annuelle sur les friches commerciales
type: ConceptReFip
type: Concept
broader: taxes assimilées aux impôts directs locaux (non descripteur)
definition: Taxe s'appliquant aux locaux qui ne sont plus affectés à une activité entrant dans le champ de la cotisation foncière des entreprises depuis au moins 2 ans au 1er janvier de l'année d'imposition et qui sont restés inoccupés au cours de la même période. Elle est perçue au profit des communes ou des EPCI.
in scheme: FINANCES PUBLIQUES
in scheme: Fiscalité
in scheme: Impôt
notation: REFIP2619

catégorie B
type: ConceptReFip
type: Concept
broader: catégorie d'emploi
definition: Fonctionnaires assurant des fonctions d'application et éventuellement d'encadrement intermédiaire.
in scheme: FINANCES PUBLIQUES
in scheme: Gestion des ressources humaines
in scheme: Statut du fonctionnaire
in scheme: Fonction Publique et Gestion des Ressources Humaines
notation: REFIP262

documentation foncière
type: ConceptReFip
type: Concept
broader: documentation cadastrale
definition: Documentation conservée dans les bureaux des services de publicité foncière et constituée des « registres de formalités » et des instruments de recherches permettant d'y accéder ainsi que d'analyses faites au fichier immobilier.
in scheme: FINANCES PUBLIQUES
in scheme: Cadastre
in scheme: Fiscalité
notation: REFIP2620

équilibre budgétaire
type: ConceptReFip
type: Concept
broader: principe budgétaire
definition: Principe renvoyant à la nécessité d'équilibrer les comptes de manière à éviter la présence de déficit dans le budget.
in scheme: FINANCES PUBLIQUES
in scheme: Élaboration du budget
in scheme: Budget
notation: REFIP2622

comité national de maîtrise des risques
type: ConceptReFip
type: Concept
alternative label: CNMR
broader: administration centrale des finances publiques
definition: Présidé par le Directeur Général, le comité veille d’une part, à ce que le niveau central élabore, pour l’exercice de chaque mission, des référentiels d’organisation, de procédure et de contrôle, d’autre part, à ce que le niveau local les mette en oeuvre. Il approuve la cartographie des risques et valide la plan national de contrôle interne.
in scheme: FINANCES PUBLIQUES
in scheme: Organisation Structurelle de l'Etat
in scheme: Ministère
in scheme: Administration de L'Etat
notation: REFIP2623

travaux supplémentaires
type: ConceptReFip
type: Concept
broader: exécution d'un marché public
definition: Travaux ouvrages non prévus par le marché, décidés par l’acheteur public et notifiés au titulaire du marché. Le pouvoir adjudicateur a l’obligation de passer un avenant.
in scheme: FINANCES PUBLIQUES
in scheme: Commande publique
in scheme: Gestion Publique
notation: REFIP2624
scope note: Marchés publics

société d'investissement immobilier cotée
type: ConceptReFip
type: Concept
alternative label: SIIC
broader: société de capitaux
definition: Société par actions cotée sur un marché réglementé qui donne en location les immeubles qu'elle fait construire ou qu'elle acquiert. Les loyers et les plus-values nettes sont partagées entre les actionnaires sous forme de dividendes.
in scheme: FINANCES PUBLIQUES
in scheme: Société
in scheme: Entreprises
in scheme: Forme juridique
notation: REFIP2625

contre-passation
type: ConceptReFip
type: Concept
broader: rectification comptable
definition: Procédé comptable consistant à rectifier une opération comptable en passant une écriture en sens inverse de celle qu’il y a lieu d’annuler.
in scheme: FINANCES PUBLIQUES
in scheme: Procédures et Techniques Comptables
in scheme: Comptabilité
notation: REFIP2626

lieu public
type: ConceptReFip
type: Concept
alternative label: espace public
broader: domaine public
definition: Ensemble des espaces de passage et de rassemblement qui sont à l'usage de tous et qui relèvent du domaine public.
in scheme: FINANCES PUBLIQUES
in scheme: Domaine
in scheme: Gestion Publique
narrower: bâtiment de l'Etat
narrower: refip-REFIP86
notation: REFIP2627

imposition forfaitaire sur les répartiteurs principaux de la boucle locale cuivre
type: ConceptReFip
type: Concept
alternative label: IFRP
broader: imposition forfaitaire sur les entreprises de réseaux
definition: Imposition qui s'applique aux répartiteurs principaux de la boucle locale de cuivre au sens du 3°ter de l'article L.32 du Code des postes et des communications électroniques ainsi qu'aux unités de raccordement d'abonnés et aux cartes d'abonnées du réseau téléphonique commuté. Constitue une des composantes de l'IFER.
in scheme: FINANCES PUBLIQUES
in scheme: Fiscalité
in scheme: Impôt
notation: REFIP2628

Bas-Rhin
type: ConceptReFip
type: Concept
broader: refip-REFIP7009
definition: Département français
in scheme: FINANCES PUBLIQUES
in scheme: Géographie
in scheme: Europe
notation: REFIP2629

distribution indirecte
type: ConceptReFip
type: Concept
alternative label: distribution déguisée
broader: fraude fiscale
definition: La distribution (de revenus par une personne morale à ses actionnaires) est imposable quelle que soit la forme sous laquelle elle est effectuée. Elle peut revêtir une forme indirecte ou déguisée (cession aux associés de biens sociaux pour un prix inférieur à leur valeur réelle; vente de biens quelconques par les associés à la société pour un prix supérieur à la valeur réelle etc.).
in scheme: FINANCES PUBLIQUES
in scheme: Droit de Contrôle de l'Administration
in scheme: Fiscalité
notation: REFIP263
related: présomption de distribution

convention d'exercice conjoint
type: ConceptReFip
type: Concept
alternative label: exercice conjoint
broader: entité sans personnalité morale
definition: Contrat conclu entre plusieurs professionnels dans lequel chacun des praticiens conserve l’entière responsabilité de ses actes professionnels et reçoit personnellement les honoraires correspondant à ces actes. Chaque membre du groupement est soumis à l’impôt sur le revenu pour la part de bénéfice social qui lui revient en application des règles prévues à la convention.
in scheme: FINANCES PUBLIQUES
in scheme: Société
in scheme: Entreprises
in scheme: Forme juridique
notation: REFIP2630

arrêté comptable
type: ConceptReFip
type: Concept
alternative label: arrêté des comptes
broader: fin de gestion
definition: Validation qui fige, à une date donnée, les écritures comptables, suite à un contrôle positif sur une totalisation.
in scheme: FINANCES PUBLIQUES
in scheme: Procédures et Techniques Comptables
in scheme: Comptabilité
notation: REFIP2631

régie dotée de la personnalité morale et de l'autonomie financière
type: ConceptReFip
type: Concept
broader: régie
definition: Mode de gestion des services publics : aux côtés de la gestion directe ou déléguée, la création d’une régie à personnalité morale et autonomie financière ou à seule autonomie financière constitue un troisième mode de gestion d’un service public. Dans ce cas, la collectivité choisit de distinguer la gestion d’un service public en confiant celle-ci à un organisme créé à cet effet, notamment pour apprécier la qualité du service dispensé et son coût.
in scheme: FINANCES PUBLIQUES
in scheme: Secteur public local
in scheme: Gestion Publique
notation: REFIP2632

réforme de l'Etat
type: ConceptReFip
type: Concept
broader: Etat
definition: Action législative ou réglementaire entraînant une modification substantielle de l'organisation, du périmètre d'action, ou des méthodes de fonctionnement de l'État, c'est-à-dire de ses administrations. L'objectif de ce type de réforme structurelle, inspiré par la nouvelle gestion publique, est de réduire les coûts de fonctionnement, éventuellement par des hausses de productivité, d'améliorer le service rendu aux citoyens, de diminuer l'impôt papier, ou encore de réduire l'emprise de l'État sur l'économie.
in scheme: FINANCES PUBLIQUES
in scheme: Etat
in scheme: Réforme de l'Etat
in scheme: Administration de L'Etat
narrower: transfert de mission
narrower: réforme des retraites
narrower: transfert de compétence
narrower: fusion de communes
narrower: Modernisation de l'action publique
narrower: décentralisation
narrower: réforme administrative
narrower: fusion DGI-DGCP
narrower: réforme budgétaire
narrower: réforme hospitalière
narrower: fusion d'établissements publics de coopération intercommunale
narrower: réforme de l'administration territoriale de l'Etat
narrower: déconcentration
narrower: mutualisation des moyens
narrower: révision générale des politiques publiques
narrower: fusion de postes comptables
narrower: réforme fiscale
narrower: refip-REFIP6708
notation: REFIP2633

gestion conjointe de postes comptables
type: ConceptReFip
type: Concept
broader: responsabilité des comptables
definition: Gestion de plusieurs postes comptables assurée par un même comptable public dans un soucis de préservation du service de proximité lors d'un regroupement, d'une fermeture ponctuelle ou définitive, ou d'une fusion de sites.
in scheme: FINANCES PUBLIQUES
in scheme: Responsabilité des comptables
in scheme: Missions Transverses des Finances publiques
notation: REFIP2635

Fonds national de développement agricole
type: ConceptReFip
type: Concept
alternative label: FNOA
broader: fonds (non-descripteur)
definition: Ensemble des moyens financiers et comptables dont dispose l'association nationale pour le développement agricole pour l'exécution de certaines missions.
in scheme: FINANCES PUBLIQUES
in scheme: Dépenses publiques
in scheme: Gestion Publique
notation: REFIP2636

commissaire enquêteur
type: ConceptReFip
type: Concept
broader: profession juridique (non-descripteur)
definition: Personne, indépendante, en général désignée par le président du Tribunal Administratif et chargée de conduire les enquêtes publiques imposées par la Loi. C'est un collaborateur occasionnel de l'État.
in scheme: FINANCES PUBLIQUES
in scheme: Profession Juridique
in scheme: Droit et Justice
in scheme: Organisation Juridictionnelle
notation: REFIP2639

droit d'enquête
type: ConceptReFip
type: Concept
broader: droit de contrôle de l'administration (non-descripteur)
definition: Droit reconnu à l'administration fiscale de rechercher les manquements aux règles de facturation auxquelles sont tenus les assujettis à la TVA.
in scheme: FINANCES PUBLIQUES
in scheme: Droit de Contrôle de l'Administration
in scheme: Fiscalité
notation: REFIP264

entreprise de travail temporaire
type: ConceptReFip
type: Concept
broader: travail temporaire
definition: Entreprise mettant à disposition provisoire d'entreprises clientes, des salariés qui, en fonction d'une rémunération convenue, sont embauchés et rémunérés à cet effet par l'entreprise de travail intérimaire (ou entreprise de travail temporaire). L'opération de travail intérimaire se caractérise donc par une relation triangulaire entre l'entreprise de travail temporaire, l'entreprise cliente et le salarié, et implique la conclusion de deux contrats : un contrat de mise à disposition (entre l'entreprise de travail temporaire et l'entreprise cliente) et un contrat de mission (entre l'entreprise de travail temporaire et le salarié).
in scheme: FINANCES PUBLIQUES
in scheme: Entreprises
in scheme: Travail
in scheme: 212619
notation: REFIP2640

commerce
type: ConceptReFip
type: Concept
alternative label: activité commerciale
alternative label: commerce intérieur
broader: branche d'activité
definition: Activité consistant dans l'achat, la vente, l'échange de marchandises, de denrées, de valeurs, dans la vente de services.
in scheme: FINANCES PUBLIQUES
in scheme: Branche d'activité
in scheme: Questions Economiques
in scheme: Commerce
narrower: magasin
narrower: commerçant
narrower: fourniture de logement
narrower: commerce électronique
narrower: commerce de détail
narrower: centrale d'achat
narrower: activité ambulante
narrower: auto-école
narrower: publicité commerciale
narrower: marchandise
narrower: commerce international
narrower: agent commercial
narrower: fournisseur
narrower: client
narrower: commerce de demi-gros
narrower: contrat de maintenance
narrower: fourniture de repas
narrower: commissionnaire
notation: REFIP2641

bail rural
type: ConceptReFip
type: Concept
broader: refip-REFIP95
definition: Contrat ayant pour objet un fonds rural, conclu pour une période de 9 ans renouvelable. Le preneur est qualifié de fermier et le loyer de fermage.
in scheme: FINANCES PUBLIQUES
in scheme: Droit et Justice
in scheme: Divisions du Droit
in scheme: Droit Privé
narrower: bail à convenant
narrower: fermage
notation: REFIP2643

présomption de distribution
type: ConceptReFip
type: Concept
broader: revenu distribué
definition: Présomption fiscale selon laquelle les bénéfices qui ne demeurent pas investis ou versés en réserve de trésorerie, à la clôture de l'exercice au moment de la présentation du bilan de l'entreprise, sont présumés distribués aux associés ou actionnaires.
in scheme: FINANCES PUBLIQUES
in scheme: Champ d'Application
in scheme: Fiscalité
notation: REFIP2644
related: distribution occulte
related: distribution indirecte

donation-partage
type: ConceptReFip
type: Concept
broader: donation
definition: Acte par lequel une personne, de son vivant, transfère à ses héritiers présomptifs et répartit entre eux ses biens présents, Ils en deviennent immédiatement et irrévocablement propriétaires, Elle bénéficie d'un régime juridique et fiscal très favorable.
in scheme: FINANCES PUBLIQUES
in scheme: Champ d'Application
in scheme: Fiscalité
notation: REFIP2645

contrôle financier déconcentré
type: ConceptReFip
type: Concept
alternative label: contrôle financier local
broader: contrôle interne
definition: Contrôle de régularité qui concerne, à l'exclusion de tout examen en opportunité : l'imputation budgétaire de la dépense ; la disponibilité des crédits ; l'exactitude de l'évaluation ; la régularité de la dépense au regard des dispositions d'ordre financier des lois et règlements ; les conséquences que les mesures proposées peuvent entraîner pour les finances de l’État. Ce contrôle est assuré au niveau déconcentré par le DRFIP, assisté par le DDFIP
in scheme: FINANCES PUBLIQUES
in scheme: Missions Transverses des Finances publiques
in scheme: Maîtrise des risques
notation: REFIP2646

séparation de fait
type: ConceptReFip
type: Concept
broader: droit civil
definition: Situation de pur fait (par opposition à une situation de droit comme la séparation de corps ou le divorce) où deux époux vivent séparément sans y avoir été autorisés par un jugement de divorce ou de séparation de corps.
in scheme: FINANCES PUBLIQUES
in scheme: Droit et Justice
in scheme: Divisions du Droit
in scheme: Droit Privé
notation: REFIP2648

bien non enlevé non loti
type: ConceptReFip
type: Concept
alternative label: bien non enlevé
alternative label: bien non loti
broader: domaine public
definition: Bien qui n'est pas encore réparti par lots ou qui n'a pas encore fait l'objet d'un enlèvement dans le cadre des marchés d'enlèvement que la DID conclut avec ses prestataires.
in scheme: FINANCES PUBLIQUES
in scheme: Domaine
in scheme: Gestion Publique
notation: REFIP2649

Centre national de la recherche scientifique
type: ConceptReFip
type: Concept
alternative label: CNRS
broader: établissement public à caractère scientifique et technologique
definition: Etablissement public à caractère scientifique et technologique, placé sous la tutelle du Ministère de l'Enseignement supérieur et de la Recherche.
in scheme: FINANCES PUBLIQUES
in scheme: Organisation Structurelle de l'Etat
in scheme: Opérateur de l'Etat
in scheme: Administration de L'Etat
notation: REFIP2650

Vosges
type: ConceptReFip
type: Concept
broader: refip-REFIP7009
definition: Département français
in scheme: FINANCES PUBLIQUES
in scheme: Géographie
in scheme: Europe
notation: REFIP2651

Office national de la chasse et de la faune sauvage
type: ConceptReFip
type: Concept
alternative label: ONCFS
alternative label: Office national de la chasse
broader: établissement public à caractère administratif
definition: Etablissement public sous la double tutelle des Ministères chargés de l’Ecologie et de l’Agriculture, l’Office National de la Chasse et de la Faune Sauvage remplit cinq missions principales : la surveillance des territoires et la police de l’environnement et de la chasse ; la réalisation des études et des recherches sur la faune sauvage et ses habitats ; l’appui technique et le conseil aux administrations, collectivités territoriales, gestionnaires et aménageurs du territoire ; l’évolution de la pratique de la chasse selon les principes du développement durable et la mise au point de pratiques de gestion des territoires ruraux respectueuses de l’environnement ; et l’organisation de l’examen et la délivrance du permis de chasser.
in scheme: FINANCES PUBLIQUES
in scheme: Organisation Structurelle de l'Etat
in scheme: Opérateur de l'Etat
in scheme: Administration de L'Etat
notation: REFIP2652

accord de siège
type: ConceptReFip
type: Concept
broader: droit international
definition: Traité conclu entre une organisation internationale et l’État sur le territoire duquel elle est établie, pour régler les problèmes soulevés par cette situation.
in scheme: FINANCES PUBLIQUES
in scheme: Droit et Justice
in scheme: Divisions du Droit
in scheme: Droit International
notation: REFIP2654

commission de réforme
type: ConceptReFip
type: Concept
broader: refip-REFIP7063
definition: Instance consultative médicale et paritaire chargée de donner des avis sur les questions médicales concernant les fonctionnaires. Elle est composée des médecins du comité médical, de représentants de l'administration et de représentants du personnel. Elle est notamment consultée sur l'imputabilité au service de la maladie ou de l’accident à l'origine d'un congé de maladie ordinaire, d'un CLM ou d'un CLD sauf si l'administration reconnaît d'emblée cette imputabilité, la situation du fonctionnaire à la fin de la dernière période d'un CLM ou d'un CLD lorsque le comité médical a présumé le fonctionnaire définitivement inapte lors du dernier renouvellement de son congé...
in scheme: FINANCES PUBLIQUES
in scheme: Organisation Structurelle de l'Etat
in scheme: Ministère
in scheme: Administration de L'Etat
notation: REFIP2655
related: refip-REFIP6803

relance amiable
type: ConceptReFip
type: Concept
broader: contrôle fiscal
definition: Dispositif permettant à l'administration, en désaccord avec le revenu déclaré, d'adresser un courrier de « relance amiable » au contribuable. Ce dernier dispose alors d'un délai de 30 jours pour préciser à l'administration s'il accepte de déclarer le montant qu'elle a mentionné. Dans ce cas cette régularisation s'applique sans intérêts de retard ni pénalités.
in scheme: FINANCES PUBLIQUES
in scheme: Droit de Contrôle de l'Administration
in scheme: Fiscalité
notation: REFIP2656

ouvrage public
type: ConceptReFip
type: Concept
broader: domaine public
definition: Bien immeuble affecté à un intérêt général ou une mission de service public.
in scheme: FINANCES PUBLIQUES
in scheme: Domaine
in scheme: Gestion Publique
notation: REFIP2657

avis de crédit
type: ConceptReFip
type: Concept
broader: documents comptables
definition: Avis transmis par un comptable informant un autre comptable du crédit de son compte et lui fournissant les détails de la transaction.
in scheme: FINANCES PUBLIQUES
in scheme: Documents comptables
in scheme: Comptabilité
notation: REFIP2658

application de gestion des imprimés
type: ConceptReFip
type: Concept
alternative label: AGIM
broader: applications missions transverses (non-descripteur)
definition: Application d'aide à la gestion des imprimés sous intranet.
in scheme: FINANCES PUBLIQUES
in scheme: Applications missions transverses
in scheme: Applications Informatiques
notation: REFIP2659

Agence française de développement
type: ConceptReFip
type: Concept
alternative label: AFD
broader: établissement public à caractère industriel et commercial
definition: Etablissement public agissant pour lutter contre la pauvreté et favoriser le développement dans les pays du Sud et dans l'Outre-mer. Au moyen de subventions, de prêts, de fonds de garantie ou de contrats de désendettement, il finance des projets, des programmes et des études et accompagne ses partenaires du Sud dans le renforcement de leurs capacités.
in scheme: FINANCES PUBLIQUES
in scheme: Organisation Structurelle de l'Etat
in scheme: Opérateur de l'Etat
in scheme: Administration de L'Etat
narrower: Fonds d'investissement des départements d'outre mer
notation: REFIP266

contrat verbal
type: ConceptReFip
type: Concept
broader: contrat
definition: Contrat aussi valable qu’un contrat écrit et engageant les parties contractantes de la même façon. Toutefois, il peut parfois être difficile de faire la preuve de l’existence d’un contrat verbal, en cas de manquement d’une des parties à ses obligations.
in scheme: FINANCES PUBLIQUES
in scheme: Droit et Justice
in scheme: Divisions du Droit
in scheme: Droit Privé
notation: REFIP2660

application XEMELIOS
type: ConceptReFip
type: Concept
alternative label: XEMELIOS
alternative label: outil XEMELIOS
broader: applications missions transverses (non-descripteur)
definition: Outil d'exploitation de données au format WML permettant des tris des recherches multi-critères et des visualisations de fichiers.
in scheme: FINANCES PUBLIQUES
in scheme: Applications missions transverses
in scheme: Applications Informatiques
notation: REFIP2663

scission de sociétés
type: ConceptReFip
type: Concept
alternative label: scission d'entreprises
alternative label: scission d'une société
broader: transfert d'entreprise
definition: Opération par laquelle une société apporte l'intégralité de son patrimoine à deux ou plusieurs sociétés nouvelles ou préexistantes. La scission de sociétés peut être réalisée selon l'une ou l'autre des modalités ci-après : l'opération est faite au profit de deux (ou plus) sociétés nouvelles constituées à cette fin et entre lesquelles est réparti le patrimoine de la société dissoute ; l'opération est faite au profit de deux (ou plus) sociétés nouvelles constituées à cette fin et entre lesquelles est réparti le patrimoine de la société dissoute. Par ailleurs, la combinaison de ces deux modalités autorise les opérations du type suivant : la société qui se dissout fait apport d'une partie de ses biens à une ou plusieurs sociétés nouvelles constituées à cet effet, le surplus des biens étant absorbé par une ou plusieurs sociétés préexistantes ; plusieurs sociétés se scindent en même temps pour donner ensemble naissance à plusieurs sociétés nouvelles ou effectuer des apports à plusieurs sociétés préexistantes.
in scheme: FINANCES PUBLIQUES
in scheme: Vie de l'Entreprise
in scheme: Entreprises
in scheme: Vie et Gestion de l'entreprise
notation: REFIP2664

activité libérale
type: ConceptReFip
type: Concept
alternative label: profession libérale
broader: services et professions libérales (non-descripteur)
definition: Toute activité professionnelle indépendante, non salariée, non agricole, non commerciale ou non artisanale.
in scheme: FINANCES PUBLIQUES
in scheme: Branche d'activité
in scheme: Questions Economiques
in scheme: Services et professions libérales
narrower: architecture
narrower: vétérinaire
narrower: Conseil de l'ordre
narrower: comptable agrée
narrower: refip-REFIP703
notation: REFIP2665

assistance administrative et fiscale internationale
type: ConceptReFip
type: Concept
alternative label: assistance administrative internationale
broader: fiscalité internationale
definition: Ensemble des opérations traduisant, en matière d'échange de renseignements, une coopération entre les administrations fiscales de deux ou plusieurs Etats pour permettre une application correcte des dispositions régissant l'assiette, le contrôle et le recouvrement des impôts de chacun des Etats intéressés.
in scheme: FINANCES PUBLIQUES
in scheme: Champ d'Application
in scheme: Fiscalité
notation: REFIP2666

application GIDE INTRANET
type: ConceptReFip
type: Concept
broader: applications gestion publique (non-descripteur)
definition: Application permettant la gestion informatisée des occupations du domaine public et privé en mode Web.
in scheme: FINANCES PUBLIQUES
in scheme: Applications Informatiques
in scheme: Applications gestion publique
notation: REFIP2667

lycée
type: ConceptReFip
type: Concept
alternative label: lycée d'enseignement général et technologique
alternative label: lycée technique
alternative label: lycée technologique
broader: établissement public local d'enseignement
definition: Etablissement public local d'enseignement, dont la construction et l'entretien relèvent des collectivités territoriales de par les lois de décentralisation, qui ont rattaché les lycées à la région. Chaque lycée a élaboré un projet d'établissement, qui lui permet d’avoir une politique particulière en fonction de son public scolaire.
in scheme: FINANCES PUBLIQUES
in scheme: Organisation Territoriale
in scheme: Structures Territoriales
in scheme: Administration de L'Etat
narrower: Ecole de formation maritime et aquacole
notation: REFIP2668

Ministère des Finances et des Comptes publics (obsolète)
type: ConceptReFip
type: Concept
is replaced by: Ministère de l'Economie et des Finances
broader: ZZ
in scheme: FINANCES PUBLIQUES
notation: REFIP2669

examen contradictoire de la situation fiscale personnelle
type: ConceptReFip
type: Concept
alternative label: ESFP
broader: contrôle fiscal externe
definition: Forme de contrôle fiscal externe visant les particuliers et permettant à l’administration de vérifier la cohérence entre les revenus déclarés et la situation patrimoniale ainsi que la situation de trésorerie et les éléments de train de vie des membres du foyer fiscal.
in scheme: FINANCES PUBLIQUES
in scheme: Droit de Contrôle de l'Administration
in scheme: Fiscalité
notation: REFIP267

assujetti occasionnel
type: ConceptReFip
type: Concept
broader: assujetti
definition: Notion utilisée pour un assujetti non habituellement redevable de la TVA, ayant supporté la TVA lors de l'achat, l'importation ou l'acquisition intracommunautaire d'un bien ou lors de la construction d'un immeuble et lui permettant de demander le remboursement de cette TVA en cas de revente.
in scheme: FINANCES PUBLIQUES
in scheme: Champ d'Application
in scheme: Fiscalité
notation: REFIP2670

adjoint spécial
type: ConceptReFip
type: Concept
broader: adjoint au maire
definition: Poste d’adjoint spécial au maire institué par délibération motivée du conseil municipal lorsqu’un obstacle quelconque ou l’éloignement rend difficiles, dangereuses ou momentanément impossibles les communications entre le chef-lieu et une fraction de commune.
in scheme: FINANCES PUBLIQUES
in scheme: Organisation Territoriale
in scheme: Administration de L'Etat
in scheme: 212106
notation: REFIP2671

annulation d'un acte administratif
type: ConceptReFip
type: Concept
alternative label: annulation d'une décision administrative
broader: acte administratif
definition: Anéantissement rétroactif d'un acte juridique fait dans le cadre de l'administration et dans l'intérêt général, pour inobservation de ses conditions de formation.
in scheme: FINANCES PUBLIQUES
in scheme: Droit et Justice
in scheme: Divisions du Droit
in scheme: Droit Public
notation: REFIP2672

société publique locale d'aménagement
type: ConceptReFip
type: Concept
broader: coopération intercommunale
definition: Société anonyme contrôlée à 100% par les collectivités territoriales dans laquelle les établissements publics peuvent aussi participer. Sa compétence est limitée géographiquement au domaine de l'aménagement pour le compte de ses actionnaires. Outre leur domaine de compétence privilégié que sont les opérations d’aménagement, les Spla peuvent piloter des opérations de construction et de réhabilitation immobilière ainsi que des missions connexes comme la réalisation des études préalables, l’acquisition et la cession d’immeubles, de baux commerciaux, de fonds de commerce ou de fonds artisanaux.
in scheme: FINANCES PUBLIQUES
in scheme: Secteur public local
in scheme: Gestion Publique
notation: REFIP2673

taxation d'office
type: ConceptReFip
type: Concept
broader: imposition d'office
definition: Procédure que l'administration peut mettre en œuvre envers les contribuables qui se sont soustraits volontairement et en toute connaissance de cause à l'impôt.
in scheme: FINANCES PUBLIQUES
in scheme: Droit de Reprise de l'Administration
in scheme: Fiscalité
notation: REFIP2674

réserve de trésorerie
type: ConceptReFip
type: Concept
alternative label: compte de réserve
broader: passif
definition: "Compte de réserve" de trésorerie, c'est un poste comptable des capitaux propres qui représente une fraction des résultats de l'entreprise qui n'ont pas été distribués aux actionnaires.
in scheme: FINANCES PUBLIQUES
in scheme: Documents comptables
in scheme: Comptabilité
notation: REFIP2675
related: refip-REFIP742

reprise en régie d'un service public délégué
type: ConceptReFip
type: Concept
broader: régie
definition: Reprise sous forme de régie par une collectivité d'un service public industriel et commercial.
in scheme: FINANCES PUBLIQUES
in scheme: Secteur public local
in scheme: Gestion Publique
notation: REFIP2676

article budgétaire
type: ConceptReFip
type: Concept
broader: exécution du budget
definition: Ancienne subdivision des crédits budgétaires.
in scheme: FINANCES PUBLIQUES
in scheme: Exécution du budget
in scheme: Budget
notation: REFIP2678

abattoir
type: ConceptReFip
type: Concept
broader: agroalimentaire
definition: Bâtiment industriel dans lequel les animaux sont abattus pour la consommation et la boucherie, géré par collectivités (abattoirs publics).
in scheme: FINANCES PUBLIQUES
in scheme: Branche d'activité
in scheme: Questions Economiques
in scheme: Industrie
notation: REFIP268

relance des défaillants déclaratifs
type: ConceptReFip
type: Concept
broader: défaillant déclaratif
definition: Procédure mise en œuvre après constat de la défaillance de dépôt de déclaration du contribuable et qui peut éventuellement se matérialiser par l'envoi d'une lettre de relance.
in scheme: FINANCES PUBLIQUES
in scheme: Fiscalité - Autres notions
in scheme: Fiscalité
notation: REFIP2680

contentieux judiciaire
type: ConceptReFip
type: Concept
broader: refip-REFIP689
definition: Ensemble des litiges recouvrant les affaires d’ordre pénal , civil ou social.
in scheme: FINANCES PUBLIQUES
in scheme: Principes Généraux
in scheme: Droit et Justice
in scheme: Procédure
notation: REFIP2681

appel d'offres sur performances (supprimé)
type: ConceptReFip
type: Concept
broader: ZZ
in scheme: FINANCES PUBLIQUES
notation: REFIP2684

crédit d'impôt pour la compétitivité et l'emploi
type: ConceptReFip
type: Concept
alternative label: crédit d'impôt compétitivité emploi
broader: refip-REFIP849
definition: Avantage fiscal qui concerne les entreprises employant des salariés et équivaut à une baisse de leurs charges sociales. Le CICE s'impute en priorité sur l'impôt sur le revenu ou l'impôt sur les sociétés dû au titre de l'année au cours de laquelle les rémunérations prises en compte pour le calcul du CICE ont été versées. Il peut ensuite être imputé sur les 3 années suivantes. Il est restitué au-delà de ce délai.
in scheme: FINANCES PUBLIQUES
in scheme: Liquidation de l'Impôt
in scheme: Fiscalité
notation: REFIP2686

contrainte administrative
type: ConceptReFip
type: Concept
broader: procédure civile
definition: Acte délivré par l’administration des Finances ou par une caisse de Sécurité sociale, susceptible d’exécution forcée contre le redevable, dans le cadre de procédure de recouvrement.
in scheme: FINANCES PUBLIQUES
in scheme: Procédure Civile
in scheme: Droit et Justice
in scheme: Procédure
narrower: ordonnance de contrainte
notation: REFIP2687

établissement public de coopération culturelle
type: ConceptReFip
type: Concept
alternative label: EPCC
broader: refip-REFIP973
definition: Etablissement public constitué par une collectivité territoriale ou un établissement public de coopération intercommunale (EPCI) pour gérer un service public culturel. Les activités de l'EPCC doivent présenter un intérêt pour chacune des personnes morales en cause et contribuer à la réalisation de la politique culturelle nationale.
in scheme: FINANCES PUBLIQUES
in scheme: Organisation Territoriale
in scheme: Structures Territoriales
in scheme: Administration de L'Etat
notation: REFIP2688

régime de déclaration contrôlée
type: ConceptReFip
type: Concept
broader: régime d'imposition
definition: Régime fiscal des contribuables percevant des revenus non commerciaux dont le montant annuel excède les limites prévues dans le Code Général des Impôts.
in scheme: FINANCES PUBLIQUES
in scheme: Régime d'Imposition
in scheme: Fiscalité
notation: REFIP2689

jugement de conversion
type: ConceptReFip
type: Concept
broader: jugement
definition: Décision fixant le passage d'un mécanisme à un autre à l'intérieur d'un même cadre juridique (ex, jugement de conversion de RJ en LJ),
in scheme: FINANCES PUBLIQUES
in scheme: Principes Généraux
in scheme: Droit et Justice
in scheme: Procédure
notation: REFIP269

recensement économique de l'achat public
type: ConceptReFip
type: Concept
alternative label: recensement économique des achats publics
broader: commande publique
definition: Acte permettant de satisfaire aux obligations statistiques de l’Union européenne, de fournir à l’ensemble des décideurs publics des indicateurs de pilotage, d’apprécier l’impact des politiques publiques et de permettre une meilleure gestion des deniers publics.
in scheme: FINANCES PUBLIQUES
in scheme: Commande publique
in scheme: Gestion Publique
notation: REFIP2690

allocation temporaire d'invalidité
type: ConceptReFip
type: Concept
alternative label: ATI
broader: refip-REFIP6584
definition: Prestation versée, en plus de son traitement, à un agent en activité devenu partiellement invalide à la suite d'un accident de travail ou d'une maladie professionnelle, sous certaines conditions. Elle est octroyée pour une période de 5 ans reconductible après examen par la commission de réforme.
in scheme: FINANCES PUBLIQUES
in scheme: Gestion des ressources humaines
in scheme: Rémunération
in scheme: Fonction Publique et Gestion des Ressources Humaines
notation: REFIP2692

contentieux juridictionnel
type: ConceptReFip
type: Concept
broader: refip-REFIP689
definition: Contentieux porté devant une juridiction.
in scheme: FINANCES PUBLIQUES
in scheme: Principes Généraux
in scheme: Droit et Justice
in scheme: Procédure
notation: REFIP2693

application SPI
type: ConceptReFip
type: Concept
alternative label: simplification des procédures d'imposition
broader: applications fiscales (non-descripteur)
definition: Application permettant au niveau national d'identifier les contribuables personnes physiques, de gérer leur état civil notamment en liaison avec l'INSEE, de répertorier l'ensemble de leurs obligations fiscales ainsi que de localiser les occurrences fiscales liées à ces obligations.
in scheme: FINANCES PUBLIQUES
in scheme: Applications Informatiques
in scheme: Applications fiscales
notation: REFIP2694
scope note: Remplacée à compter du 15/01/2009 par l'application SYNCOFI

réserves à la réception de travaux
type: ConceptReFip
type: Concept
broader: réception de travaux
definition: Ensemble des constatations de non-conformité aux stipulations du marché, faites lors des vérifications préalables à l’admission, qui sont portées à la connaissance du titulaire et qui font obstacle au prononcé de la décision d’admission par le pouvoir adjudicateur. En cas de réserves, la décision d’admission est ajournée ou prononcée avec une réfaction du prix.
in scheme: FINANCES PUBLIQUES
in scheme: Commande publique
in scheme: Gestion Publique
notation: REFIP2696

théorie de l'imprévision
type: ConceptReFip
type: Concept
broader: droit administratif
definition: Événement exceptionnel, ou événement naturel (catastrophe) qui peut faire obstacle à l'exécution du marché.
in scheme: FINANCES PUBLIQUES
in scheme: Droit et Justice
in scheme: Divisions du Droit
in scheme: Droit Public
notation: REFIP2697
related: fait du prince

centre financier
type: ConceptReFip
type: Concept
broader: CHORUS (non-descripteur)
definition: Unité au sein de laquelle le budget est mis en place et potentiellement exécuté, le centre financier traduit la structure de l'établissement en unités budgétaires et en centres de responsabilité.
in scheme: FINANCES PUBLIQUES
in scheme: Comptabilité publique
in scheme: Comptabilité
notation: REFIP2699

Bulletin officiel des services déconcentrés du Trésor (supprimé)
type: ConceptReFip
type: Concept
broader: ZZ
in scheme: FINANCES PUBLIQUES
notation: REFIP27

irrecevabilité
type: ConceptReFip
type: Concept
broader: recevabilité
definition: Sanction de l'inobservation d'une prescription légale consistant à rejeter, sans l'examiner au fond, un acte qui n'a pas été formulé en temps voulu ou qui ne remplit pas les conditions exigées.
in scheme: FINANCES PUBLIQUES
in scheme: Principes Généraux
in scheme: Droit et Justice
in scheme: Procédure
notation: REFIP270

acte sous seing privé
type: ConceptReFip
type: Concept
broader: sources des droits subjectifs (non-descripteur)
definition: Acte écrit établi par les parties elles-mêmes ou par un tiers autre qu'un officier public, et signé par les parties.
in scheme: FINANCES PUBLIQUES
in scheme: Droit et Justice
in scheme: Sources du Droit
in scheme: Sources des Droits Subjectifs
notation: REFIP2700

transport routier
type: ConceptReFip
type: Concept
broader: refip-REFIP766
definition: Activité réglementée de transports terrestres englobant à la fois le transport routier de personnes ou de marchandises ainsi que l'activité de déménagement.
in scheme: FINANCES PUBLIQUES
in scheme: Branche d'activité
in scheme: Questions Economiques
in scheme: Transports
narrower: véhicule terrestre à moteur
narrower: immatriculation de véhicule
narrower: péage
notation: REFIP2702
related: autobus
related: transport de marchandises
related: infrastructure routière

taxe sur les salaires
type: ConceptReFip
type: Concept
broader: taxes et participations assises sur les salaires (non-descripteur)
definition: Taxe acquittée par les employeurs établis en France, lorsqu'ils ne sont pas soumis à la taxe sur la valeur ajoutée (TVA) sur la totalité de leur chiffre d'affaires. Elle est calculée sur les rémunérations versées au cours de l'année par application d'un barème progressif.
in scheme: FINANCES PUBLIQUES
in scheme: Fiscalité
in scheme: Impôt
notation: REFIP2704

acte innommé
type: ConceptReFip
type: Concept
alternative label: contrat innommé
broader: sources des droits subjectifs (non-descripteur)
definition: Contrat qui n'est pas décrit par le code civil et par là-même dont le régime juridique n'est pas fixé par ce même code civil. Il répond aux exigences relatives à tous les contrats, mais en cas de litige, c'est au juge qu'il appartient de procéder par analogie, en le rapprochant d'un contrat nommé qui lui est proche.
in scheme: FINANCES PUBLIQUES
in scheme: Droit et Justice
in scheme: Sources du Droit
in scheme: Sources des Droits Subjectifs
notation: REFIP2706

vente à consommer sur place
type: ConceptReFip
type: Concept
broader: vente
definition: Fourniture de nourriture préparée ou non et/ou de boissons, destinées à la consommation humaine, accompagnées de services connexes suffisants pour permettre leur consommation immédiate sur place.
in scheme: FINANCES PUBLIQUES
in scheme: Droit et Justice
in scheme: Divisions du Droit
in scheme: Droit Privé
notation: REFIP2707

rappel de taxe sur la valeur ajoutée
type: ConceptReFip
type: Concept
alternative label: rappel de TVA
broader: procédure de contrôle fiscal
definition: Montant de TVA réclamé au redevable et résultant d'un contrôle fiscal.
in scheme: FINANCES PUBLIQUES
in scheme: Droit de Reprise de l'Administration
in scheme: Fiscalité
notation: REFIP2708

paramétrage
type: ConceptReFip
type: Concept
broader: informatique
definition: Réglage d'un progiciel par l’introduction de données permettant ainsi la modification de son fonctionnement.
in scheme: FINANCES PUBLIQUES
in scheme: Informatique
in scheme: Communication Documentation Informatique
notation: REFIP271

application BODACC
type: ConceptReFip
type: Concept
broader: applications fiscales (non-descripteur)
definition: Application permettant la transmission par messagerie des annonces BODACC, des annonces des journaux d'annonces légales, des décisions des greffes des tribunaux de commerces aux SIE et PRS afin de leur permettre de procéder dans les délais au recouvrement des dettes fiscales des entreprises.
in scheme: FINANCES PUBLIQUES
in scheme: Applications Informatiques
in scheme: Applications fiscales
notation: REFIP2710

convention de services comptable et financier
type: ConceptReFip
type: Concept
alternative label: CSCF
broader: contrat et mode de gestion (non-descripteur)
definition: Cadre partenarial établi entre la collectivité territoriale et la DGFiP afin de permettre à la collectivité signataire de bénéficier de l'appui de son comptable public et de l'ensemble du réseau de la DGFiP.
in scheme: FINANCES PUBLIQUES
in scheme: Secteur public local
in scheme: Gestion Publique
notation: REFIP2711

Pôle interrégional d'apurement administratif
type: ConceptReFip
type: Concept
alternative label: PIAA
broader: direction régionale des finances publiques
definition: Structure interrégionale ayant pour mission de procéder à la vérification des comptes soumis à l’apurement administratif pour le compte des comptables supérieurs. Le PIAA exerce un contrôle de recevabilité des comptes, dès leur réception. Après cette vérification de forme, il procède à la vérification au fond des comptes de gestion.
in scheme: FINANCES PUBLIQUES
in scheme: Organisation Structurelle de l'Etat
in scheme: Ministère
in scheme: Administration de L'Etat
notation: REFIP2712

contingent
type: ConceptReFip
type: Concept
alternative label: quota
broader: mots outils (liste additive)
definition: Proportion prédéfinie.
in scheme: FINANCES PUBLIQUES
in scheme: Mots Outils
notation: REFIP2714

archives
type: ConceptReFip
type: Concept
broader: délai de conservation
definition: Ensemble des documents créés dans le cadre de son activité et que l'on conserve pour pouvoir s'y reporter un jour. Désigne également les services et institutions qui les collectent, les classent, les conservent et les communiquent ; ainsi que les locaux où ils sont conservés.
in scheme: FINANCES PUBLIQUES
in scheme: Documentation
in scheme: Communication Documentation Informatique
narrower: refip-REFIP6983
notation: REFIP2715

circulaire
type: ConceptReFip
type: Concept
alternative label: circulaire administrative
broader: législation
definition: Instruction de service écrite adressée par une autorité supérieure à des agents subordonnés en vertu de son pouvoir hiérarchique. En principe juridiquement dépourvue de force obligatoire vis à vis des administrés.
in scheme: FINANCES PUBLIQUES
in scheme: Droit et Justice
in scheme: Sources du Droit
in scheme: Sources du Droit Objectif
notation: REFIP2716

Code des pensions militaires d'invalidité et des victimes de la guerre
type: ConceptReFip
type: Concept
broader: documentation juridique (non-descripteur)
definition: Ensemble des lois relatives au droit des pensions militaires d'invalidité et des victimes de la guerre. Les anciens combattants et les victimes de guerre se voient manifester une reconnaissance particulière par la République française, qui prend la forme d'un droit à réparation. Ce droit et cette reconnaissance sont dus également aux conjoints survivants, ascendants et orphelins. Ce code définit les critères nécessaire pour se voir reconnaître ces statuts.
in scheme: FINANCES PUBLIQUES
in scheme: Droit et Justice
in scheme: Documentation Juridique
in scheme: Sources du Droit
notation: REFIP2717

imposition forfaitaire sur les transformateurs électriques
type: ConceptReFip
type: Concept
alternative label: IFTE
broader: imposition forfaitaire sur les entreprises de réseaux
definition: Imposition qui s'applique aux transformateurs électriques relevant des réseaux publics de transport et de distribution d'électricité. Constitue une composante de l'IFER.
in scheme: FINANCES PUBLIQUES
in scheme: Fiscalité
in scheme: Impôt
notation: REFIP2719

cadeau d'affaire
type: ConceptReFip
type: Concept
alternative label: cadeau d'entreprise
broader: cadeau
definition: Cadeau offert occasionnellement ou périodiquement dans le cadre de relations professionnelles.
in scheme: FINANCES PUBLIQUES
in scheme: Champ d'Application
in scheme: Fiscalité
notation: REFIP272

application DELPHES
type: ConceptReFip
type: Concept
alternative label: DELPHES
broader: applications gestion publique (non-descripteur)
definition: Application décisionnelle d’Hélios offrant des outils de contrôle interne, de pilotage et de mesure de l’activité, des tableaux de bord et un portail de saisie.
in scheme: FINANCES PUBLIQUES
in scheme: Applications Informatiques
in scheme: Applications gestion publique
notation: REFIP2720

Slovénie
type: ConceptReFip
type: Concept
alternative label: République de Slovénie
broader: Europe
definition: Pays
in scheme: FINANCES PUBLIQUES
in scheme: Géographie
in scheme: Europe
notation: REFIP2722

provision réglementée
type: ConceptReFip
type: Concept
broader: provision
definition: Provision qui ne répond pas à la définition d’une provision au sens comptable (c’est-à-dire qu’il ne s’agit pas d’une provision constatée en l’application des principes comptables) mais qui est constituée en application de dispositions fiscales particulières instituées par le Code Général des Impôts (CGI). Toutes les provisions réglementées sont regroupées dans les capitaux propres au passif du bilan comptable. Elles sont assimilées à des réserves non libérées d’impôt générant une fiscalité différée qui n’est pas comptabilisée.
in scheme: FINANCES PUBLIQUES
in scheme: Documents comptables
in scheme: Comptabilité
notation: REFIP2723

service à compétence nationale
type: ConceptReFip
type: Concept
broader: Direction générale des finances publiques
definition: Service se situant à mi-chemin entre les administrations centrales et les administrations déconcentrées. Les attributions des services à compétence nationale ont un caractère national et leur exécution ne peut être déléguée à un échelon territorial. Ils se distinguent également des services centraux, car leurs missions ont un « caractère opérationnel » et, pour ceux placés sous l’autorité d’un ministre, ils bénéficient d’une certaine autonomie.
in scheme: FINANCES PUBLIQUES
in scheme: Organisation Structurelle de l'Etat
in scheme: Ministère
in scheme: Administration de L'Etat
narrower: service des retraites de l'Etat
narrower: Direction nationale d'enquêtes fiscales
narrower: Direction des vérifications nationales et internationales
narrower: Direction des résidents à l'étranger et des services généraux
narrower: services informatiques
narrower: Direction nationale de vérification des situations fiscales
narrower: Ecole nationale des finances publiques
narrower: service de la documentation nationale du cadastre
narrower: Direction nationale d'intervention domaniale
narrower: Direction impôts service
narrower: Cap numérique
narrower: refip-REFIP7018
narrower: refip-REFIP7019
narrower: refip-REFIP984
notation: REFIP2725

Code de l'environnement
type: ConceptReFip
type: Concept
broader: documentation juridique (non-descripteur)
definition: Ensemble des textes juridiques relatifs au droit de l'environnement.
in scheme: FINANCES PUBLIQUES
in scheme: Droit et Justice
in scheme: Documentation Juridique
in scheme: Sources du Droit
notation: REFIP2726

bordereau de situation fiscale
type: ConceptReFip
type: Concept
alternative label: bordereau de situation
alternative label: rapport sur situation fiscale
broader: documentation fiscale (non-descripteur)
definition: Relevé des paiements des impôts, attestant le cas échéant, que le contribuable qui le demande est à jour du paiement de ses impôts.
in scheme: FINANCES PUBLIQUES
in scheme: Documentation Fiscale
in scheme: Fiscalité
notation: REFIP2727

forêt
type: ConceptReFip
type: Concept
broader: milieu naturel
definition: Etendue boisée, relativement dense, constituée d'un ou plusieurs peuplements d'arbres et d'espèces associées.
in scheme: FINANCES PUBLIQUES
in scheme: Environnement
in scheme: Milieu Naturel
in scheme: Questions de Société
notation: REFIP2728
related: affouage

Luxembourg
type: ConceptReFip
type: Concept
broader: Europe
definition: Pays
in scheme: FINANCES PUBLIQUES
in scheme: Géographie
in scheme: Europe
notation: REFIP2729

rapport de gestion
type: ConceptReFip
type: Concept
broader: documents comptables
definition: Document nécessaire à la présentation des résultats comptables d'une entité. Le rapport de gestion fait partie des documents que certaines entreprises doivent impérativement dresser dans le cadre de leurs obligations comptables. Il vise à présenter les informations délivrées par l'équipe de direction ainsi que leurs commentaires et points de vue sur les résultats de l'entreprise.
in scheme: FINANCES PUBLIQUES
in scheme: Documents comptables
in scheme: Comptabilité
notation: REFIP273

Kenya
type: ConceptReFip
type: Concept
alternative label: République du Kenya
broader: Afrique
definition: Pays
in scheme: FINANCES PUBLIQUES
in scheme: Géographie
in scheme: Afrique
notation: REFIP2730

Code de la voirie routière
type: ConceptReFip
type: Concept
broader: documentation juridique (non-descripteur)
definition: Code qui regroupe les dispositions législatives et réglementaires relatives aux voies routières publiques ou privées.
in scheme: FINANCES PUBLIQUES
in scheme: Droit et Justice
in scheme: Documentation Juridique
in scheme: Sources du Droit
notation: REFIP2731

opposition administrative
type: ConceptReFip
type: Concept
broader: opposition
definition: Principal acte de poursuite en matière de recouvrement contentieux des amendes. Adressée aux personnes physiques ou morales qui détiennent des fonds pour le compte du redevable, qui ont une dette envers lui ou qui lui versent une rémunération. Le Trésor public notifie cette opposition administrative au redevable en même temps qu'elle est adressée au tiers détenteur. Le destinataire de l'opposition administrative est tenu de rendre les fonds qu'il détient indisponibles à concurrence du montant de l'amende ou de la condamnation pécuniaire.
in scheme: FINANCES PUBLIQUES
in scheme: Recouvrement
in scheme: Fiscalité
narrower: opposition au transfert du certificat d'immatriculation
notation: REFIP2732

avis d'enquête
type: ConceptReFip
type: Concept
broader: documentation fiscale (non-descripteur)
definition: Imprimé n° 3931-SD remis par l'administration à l'assujetti lors de la première intervention ou convocation, dans le cadre de l'exercice de son droit d'enquête.
in scheme: FINANCES PUBLIQUES
in scheme: Documentation Fiscale
in scheme: Fiscalité
notation: REFIP2733

coopération transfrontalière
type: ConceptReFip
type: Concept
broader: coopération intercommunale
definition: Coopération visant à renforcer et à développer les rapports de voisinage entre collectivités ou autorités territoriales relevant de deux ou plusieurs États. L'un des principes de base de la coopération transfrontalière est de créer des liens et des relations contractuelles dans des régions frontalières afin que des solutions communes à des problèmes communs puissent être trouvées. En Europe, la coopération transfrontalière a été formalisée par la Convention-cadre européenne sur la coopération transfrontalière des collectivités ou autorités territoriales, dite Convention de Madrid, signée par les États membres du Conseil de l'Europe.
in scheme: FINANCES PUBLIQUES
in scheme: Secteur public local
in scheme: Gestion Publique
notation: REFIP2734

amodiation
type: ConceptReFip
type: Concept
broader: convention d'utilisation
definition: Acte juridique qui permet à une autorité publique ou un particulier d'affecter un terrain pour une durée limitée de façon irréversible à un tiers qui peut être une entreprise privée ou une collectivité.
in scheme: FINANCES PUBLIQUES
in scheme: Domaine
in scheme: Gestion Publique
notation: REFIP2735

ordre de recette
type: ConceptReFip
type: Concept
broader: refip-REFIP982
definition: Titre exécutoire émis par un ordonnateur dans le cadre de l'exécution d'un budget en recette. Ce titre de perception prend le nom de rôle lorsqu'il s'agit d'une recette d'impôt.
in scheme: FINANCES PUBLIQUES
in scheme: Documentation budgétaire
in scheme: Budget
narrower: titre de perception
narrower: état exécutoire
narrower: titre de recette
notation: REFIP2738
related: rôle d'imposition

document d'orientations stratégiques (supprimé)
type: ConceptReFip
type: Concept
broader: ZZ
in scheme: FINANCES PUBLIQUES
notation: REFIP2739

juridiction civile
type: ConceptReFip
type: Concept
broader: juridiction judiciaire
definition: Ensemble des tribunaux qui connaissent des litiges entre particuliers, régis par le droit civil.
in scheme: FINANCES PUBLIQUES
in scheme: Droit et Justice
in scheme: Juridiction
in scheme: Organisation Juridictionnelle
narrower: tribunal de grande instance
narrower: conseil de prud'hommes
narrower: juridiction commerciale
narrower: tribunal d'instance
narrower: refip-REFIP867
notation: REFIP274

fonds particuliers (supprimé)
type: ConceptReFip
type: Concept
broader: ZZ
in scheme: FINANCES PUBLIQUES
notation: REFIP2741

République du Panama
type: ConceptReFip
type: Concept
alternative label: Panama
broader: Amérique
definition: Pays
in scheme: FINANCES PUBLIQUES
in scheme: Géographie
in scheme: Amérique
notation: REFIP2742

contrôle financier
type: ConceptReFip
type: Concept
alternative label: contrôle financier central
broader: contrôle interne
definition: Contrôle de nature administrative s'exerçant sur les actes des ordonnateurs de nature à engager financièrement l’État, ainsi que sur les affectations d'autorisation de programme et les mouvements de crédits. Il s'exerce également sur les actes de recrutement et de GRH. Au niveau central le contrôle est exercé par un agent placé auprès de chaque ministre mais sous l'autorité du ministre des finances.
in scheme: FINANCES PUBLIQUES
in scheme: Missions Transverses des Finances publiques
in scheme: Maîtrise des risques
notation: REFIP2744

droit de véto
type: ConceptReFip
type: Concept
broader: droit constitutionnel
definition: Droit de s’opposer par un vote hostile à l’adoption d’une résolution lorsque l’unanimité est requise.
in scheme: FINANCES PUBLIQUES
in scheme: Droit et Justice
in scheme: Divisions du Droit
in scheme: Droit Public
notation: REFIP2745

Marseille
type: ConceptReFip
type: Concept
broader: Bouches-du-Rhône
definition: Ville française
in scheme: FINANCES PUBLIQUES
in scheme: Géographie
in scheme: Europe
notation: REFIP2746

association sportive
type: ConceptReFip
type: Concept
broader: association de la loi de 1901
definition: Association déclarée sous le statut des associations Loi 1901, libre de s'affilier à la fédération sportive de son choix. Elle ne peut bénéficier de l’aide de l’état qu’à la condition d’avoir été agréé par le préfet.
in scheme: FINANCES PUBLIQUES
in scheme: Entreprises
in scheme: Forme juridique
in scheme: Association
notation: REFIP2747
related: refip-REFIP6858

extension
type: ConceptReFip
type: Concept
broader: mots outils (liste additive)
definition: Développement.
in scheme: FINANCES PUBLIQUES
in scheme: Mots Outils
notation: REFIP275

franchise de taxe
type: ConceptReFip
type: Concept
alternative label: franchise fiscale
broader: régime d'imposition
definition: Dispense de paiement de l'impôt normalement dû pour des opérations n'excédant pas un certain montant ou pour certains contribuables, sous conditions.
in scheme: FINANCES PUBLIQUES
in scheme: Régime d'Imposition
in scheme: Fiscalité
narrower: achat en franchise
notation: REFIP2750

assainissement
type: ConceptReFip
type: Concept
alternative label: gestion des déchets
broader: protection de l'environnement
definition: Dispositif visant à améliorer la situation sanitaire globale de l'environnement dans ses différentes composantes. Il comprend la collecte, le traitement et l'évacuation des déchets liquides, des déchets solides et des excréments.
in scheme: FINANCES PUBLIQUES
in scheme: Environnement
in scheme: Protection de l'Environnement
in scheme: Questions de Société
narrower: refip-REFIP6811
narrower: refip-REFIP6886
narrower: refip-REFIP829
notation: REFIP2751
related: service public d'assainissement non collectif

formulaire conventionnel (supprimé)
type: ConceptReFip
type: Concept
broader: ZZ
in scheme: FINANCES PUBLIQUES
notation: REFIP2752

expulsion
type: ConceptReFip
type: Concept
broader: droit administratif
definition: Ordre donné par le ministère de l'Intérieur à un étranger de quitter le territoire français ou action consistant à obliger l'occupant sans titre ou le locataire en fin de bail d'un immeuble de vider les lieux.
in scheme: FINANCES PUBLIQUES
in scheme: Droit et Justice
in scheme: Divisions du Droit
in scheme: Droit Public
notation: REFIP2753

crédit d'impôt pour dépenses d'acquisition d'un véhicule propre
type: ConceptReFip
type: Concept
broader: refip-REFIP849
definition: Crédit d'impôt pour les personnes achetant ou louant un véhicule peu polluant. Dispositif mis en place du 1er janvier 2001 au 31 décembre 2009.
in scheme: FINANCES PUBLIQUES
in scheme: Liquidation de l'Impôt
in scheme: Fiscalité
notation: REFIP2754

témoin
type: ConceptReFip
type: Concept
broader: procédure pénale
definition: Particulier invité à déposer dans le cadre d'une enquête ou sous la forme écrite d'une attestation sur les faits dont il a eu personnellement connaissance, après avoir prêté serment de dire la vérité.
in scheme: FINANCES PUBLIQUES
in scheme: Procédure Pénale
in scheme: Droit et Justice
in scheme: Procédure
notation: REFIP2755

établissement de cure
type: ConceptReFip
type: Concept
alternative label: Centre thermal
alternative label: établissement de cure thermale
alternative label: établissement thermal
broader: établissement public de santé
definition: Etablissement recevant des curistes, personnes effectuant un séjour thérapeutique, avec ou sans traitement médical, dans une station thermale.
in scheme: FINANCES PUBLIQUES
in scheme: Organisation Territoriale
in scheme: Structures Territoriales
in scheme: Administration de L'Etat
notation: REFIP2756

marché d'entreprise de travaux publics (supprimé)
type: ConceptReFip
type: Concept
broader: ZZ
in scheme: FINANCES PUBLIQUES
notation: REFIP2757

service France Domaine
type: ConceptReFip
type: Concept
alternative label: France Domaine
alternative label: service des domaines
broader: administration centrale des finances publiques
definition: Service de la DGFIP, rattaché directement au directeur général réalisant entre autres, les schémas pluriannuels de stratégie immobilière des administrations centrales, déconcentrées et des opérateurs. Il est responsable du plan de cessions, de la gestion et de l’entretien des immeubles domaniaux.
in scheme: FINANCES PUBLIQUES
in scheme: Organisation Structurelle de l'Etat
in scheme: Ministère
in scheme: Administration de L'Etat
notation: REFIP2758
related: Direction nationale d'intervention domaniale
scope note: Remplacé par la Direction de l'Immobilier de l'Etat depuis le 22 septembre 2016

Autorité des marchés financiers
type: ConceptReFip
type: Concept
broader: Autorité publique indépendante
definition: Autorité publique indépendante de régulation des marchés financier, elle a sous son contrôle tous les marchés financiers et apporte son concours au législateur pour l'élaboration de la réglementation des marchés financiers y compris à l’échelon européen. Elle a pour missions de veiller à la protection de l'épargne investie dans les produits financiers, à l'information des investisseurs,et au bon fonctionnement des marchés financiers.
in scheme: FINANCES PUBLIQUES
in scheme: Organisation Structurelle de l'Etat
in scheme: Autorité Administrative
in scheme: Administration de L'Etat
notation: REFIP2759

déduction pour investissement
type: ConceptReFip
type: Concept
alternative label: DPI
alternative label: déduction fiscale pour investissement
broader: déduction fiscale
definition: Déduction en faveur des exploitants agricoles soumis à un régime réel d'imposition, d'une fraction de leur bénéfice en vue de financer dans les 5 ans qui suivent, leurs stocks ou leurs immobilisations amortissables.
in scheme: FINANCES PUBLIQUES
in scheme: Liquidation de l'Impôt
in scheme: Fiscalité
notation: REFIP276

redevance d'équipement (supprimé)
type: ConceptReFip
type: Concept
broader: ZZ
in scheme: FINANCES PUBLIQUES
notation: REFIP2760

communauté réduite aux acquets
type: ConceptReFip
type: Concept
alternative label: communauté de biens
alternative label: communauté légale
alternative label: régime légal
broader: régime matrimonial
definition: Régime matrimonial qui s’applique à tous les époux mariés depuis le 1er février 1966 et qui n’ont pas choisi un autre régime matrimonial par contrat de mariage. Les biens communs aux époux se réduisent aux seuls acquêts.
in scheme: FINANCES PUBLIQUES
in scheme: Droit et Justice
in scheme: Divisions du Droit
in scheme: Droit Privé
notation: REFIP2761

vice de construction
type: ConceptReFip
type: Concept
broader: droit des obligations et contrats (non-descripteur)
definition: Défaut portant sur la qualité technique de la construction et qui rend l'ouvrage impropre à sa destination normale ou qui en affecte la solidité. Il peut être apparent ou caché.
in scheme: FINANCES PUBLIQUES
in scheme: Droit et Justice
in scheme: Divisions du Droit
in scheme: Droit Privé
notation: REFIP2762
related: malfaçon

Institut d'émission d'outre-mer
type: ConceptReFip
type: Concept
alternative label: IEOM
broader: établissement public à caractère administratif
definition: Etablissement public national qui exerce les fonctions de banque centrale dans les collectivités d’outre-mer du Pacifique (Nouvelle-Calédonie, Polynésie française, Wallis-et-Futuna). Il est chargé de l’émission monétaire, précédemment dévolu dans les territoires français du Pacifique à la Banque de l’Indochine.
in scheme: FINANCES PUBLIQUES
in scheme: Organisation Structurelle de l'Etat
in scheme: Opérateur de l'Etat
in scheme: Administration de L'Etat
notation: REFIP2763

passeport
type: ConceptReFip
type: Concept
broader: document administratif
definition: Document de circulation délivré par le gouvernement d'un État à ses citoyens, pouvant aussi servir de justificatif d'identité.
in scheme: FINANCES PUBLIQUES
in scheme: Documentation
in scheme: Communication Documentation Informatique
notation: REFIP2764

école
type: ConceptReFip
type: Concept
alternative label: bâtiment scolaire
alternative label: construction scolaire
alternative label: école maternelle
alternative label: école primaire
alternative label: école élémentaire
broader: établissement d'enseignement
definition: Etablissement d'enseignement du premier degré, divisé en deux niveaux : l'école maternelle qui accueille les enfants avant l'instruction obligatoire qui débute à 6 ans et l'école élémentaire qui accueille les enfants scolarisés de 6 à 11 ans.
in scheme: FINANCES PUBLIQUES
in scheme: Organisation Territoriale
in scheme: Structures Territoriales
in scheme: Administration de L'Etat
notation: REFIP2765

prestation de service
type: ConceptReFip
type: Concept
broader: fiscalité des professionnels
definition: Toute opération qui ne constitue pas une livraison de bien corporel ainsi que les opérations mixtes assimilées à des prestations de services (travaux immobiliers, ventes à consommer sur place).
in scheme: FINANCES PUBLIQUES
in scheme: Champ d'Application
in scheme: Fiscalité
notation: REFIP2766

aide aux grands projets d'investissement (supprimé)
type: ConceptReFip
type: Concept
broader: ZZ
in scheme: FINANCES PUBLIQUES
notation: REFIP2768

transfert d'actif
type: ConceptReFip
type: Concept
broader: fusion de sociétés
definition: Terme général englobant : la fusion, l'absorption , la scission et l'apport partiel d'actif.
in scheme: FINANCES PUBLIQUES
in scheme: Vie de l'Entreprise
in scheme: Entreprises
in scheme: Vie et Gestion de l'entreprise
notation: REFIP2769

créancier nanti
type: ConceptReFip
type: Concept
broader: créancier privilégié
definition: Créancier bénéficiant d'un nantissement, à savoir une garantie opérant dépossession du bien meuble (gage) ou immeuble (antichrèse).
in scheme: FINANCES PUBLIQUES
in scheme: Droit et Justice
in scheme: Divisions du Droit
in scheme: Droit Privé
narrower: créancier gagiste
notation: REFIP277

travailleur étranger
type: ConceptReFip
type: Concept
broader: travailleur salarié
definition: Salarié ayant en France, une autorisation de travail ou un contrat de travail visé par l’autorité administrative.
in scheme: FINANCES PUBLIQUES
in scheme: Entreprises
in scheme: Travail
in scheme: 212619
notation: REFIP2771
related: refip-REFIP6619

contrôle de gestion
type: ConceptReFip
type: Concept
broader: pilotage
definition: Système de pilotage à la disposition d'un responsable, ayant pour mission de contribuer à accroître le bénéfice que l'action de l'Etat procure à la société et à optimiser la qualité du service rendu à l'usager dans un cadre budgétaire soutenable. Il permet de donner du sens à l'action collective et constitue une aide permanente à la décision.
in scheme: FINANCES PUBLIQUES
in scheme: Missions Transverses des Finances publiques
in scheme: Pilotage
notation: REFIP2772

changement d'adresse
type: ConceptReFip
type: Concept
broader: domicile fiscal
definition: Déménagement du contribuable qui doit en informer la Direction Générale des Fiances Publiques et l'indiquer sur sa déclaration de revenus.
in scheme: FINANCES PUBLIQUES
in scheme: Champ d'Application
in scheme: Fiscalité
notation: REFIP2773
scope note: Fiscalité

courriel
type: ConceptReFip
type: Concept
alternative label: courrier électronique
alternative label: email
alternative label: mel
broader: courrier
definition: Courrier électronique qu'un utilisateur saisit, envoie ou consulte en différé par l'intermédiaire d'un réseau informatique.
in scheme: FINANCES PUBLIQUES
in scheme: Communication
in scheme: Communication Documentation Informatique
notation: REFIP2775

syndicat interhospitalier
type: ConceptReFip
type: Concept
broader: établissement public de santé
definition: Etablissement public dont la création est autorisée par arrêté du directeur de l'agence régionale de l'hospitalisation du siège du syndicat, à la demande de deux ou plusieurs établissements publics de santé ou privés à but non lucratif participant à l'exécution du service public hospitalier. Il peut notamment exercer les missions suivantes : création et gestion de services communs ; formation et perfectionnement de tout ou partie du personnel.
in scheme: FINANCES PUBLIQUES
in scheme: Organisation Territoriale
in scheme: Structures Territoriales
in scheme: Administration de L'Etat
notation: REFIP2777

réclamation fiscale
type: ConceptReFip
type: Concept
broader: contentieux fiscal
definition: Demande adressée par un contribuable à l'administration fiscale afin d'obtenir la réparation d'une erreur ou le bénéfice d'un droit.
in scheme: FINANCES PUBLIQUES
in scheme: Contentieux Fiscal
in scheme: Fiscalité
narrower: réclamation amiable
narrower: réclamation contentieuse
notation: REFIP2779

commission d'appel d'offres
type: ConceptReFip
type: Concept
alternative label: CAO
broader: attribution de marché public
definition: Instance chargée d’examiner les candidatures et les offres et d'attribuer le marché public. Elle dispose du pouvoir de déclarer la procédure infructueuse et doit donner son avis favorable pour l’engagement d’une procédure négociée.
in scheme: FINANCES PUBLIQUES
in scheme: Commande publique
in scheme: Gestion Publique
notation: REFIP278

groupement conjoint
type: ConceptReFip
type: Concept
broader: groupement d'entreprises
definition: Groupement d'entreprises constitué pour répondre à un marché public divisé en lots.
in scheme: FINANCES PUBLIQUES
in scheme: Commande publique
in scheme: Gestion Publique
notation: REFIP2780
related: lots

application FIDJI
type: ConceptReFip
type: Concept
alternative label: FIDJI
alternative label: fichier FIDJI
alternative label: fichier immobilier informatisé
alternative label: fichier informatisé de la documentation juridique des immeubles
alternative label: fichier informatisé des données juridiques immobilières
broader: applications fiscales (non-descripteur)
definition: Fichier Informatisé des Données Juridiques Immobilières permettant l'informatisation des processus métiers civils et fiscaux mis en œuvre dans les services de publicité foncière (Comptabilité, Enregistrement, Publication et Demande de renseignements).
in scheme: FINANCES PUBLIQUES
in scheme: Applications Informatiques
in scheme: Applications fiscales
notation: REFIP2781

délégation de crédit
type: ConceptReFip
type: Concept
broader: refip-REFIP996
definition: Avis d'octroi de crédit permettant l'engagement et la liquidation des dépenses au niveau déconcentré des ministères concernés.
in scheme: FINANCES PUBLIQUES
in scheme: Dépenses publiques
in scheme: Gestion Publique
notation: REFIP2785

charte du contribuable
type: ConceptReFip
type: Concept
alternative label: charte du contribuable vérifié
broader: documentation fiscale (non-descripteur)
definition: Document ayant pour objet de faire connaître au contribuable les garanties dont il bénéficie lorsqu'il fait l'objet d’une vérification de comptabilité, d'un examen de comptabilité ou d’un examen contradictoire de situation fiscale personnelle. Les dispositions contenues dans cette charte, mise à jour annuellement, sont opposables à l’administration.
in scheme: FINANCES PUBLIQUES
in scheme: Documentation Fiscale
in scheme: Fiscalité
notation: REFIP2786

cellule interrégionale de supervision des tiers
type: ConceptReFip
type: Concept
alternative label: CIST
broader: direction régionale des finances publiques
definition: Service lié à CHORUS traitant l’ensemble des demandes de validation de RIB simples.
in scheme: FINANCES PUBLIQUES
in scheme: Organisation Structurelle de l'Etat
in scheme: Ministère
in scheme: Administration de L'Etat
notation: REFIP2788
related: fonction de supervision des tiers

application LORCA
type: ConceptReFip
type: Concept
broader: applications missions transverses (non-descripteur)
definition: Logiciel d'organisation et de gestion du recrutement par concours administratif.
in scheme: FINANCES PUBLIQUES
in scheme: Applications missions transverses
in scheme: Applications Informatiques
notation: REFIP279

grand port maritime
type: ConceptReFip
type: Concept
broader: établissement public à caractère industriel et commercial
definition: Établissement public chargé de la gestion d'un port maritime. Ce type de statut, remplace, pour les principaux ports maritimes, celui de port autonome.
in scheme: FINANCES PUBLIQUES
in scheme: Organisation Structurelle de l'Etat
in scheme: Opérateur de l'Etat
in scheme: Administration de L'Etat
notation: REFIP2790
related: transport maritime

groupement agricole d'exploitation en commun
type: ConceptReFip
type: Concept
alternative label: GAEC
broader: société civile
definition: Société civile agricole de personnes permettant à des agriculteurs associés de travailler en commun dans des conditions comparables à celles existant dans les exploitations de caractère familial. Le GAEC a pour objet la mise en valeur en commun des exploitations des agriculteurs associés. Il favorise la mise en commun des compétences et des exploitations.
in scheme: FINANCES PUBLIQUES
in scheme: Société
in scheme: Entreprises
in scheme: Forme juridique
notation: REFIP2792

Direction des personnels et de l'adaptation de l'environnement professionnel (supprimé)
type: ConceptReFip
type: Concept
broader: ZZ
in scheme: FINANCES PUBLIQUES
notation: REFIP2795

centre d'appels interministériel (supprimé)
type: ConceptReFip
type: Concept
broader: ZZ
in scheme: FINANCES PUBLIQUES
notation: REFIP2797

Lot-et-Garonne
type: ConceptReFip
type: Concept
broader: refip-REFIP7020
definition: Département français
in scheme: FINANCES PUBLIQUES
in scheme: Géographie
in scheme: Europe
notation: REFIP2798

serveur professionnel des données cadastrales
type: ConceptReFip
type: Concept
alternative label: SPDC
alternative label: application SPDC
broader: applications fiscales (non-descripteur)
definition: Interface de confection des extraits cadastraux et de consultation, en temps réel et sur l'ensemble du territoire, des données foncières de la documentation cadastrale.
in scheme: FINANCES PUBLIQUES
in scheme: Applications Informatiques
in scheme: Applications fiscales
notation: REFIP2799

saisie conservatoire
type: ConceptReFip
type: Concept
broader: refip-REFIP783
definition: Mesure conservatoire pratiquée sur tous les biens mobiliers, corporels ou incorporels, appartenant au débiteur, même s'ils sont détenus par un tiers.
in scheme: FINANCES PUBLIQUES
in scheme: Recouvrement
in scheme: Fiscalité
notation: REFIP28

suspension provisoire des poursuites (supprimé)
type: ConceptReFip
type: Concept
broader: ZZ
in scheme: FINANCES PUBLIQUES
notation: REFIP280

activité ambulante
type: ConceptReFip
type: Concept
alternative label: activité itinérante
broader: commerce
definition: Activité commerciale exercée hors du territoire de la commune où est situé, pour la personne physique, son habitation ou, pour la personne morale, son principal établissement. Elles se déroulent essentiellement sur les marchés ou dans les halles et sur la voie publique.
in scheme: FINANCES PUBLIQUES
in scheme: Branche d'activité
in scheme: Questions Economiques
in scheme: Commerce
narrower: foire et marché
notation: REFIP2800

documents comptables
type: ConceptReFip
type: Concept
definition: Pièces justificatives des opérations réalisées par les entreprises ainsi que le livre et registre comptable. Ces pièces doivent être conservées par l’entreprise pendant une certaine durée minimale.
in scheme: FINANCES PUBLIQUES
in scheme: Documents comptables
in scheme: Comptabilité
narrower: plan comptable
narrower: bordereau
narrower: état de l'actif
narrower: pièce comptable
narrower: fiche d'écriture
narrower: compte de résultat
narrower: état financier
narrower: bilan
narrower: avis de crédit
narrower: rapport de gestion
narrower: compte annuel de l'Etat
narrower: compte financier
narrower: grand livre
narrower: déclaration de recettes
narrower: comptes sociaux
narrower: nomenclature comptable
narrower: état de synthèse
narrower: état de développement des soldes
narrower: état des prévisions de recettes et de dépenses
narrower: certificat de recettes
narrower: avis de règlement
narrower: compte de gestion
narrower: plan comptable de l'Etat
narrower: état de situation
narrower: balance comptable
narrower: refip-REFIP72
narrower: refip-REFIP876
notation: REFIP2802

crédit évaluatif
type: ConceptReFip
type: Concept
broader: exécution du budget
definition: Montant de crédits inscrits dans la loi de finances correspondant à une simple évaluation pouvant être dépassée sans l’accord préalable du législateur. Un programme de crédit évaluatif est ainsi mis en place pour le financement des charges de la dette et de la trésorerie de l’État.
in scheme: FINANCES PUBLIQUES
in scheme: Exécution du budget
in scheme: Budget
notation: REFIP2803

Délégation interministérielle à l'intelligence économique (supprimé)
type: ConceptReFip
type: Concept
broader: ZZ
in scheme: FINANCES PUBLIQUES
notation: REFIP2805

bail à construction
type: ConceptReFip
type: Concept
broader: refip-REFIP95
definition: Contrat de longue durée (18 à 99 ans) portant sur un bien immeuble et qui oblige le preneur à édifier sur le terrain loué des constructions, moyennant en tout ou partie, la remise des édifices au bailleur et si stipulé, un loyer révisable.
in scheme: FINANCES PUBLIQUES
in scheme: Droit et Justice
in scheme: Divisions du Droit
in scheme: Droit Privé
notation: REFIP2807

faillite personnelle
type: ConceptReFip
type: Concept
broader: entreprise en difficulté
definition: Sanction judiciaire, civile ou professionnelle, à l'encontre des dirigeants ayant commis de graves fautes entraînant la perte de l’entreprise. Elle cible les actes de gestion du dirigeant. Elle est indépendante du sort de la société et ne s’applique qu’à une personne physique et concerne les personnes physiques dirigeants de droit ou de fait de personnes morales ayant une activité économique; les personnes physiques exerçant la profession de commerçant, d’artisan, d’agriculteur; les personnes physiques représentants permanents de personnes morales, dirigeants des personnes morales.
in scheme: FINANCES PUBLIQUES
in scheme: Vie de l'Entreprise
in scheme: Entreprises
in scheme: Vie et Gestion de l'entreprise
notation: REFIP2808

société civile immobilière
type: ConceptReFip
type: Concept
alternative label: SCI
broader: société civile
definition: Entité ayant pour objet la gestion et la location d'immeubles dont elle est propriétaire par suite d'apport, d'achat ou de construction.
in scheme: FINANCES PUBLIQUES
in scheme: Société
in scheme: Entreprises
in scheme: Forme juridique
notation: REFIP2809

réquisition de paiement
type: ConceptReFip
type: Concept
broader: procédures et techniques comptables (non-descripteur)
definition: Procédure intervenant lorsque l'ordonnateur requiert, par écrit et sous sa responsabilité, l'agent comptable de payer, alors que celui-ci a suspendu le paiement des dépenses en cas d'irrégularité ou pour laisser le temps à l'ordonnateur de rectifier une erreur ou de compléter la production de pièces justificatives.
in scheme: FINANCES PUBLIQUES
in scheme: Procédures et Techniques Comptables
in scheme: Comptabilité
narrower: ordre de réquisition
notation: REFIP281
scope note: Corollaire au principe de séparation comptable / ordonnateur

dégrèvement partiel
type: ConceptReFip
type: Concept
broader: acceptation partielle
definition: Annulation partielle d'impôt, décidée par l'administration soit dans les cas prévus par la loi, soit à la suite d'une réclamation contentieuse ou gracieuse.
in scheme: FINANCES PUBLIQUES
in scheme: Contentieux Fiscal
in scheme: Fiscalité
notation: REFIP2812

application SIV
type: ConceptReFip
type: Concept
broader: applications fiscales (non-descripteur)
definition: Application offrant aux agents de la DGFIP, une interface d'accès au Système d'Immatriculation des Véhicules géré par le Ministère de l'Intérieur.
in scheme: FINANCES PUBLIQUES
in scheme: Applications Informatiques
in scheme: Applications fiscales
notation: REFIP2814

avoir fiscal
type: ConceptReFip
type: Concept
broader: refip-REFIP849
definition: Crédit d'impôt alloué aux bénéficiaires de dividendes. Il a pour objet d'alléger la charge de l'impôt supportée par le bénéficiaire du dividende au motif que la société distributrice a déjà acquitté l'impôt sur ses bénéfices. L'avoir fiscal s'ajoute au revenu imposable de l'actionnaire et vient en déduction de l'impôt dû. Il est supprimé à compter du 1er janvier 2005.
in scheme: FINANCES PUBLIQUES
in scheme: Liquidation de l'Impôt
in scheme: Fiscalité
notation: REFIP2815

contrat
type: ConceptReFip
type: Concept
broader: droit des obligations et contrats (non-descripteur)
definition: Convention faisant naître une ou plusieurs obligations ou bien créant ou transférant un droit réel.
in scheme: FINANCES PUBLIQUES
in scheme: Droit et Justice
in scheme: Divisions du Droit
in scheme: Droit Privé
narrower: contrat de droit privé
narrower: fin de contrat
narrower: contrat administratif
narrower: contrat verbal
narrower: contrat à titre onéreux
narrower: contrat à exécution successive
narrower: contrat en mains
notation: REFIP2816

norme comptable
type: ConceptReFip
type: Concept
broader: nomenclature comptable
definition: Règles de comptabilité qui visent à l'amélioration des méthodes de tenue comptable et à la meilleure compréhension des comptabilités et de leur contrôle. Les normes comptables comportent des principes, des règles et des méthodes intégrés dans un référentiel comptable.
in scheme: FINANCES PUBLIQUES
in scheme: Documents comptables
in scheme: Comptabilité
notation: REFIP2818

contribution sur les ventes de produits alimentaires
type: ConceptReFip
type: Concept
broader: refip-REFIP934
definition: Contribution s'appliquant aux ventes de produits alimentaires solides ou liquides à consommer sur place et aux ventes de produits alimentaires solides ou liquides à emporter réalisées au sein des établissements d'hébergement ainsi qu'au sein des établissements qui réalisent des ventes à consommer sur place de produits alimentaires et dont l'activité principale est constituée par la vente de produits alimentaires à consommer sur place et à emporter, à l'exception des cantines d'entreprises.
in scheme: FINANCES PUBLIQUES
in scheme: Fiscalité
in scheme: Impôt
notation: REFIP2819

OSEO
type: ConceptReFip
type: Concept
alternative label: crédit d'équipement aux petites et moyennes entreprises
broader: BPIFRANCE
definition: Entreprise privée avec délégation de service public, qui finance les PME françaises pour l'emploi et la croissance : innovation, investissement, international, création et transmission. En juin 2013, elle a été fusionnée avec CDC Entreprises, le FSI et FSI Régions pour créer la Banque Publique d'Investissement, ou bpifrance.
in scheme: FINANCES PUBLIQUES
in scheme: Organisation Structurelle de l'Etat
in scheme: Opérateur de l'Etat
in scheme: Administration de L'Etat
notation: REFIP2820

restes à réaliser
type: ConceptReFip
type: Concept
broader: dépenses d'investissement
definition: En investissement, dépenses engagées non mandatées à la clôture de l’exercice et aux recettes certaines n’ayant pas donné lieu à l’émission d’un titre de recette. En fonctionnement, ils correspondent aux dépenses engagées à la clôture de l'exercice non mandatées et non rattachées ainsi qu'aux recettes certaines n'ayant pas donné lieu à l'émission d'un titre et non rattachées. Ils sont reportés au budget de l'exercice suivant.
in scheme: FINANCES PUBLIQUES
in scheme: Dépenses publiques
in scheme: Gestion Publique
notation: REFIP2822

avion
type: ConceptReFip
type: Concept
alternative label: aéronef
alternative label: planeur
broader: transport aérien
definition: Appareil destiné à la navigation aérienne.
in scheme: FINANCES PUBLIQUES
in scheme: Branche d'activité
in scheme: Questions Economiques
in scheme: Transports
notation: REFIP2823

charge de la preuve
type: ConceptReFip
type: Concept
broader: principes généraux (non-descripteur)
definition: Nécessité pour le plaideur, d'établir, s'ils sont contestés, les faits dont dépend le succès de sa prétention.
in scheme: FINANCES PUBLIQUES
in scheme: Principes Généraux
in scheme: Droit et Justice
in scheme: Procédure
notation: REFIP2824

application GOLD
type: ConceptReFip
type: Concept
alternative label: GOLD
broader: applications fiscales (non-descripteur)
definition: Outil de suivi des paiements (fractionnés ou différés) des droits d’enregistrement et de la taxe de publicité foncière.
in scheme: FINANCES PUBLIQUES
in scheme: Applications Informatiques
in scheme: Applications fiscales
notation: REFIP2825

affectation de résultat
type: ConceptReFip
type: Concept
alternative label: affectation des résultats
alternative label: affectation du résultat
broader: fin de gestion
definition: Répartition du bénéfice conformément aux statuts de la société
in scheme: FINANCES PUBLIQUES
in scheme: Procédures et Techniques Comptables
in scheme: Comptabilité
notation: REFIP2828

Haut-Rhin
type: ConceptReFip
type: Concept
broader: refip-REFIP7009
definition: Département français
in scheme: FINANCES PUBLIQUES
in scheme: Géographie
in scheme: Europe
notation: REFIP283

subvention pour charges de service public
type: ConceptReFip
type: Concept
broader: subvention
definition: Versement effectué par l’État au profit de tiers identifiés appelés « opérateurs » afin de couvrir leurs propres charges de fonctionnement, engendrées par l'exécution de politiques publiques relevant directement de la compétence directe de l’État. Ce versement a donc pour contrepartie la réalisation de missions confiées par l’État dont il conserve le contrôle.
in scheme: FINANCES PUBLIQUES
in scheme: Dépenses publiques
in scheme: Gestion Publique
notation: REFIP2830

Languedoc-Roussillon (obsolète)
type: ConceptReFip
type: Concept
is replaced by: refip-REFIP7036
broader: ZZ
in scheme: FINANCES PUBLIQUES
notation: REFIP2831

congé de maternité
type: ConceptReFip
type: Concept
broader: congés (non-descripteur)
definition: Congé accordé à une femme enceinte en activité, qu'elle soit fonctionnaire, stagiaire, ou contractuelle, après qu'elle ait fourni un certificat de grossesse à l'administration, et comprenant le congé prénatal (en fin de grossesse) et le congé postnatal (après l'accouchement).
in scheme: FINANCES PUBLIQUES
in scheme: Gestion des ressources humaines
in scheme: Temps de travail
in scheme: Fonction Publique et Gestion des Ressources Humaines
notation: REFIP2832

réclamation collective
type: ConceptReFip
type: Concept
broader: réclamation contentieuse
definition: Demande présentée notamment par les contribuables imposés collectivement (propriétaires indivis par exemple) ou les membres des sociétés de personnes lorsqu'ils contestent des impositions à la charge de la société.
in scheme: FINANCES PUBLIQUES
in scheme: Contentieux Fiscal
in scheme: Fiscalité
notation: REFIP2833

paiement de l'impôt
type: ConceptReFip
type: Concept
broader: recouvrement
definition: Acte par lequel un redevable de l'impôt se libère de sa dette auprès d'un comptable public.
in scheme: FINANCES PUBLIQUES
in scheme: Recouvrement
in scheme: Fiscalité
narrower: acompte d'impôt
narrower: compensation fiscale
narrower: dation en paiement
narrower: prélèvement à l'échéance
narrower: paiement fractionné
narrower: mensualisation
narrower: autoliquidation de l'impôt
narrower: prélèvement à la source
narrower: refip-REFIP6663
narrower: refip-REFIP698
notation: REFIP2834

Procureur de la République
type: ConceptReFip
type: Concept
broader: magistrat
definition: Magistrat du ministère public chargé de l'action publique dans le ressort d'un tribunal de grande instance.
in scheme: FINANCES PUBLIQUES
in scheme: Profession Juridique
in scheme: Droit et Justice
in scheme: Organisation Juridictionnelle
notation: REFIP2835

fonds européen agricole de garantie
type: ConceptReFip
type: Concept
alternative label: FEAGA
alternative label: FEOGA
broader: fonds (non-descripteur)
definition: Instrument financier de la politique agricole commune (PAC). Il finance les aides aux agriculteurs et d'autres mesures de soutien aux marchés agricoles.
in scheme: FINANCES PUBLIQUES
in scheme: Dépenses publiques
in scheme: Gestion Publique
notation: REFIP2838

Président de la République
type: ConceptReFip
type: Concept
broader: pouvoirs publics
definition: Chef de l’État exerçant la plus haute fonction du pouvoir exécutif, il incarne l’autorité de l’État. Il veille, par son arbitrage, au respect du texte constitutionnel, et assure le fonctionnement normal des pouvoirs publics et la continuité de l’État. Vis-à-vis de l’extérieur, il est le garant de l’indépendance nationale, de l’intégrité du territoire et du respect des traités conclus par la France. La Constitution fait de lui le chef des armées.
in scheme: FINANCES PUBLIQUES
in scheme: Organisation Structurelle de l'Etat
in scheme: Pouvoirs Publics
in scheme: Administration de L'Etat
notation: REFIP2839

Chili
type: ConceptReFip
type: Concept
broader: Amérique
definition: Pays
in scheme: FINANCES PUBLIQUES
in scheme: Géographie
in scheme: Amérique
notation: REFIP284

amortissement linéaire
type: ConceptReFip
type: Concept
alternative label: amortissement constant
broader: amortissement comptable
definition: Système d'amortissement comptable consistant à imputer sur les résultats de chaque exercice une dépréciation égale au quotient de la somme à amortir par le nombre d'annuités correspondant à la durée probable d'utilisation du bien à amortir.
in scheme: FINANCES PUBLIQUES
in scheme: Procédures et Techniques Comptables
in scheme: Comptabilité
notation: REFIP2840

outil collaboratif
type: ConceptReFip
type: Concept
alternative label: solution collaborative
broader: technologie de l'information et de la communication
definition: Ensemble de moyens et d'outils qui permettent à un groupe de plusieurs personnes de travailler ensemble, de partager de l'information, de modifier simultanément et en temps réel les documents mis en ligne en s'affranchissant des contraintes de temps et de lieux.
in scheme: FINANCES PUBLIQUES
in scheme: Communication
in scheme: Communication Documentation Informatique
narrower: messagerie électronique
narrower: réseau collaboratif
narrower: liste de diffusion
narrower: nomadisme numérique
narrower: agenda électronique
narrower: webmail
notation: REFIP2842

admission de créance
type: ConceptReFip
type: Concept
broader: déclaration de créances
definition: Validation par le juge-commissaire de la liste de créances présentées par le représentant des créanciers dans le cadre d'une procédure collective. Décision du juge-commissaire admettant l'existence, la validité et le montant d'une créance contre le débiteur
in scheme: FINANCES PUBLIQUES
in scheme: Recouvrement
in scheme: Fiscalité
notation: REFIP2843

séparation de corps
type: ConceptReFip
type: Concept
broader: droit civil
definition: Relâchement du lien conjugal résultant d'un jugement rendu à la demande de l'un des époux dans les mêmes cas et aux mêmes conditions que le divorce. Comporte pour l'essentiel la suppression du devoir de cohabitation entre époux (les devoirs de fidélité et d'assistance demeurent).
in scheme: FINANCES PUBLIQUES
in scheme: Droit et Justice
in scheme: Divisions du Droit
in scheme: Droit Privé
notation: REFIP2844

département des études économiques et financières (obsolète)
type: ConceptReFip
type: Concept
is replaced by: division expertise et actions économiques et financières
broader: ZZ
in scheme: FINANCES PUBLIQUES
notation: REFIP2845

redevance domaniale
type: ConceptReFip
type: Concept
broader: refip-REFIP6752
definition: Redevance payée pour toute occupation ou utilisation du domaine public, sous certaines conditions.
in scheme: FINANCES PUBLIQUES
in scheme: Fiscalité
in scheme: Impôt
notation: REFIP2846

tarification
type: ConceptReFip
type: Concept
alternative label: fixation des prix
broader: économie générale (non-descripteur)
definition: Fait de fixer le prix d'un produit ou d'un service.
in scheme: FINANCES PUBLIQUES
in scheme: Questions Economiques
in scheme: Economie générale
narrower: tarif
notation: REFIP2847

date d'envoi
type: ConceptReFip
type: Concept
broader: mots outils (liste additive)
definition: Date à laquelle un document est envoyé.
in scheme: FINANCES PUBLIQUES
in scheme: Mots Outils
notation: REFIP2848

procédure de l'abus de droit
type: ConceptReFip
type: Concept
alternative label: procédure d'abus de droit
alternative label: procédure de l'abus de droit fiscal
broader: procédure contradictoire
definition: Procédure exceptionnelle. Elle permet à l'administration de sanctionner les « manoeuvres » de certains contribuables qui mettent en oeuvre des opérations juridiques dans le seul et unique but de diminuer l'impôt.
in scheme: FINANCES PUBLIQUES
in scheme: Droit de Reprise de l'Administration
in scheme: Fiscalité
narrower: abus de droit fiscal
notation: REFIP2849

déficit foncier
type: ConceptReFip
type: Concept
alternative label: loi Malraux
broader: liquidation de l'impôt
definition: Total des charges déductibles supérieur aux revenus fonciers bruts (recettes). Les déficits fonciers inférieurs à un certain plafond sont déductibles du revenu brut global de l'année. La part des déficits qui dépasse le plafond est reportable et déductible sur les revenus fonciers des 10 années suivantes.
in scheme: FINANCES PUBLIQUES
in scheme: Liquidation de l'Impôt
in scheme: Fiscalité
notation: REFIP285

taxi
type: ConceptReFip
type: Concept
alternative label: artisan taxi
alternative label: taxi locataire
broader: véhicule terrestre à moteur
definition: Véhicule automobile terrestre privé, conduit par un chauffeur et destiné au transport payant de passagers et de leurs bagages.
in scheme: FINANCES PUBLIQUES
in scheme: Branche d'activité
in scheme: Questions Economiques
in scheme: Transports
notation: REFIP2850

réunion des musées nationaux Grand Palais
type: ConceptReFip
type: Concept
alternative label: Grand Palais
alternative label: RMN
alternative label: réunion des musées nationaux
alternative label: réunion des musées nationaux et du Grand Palais des Champs-Elysées
broader: établissement public à caractère industriel et commercial
definition: Etablissement public à caractère industriel et commercial, issu de la fusion de la Réunion des Musées Nationaux et du Grand Palais. Il a pour but de contribuer à la diffusion du patrimoine muséographique et au développement des publics, notamment en mettant ses capacités en ingénierie culturelle à disposition des musées français. Il gère également le Grand Palais des Champs-Élysées, à Paris. Il est placé sous la tutelle du ministère de la Culture.
in scheme: FINANCES PUBLIQUES
in scheme: Organisation Structurelle de l'Etat
in scheme: Opérateur de l'Etat
in scheme: Administration de L'Etat
notation: REFIP2853

application ISTP
type: ConceptReFip
type: Concept
alternative label: ISTP
broader: applications fiscales (non-descripteur)
definition: Application qui permet le recouvrement des rôles supplémentaires et la prise en compte des dégrèvements de taxe professionnelle, de cotisation foncière des entreprises et d’Imposition Forfaitaire sur les Entreprises de Réseaux.
in scheme: FINANCES PUBLIQUES
in scheme: Applications Informatiques
in scheme: Applications fiscales
notation: REFIP2854

retrait d'actif
type: ConceptReFip
type: Concept
broader: actif
definition: Technique visant à retirer du bilan comptable une immobilisation devenue sans valeur, l'origine peut notamment, être la destruction par sinistre, la liquidation d'une société dont on détient les titres, la mise au rebut pour obsolescence, le vol.
in scheme: FINANCES PUBLIQUES
in scheme: Documents comptables
in scheme: Comptabilité
notation: REFIP2855

retenue de taxe sur la valeur ajoutée
type: ConceptReFip
type: Concept
alternative label: retenue de TVA
broader: régime d'imposition
definition: Dispositif permettant de dispenser de toute obligation à l'égard de la TVA les personnes qui perçoivent des droits d'auteurs, d'éditeurs, de sociétés de perception et de répartition de droits ou de producteurs.
in scheme: FINANCES PUBLIQUES
in scheme: Régime d'Imposition
in scheme: Fiscalité
notation: REFIP2857

propriété des personnes publiques
type: ConceptReFip
type: Concept
alternative label: Domaines
broader: domaine (non-descripteur)
definition: Ensemble des biens et droits, à caractère mobilier ou immobilier, appartenant à l’État, aux collectivités territoriales et à leurs groupements, ainsi qu'aux établissements publics.
in scheme: FINANCES PUBLIQUES
in scheme: Domaine
in scheme: Gestion Publique
narrower: domaine public
narrower: déclaration d'utilité publique
narrower: déclaration d'intention d'aliéner
narrower: domaine privé
notation: REFIP2858
scope note: Se substitue à l'appellation Domaines à compter du 1er janvier 2007.

Pôle d'évaluation des locaux professionnels
type: ConceptReFip
type: Concept
alternative label: PELP
broader: direction départementale des finances publiques
definition: Structure de la DGFIP assurant notamment la gestion, le contrôle et le contentieux des locaux professionels.
in scheme: FINANCES PUBLIQUES
in scheme: Organisation Structurelle de l'Etat
in scheme: Ministère
in scheme: Administration de L'Etat
notation: REFIP2859

frais de secours
type: ConceptReFip
type: Concept
broader: dépenses d'intervention
definition: Dépense engagée par l'État ou les collectivités lors d'opérations de sauvetage.
in scheme: FINANCES PUBLIQUES
in scheme: Dépenses publiques
in scheme: Gestion Publique
notation: REFIP286

droit de port (supprimé)
type: ConceptReFip
type: Concept
broader: ZZ
in scheme: FINANCES PUBLIQUES
notation: REFIP2860

départ négocié
type: ConceptReFip
type: Concept
broader: rupture de contrat
definition: Accord par lequel salarié et employeur décident de rompre le contrat de travail, également appelé "rupture négociée", "rupture amiable" ou "résiliation conventionnelle".
in scheme: FINANCES PUBLIQUES
in scheme: Entreprises
in scheme: Travail
in scheme: 212619
notation: REFIP2861

inexploitation d'immeuble
type: ConceptReFip
type: Concept
broader: cadastre
definition: Immeuble à usage commercial ou industriel dont il n'est fait aucun usage et pouvant donner lieu, sous certaines conditions, à dégrèvement de taxe foncière.
in scheme: FINANCES PUBLIQUES
in scheme: Cadastre
in scheme: Fiscalité
narrower: vacance de maison
notation: REFIP2862

bon de commande
type: ConceptReFip
type: Concept
broader: pièce comptable
definition: Document adressé par l’acheteur à un fournisseur pour matérialiser une commande. Il constitue un engagement juridique et financier pour l’établissement ou la collectivité
in scheme: FINANCES PUBLIQUES
in scheme: Documents comptables
in scheme: Comptabilité
notation: REFIP2863

protection juridique
type: ConceptReFip
type: Concept
broader: capacité juridique
definition: Dispositif décidé par le juge pour des personnes dont les facultés sont altérées en vue de défendre et de représenter les intérêts de celles-ci.
in scheme: FINANCES PUBLIQUES
in scheme: Droit et Justice
in scheme: Divisions du Droit
in scheme: Droit Privé
narrower: sauvegarde de justice
narrower: tutelle
narrower: curatelle
narrower: majeur protégé
notation: REFIP2864
related: mesure d'accompagnement judiciaire
scope note: Majeurs protégés

analyse financière prospective
type: ConceptReFip
type: Concept
broader: refip-REFIP788
definition: Technique de gestion permettant à une entité de dégager sa capacité pluriannuelle d'investissement, et, après intégration des dépenses prévisionnelles, de déterminer un besoin résiduel de financement, et de présenter l'équilibre de son plan de financement.
in scheme: FINANCES PUBLIQUES
in scheme: Analyse financière
in scheme: Comptabilité
notation: REFIP2866

application STEFFI
type: ConceptReFip
type: Concept
alternative label: STEFFI
broader: applications fiscales (non-descripteur)
definition: Application permettant la réception des fiches décès transmises par les mairies sous formes de fichiers magnétiques. Supprimée en 2015.
in scheme: FINANCES PUBLIQUES
in scheme: Applications Informatiques
in scheme: Applications fiscales
notation: REFIP2869

bien communal
type: ConceptReFip
type: Concept
broader: domaine public
definition: Bien appartenant à la commune qui figure sur la matrice cadastrale au nom de la commune et dont la gestion est assurée directement par le Maire et le conseil municipal.
in scheme: FINANCES PUBLIQUES
in scheme: Domaine
in scheme: Gestion Publique
notation: REFIP287

groupement de coopération sociale et médico-sociale
type: ConceptReFip
type: Concept
alternative label: GCSMS
broader: coopération intercommunale
definition: Groupement permettant à ses membres d’organiser et de formaliser la coopération et le partenariat. Cela va de la simple mise en commun de moyens, à la gestion d’un personnel à temps partagé jusqu’à l’exercice des missions des établissements et services sociaux et médico-sociaux.
in scheme: FINANCES PUBLIQUES
in scheme: Secteur public local
in scheme: Gestion Publique
notation: REFIP2871

application RE7LOCAL (supprimé)
type: ConceptReFip
type: Concept
broader: ZZ
in scheme: FINANCES PUBLIQUES
notation: REFIP2872

Code pénal
type: ConceptReFip
type: Concept
broader: documentation juridique (non-descripteur)
definition: Codification du droit pénal français. Il est entré en vigueur le 1er mars 1994 pour remplacer le code pénal de 1810, et qu'on appelle désormais le code pénal ancien dans les rares décisions devant encore l'appliquer.
in scheme: FINANCES PUBLIQUES
in scheme: Droit et Justice
in scheme: Documentation Juridique
in scheme: Sources du Droit
notation: REFIP2873

Gironde
type: ConceptReFip
type: Concept
broader: refip-REFIP7020
definition: Département française
in scheme: FINANCES PUBLIQUES
in scheme: Géographie
in scheme: Europe
notation: REFIP2874

boucherie (supprimé)
type: ConceptReFip
type: Concept
broader: ZZ
in scheme: FINANCES PUBLIQUES
notation: REFIP2875

exercice comptable
type: ConceptReFip
type: Concept
broader: comptabilité d'exercice
definition: Période de temps pendant laquelle une entité enregistre les faits relatifs à son activité. La durée normale d'un exercice comptable est de 12 mois.
in scheme: FINANCES PUBLIQUES
in scheme: Comptabilité d'exercice
in scheme: Comptabilité
notation: REFIP2876

application CCI
type: ConceptReFip
type: Concept
broader: applications gestion publique (non-descripteur)
definition: Application de centralisation des comptes des collectivités et établissements publics locaux.
in scheme: FINANCES PUBLIQUES
in scheme: Applications Informatiques
in scheme: Applications gestion publique
notation: REFIP2877

maîtrise d'ouvrage déléguée
type: ConceptReFip
type: Concept
broader: refip-REFIP699
definition: Mandat où le maître d’ouvrage confie à un mandataire une partie de ses attributions pour la réalisation d’une opération immobilière.
in scheme: FINANCES PUBLIQUES
in scheme: Commande publique
in scheme: Gestion Publique
notation: REFIP2878

occupation de locaux
type: ConceptReFip
type: Concept
broader: domaine public
definition: Fait d'occuper des locaux du domaine public.
in scheme: FINANCES PUBLIQUES
in scheme: Domaine
in scheme: Gestion Publique
narrower: convention d'utilisation
narrower: occupation précaire
narrower: occupation temporaire
notation: REFIP2879

codification
type: ConceptReFip
type: Concept
alternative label: code action
alternative label: code actualité
alternative label: code paiement
broader: classement
definition: Fait de codifier, de réunir dans un code ou de normaliser.
in scheme: FINANCES PUBLIQUES
in scheme: Documentation
in scheme: Communication Documentation Informatique
narrower: codification SAGES
narrower: codification codique
notation: REFIP288

service de la fiscalité directe locale
type: ConceptReFip
type: Concept
broader: direction départementale des finances publiques
definition: Service rattaché au Pôle Gestion Publique des directions départementales ou régionales des finances publiques, il assure la notification des bases d'imposition locales aux collectivités et leur assure le conseil fiscal nécessaire.
in scheme: FINANCES PUBLIQUES
in scheme: Organisation Structurelle de l'Etat
in scheme: Ministère
in scheme: Administration de L'Etat
notation: REFIP2880

quotient familial
type: ConceptReFip
type: Concept
alternative label: QF
broader: refip-REFIP952
definition: Système consistant à diviser le revenu imposable par un nombre de parts fixé eu égard à la situation de famille des intéressés et, le cas échéant, au nombre de personnes considérées comme à leur charge au sens de la loi fiscale.
in scheme: FINANCES PUBLIQUES
in scheme: Liquidation de l'Impôt
in scheme: Fiscalité
narrower: demi-part
narrower: charges de famille
notation: REFIP2881

contrat à titre onéreux
type: ConceptReFip
type: Concept
broader: contrat
definition: Contrat par lequel chacune des parties recherche un avantage. Bien que procurant des avantages pour chaque contractant, il ne crée pas nécessairement d'obligations juridiques réciproques.
in scheme: FINANCES PUBLIQUES
in scheme: Droit et Justice
in scheme: Divisions du Droit
in scheme: Droit Privé
notation: REFIP2882

droit de visite et de saisie
type: ConceptReFip
type: Concept
alternative label: perquisition fiscale
alternative label: visite domiciliaire
broader: droit de contrôle de l'administration (non-descripteur)
definition: Droit reconnu à l'administration fiscale de procéder, sur autorisation du juge des libertés et de la détention, à des visites, en tous lieux, même privés, et à des saisies de pièces et documents, par un agent habilité dans le but de rechercher les infractions en matière d'impôts directs et de taxe sur le chiffre d'affaires.
in scheme: FINANCES PUBLIQUES
in scheme: Droit de Contrôle de l'Administration
in scheme: Fiscalité
notation: REFIP2883

Pôle national d'assistance aux comptables dans leurs relations avec le juge des comptes
type: ConceptReFip
type: Concept
alternative label: PNSR de Besançon
alternative label: Pôle de Besançon
broader: Pôle national de soutien au réseau
definition: Structure qui assiste les comptables publics du secteur public local dans leurs relations avec le juge financier ; collecte la jurisprudence des chambres régionales des comptes et de la Cour des comptes. Sa mission d’assistance auprès des comptables publics du SPL, consiste à leur procurer une argumentation, tirée de l’examen des décisions rendues par les autres chambres, la Cour des comptes ou le Conseil d’ État. Le pôle se prononce sur l'état du droit mais n'a pas compétence pour prendre une position sur une question sujette à interprétation.
in scheme: FINANCES PUBLIQUES
in scheme: Organisation Structurelle de l'Etat
in scheme: Ministère
in scheme: Administration de L'Etat
notation: REFIP2884
scope note: Mission reprise par la Délégation à la gestion des cadres et personnels de centrale et à la responsabilité des comptables

recouvrement des produits locaux
type: ConceptReFip
type: Concept
broader: recouvrement
in scheme: FINANCES PUBLIQUES
in scheme: Recouvrement
in scheme: Fiscalité
narrower: recouvrement des produits hospitaliers
notation: REFIP2885

principe de bonne information
type: ConceptReFip
type: Concept
broader: refip-REFIP819
definition: Principe comptable ayant pour objet d'apporter aux utilisateurs des documents comptables une information suffisante et significative pour interpréter ceux-ci. Le Plan Comptable Général précise que les informations comptables doivent donner une description adéquate, loyale, précise et complète des opérations, événements et situations
in scheme: FINANCES PUBLIQUES
in scheme: Principe comptable
in scheme: Comptabilité
notation: REFIP2886

formation en milieu professionnel
type: ConceptReFip
type: Concept
alternative label: stage d'insertion professionnelle et de formation à l'emploi
broader: insertion professionnelle
definition: Dispositif mis en place afin de faciliter une première connaissance du monde professionnel par une découverte des métiers, du milieu professionnel et de l'environnement économique et social.
in scheme: FINANCES PUBLIQUES
in scheme: Entreprises
in scheme: Travail
in scheme: 212619
narrower: congé individuel de formation
narrower: validation des acquis de l'expérience
narrower: formation en alternance
narrower: refip-REFIP6901
notation: REFIP2887

conversion
type: ConceptReFip
type: Concept
broader: mots outils (liste additive)
definition: Action d'exprimer une grandeur à l'aide d'une autre unité.
in scheme: FINANCES PUBLIQUES
in scheme: Mots Outils
notation: REFIP2888

régime du réel normal
type: ConceptReFip
type: Concept
broader: régime réel d'imposition
definition: Régime fiscal pour les professionnels en matière de résultat et de TVA et dont le chiffre d'affaires est supérieur à un certain seuil.
in scheme: FINANCES PUBLIQUES
in scheme: Régime d'Imposition
in scheme: Fiscalité
notation: REFIP2889

garde à vue
type: ConceptReFip
type: Concept
broader: procédure pénale
definition: Mesure de contrainte par laquelle un officier de police judiciaire retient dans les locaux de la police toute personne soupçonnée de commettre ou tenter de commettre crime ou délit.
in scheme: FINANCES PUBLIQUES
in scheme: Procédure Pénale
in scheme: Droit et Justice
in scheme: Procédure
notation: REFIP289

fiducie
type: ConceptReFip
type: Concept
broader: droit des obligations et contrats (non-descripteur)
definition: Acte juridique (contrat ou legs) par lequel une personne nommée fiduciant transfère la propriété d'un bien à une autre personne nommée fiduciaire, soit à titre de garantie d'une créance sous l'obligation de rétrocéder le bien, soit en vue de réaliser une libéralité.
in scheme: FINANCES PUBLIQUES
in scheme: Droit et Justice
in scheme: Divisions du Droit
in scheme: Droit Privé
notation: REFIP2890

loi en faveur du travail de l'emploi et du pouvoir d'achat
type: ConceptReFip
type: Concept
alternative label: paquet fiscal
broader: loi
definition: Loi du 21/08/2007 destinée à accroître l'activité économique et l'emploi.
in scheme: FINANCES PUBLIQUES
in scheme: Droit et Justice
in scheme: Sources du Droit
in scheme: Sources du Droit Objectif
notation: REFIP2891

convention de mandat
type: ConceptReFip
type: Concept
alternative label: contrat de mandat
broader: marché de services
definition: Document déterminant les conditions dans lesquelles la conclusion des marchés publics peut être confiée au mandataire.
in scheme: FINANCES PUBLIQUES
in scheme: Commande publique
in scheme: Gestion Publique
notation: REFIP2892

indemnité pour gardes supplémentaires (supprimé)
type: ConceptReFip
type: Concept
broader: ZZ
in scheme: FINANCES PUBLIQUES
notation: REFIP2893

contribution salariale sur les attributions d'actions gratuites
type: ConceptReFip
type: Concept
broader: contribution
definition: Contribution due par les bénéficiaires d'options sur titres et d'actions gratuites, au profit des régimes obligatoires d'assurance maladie dont relèvent ces bénéficiaires.
in scheme: FINANCES PUBLIQUES
in scheme: Fiscalité
in scheme: Impôt
notation: REFIP2894

contremaitre
type: ConceptReFip
type: Concept
broader: entreprise de construction
definition: Personne dirigeant et encadrant le travail d'ouvriers et d'artisans sur les chantiers de construction, dans les ateliers ou d'autres domaines industriels.
in scheme: FINANCES PUBLIQUES
in scheme: Branche d'activité
in scheme: Questions Economiques
in scheme: Construction
notation: REFIP2896

théorie de l'accession
type: ConceptReFip
type: Concept
broader: droit de propriété
definition: Extension légale du droit de propriété sur une chose à tout ce qu'elle produit et à tout ce qui s'unit ou s'incorpore à elle. Si une personne construit avec ses matériaux sur un terrain appartenant à un tiers, le propriétaire du sol devient propriétaire de la construction par accession.
in scheme: FINANCES PUBLIQUES
in scheme: Droit et Justice
in scheme: Divisions du Droit
in scheme: Droit Privé
narrower: construction sur sol d'autrui
notation: REFIP2897

acte authentique
type: ConceptReFip
type: Concept
broader: sources des droits subjectifs (non-descripteur)
definition: Document établi par un officier public compétent (notaire, huissier, officier d'état civil), rédigé selon les formalités exigées par la loi et susceptible d'exécution forcée.
in scheme: FINANCES PUBLIQUES
in scheme: Droit et Justice
in scheme: Sources du Droit
in scheme: Sources des Droits Subjectifs
narrower: acte notarié
narrower: acte de vente
notation: REFIP2898

ligne électrique
type: ConceptReFip
type: Concept
alternative label: ligne EDF
broader: électricité
definition: Infrastructure permettant le transport de l'énergie par l'intermédiaire de l'électricité des centrales électriques au consommateur. Ces lignes à haute tension peuvent être aériennes, souterraines ou sous-marines.
in scheme: FINANCES PUBLIQUES
in scheme: Branche d'activité
in scheme: Questions Economiques
in scheme: Industrie
notation: REFIP2899

Union des groupements d'achats publics
type: ConceptReFip
type: Concept
alternative label: UGAP
alternative label: groupement d'achats publics
broader: établissement public à caractère industriel et commercial
definition: Etablissement public industriel et commercial de l’Etat placé sous la tutelle du ministre chargé du Budget et du ministre chargé de l’Education nationale. Il constitue une centrale d'achat au sens du code des marchés publics et des textes réglementaires en vigueur.
in scheme: FINANCES PUBLIQUES
in scheme: Organisation Structurelle de l'Etat
in scheme: Opérateur de l'Etat
in scheme: Administration de L'Etat
notation: REFIP29
related: centrale d'achat

application HELIOS
type: ConceptReFip
type: Concept
alternative label: HELIOS
alternative label: programme HELIOS
broader: applications gestion publique (non-descripteur)
definition: Application unique de gestion comptable de l'ensemble des collectivités locales et établissements publics locaux.
in scheme: FINANCES PUBLIQUES
in scheme: Applications Informatiques
in scheme: Applications gestion publique
notation: REFIP290

remise conditionnelle (supprimé)
type: ConceptReFip
type: Concept
broader: ZZ
in scheme: FINANCES PUBLIQUES
notation: REFIP2900

assujetti
type: ConceptReFip
type: Concept
broader: assujettissement
definition: Personne effectuant de manière indépendante et régulière une activité économique (activité de producteur, de commerçant ou de prestataires de services, y compris les activités extractives, agricoles, et celles des professions libérales et assimilées) et agissant en tant que tel.
in scheme: FINANCES PUBLIQUES
in scheme: Champ d'Application
in scheme: Fiscalité
narrower: redevable
narrower: assujetti partiel
narrower: assujetti occasionnel
notation: REFIP2901

gérant de fonds de commerce
type: ConceptReFip
type: Concept
broader: gérance
definition: Personne, appelée locataire-gérant, exploitant librement un fonds de commerce à ses risques et périls, moyennant le paiement d'une redevance au propriétaire du fonds de commerce.
in scheme: FINANCES PUBLIQUES
in scheme: Gestion de l'Entreprise
in scheme: Entreprises
in scheme: Vie et Gestion de l'entreprise
notation: REFIP2904
related: location-gérance

concession de service public
type: ConceptReFip
type: Concept
broader: délégation de service public
definition: Contrat qui charge un particulier ou une société d'exécuter un ouvrage public, à ses frais, avec ou sans subvention et que l'on rémunère en lui confiant l'exploitation de l'ouvrage public ou l'exécution du service public en échange de redevances sur les usager.
in scheme: FINANCES PUBLIQUES
in scheme: Commande publique
in scheme: Gestion Publique
narrower: refip-REFIP725
notation: REFIP2905
related: marché de services
related: société concessionnaire

reconstitution du bénéfice
type: ConceptReFip
type: Concept
broader: vérification de comptabilité
definition: Méthode utilisée par les vérificateurs pour les entreprises de taille modeste afin de s'assurer de la sincérité des bénéfices déclarés ou à défaut de présentation de comptabilité, Consiste bien souvent à évaluer un montant de bénéfices à partir des factures d'achat, des dosages et des tarifs fournis ou retenus par le service.
in scheme: FINANCES PUBLIQUES
in scheme: Droit de Contrôle de l'Administration
in scheme: Fiscalité
notation: REFIP2906

responsabilité pécuniaire (obsolète)
type: ConceptReFip
type: Concept
is replaced by: refip-REFIP7041
broader: ZZ
in scheme: FINANCES PUBLIQUES
notation: REFIP2907

Koweït
type: ConceptReFip
type: Concept
broader: Asie
definition: Pays
in scheme: FINANCES PUBLIQUES
in scheme: Géographie
in scheme: Asie
notation: REFIP2908

legs
type: ConceptReFip
type: Concept
broader: testament
definition: Libéralité contenue dans un testament et qui ne prend effet qu'à la mort de son auteur.
in scheme: FINANCES PUBLIQUES
in scheme: Droit et Justice
in scheme: Divisions du Droit
in scheme: Droit Privé
narrower: légataire universel
notation: REFIP291

date de signature
type: ConceptReFip
type: Concept
alternative label: date d'acceptation
broader: mots outils (liste additive)
definition: Date à laquelle un document est signé, au moment précis de l'engagement d'un signataire.
in scheme: FINANCES PUBLIQUES
in scheme: Mots Outils
notation: REFIP2912

expropriation pour cause d'utilité publique
type: ConceptReFip
type: Concept
broader: déclaration d'utilité publique
definition: Procédure permettant à une personne publique de contraindre une personne privée à lui céder un bien immobilier ou des droits réels immobiliers, dans un but d'utilité publique moyennant une juste et préalable indemnité.
in scheme: FINANCES PUBLIQUES
in scheme: Domaine
in scheme: Gestion Publique
narrower: procédure d'extrême urgence
narrower: indemnité de remploi
notation: REFIP2913

au marc le franc
type: ConceptReFip
type: Concept
broader: ordre entre créanciers
definition: Méthode de répartition des créances entre tous les créanciers, lorsque le montant de la liquidation est inférieur au total des créances. La répartition se fait au prorata de chacune des créances.
in scheme: FINANCES PUBLIQUES
in scheme: Droit et Justice
in scheme: Divisions du Droit
in scheme: Droit Privé
notation: REFIP2914

Syrie
type: ConceptReFip
type: Concept
broader: Asie
definition: Pays
in scheme: FINANCES PUBLIQUES
in scheme: Géographie
in scheme: Asie
notation: REFIP2915

représentant légal
type: ConceptReFip
type: Concept
broader: droit civil
definition: Celui qui agit par représentation, au nom, à la place et pour le compte du représenté en vertu d'un pouvoir conféré par la loi.
in scheme: FINANCES PUBLIQUES
in scheme: Droit et Justice
in scheme: Divisions du Droit
in scheme: Droit Privé
notation: REFIP2916

coût
type: ConceptReFip
type: Concept
broader: mots outils (liste additive)
definition: Somme, valeur d'une chose.
in scheme: FINANCES PUBLIQUES
in scheme: Mots Outils
notation: REFIP2917

patrimoine social
type: ConceptReFip
type: Concept
alternative label: patrimoine de société
broader: patrimoine
definition: Patrimoine propre à une société qui ne peut se confondre avec le patrimoine de chaque associé.
in scheme: FINANCES PUBLIQUES
in scheme: Droit et Justice
in scheme: Divisions du Droit
in scheme: Droit Privé
notation: REFIP2919

Comité national de contrôle interne (supprimé)
type: ConceptReFip
type: Concept
broader: ZZ
in scheme: FINANCES PUBLIQUES
notation: REFIP292

axe de contrôle interne
type: ConceptReFip
type: Concept
alternative label: axe national de contrôle interne
broader: contrôle interne
definition: Ligne directrice et orientations que l'on donne aux actions de contrôle interne en précisant les principes qui gouvernent le rôle des acteurs dans la mise en œuvre de la maîtrise des risques, ainsi que les thèmes de recherche, définis selon les structures.
in scheme: FINANCES PUBLIQUES
in scheme: Missions Transverses des Finances publiques
in scheme: Maîtrise des risques
notation: REFIP2921

information
type: ConceptReFip
type: Concept
broader: communication
definition: Événement ou élément de connaissance communiqué auprès d'un public plus ou moins large, sous forme d'images, de textes, de discours, de sons.
in scheme: FINANCES PUBLIQUES
in scheme: Communication
in scheme: Communication Documentation Informatique
narrower: technologie de l'information et de la communication
narrower: langue étrangère
narrower: support de communication
narrower: confidentialité
narrower: langue des signes française
narrower: signalétique
narrower: traitement de l'information
narrower: renseignement
narrower: langage parlé complété
notation: REFIP2924
related: restitution de l'information

assistance internationale au recouvrement
type: ConceptReFip
type: Concept
alternative label: assistance mutuelle en matière de recouvrement des créances
broader: recouvrement
definition: Procédure visant à permettre au comptable lorsqu’il est soit démuni de moyens de recouvrement sur le territoire national, soit n’obtient pas ou peu de recouvrement en dépit des procédures de recouvrement forcé qu’il a engagées en France à l’encontre d’un débiteur, de demander à d’autres Etats des renseignements sur ce débiteur parti à l'étranger ou d’engager à son encontre le recouvrement forcé dans le cadre d'une convention fiscale prévoyant l'assistance au recouvrement forcé ou dans le cadre de la directive n° 2010/24/UE du 16 mars 2010 et de son règlement d’application n°1189/2011 du 18 novembre 2011 qui ont instauré un régime d’assistance mutuelle au recouvrement forcé entre les Etats membres de l’Union européenne.
in scheme: FINANCES PUBLIQUES
in scheme: Recouvrement
in scheme: Fiscalité
notation: REFIP2925

recette des finances
type: ConceptReFip
type: Concept
broader: direction départementale des finances publiques
definition: Structure départementale de la Direction Générale des Finances publiques ayant pour vocation d'intervenir sur l'ensemble des missions relevant de la division du recouvrement local.
in scheme: FINANCES PUBLIQUES
in scheme: Organisation Structurelle de l'Etat
in scheme: Ministère
in scheme: Administration de L'Etat
notation: REFIP2926

droit de participation (supprimé)
type: ConceptReFip
type: Concept
broader: ZZ
in scheme: FINANCES PUBLIQUES
notation: REFIP2927

Limousin (obsolète)
type: ConceptReFip
type: Concept
is replaced by: refip-REFIP7020
broader: ZZ
in scheme: FINANCES PUBLIQUES
notation: REFIP2929

culture marine
type: ConceptReFip
type: Concept
alternative label: aquaculture
alternative label: conchyliculteur
alternative label: conchyliculture
alternative label: ostréiculteur
alternative label: ostréiculture
alternative label: pisciculture
broader: élevage
definition: Elevage de coquillages marins, de poissons de mer, d’algues (algoculture) ou de crustacés.
in scheme: FINANCES PUBLIQUES
in scheme: Branche d'activité
in scheme: Questions Economiques
in scheme: Agriculture
notation: REFIP293

intervention économique
type: ConceptReFip
type: Concept
broader: économie générale (non-descripteur)
definition: Politique conduisant les pouvoirs publics à participer à l'économie du pays et imposer leurs règles chaque fois que cela leur paraît nécessaire pour protéger les intérêts des citoyens ou développer des secteurs d'activité qu'ils considèrent comme stratégiques ou prioritaires.
in scheme: FINANCES PUBLIQUES
in scheme: Questions Economiques
in scheme: Economie générale
notation: REFIP2931
related: dépenses d'intervention

dol
type: ConceptReFip
type: Concept
broader: droit civil
definition: Ensemble des tromperies (manœuvre frauduleuse, mensonge ou réticence blâmable) par lesquelles une partie à un acte juridique provoque chez l’autre partie une erreur qui la détermine à donner son consentement, en matière contractuelle.
in scheme: FINANCES PUBLIQUES
in scheme: Droit et Justice
in scheme: Divisions du Droit
in scheme: Droit Privé
notation: REFIP2932

Etablissement de retraite additionnelle de la fonction publique
type: ConceptReFip
type: Concept
alternative label: ERAFP
broader: établissement public à caractère administratif
definition: Etablissement public à caractère administratif placé sous la tutelle de l’Etat, l’établissement de retraite additionnelle de la fonction publique propose un ensemble de services d’information dématérialisés pour les fonctionnaires et leurs employeurs, il centralise dans ses comptes les recettes et les dépenses du régime et assure le versement des prestations aux bénéficiaires.
in scheme: FINANCES PUBLIQUES
in scheme: Organisation Structurelle de l'Etat
in scheme: Opérateur de l'Etat
in scheme: Administration de L'Etat
notation: REFIP2934
related: refip-REFIP6735

ambulance
type: ConceptReFip
type: Concept
alternative label: transport sanitaire
broader: transport de personnes
definition: Véhicule spécialement adapté et aménagé pour permettre le transport des personnes malades, blessées ou parturientes vers un établissement hospitalier.
in scheme: FINANCES PUBLIQUES
in scheme: Branche d'activité
in scheme: Questions Economiques
in scheme: Transports
notation: REFIP2936

échange inter-applicatif
type: ConceptReFip
type: Concept
broader: interface
definition: Échange de données, de flux ou de services entre des applications informatiques.
in scheme: FINANCES PUBLIQUES
in scheme: Informatique
in scheme: Communication Documentation Informatique
notation: REFIP2937

application ACANTHE
type: ConceptReFip
type: Concept
alternative label: ACANTHE
broader: applications missions transverses (non-descripteur)
definition: Application permettant de planifier, organiser et suivre les formations Hélios et de permettre aux agents d'accéder à un parcours de formation individuel.
in scheme: FINANCES PUBLIQUES
in scheme: Applications missions transverses
in scheme: Applications Informatiques
notation: REFIP2938

application ACL
type: ConceptReFip
type: Concept
alternative label: ACL
broader: applications gestion publique (non-descripteur)
definition: Application permettant le suivi des versements anticipés du produit des impositions aux collectivités locales.
in scheme: FINANCES PUBLIQUES
in scheme: Applications Informatiques
in scheme: Applications gestion publique
notation: REFIP2939

plafond légal de densité
type: ConceptReFip
type: Concept
alternative label: PLD
broader: cadastre
definition: Limite au droit de construire et en vertu de laquelle la surface de plancher construite ne peut dépasser un certain rapport avec la surface de terrain.
in scheme: FINANCES PUBLIQUES
in scheme: Cadastre
in scheme: Fiscalité
notation: REFIP294

aide à la pierre
type: ConceptReFip
type: Concept
broader: aide aux particuliers (non-descripteur)
definition: Ensemble des aides accordées par l’État pour financer des opérations de développement, d'amélioration et de démolition du parc de logements locatifs sociaux appartenant aux organismes d'habitations à loyer modéré et assimilés.
in scheme: FINANCES PUBLIQUES
in scheme: Dépenses publiques
in scheme: Gestion Publique
notation: REFIP2940

loi de finances
type: ConceptReFip
type: Concept
broader: refip-REFIP978
definition: Texte déterminant la nature, le montant et l’affectation des ressources et des charges de l’État, ainsi que l’équilibre budgétaire et financier qui en résulte.
in scheme: FINANCES PUBLIQUES
in scheme: Élaboration du budget
in scheme: Budget
notation: REFIP2942

fin de gestion
type: ConceptReFip
type: Concept
alternative label: traitement de fin de gestion
broader: procédures et techniques comptables (non-descripteur)
definition: Période où les opérations comptables de fin de gestion sont réalisées.
in scheme: FINANCES PUBLIQUES
in scheme: Procédures et Techniques Comptables
in scheme: Comptabilité
narrower: régularisation des écritures comptables
narrower: clôture des comptes
narrower: arrêté comptable
narrower: affectation de résultat
narrower: clôture de l'exercice
narrower: bascule comptable
narrower: période comptable
narrower: journée complémentaire
notation: REFIP2944

contrôle administratif
type: ConceptReFip
type: Concept
broader: droit administratif
definition: Contrôle exercé par une autorité administrative supérieure sur les autorités administratives qui lui sont subordonnées.
in scheme: FINANCES PUBLIQUES
in scheme: Droit et Justice
in scheme: Divisions du Droit
in scheme: Droit Public
narrower: contrôle de légalité
narrower: contrôle de l'opportunité
notation: REFIP2945

dégrèvement
type: ConceptReFip
type: Concept
broader: décision administrative contentieuse
definition: Annulation totale ou partielle d'impôt décidée par l'administration soit dans les cas prévus par la loi, soit à la suite d'une réclamation contentieuse ou gracieuse.
in scheme: FINANCES PUBLIQUES
in scheme: Contentieux Fiscal
in scheme: Fiscalité
narrower: acceptation partielle
narrower: décision d'office
narrower: dégrèvement spécial
narrower: décision de rejet
narrower: dégrèvement transitoire
notation: REFIP2946

créance sur l'Etat
type: ConceptReFip
type: Concept
broader: recouvrement
definition: Ensemble des engagements financiers pris par l'État.
in scheme: FINANCES PUBLIQUES
in scheme: Recouvrement
in scheme: Fiscalité
notation: REFIP2947

ministère
type: ConceptReFip
type: Concept
broader: organisation structurelle de l'Etat (non-descripteur)
definition: Division de l'administration publique centrale chargé de mettre en œuvre la politique gouvernementale dans un domaine précis. Chaque ministère est composé de plusieurs grandes directions qui se subdivisent en de nombreux services.
in scheme: FINANCES PUBLIQUES
in scheme: Organisation Structurelle de l'Etat
in scheme: Ministère
in scheme: Administration de L'Etat
narrower: administration centrale de l'Etat
narrower: services déconcentrés des administrations civiles de l'Etat
narrower: Ministère de l'Economie et des Finances
narrower: Ministère des Outre-mer
narrower: cabinet ministériel
narrower: Ministère de la Justice
narrower: Ministère de l'Intérieur
narrower: structure rattachée au Premier Ministre (non-descripteur)
narrower: refip-REFIP7058
narrower: refip-REFIP7060
narrower: refip-REFIP7061
narrower: refip-REFIP7062
narrower: refip-REFIP7063
narrower: refip-REFIP7064
narrower: refip-REFIP7065
narrower: refip-REFIP7066
narrower: refip-REFIP7067
narrower: refip-REFIP7068
narrower: refip-REFIP7075
narrower: refip-REFIP7076
notation: REFIP2948

juge du fond
type: ConceptReFip
type: Concept
broader: magistrat
definition: Juge des juridictions du premier degré, c'est-à-dire les tribunaux d’instance ou de grande instance, ou des juridictions du second degré comme les Cour d'appel ou les Cour administratives d’appel. Il a compétence pour trancher les litiges en prenant compte des faits présentés et sur des prétentions des parties pour justifier leurs décisions. Les litiges sont nécessairement jugés ainsi au moins une fois.
in scheme: FINANCES PUBLIQUES
in scheme: Profession Juridique
in scheme: Droit et Justice
in scheme: Organisation Juridictionnelle
notation: REFIP295

contribution additionnelle de solidarité pour l'autonomie
type: ConceptReFip
type: Concept
alternative label: CASA
broader: impôts et taxes affectés
definition: Taxe additionnelle destinée au financement de l'aide aux personnes en perte d'autonomie, et prélevée sur les retraites, pensions d'invalidité et allocations de préretraite.
in scheme: FINANCES PUBLIQUES
in scheme: Fiscalité
in scheme: Impôt
notation: REFIP2950

application TELE-TD
type: ConceptReFip
type: Concept
alternative label: TELE-TD
alternative label: TELETD
broader: applications fiscales (non-descripteur)
definition: Application permettant de déclarer en ligne les « Produits Non Gérés » (titres de créances et valeurs mobilières non dématérialisés) des personnes physiques.
in scheme: FINANCES PUBLIQUES
in scheme: Applications Informatiques
in scheme: Applications fiscales
notation: REFIP2951

foire et marché
type: ConceptReFip
type: Concept
alternative label: exposition et salon
broader: activité ambulante
definition: Manifestation commerciale regroupant des exposants ou commerçants.
in scheme: FINANCES PUBLIQUES
in scheme: Branche d'activité
in scheme: Questions Economiques
in scheme: Commerce
narrower: forain
notation: REFIP2952

comptabilité M 14
type: ConceptReFip
type: Concept
broader: comptabilité publique locale
definition: Instruction comptable M 14, applicable aux communes et aux établissements publics communaux et intercommunaux à caractère administratif.
in scheme: FINANCES PUBLIQUES
in scheme: Secteur public local
in scheme: Gestion Publique
notation: REFIP2953

engagement de l'Etat
type: ConceptReFip
type: Concept
broader: comptabilité des engagements
definition: Toute grande opération d’infrastructure dont l’Etat est maître d’ouvrage donne lieu à la formalisation des engagements de l’Etat dans neuf domaines très détaillées : cadre de vie, agriculture, développement local, eau, paysage, patrimoine culturel, milieux naturels et exploitation de l’itinéraire.
in scheme: FINANCES PUBLIQUES
in scheme: Exécution du budget
in scheme: Budget
narrower: engagement hors bilan
narrower: engagement des dépenses
notation: REFIP2954

impôt direct local
type: ConceptReFip
type: Concept
alternative label: impôt local
alternative label: impôts locaux
broader: impôt direct
definition: Impôt perçu par les collectivités territoriales. Comprend notamment la taxe d'habitation, la taxe foncière, la Contribution Économique Territoriale et la Taxe d'enlèvement des ordures ménagères.
in scheme: FINANCES PUBLIQUES
in scheme: Fiscalité
in scheme: Impôt
narrower: contribution économique territoriale
narrower: taxe d'habitation
narrower: taxe additionnelle à la cotisation foncière des entreprises
narrower: taxe additionnelle à la cotisation sur la valeur ajoutée des entreprises
narrower: taxe professionnelle
narrower: taxe foncière
notation: REFIP2955
related: fiscalité directe locale

accueil physique
type: ConceptReFip
type: Concept
broader: accueil du public
definition: Réception des usagers de la DGFIP au sein de ses structures ou lors des permanences externes d’accueil du public.
in scheme: FINANCES PUBLIQUES
in scheme: Missions Transverses des Finances publiques
in scheme: Qualité de service
notation: REFIP2956

facture
type: ConceptReFip
type: Concept
broader: pièce comptable
definition: Note détaillée des prestations ou des marchandises vendues. Il s'agit d'un document de nature commerciale et comptable établi par une structure juridique (société, association, entrepreneur individuel par exemple) pour constater les conditions des achats et ventes de produits, de marchandises ou de services rendus (nature, quantité, poids, qualité, prix, modalités et échéance de paiement notamment).
in scheme: FINANCES PUBLIQUES
in scheme: Documents comptables
in scheme: Comptabilité
narrower: facture pro forma
narrower: facture irrégulière
narrower: facture électronique
notation: REFIP2957

ligne téléphonique
type: ConceptReFip
type: Concept
alternative label: ligne de télécommunication
broader: téléphonie
definition: Installation destinée à la transmission de signaux électromagnétiques entre deux points pour assurer une communication par téléphone.
in scheme: FINANCES PUBLIQUES
in scheme: Communication
in scheme: Communication Documentation Informatique
notation: REFIP2958

application CIR
type: ConceptReFip
type: Concept
alternative label: CIR
broader: applications missions transverses (non-descripteur)
definition: Système d'information découpé en silos applicatifs permettant principalement l'information, la liquidation et le contrôle des droits à la retraite.
in scheme: FINANCES PUBLIQUES
in scheme: Applications missions transverses
in scheme: Applications Informatiques
notation: REFIP296

publication
type: ConceptReFip
type: Concept
broader: traitement de l'information
definition: Action de rendre publique une information, un texte, un livre. Par extension l'ouvrage publié en lui-même.
in scheme: FINANCES PUBLIQUES
in scheme: Communication
in scheme: Communication Documentation Informatique
narrower: éditeur
narrower: publication interne
notation: REFIP2960

application PUBLIDOM
type: ConceptReFip
type: Concept
alternative label: PUBLIDOM
broader: applications gestion publique (non-descripteur)
definition: Gestion des données de publication des ventes pour le site de ventes domaniales.
in scheme: FINANCES PUBLIQUES
in scheme: Applications Informatiques
in scheme: Applications gestion publique
notation: REFIP2961
scope note: Remplacée par l'application HERMES à compter du 18/07/2017

Caisse d'assurance retraite et de la santé au travail
type: ConceptReFip
type: Concept
alternative label: CARSAT
broader: organisme de sécurité sociale
definition: Organisme du régime général de sécurité sociale de France métropolitaine ayant une compétence régionale. Les Carsat ont succédé, au 1er juillet 2010, aux caisses régionales d'assurances maladie (CRAM). Elles exercent leurs missions dans les domaines de l'assurance vieillesse et de l'assurance des risques professionnels (accidents du travail et maladies professionnelles).
in scheme: FINANCES PUBLIQUES
in scheme: Organisation Structurelle de l'Etat
in scheme: Organisme de Sécurité Sociale
in scheme: Administration de L'Etat
notation: REFIP2962
scope note: Succède aux CRAM à compter du 01/07/2010

non-lieu à statuer
type: ConceptReFip
type: Concept
broader: décision de justice
definition: Constatation par le juge du fait que l'objet du litige a disparu au cours de l'instruction. Cette situation se produit si satisfaction a été donnée à l'intéressé (la somme réclamée a été payée, l'impôt contesté a été dégrevé, la décision attaquée a été retirée) ou si les faits, à l'origine de la décision, ont été amnistiés.
in scheme: FINANCES PUBLIQUES
in scheme: Principes Généraux
in scheme: Droit et Justice
in scheme: Procédure
notation: REFIP2963

service public à caractère industriel et commercial
type: ConceptReFip
type: Concept
alternative label: SPIC
broader: service public
definition: Organisme de gestion de service public dont l'objet à caractère industriel et commercial, soumis principalement aux règles de droit privé mais restant soumis à la tutelle des pouvoirs publics. Ces derniers s'assurent qu'il mène à bien sa mission et respecte le principe d'égalité d'accès des usagers au service public.
in scheme: FINANCES PUBLIQUES
in scheme: Etat
in scheme: Mission de Service Public
in scheme: Administration de L'Etat
notation: REFIP2964

application LASER DE SIMPLIFICATION DES ECHANGES (obsolète)
type: ConceptReFip
type: Concept
is replaced by: application LAER
broader: ZZ
in scheme: FINANCES PUBLIQUES
notation: REFIP2965

Gers
type: ConceptReFip
type: Concept
broader: refip-REFIP7036
definition: Département française
in scheme: FINANCES PUBLIQUES
in scheme: Géographie
in scheme: Europe
notation: REFIP2966

local professionnel
type: ConceptReFip
type: Concept
broader: local
definition: Local destiné à accueillir une activité professionnelle.
in scheme: FINANCES PUBLIQUES
in scheme: Cadastre
in scheme: Fiscalité
narrower: local de stockage
narrower: local commercial
narrower: local à usage de bureaux
notation: REFIP2967

impatrié
type: ConceptReFip
type: Concept
broader: territorialité de l'impôt
definition: Salarié ou individu expatrié rentré dans son pays d'origine, notamment dans le cadre de son parcours professionnel, en dehors d'une situation d'urgence.
in scheme: FINANCES PUBLIQUES
in scheme: Champ d'Application
in scheme: Fiscalité
notation: REFIP2968

achat sans facture
type: ConceptReFip
type: Concept
broader: fraude fiscale
definition: Lorsque le service établit l’existence d’achats ou de ventes réalisés sans factures, il constate un cas de fraude par non comptabilisation des opérations commerciales réalisées. Le recours à la flagrance fiscale est justifié uniquement en cas de réitération de ces opérations.
in scheme: FINANCES PUBLIQUES
in scheme: Droit de Contrôle de l'Administration
in scheme: Fiscalité
notation: REFIP2969

station de tourisme
type: ConceptReFip
type: Concept
alternative label: station balnéaire
alternative label: station de sports d'hiver
alternative label: station thermale
alternative label: station touristique
broader: tourisme
definition: Lieu touristique se caractérisant par la prédominance l'activité touristique et récréative d'une capacité d'hébergement d'une population non permanente conséquente.
in scheme: FINANCES PUBLIQUES
in scheme: Branche d'activité
in scheme: Questions Economiques
in scheme: Tourisme
notation: REFIP2971

application CISIS
type: ConceptReFip
type: Concept
alternative label: CISIS
broader: applications gestion publique (non-descripteur)
definition: Comptabilisation et suivi des inventaires de certaines immobilisations de l'Etat.
in scheme: FINANCES PUBLIQUES
in scheme: Applications Informatiques
in scheme: Applications gestion publique
notation: REFIP2973

contrôle formel
type: ConceptReFip
type: Concept
alternative label: contrôle des déclarations
alternative label: vérification des déclarations
broader: contrôle fiscal
definition: Ensemble des opérations ayant trait à la rectification des erreurs matérielles évidentes constatées dans les déclarations déposées.
in scheme: FINANCES PUBLIQUES
in scheme: Droit de Contrôle de l'Administration
in scheme: Fiscalité
notation: REFIP2979

excédent de versement
type: ConceptReFip
type: Concept
broader: comptabilité développée du recouvrement
definition: Somme résultant soit d’un encaissement supérieur à la recette constatée en écritures, soit de la réduction ou de l’annulation d’une recette recouvrée.
in scheme: FINANCES PUBLIQUES
in scheme: Comptabilité générale de l'Etat
in scheme: Comptabilité
notation: REFIP298

Ministère de l'Economie du Redressement productif et du Numérique (obsolète)
type: ConceptReFip
type: Concept
is replaced by: Ministère de l'Economie et des Finances
broader: ZZ
in scheme: FINANCES PUBLIQUES
notation: REFIP2980

contribution solidarité autonomie
type: ConceptReFip
type: Concept
broader: impôts et taxes affectés
definition: Contribution due par tous les employeurs du secteur privé et du secteur public, redevables de la cotisation patronale d’assurance maladie. Cette contribution est applicable aux rémunérations afférentes aux périodes d’emploi accomplies à compter du 1er juillet 2004. Elle finance la Caisse nationale de solidarité pour l'autonomie.
in scheme: FINANCES PUBLIQUES
in scheme: Fiscalité
in scheme: Impôt
notation: REFIP2981

France Télécom (obsolète)
type: ConceptReFip
type: Concept
is replaced by: refip-REFIP7088
broader: ZZ
in scheme: FINANCES PUBLIQUES
notation: REFIP2982

bureau
type: ConceptReFip
type: Concept
broader: mobilier
definition: Table de travail.
in scheme: FINANCES PUBLIQUES
in scheme: Lieu de Travail
in scheme: Entreprises
in scheme: Travail
notation: REFIP2983
scope note: mobilier

surenchère
type: ConceptReFip
type: Concept
broader: vente aux enchères
definition: Enchère qu’on fait au-dessus d’une autre enchère.
in scheme: FINANCES PUBLIQUES
in scheme: Droit et Justice
in scheme: Divisions du Droit
in scheme: Droit Privé
notation: REFIP2984

amortissement comptable
type: ConceptReFip
type: Concept
alternative label: amortissement
broader: procédures et techniques comptables (non-descripteur)
definition: Dispositif comptable consistant à répartir le coût d'un élément d'actif sur sa durée d'utilisation prévue par l'entreprise, lorsque celle-ci est limitée dans le temps en raison d'un critère physique (usure), technique (obsolescence) ou juridique (période de protection légale ou contractuelle). La comptabilisation des amortissements est obligatoire à la clôture de chaque exercice comptable.
in scheme: FINANCES PUBLIQUES
in scheme: Procédures et Techniques Comptables
in scheme: Comptabilité
narrower: année comptable
narrower: amortissement différé
narrower: amortissement linéaire
narrower: amortissement exceptionnel
narrower: amortissement par composant
narrower: durée d'amortissement
narrower: amortissement dégressif
notation: REFIP2985

application EDEN
type: ConceptReFip
type: Concept
alternative label: EDEN
broader: applications missions transverses (non-descripteur)
definition: Application d'évaluation et de notation des agents de l'ex DGCP.
in scheme: FINANCES PUBLIQUES
in scheme: Applications missions transverses
in scheme: Applications Informatiques
notation: REFIP2986

appel en garantie
type: ConceptReFip
type: Concept
broader: procédure civile
definition: Recours exercé par une personne qui est assignée en justice aux fins qu'une autre personne lui soit substituée dans les condamnations qui pourraient éventuellement être prononcées contre elle. Le garant peut être appelé devant le tribunal saisis ou lors d'un procès d'un distinct et ultérieur.
in scheme: FINANCES PUBLIQUES
in scheme: Procédure Civile
in scheme: Droit et Justice
in scheme: Procédure
notation: REFIP2987

contrôle interne comptable
type: ConceptReFip
type: Concept
broader: contrôle interne
definition: Ensemble des dispositifs formalisés et permanents ayant pour objet de maîtriser les risques afférents à la poursuite des objectifs de qualité des comptes, depuis le fait générateur d’une opération jusqu’à son dénouement comptable.
in scheme: FINANCES PUBLIQUES
in scheme: Missions Transverses des Finances publiques
in scheme: Maîtrise des risques
notation: REFIP2989

régie personnalisée
type: ConceptReFip
type: Concept
broader: régie
definition: Régie disposant de l'autonomie financière et de la personnalité morale. La régie personnalisée est administrée par un conseil d'administration et un directeur désigné sur proposition du maire.
in scheme: FINANCES PUBLIQUES
in scheme: Secteur public local
in scheme: Gestion Publique
notation: REFIP299

cahier des clauses administratives générales
type: ConceptReFip
type: Concept
alternative label: CCAG
broader: cahier des charges
definition: Document qui fixe les dispositions administratives applicables à une catégorie de marché (travaux, fournitures, services …)
in scheme: FINANCES PUBLIQUES
in scheme: Commande publique
in scheme: Gestion Publique
notation: REFIP2990

loi constitutionnelle
type: ConceptReFip
type: Concept
broader: loi
definition: Loi de révision de la Constitution. Expression aussi employée pour désigner la Constitution elle-même.
in scheme: FINANCES PUBLIQUES
in scheme: Droit et Justice
in scheme: Sources du Droit
in scheme: Sources du Droit Objectif
notation: REFIP2991

contribution pour le remboursement de la dette sociale
type: ConceptReFip
type: Concept
alternative label: CRDS
alternative label: contribution au remboursement de la dette sociale
broader: prélèvements sociaux
definition: Prélèvement destiné au financement de la sécurité sociale et assis sur les revenus d'activité ou de remplacement.
in scheme: FINANCES PUBLIQUES
in scheme: Fiscalité
in scheme: Impôt
notation: REFIP2992

tacite reconduction
type: ConceptReFip
type: Concept
alternative label: accord tacite
alternative label: clause de tacite reconduction
broader: reconduction
definition: Mécanisme juridique permettant le renouvellement automatique d'un contrat.
in scheme: FINANCES PUBLIQUES
in scheme: Droit et Justice
in scheme: Divisions du Droit
in scheme: Droit Privé
notation: REFIP2994

contribution additionnelle au prélèvement social
type: ConceptReFip
type: Concept
broader: impôts et taxes affectés
definition: Taxe additionnelle destinée au financement de la protection sociale et assise sur les revenus du patrimoine et les produits de placements assujettis à la CSG des personnes physiques domiciliées en France.
in scheme: FINANCES PUBLIQUES
in scheme: Fiscalité
in scheme: Impôt
notation: REFIP2995

procédure d'insolvabilité
type: ConceptReFip
type: Concept
broader: droit européen
definition: Règlement ayant pour objet de définir des règles applicables aux procédures d’insolvabilité transfrontalières au sein de l’Union Européenne, avec un double objectif : Faciliter la restructuration des entreprises et permettre aux créanciers de récupérer plus facilement leurs fonds. Ce texte n’a pas pour objet de proposer un droit unique des procédures collectives mais principalement de définir des règles de conflits de lois et de compétence ainsi que des règles en matière de reconnaissance des décisions judiciaires en lien avec les procédures d’insolvabilité. Le règlement précise tout d’abord, pour chaque pays membre de l’Union Européenne, quelles sont les procédures d’insolvabilité concernées. Pour la France il s’agit des procédures de sauvegarde, de sauvegarde accélérée, de sauvegarde financière accélérée, de redressement et de liquidation judiciaire. Ce règlement pose ainsi, notamment, les juridictions compétentes pour ouvrir une procédure d’insolvabilité sont celles du territoire où est situé le centre des intérêts principaux du débiteur. Pour les personnes morales, celui-ci peut donc être différent du lieu du siège social même si ce dernier est présumé, sauf preuve contraire, être le même.
in scheme: FINANCES PUBLIQUES
in scheme: Droit et Justice
in scheme: Divisions du Droit
in scheme: Droit Européen
notation: REFIP2996

littoral
type: ConceptReFip
type: Concept
broader: milieu naturel
definition: Zone géographique comprise entre une étendue maritime et le continent ou l'arrière-pays.
in scheme: FINANCES PUBLIQUES
in scheme: Environnement
in scheme: Milieu Naturel
in scheme: Questions de Société
narrower: plage
notation: REFIP2997

domicile fiscal
type: ConceptReFip
type: Concept
alternative label: délocalisation de domicile fiscal
alternative label: transfert de domicile fiscal
broader: lieu d'imposition
definition: Lieu d'imposition d'un contribuable définit selon plusieurs critères fixés par le droit interne. En cas d'application d'une convention fiscale internationale, on parle alors de résidence fiscale.
in scheme: FINANCES PUBLIQUES
in scheme: Champ d'Application
in scheme: Fiscalité
narrower: adresse fiscale de taxation
narrower: changement d'adresse
notation: REFIP2998

Meuse
type: ConceptReFip
type: Concept
broader: refip-REFIP7009
definition: Département français
in scheme: FINANCES PUBLIQUES
in scheme: Géographie
in scheme: Europe
notation: REFIP2999

opération d'ordre
type: ConceptReFip
type: Concept
broader: procédures et techniques comptables (non-descripteur)
definition: Opération permettant de retracer des mouvements qui ont un impact sur l’actif sans avoir de conséquences sur la trésorerie.
in scheme: FINANCES PUBLIQUES
in scheme: Procédures et Techniques Comptables
in scheme: Comptabilité
notation: REFIP3

contribution indirecte
type: ConceptReFip
type: Concept
alternative label: accises
alternative label: droit d'accise
broader: refip-REFIP934
definition: Ensemble des impôts collectés par d'autres personnes que celles qui en supportent le coût.
in scheme: FINANCES PUBLIQUES
in scheme: Fiscalité
in scheme: Impôt
narrower: droit sur les tabacs et les boissons alcooliques
notation: REFIP30

climatisation
type: ConceptReFip
type: Concept
alternative label: air conditionné
broader: énergie
definition: Technique qui consiste à modifier, contrôler et réguler les conditions climatiques d’un local.
in scheme: FINANCES PUBLIQUES
in scheme: Branche d'activité
in scheme: Questions Economiques
in scheme: Industrie
notation: REFIP300

plan de reprise
type: ConceptReFip
type: Concept
alternative label: plan de reprise d'entreprise
broader: reprise d'entreprise
definition: Document synthétique qui résume la stratégie et les objectifs du repreneur et qui permet de vérifier si le projet est réalisable.
in scheme: FINANCES PUBLIQUES
in scheme: Vie de l'Entreprise
in scheme: Entreprises
in scheme: Vie et Gestion de l'entreprise
notation: REFIP3000

mise en concurrence
type: ConceptReFip
type: Concept
broader: passation des marchés publics
definition: Règle générale de procédure de passation des marchés. Préalable au choix de l'entreprise, les procédures de mises en concurrence sont plus ou moins formalisées selon le montant ou l'objet du marché.
in scheme: FINANCES PUBLIQUES
in scheme: Commande publique
in scheme: Gestion Publique
notation: REFIP3002

concussion
type: ConceptReFip
type: Concept
broader: corruption
definition: Manquement au devoir de probité. Infraction commise par un représentant de l'autorité publique qui, par abus d'autorité, retire un profit illicite de sa fonction en exigeant ou en ordonnant le versement d'une somme indue.
in scheme: FINANCES PUBLIQUES
in scheme: Droit et Justice
in scheme: Infractions et Sanctions
in scheme: Infraction
notation: REFIP3003

comité consultatif national paritaire (supprimé)
type: ConceptReFip
type: Concept
broader: ZZ
in scheme: FINANCES PUBLIQUES
notation: REFIP3005

crédit d'impôt famille
type: ConceptReFip
type: Concept
broader: refip-REFIP849
definition: Dispositif institué au profit des entreprises qui supportent des dépenses permettant à leur personnel de mieux concilier vie familiale et vie professionnelle. Les entreprises qui engagent des dépenses de mise en place de crèches ou d'aide versée aux salariés et aux dirigeants sociaux peuvent bénéficier du CIF en les déduisant de leur impôt sous certaines conditions. Le taux du CIF varie selon les catégories de dépenses engagées.
in scheme: FINANCES PUBLIQUES
in scheme: Liquidation de l'Impôt
in scheme: Fiscalité
notation: REFIP3006

Agence de gestion et de recouvrement des avoirs saisis et confisqués
type: ConceptReFip
type: Concept
alternative label: AGRASC
broader: établissement public à caractère administratif
definition: Etablissement public administratif facilitant la saisie et la confiscation en matière pénale.
in scheme: FINANCES PUBLIQUES
in scheme: Organisation Structurelle de l'Etat
in scheme: Opérateur de l'Etat
in scheme: Administration de L'Etat
notation: REFIP3007

Cabinet et Communication
type: ConceptReFip
type: Concept
alternative label: Cabinet et Communication Cabinet international
alternative label: service de la communication
broader: administration centrale des finances publiques
definition: Placée sous l’autorité du directeur général dans une structure appelée Cabinet et Communication, cette structure s'organise autour d'une cellule Presse, d'un pôle éditorial numérique et événements ainsi que d'un pôle administration web et création graphique.
in scheme: FINANCES PUBLIQUES
in scheme: Organisation Structurelle de l'Etat
in scheme: Ministère
in scheme: Administration de L'Etat
notation: REFIP3009

décision d'office
type: ConceptReFip
type: Concept
broader: dégrèvement
definition: Décision prise par l'administration en matière contentieuse ou gracieuse consistant à ne pas donner une suite favorable à la réclamation du contribuable ou, pour le service de la publicité foncière, à ne pas exécuter la formalité de l'enregistrement.
in scheme: FINANCES PUBLIQUES
in scheme: Contentieux Fiscal
in scheme: Fiscalité
narrower: refip-REFIP720
notation: REFIP301

application ANTILOPE
type: ConceptReFip
type: Concept
broader: applications missions transverses (non-descripteur)
definition: Outil d’aide à la gestion du parc immobilier de la DGFiP.
in scheme: FINANCES PUBLIQUES
in scheme: Applications missions transverses
in scheme: Applications Informatiques
notation: REFIP3011

application ERICA
type: ConceptReFip
type: Concept
alternative label: ERICA
broader: applications fiscales (non-descripteur)
definition: Application de gestion des affaires du contentieux administratif ou des affaires juridiques.
in scheme: FINANCES PUBLIQUES
in scheme: Applications Informatiques
in scheme: Applications fiscales
notation: REFIP3012

puéricultrice
type: ConceptReFip
type: Concept
broader: fonction publique hospitalière
definition: Fonctionnaire territorial ou hospitalier de catégorie A participant au développement et à l’éveil des enfants. Elle assure la protection et la promotion de la santé de l’enfant et de sa famille, elle conseille et accompagne les parents.
in scheme: FINANCES PUBLIQUES
in scheme: Personnels et fonctions
in scheme: Fonction Publique et Gestion des Ressources Humaines
notation: REFIP3013

rétablissement de crédit
type: ConceptReFip
type: Concept
broader: budget de l'Etat
definition: Procédure permettant d'affecter le remboursement d'une dépense au budget et au chapitre qui l'ont initialement supportée. Ces rétablissements de crédits doivent être exercés au cours de l'exercice qui a supporté la dépense ou au cours de l'exercice suivant.
in scheme: FINANCES PUBLIQUES
in scheme: Budget de l’État
in scheme: Budget
notation: REFIP3015

système normalisé de numérotation
type: ConceptReFip
type: Concept
alternative label: numéro NOR
broader: classement
definition: Chaîne de 12 caractères alphanumériques attribuée depuis 1987 à tous les actes publiés au journal officiel ainsi qu'à l'ensemble des textes de portée générale publiées dans bulletins officiels des ministères.
in scheme: FINANCES PUBLIQUES
in scheme: Documentation
in scheme: Communication Documentation Informatique
notation: REFIP3017

dépenses de l'Etat
type: ConceptReFip
type: Concept
broader: dépenses publiques
definition: Ensemble des dépenses de personnel, de fonctionnement, d’intervention, d’investissement ainsi que le remboursement des intérêts de la dette.
in scheme: FINANCES PUBLIQUES
in scheme: Dépenses publiques
in scheme: Gestion Publique
narrower: dépenses de fonctionnement
narrower: dépenses de personnel
narrower: dépenses d'investissement
narrower: charges permanentes de l'Etat
narrower: charges financières de l'Etat
narrower: dépenses d'externalisation
narrower: dépenses d'intervention
notation: REFIP3018

terres australes et antarctiques françaises
type: ConceptReFip
type: Concept
broader: collectivités et territoires d'outre mer (non-descripteur)
definition: Collectivité d'outre-mer
in scheme: FINANCES PUBLIQUES
in scheme: Géographie
in scheme: Europe
notation: REFIP3019

notification
type: ConceptReFip
type: Concept
broader: principes généraux (non-descripteur)
definition: Formalité par laquelle un acte de procédure ou une décision est porté à la connaissance d'une personne.
in scheme: FINANCES PUBLIQUES
in scheme: Principes Généraux
in scheme: Droit et Justice
in scheme: Procédure
narrower: dénonciation
notation: REFIP302

dépenses du secteur public local
type: ConceptReFip
type: Concept
broader: finances locales (non-descripteur)
definition: Ensemble des transferts versés tels que les prestations sociales, les dépenses de personnel (toutes deux figurant dans la section de fonctionnement), et les dépenses d’investissement (équipement et subventions d’équipement).
in scheme: FINANCES PUBLIQUES
in scheme: Secteur public local
in scheme: Gestion Publique
narrower: dépenses imprévues
narrower: dépenses obligatoires
notation: REFIP3020

Code de l'entrée et du séjour des étrangers et du droit d'asile
type: ConceptReFip
type: Concept
alternative label: CESEDA
broader: documentation juridique (non-descripteur)
definition: Ensemble des textes intéressant l’entrée, le séjour, l’éloignement du territoire des étrangers, le droit d’asile mais également les règles relatives à la nationalité, les accords bilatéraux, les dispositions pertinentes de la convention européenne de sauvegarde des droits de l’homme et la question complexe de la protection sociale des étrangers.
in scheme: FINANCES PUBLIQUES
in scheme: Droit et Justice
in scheme: Documentation Juridique
in scheme: Sources du Droit
notation: REFIP3021

inscription d'hypothèque
type: ConceptReFip
type: Concept
alternative label: inscription hypothécaire
broader: hypothèque
definition: Mention portant identification du créancier et du débiteur, indication de la créance garantie, et désignation de l'immeuble grevé, donnant rang à l'hypothèque et assurant l'opposabilité aux tiers des hypothèques et privilèges spéciaux immobiliers.
in scheme: FINANCES PUBLIQUES
in scheme: Recouvrement
in scheme: Fiscalité
notation: REFIP3022

crédit d'impôt en faveur des entreprises qui relocalisent leur activité en France (supprimé)
type: ConceptReFip
type: Concept
broader: ZZ
in scheme: FINANCES PUBLIQUES
notation: REFIP3023

groupement de producteurs
type: ConceptReFip
type: Concept
broader: agriculture
definition: Organisation de producteurs constituée à l’initiative d’un ensemble d’agriculteurs qui se regroupent dans l’objectif de mutualiser leurs moyens afin de rééquilibrer les relations commerciales qu’ils entretiennent avec les acteurs économiques de leur filière.
in scheme: FINANCES PUBLIQUES
in scheme: Branche d'activité
in scheme: Questions Economiques
in scheme: Agriculture
notation: REFIP3025

Direction du Budget
type: ConceptReFip
type: Concept
broader: refip-REFIP7061
definition: Direction du ministère de l'Économie et des Finances, elle propose au Gouvernement la stratégie pluriannuelle en matière de finances publiques. Elle pilote l’élaboration des lois de finances et l’exécution du budget de l’État ainsi que des finances publiques, coordonne les autorités chargées du contrôle budgétaire et exerce la tutelle financière des organismes publics. Au niveau européen, elle suit les aspects budgétaires relatifs aux politiques menées et participe à l’élaboration du budget de l’UE.
in scheme: FINANCES PUBLIQUES
in scheme: Organisation Structurelle de l'Etat
in scheme: Ministère
in scheme: Administration de L'Etat
notation: REFIP3028

contribution au fonds pour l'emploi hospitalier (supprimé)
type: ConceptReFip
type: Concept
broader: ZZ
in scheme: FINANCES PUBLIQUES
notation: REFIP3029

contribution pour l'aide juridique
type: ConceptReFip
type: Concept
broader: contribution
definition: Contribution d 'un montant de 35 € perçue par instance introduite en matière civile, prud'homale, sociale ou rurale devant une juridiction judiciaire ou par une instance introduite devant une juridiction administrative. Supprimée à compter du 1er janvier 2014.
in scheme: FINANCES PUBLIQUES
in scheme: Fiscalité
in scheme: Impôt
notation: REFIP303

boulangerie
type: ConceptReFip
type: Concept
broader: commerce de détail
definition: Commerce spécialiste de la fabrication du pain et de ses dérivés.
in scheme: FINANCES PUBLIQUES
in scheme: Branche d'activité
in scheme: Questions Economiques
in scheme: Commerce
notation: REFIP3030

application COLBERT
type: ConceptReFip
type: Concept
broader: applications gestion publique (non-descripteur)
definition: Interface de gestion des dotations de L'Etat aux collectivités territoriales relevant de prélèvements sur recettes.
in scheme: FINANCES PUBLIQUES
in scheme: Applications Informatiques
in scheme: Applications gestion publique
notation: REFIP3031

Burkina-Faso
type: ConceptReFip
type: Concept
alternative label: Haute-Volta
broader: Afrique
definition: Pays
in scheme: FINANCES PUBLIQUES
in scheme: Géographie
in scheme: Afrique
notation: REFIP3033

groupement d'intérêt public
type: ConceptReFip
type: Concept
alternative label: GIP
broader: opérateur de l'Etat
definition: Personne morale de droit public dotée de l’autonomie administrative et financière. Il est constitué par convention approuvée par l’État soit entre plusieurs personnes morales de droit public, soit entre l’une ou plusieurs d’entre elles et une ou plusieurs personnes morales de droit privé quel qu’en soit le domaine (les activités marchandes ne sont pas exclues) et les fins opérationnelles, pour une durée adaptée à ces activités (elle peut être illimitée). Il permet à des partenaires publics et privés de mettre en commun des moyens en vue de missions d’intérêt général.
in scheme: FINANCES PUBLIQUES
in scheme: Organisation Structurelle de l'Etat
in scheme: Opérateur de l'Etat
in scheme: Administration de L'Etat
narrower: maison départementale des personnes handicapées
narrower: conseil départemental de l'accès au droit
notation: REFIP3035

auto-école
type: ConceptReFip
type: Concept
broader: commerce
definition: Etablissement d'enseignement de la conduite automobile.
in scheme: FINANCES PUBLIQUES
in scheme: Branche d'activité
in scheme: Questions Economiques
in scheme: Commerce
notation: REFIP3036

transaction
type: ConceptReFip
type: Concept
broader: accord amiable
definition: Contrat par lequel les parties terminent ou préviennent une contestation en se consentant des concessions réciproques.
in scheme: FINANCES PUBLIQUES
in scheme: Procédure Civile
in scheme: Droit et Justice
in scheme: Procédure
narrower: protocole transactionnel
notation: REFIP3037

imprimé fiscal unique
type: ConceptReFip
type: Concept
alternative label: IFU
broader: documentation fiscale (non-descripteur)
definition: Formulaire n° 2561 récapitulant l'ensemble des revenus de capitaux mobiliers versés et l'ensemble des opérations sur valeur mobilières effectuées par les établissements payeurs sur l'année civile.
in scheme: FINANCES PUBLIQUES
in scheme: Documentation Fiscale
in scheme: Fiscalité
notation: REFIP304

viager
type: ConceptReFip
type: Concept
broader: droit civil
definition: Droit dont on a la jouissance toute sa vie, mais dont le bénéfice ne passe pas aux héritiers (rente viagère par exemple).
in scheme: FINANCES PUBLIQUES
in scheme: Droit et Justice
in scheme: Divisions du Droit
in scheme: Droit Privé
notation: REFIP3040

contrôle multilatéral international
type: ConceptReFip
type: Concept
broader: contrôle fiscal international
definition: Les contrôles multilatéraux, institués depuis 2003, permettent à plusieurs États membres de la Communauté européenne d’effectuer simultanément, depuis leur territoire, des contrôles de la situation fiscale de sociétés ayant des intérêts communs. Ces contrôles sont organisés par des coordinateurs au sein de chaque pays. Celui de la France est rattaché au service du contrôle fiscal. Ainsi depuis 2008, la DGFiP effectue une quinzaine de contrôles par an.
in scheme: FINANCES PUBLIQUES
in scheme: Droit de Contrôle de l'Administration
in scheme: Fiscalité
narrower: EUROFISC
notation: REFIP3041

association syndicale autorisée
type: ConceptReFip
type: Concept
broader: établissement public à caractère administratif
definition: Groupement de propriétaires sur un périmètre déterminé qui dispose de prérogatives de puissance publique, pour exécuter certains travaux spécifiques d’amélioration ou d’entretien intéressant à la fois l’ensemble de leurs propriétés et d’utilité générale.
in scheme: FINANCES PUBLIQUES
in scheme: Organisation Structurelle de l'Etat
in scheme: Opérateur de l'Etat
in scheme: Administration de L'Etat
narrower: association syndicale de propriétaires
notation: REFIP3043

anomalie
type: ConceptReFip
type: Concept
alternative label: incident
broader: mots outils (liste additive)
definition: Dysfonctionnement.
in scheme: FINANCES PUBLIQUES
in scheme: Mots Outils
notation: REFIP3044

Centre national des œuvres universitaires et scolaires
type: ConceptReFip
type: Concept
alternative label: CNOUS
broader: établissement public à caractère administratif
definition: Etablissement public à caractère administratif regroupant et animant les différents CROUS de France. Le Cnous a pour vocation de favoriser l’amélioration des conditions de vie et de travail des étudiants : bourses sur critères sociaux, aides financières, logement, restauration, culture…
in scheme: FINANCES PUBLIQUES
in scheme: Organisation Structurelle de l'Etat
in scheme: Opérateur de l'Etat
in scheme: Administration de L'Etat
narrower: centre régional des œuvres universitaires et scolaires
notation: REFIP3045

juridiction judiciaire
type: ConceptReFip
type: Concept
broader: juridiction
definition: Ensemble des tribunaux de l'ordre judiciaire soumis au contrôle de la Cour de cassation. Ils sont compétents pour régler les litiges opposant les personnes privées et pour sanctionner les auteurs d’infractions aux lois pénales.
in scheme: FINANCES PUBLIQUES
in scheme: Droit et Justice
in scheme: Juridiction
in scheme: Organisation Juridictionnelle
narrower: Cour d'appel
narrower: juridiction civile
narrower: juridiction pénale
narrower: Cour de cassation
notation: REFIP3047

dotation de solidarité rurale
type: ConceptReFip
type: Concept
broader: dotation globale d'équipement
definition: Dotation attribuée à certaines communes et à certains chefs-lieux d'arrondissement, en fonction du nombre d'habitants, pour tenir compte, d'une part, des charges qu'ils supportent pour contribuer au maintien de la vie sociale en milieu rural, d'autre part, de l'insuffisance de leurs ressources fiscales.
in scheme: FINANCES PUBLIQUES
in scheme: Dépenses publiques
in scheme: Gestion Publique
notation: REFIP3048

garantie à première demande
type: ConceptReFip
type: Concept
broader: passation des marchés publics
definition: Garantie qui, souscrite par un donneur d’ordre (le titulaire du marché ) au profit d’un bénéficiaire (l’administration ) doit être exécutée par le garant (établissement bancaire ) dès lors que le bénéficiaire décide de l’appeler.
in scheme: FINANCES PUBLIQUES
in scheme: Commande publique
in scheme: Gestion Publique
notation: REFIP3049

Conseil supérieur de la magistrature
type: ConceptReFip
type: Concept
broader: organisme consultatif et représentatif (non-descripteur)
definition: Organe chargé par la Constitution d’assister le chef de l’État dans sa fonction de garant de l’indépendance de l’autorité judiciaire. À ce titre, il est principalement chargé de la gestion de la carrière des magistrats.
in scheme: FINANCES PUBLIQUES
in scheme: Organisation Structurelle de l'Etat
in scheme: Organisme Consultatif et Représentatif
in scheme: Administration de L'Etat
notation: REFIP3050

aide à l'investissement et à l'emploi
type: ConceptReFip
type: Concept
alternative label: aide à l'investissement des PME
alternative label: aide à l'investissement initial
alternative label: aide à la création d'emplois liée à l'investissement
broader: aide aux entreprises
definition: Aide accordée à une entreprise par l’État au moyen de ressources publiques procurant un avantage sélectif affectant les échanges entre Etats membres de l'Union européenne.
in scheme: FINANCES PUBLIQUES
in scheme: Dépenses publiques
in scheme: Gestion Publique
notation: REFIP3051
related: refip-REFIP6967

Cellule nationale de suivi de l'immobilier de l'Etat
type: ConceptReFip
type: Concept
alternative label: CNSIE
broader: administration centrale des finances publiques
definition: Structure technique nationale créée en 2010 et placée sous la responsabilité du chef du service France Domaine, la Cellule Nationale de Suivi de l’Immobilier de l’État pilote l'ensemble de la politique d’entretien des bâtiments de l’État.
in scheme: FINANCES PUBLIQUES
in scheme: Organisation Structurelle de l'Etat
in scheme: Ministère
in scheme: Administration de L'Etat
notation: REFIP3052
related: refip-REFIP7085
scope note: Remplacée par a Conférence nationale de l’immobilier public

exercice budgétaire
type: ConceptReFip
type: Concept
broader: exécution du budget
definition: Période (souvent d'une année) comprise entre deux budgets ou entre deux inventaires comptables.
in scheme: FINANCES PUBLIQUES
in scheme: Exécution du budget
in scheme: Budget
notation: REFIP3053

Fonds d'aide au relogement d'urgence
type: ConceptReFip
type: Concept
alternative label: FARU
broader: fonds (non-descripteur)
definition: Fonds qui peut accorder des aides financières aux communes ou à des établissements publics locaux (CCAS, CIAS …) pour assurer pendant une période maximale de 6 mois le relogement d’urgence ou le relogement temporaire de personnes occupant des locaux représentant un danger pour leur santé ou leur sécurité et faisant l’objet d’une ordonnance d’expulsion ou d’un ordre d’évacuation.
in scheme: FINANCES PUBLIQUES
in scheme: Dépenses publiques
in scheme: Gestion Publique
notation: REFIP3054

montant maximum du marché public
type: ConceptReFip
type: Concept
broader: marché à bons de commande
definition: Seuil haut de procédure (qui varie en fonction de l'objet et de la veleur du marché public) et seuil de publicité (modifiant la procédure mais aussi les modalités de publicités à donner à l'avis de marché).
in scheme: FINANCES PUBLIQUES
in scheme: Commande publique
in scheme: Gestion Publique
notation: REFIP3055

application RTU
type: ConceptReFip
type: Concept
alternative label: RTU
broader: applications fiscales (non-descripteur)
definition: Application permettant le suivi du recouvrement des taxes d’urbanisme pour le compte des collectivités locales.
in scheme: FINANCES PUBLIQUES
in scheme: Applications Informatiques
in scheme: Applications fiscales
notation: REFIP3056

obligation comptable du contribuable
type: ConceptReFip
type: Concept
broader: civisme fiscal
definition: Obligation légale que doit respecter l'entreprise, personne physique ou morale, comme notamment la tenue de la comptabilité ou la conservation des documents comptables, et pouvant varier selon la taille et la régime d'imposition.
in scheme: FINANCES PUBLIQUES
in scheme: Fiscalité - Autres notions
in scheme: Fiscalité
notation: REFIP3057

redevance cynégétique
type: ConceptReFip
type: Concept
broader: refip-REFIP6752
definition: Redevance acquittée à l'occasion de la délivrance d'un permis de chasse.
in scheme: FINANCES PUBLIQUES
in scheme: Fiscalité
in scheme: Impôt
notation: REFIP3059

Imprimerie nationale
type: ConceptReFip
type: Concept
broader: organisme privé assurant service public (non-descripteur)
definition: Entreprise commerciale, dont l'État est l'unique actionnaire, et ayant le statut de société anonyme. Le groupe délivre aux acteurs des sphères publiques et privées, françaises et internationales, des prestations en ingénierie des titres régaliens, gestion globale des identités et des droits, protection des données sensibles et pilotage des flux et impressions complexes.
in scheme: FINANCES PUBLIQUES
in scheme: Organisation Structurelle de l'Etat
in scheme: Organisme Privé Assurant Service Public
in scheme: Administration de L'Etat
notation: REFIP306

sécurité juridique
type: ConceptReFip
type: Concept
broader: droit général (non-descripteur)
definition: Fondement de l’État de droit. Ce principe vise à garantir des normes claires, intelligibles et à prévenir des dispositions législatives imprévisibles.
in scheme: FINANCES PUBLIQUES
in scheme: Droit et Justice
in scheme: Droit Général
notation: REFIP3060

subvention d'équilibre
type: ConceptReFip
type: Concept
broader: subvention
definition: Aide financière versée par l’État ou une collectivité locale pour combler les pertes d'un organisme, d'une entreprise ou d'un secteur d'activité. Elle est octroyée pour soutenir son bénéficiaire dans le cadre d'une activité nécessaire pour l'intérêt général mais non rentable (service public, recherche fondamentale).
in scheme: FINANCES PUBLIQUES
in scheme: Dépenses publiques
in scheme: Gestion Publique
notation: REFIP3061

convention collective
type: ConceptReFip
type: Concept
alternative label: convention collective de travail
broader: refip-REFIP6950
definition: Accord conclu entre d'une part, un employeur ou groupement d'employeurs et, d'autre part, une ou plusieurs organisations syndicales de salariés en vue de déterminer l'ensemble des conditions d'emploi et de travail des salariés et de leurs garanties sociales.
in scheme: FINANCES PUBLIQUES
in scheme: Entreprises
in scheme: Travail
in scheme: 212619
narrower: accord d'entreprise
notation: REFIP3062

groupe de comptes (supprimé)
type: ConceptReFip
type: Concept
broader: ZZ
in scheme: FINANCES PUBLIQUES
notation: REFIP3063

jeune agriculteur
type: ConceptReFip
type: Concept
broader: exploitant agricole
definition: Agriculteur âgé de moins de 35 ans.
in scheme: FINANCES PUBLIQUES
in scheme: Branche d'activité
in scheme: Questions Economiques
in scheme: Agriculture
notation: REFIP3065

Bulletin officiel des annonces des marchés publics
type: ConceptReFip
type: Concept
broader: bulletin officiel
definition: Publication officielle des annonces de marchés publics à utiliser pour les réponses des entreprises aux appels d'offres publics.
in scheme: FINANCES PUBLIQUES
in scheme: Documentation
in scheme: Communication Documentation Informatique
notation: REFIP3067

frais de réception
type: ConceptReFip
type: Concept
broader: dépenses de fonctionnement
definition: Dépenses afférentes aux relations d’accueil qu’entretient l’administration dans le cadre de manifestations ou journées de travail pour ses hôtes.
in scheme: FINANCES PUBLIQUES
in scheme: Dépenses publiques
in scheme: Gestion Publique
notation: REFIP3068

application BASE IMAGE AUTONOME
type: ConceptReFip
type: Concept
alternative label: BIA
broader: applications fiscales (non-descripteur)
definition: Application permettant de consulter et de délivrer les images de fiches hypothécaires afin de répondre aux demandes de renseignements déposées par les usagers.
in scheme: FINANCES PUBLIQUES
in scheme: Applications Informatiques
in scheme: Applications fiscales
notation: REFIP3069

liquidation judiciaire
type: ConceptReFip
type: Concept
broader: procédure collective
definition: Procédure applicable à tout commerçant, artisan, ou personne exerçant une activité professionnelle indépendante, se trouvant en cessation de paiement et dont le redressement est impossible. Met fin à l'activité du débiteur, dont les biens sont vendus pour permettre le paiement des différents créanciers.
in scheme: FINANCES PUBLIQUES
in scheme: Vie de l'Entreprise
in scheme: Entreprises
in scheme: Vie et Gestion de l'entreprise
narrower: plan de cession
narrower: clôture pour insuffisance d'actif
notation: REFIP307

éditeur
type: ConceptReFip
type: Concept
alternative label: édition
broader: publication
definition: Personne physique ou morale qui est responsable de l'entreprise d'édition et des choix effectués sur la publication de l'œuvre d'un auteur, d'un ouvrage collectif, d'une revue.
in scheme: FINANCES PUBLIQUES
in scheme: Communication
in scheme: Communication Documentation Informatique
narrower: livre
narrower: édition électronique
notation: REFIP3070
related: livre

gaz à effet de serre
type: ConceptReFip
type: Concept
broader: pollution
definition: Gaz qui absorbent une partie des rayons solaires en les redistribuant sous la forme de radiations au sein de l'atmosphère terrestre, phénomène appelé effet de serre.
in scheme: FINANCES PUBLIQUES
in scheme: Environnement
in scheme: Dégradation de l'Environnement
in scheme: Questions de Société
notation: REFIP3073

sursis à statuer
type: ConceptReFip
type: Concept
broader: décision de justice
definition: Décision d'une juridiction remettant à une date ultérieure le jugement d'une affaire pour des motifs de compétence ou de procédure.
in scheme: FINANCES PUBLIQUES
in scheme: Principes Généraux
in scheme: Droit et Justice
in scheme: Procédure
notation: REFIP3074

centre des finances publiques
type: ConceptReFip
type: Concept
broader: direction départementale des finances publiques
definition: Service de la direction générale des Finances publiques présent sur l’ensemble du territoire auprès des usagers et de ses partenaires. Il a pour mission notamment d'établir l'assiette de l'impôt et son recouvrement.
in scheme: FINANCES PUBLIQUES
in scheme: Organisation Structurelle de l'Etat
in scheme: Ministère
in scheme: Administration de L'Etat
notation: REFIP3075

comptabilité M 57
type: ConceptReFip
type: Concept
broader: comptabilité publique locale
definition: Instruction budgétaire et comptable M 57 applicable aux collectivités territoriales uniques, aux métropoles et à leurs établissements publics administratifs.
in scheme: FINANCES PUBLIQUES
in scheme: Secteur public local
in scheme: Gestion Publique
notation: REFIP3076

fonds de concours
type: ConceptReFip
type: Concept
broader: fonds (non-descripteur)
definition: Fonds à caractère non fiscal versés pour concourir à des dépenses d'intérêt public et par les produits de legs et donations attribués à l’État. Dans ce dispositif, la partie versante est une personne morale ou physique distincte de l’État : collectivité publique étrangère, collectivité territoriale, établissement public, organisme ou particulier.
in scheme: FINANCES PUBLIQUES
in scheme: Dépenses publiques
in scheme: Gestion Publique
notation: REFIP3078

Loir-et-Cher
type: ConceptReFip
type: Concept
broader: Centre-Val de Loire
definition: Département français
in scheme: FINANCES PUBLIQUES
in scheme: Géographie
in scheme: Europe
notation: REFIP308

compte courant d'associés
type: ConceptReFip
type: Concept
broader: refip-REFIP831
definition: Compte ouvert au nom d'un associé ou du dirigeant dans les livres comptables de l'entreprise, où l'on enregistre la créance de l'associé ou du dirigeant sur la société.
in scheme: FINANCES PUBLIQUES
in scheme: Documents comptables
in scheme: Comptabilité
notation: REFIP3080

application ARCADE
type: ConceptReFip
type: Concept
broader: applications gestion publique (non-descripteur)
definition: Application permettant l'ajustement du recouvrement et de la comptabilité automatisée du département.
in scheme: FINANCES PUBLIQUES
in scheme: Applications Informatiques
in scheme: Applications gestion publique
notation: REFIP3084

imposition commune
type: ConceptReFip
type: Concept
broader: foyer fiscal
definition: Règle d'imposition concernant les personnes mariées (quel que soit leur régime matrimonial) ou celles liées par un PACS et imposant une déclaration commune, sauf dispositions particulières.
in scheme: FINANCES PUBLIQUES
in scheme: Champ d'Application
in scheme: Fiscalité
notation: REFIP3085

Code de commerce
type: ConceptReFip
type: Concept
broader: documentation juridique (non-descripteur)
definition: Ensemble des lois portant sur le droit commercial.
in scheme: FINANCES PUBLIQUES
in scheme: Droit et Justice
in scheme: Documentation Juridique
in scheme: Sources du Droit
notation: REFIP3086

bénéfice mondial consolide (supprimé)
type: ConceptReFip
type: Concept
broader: ZZ
in scheme: FINANCES PUBLIQUES
notation: REFIP309

application FLR
type: ConceptReFip
type: Concept
broader: applications fiscales (non-descripteur)
definition: Module de l'application ILIAD utilisé dans les tâches de la mission de contrôle sur pièces des particuliers (programmation - gestion et suivi).
in scheme: FINANCES PUBLIQUES
in scheme: Applications Informatiques
in scheme: Applications fiscales
notation: REFIP3090

force exécutoire
type: ConceptReFip
type: Concept
broader: procédure civile
definition: Effet attaché aux décisions judiciaires, qu’elles soient juridictionnelles ou gracieuses, aux actes des notaires, à certains actes de l’Administration, qui permet de pratiquer une saisie contre le débiteur, ou d’expulser un occupant d’un local, en recourant, s’il le faut, à la force publique.
in scheme: FINANCES PUBLIQUES
in scheme: Procédure Civile
in scheme: Droit et Justice
in scheme: Procédure
notation: REFIP3094

application SCR3
type: ConceptReFip
type: Concept
alternative label: SCR3
broader: applications gestion publique (non-descripteur)
definition: Interface permettant la centralisation de la comptabilité des postes non centralisateurs de la DGFiP dans CHORUS.
in scheme: FINANCES PUBLIQUES
in scheme: Applications Informatiques
in scheme: Applications gestion publique
notation: REFIP3095

visa
type: ConceptReFip
type: Concept
alternative label: refus de visa
broader: mots outils (liste additive)
definition: Signature, formule, sceau ou paraphe apposé(e) sur un document pour le rendre régulier ou valable ou attester le paiement d'un droit ; acte sur lequel cette mention est apposée.
in scheme: FINANCES PUBLIQUES
in scheme: Mots Outils
notation: REFIP3096

région
type: ConceptReFip
type: Concept
broader: collectivité territoriale
definition: Structure la plus récente de l'administration locale française, la région est une collectivité territoriale. Les compétences propres de la région concernent principalement l'aménagement du territoire, le développement économique, la formation professionnelle, la construction ou l'entretien des lycées, les transports ferroviaires de voyageurs.
in scheme: FINANCES PUBLIQUES
in scheme: Organisation Territoriale
in scheme: Structures Territoriales
in scheme: Administration de L'Etat
narrower: conseil régional
narrower: préfet de région
notation: REFIP3097

saisie immobilière
type: ConceptReFip
type: Concept
broader: saisie
definition: Procédure d'exécution forcée permettant à l'administration fiscale de saisir un bien immobilier appartenant à son débiteur.
in scheme: FINANCES PUBLIQUES
in scheme: Recouvrement
in scheme: Fiscalité
notation: REFIP3099

droit des obligations et contrats (non-descripteur)
type: ConceptReFip
type: Concept
broader: droit privé
definition: Terme ne servant pas à l'indexation.
in scheme: FINANCES PUBLIQUES
in scheme: Droit et Justice
in scheme: Divisions du Droit
in scheme: Droit Privé
narrower: vente
narrower: tiers
narrower: clause attributive de compétence
narrower: ordre entre créanciers
narrower: garanties
narrower: reconnaissance de dettes
narrower: force majeure
narrower: protocole d'accord
narrower: tontine
narrower: mandat de représentation
narrower: convention
narrower: vice de construction
narrower: contrat
narrower: fiducie
narrower: vice caché
narrower: reconduction
narrower: avenant
narrower: clause d'accroissement
narrower: compensation légale
narrower: responsabilité solidaire
narrower: arrérages
narrower: remise de dettes
narrower: clause compromissoire
narrower: clause de réserve de propriété
narrower: location-gérance
narrower: pacte d'actionnaires
narrower: arrhes
narrower: co-titulaire
narrower: échange
narrower: location-vente
narrower: refip-REFIP692
narrower: refip-REFIP7148
narrower: refip-REFIP95
notation: REFIP31
note: Étiquette de noeud.

exploitation forestière
type: ConceptReFip
type: Concept
alternative label: propriété forestière
broader: agriculture
definition: Transformation et valorisation de la production forestière, comprenant l’ensemble des opérations techniques et commerciales permettant la récolte des bois.
in scheme: FINANCES PUBLIQUES
in scheme: Branche d'activité
in scheme: Questions Economiques
in scheme: Agriculture
narrower: bois
narrower: affouage
narrower: coupe de bois
notation: REFIP3100
related: refip-REFIP6925

redressement fiscal
type: ConceptReFip
type: Concept
broader: droit de reprise de l'administration
definition: Rectification d'une déclaration fiscale lorsque l'administration constate des insuffisances, inexactitudes ou omissions dans les éléments déclarés, La notification de redressement a été remplacée par la proposition de rectification.
in scheme: FINANCES PUBLIQUES
in scheme: Droit de Reprise de l'Administration
in scheme: Fiscalité
notation: REFIP3102

Cantal
type: ConceptReFip
type: Concept
broader: Auvergne-Rhône-Alpes
definition: Département français
in scheme: FINANCES PUBLIQUES
in scheme: Géographie
in scheme: Europe
notation: REFIP3103

centre de coût
type: ConceptReFip
type: Concept
broader: CHORUS (non-descripteur)
definition: Structure, placée sous l'autorité du ministre chargé de l'économie, au sein de laquelle sont effectués les flux de gestion. Elle est gérée, pour le compte de l'Etat, par un établissement de crédit.
in scheme: FINANCES PUBLIQUES
in scheme: Comptabilité publique
in scheme: Comptabilité
notation: REFIP3104

autorité administrative
type: ConceptReFip
type: Concept
broader: organisation structurelle de l'Etat (non-descripteur)
definition: Toute personne ou structure publique disposant d'un pouvoir de décision en matière administrative comme notamment, les administrations de l’État, les collectivités territoriales, les établissements publics à caractère administratif, les organismes gérant des régimes de protection sociale.
in scheme: FINANCES PUBLIQUES
in scheme: Organisation Structurelle de l'Etat
in scheme: Autorité Administrative
in scheme: Administration de L'Etat
narrower: Autorité publique indépendante
narrower: autorité administrative indépendante
notation: REFIP3106

commission d'aménagement foncier (supprimé)
type: ConceptReFip
type: Concept
broader: ZZ
in scheme: FINANCES PUBLIQUES
notation: REFIP3107

Electricité de France
type: ConceptReFip
type: Concept
alternative label: EDF
alternative label: ERDF
alternative label: électricité réseau distribution France
broader: organisme privé assurant service public (non-descripteur)
definition: Société anonyme à capitaux principalement publics. EDF est spécialisé dans l'ensemble du processus de production et de distribution de l'électricité, de la conception des centrales électriques à la distribution aux particuliers.
in scheme: FINANCES PUBLIQUES
in scheme: Organisation Structurelle de l'Etat
in scheme: Organisme Privé Assurant Service Public
in scheme: Administration de L'Etat
notation: REFIP3108

déclaration du patrimoine (supprimé)
type: ConceptReFip
type: Concept
in scheme: FINANCES PUBLIQUES
notation: REFIP3109

société commerciale
type: ConceptReFip
type: Concept
broader: société
definition: Personnalité morale immatriculée au Registre du commerce et des sociétés et créée autour de personnes ou de capitaux. Le droit français connaît au nombre des sociétés commerciales, principalement la SA, la SARL, l'EURL, l'EARL, la SAS, la SNC, la SCS, la SCA et la Société Européenne.
in scheme: FINANCES PUBLIQUES
in scheme: Société
in scheme: Entreprises
in scheme: Forme juridique
narrower: société immobilière pour le commerce et l'industrie
narrower: société de capitaux
narrower: société de personnes
notation: REFIP311

continuité du service public
type: ConceptReFip
type: Concept
broader: droit administratif
definition: Principe fondamental de la notion de service public en droit administratif qui permet d'assurer le fonctionnement régulier des services publics d'intérêt général.
in scheme: FINANCES PUBLIQUES
in scheme: Droit et Justice
in scheme: Divisions du Droit
in scheme: Droit Public
notation: REFIP3110
related: refip-REFIP6818

centre de formalités des entreprises
type: ConceptReFip
type: Concept
broader: vie de l'entreprise (non-descripteur)
definition: Centre destiné à permettre aux entreprises de souscrire en un même lieu et dans un même document, les déclarations auxquelles elles sont tenues par les lois et les règlements dans les domaines juridique, administratif, fiscal, social et statistique, lors de leur création, de la modification de leur situation, ou en cas de cessation de leur activité.
in scheme: FINANCES PUBLIQUES
in scheme: Vie de l'Entreprise
in scheme: Entreprises
in scheme: Vie et Gestion de l'entreprise
notation: REFIP3111

application OHIO
type: ConceptReFip
type: Concept
alternative label: OHIO
alternative label: outil d'analyse des hôpitaux prospectif
broader: applications gestion publique (non-descripteur)
definition: Outil permettant la réalisation d'analyse financière prospective pour les établissements publics de santé.
in scheme: FINANCES PUBLIQUES
in scheme: Applications Informatiques
in scheme: Applications gestion publique
notation: REFIP3112

fiscalité des professionnels
type: ConceptReFip
type: Concept
alternative label: fiscalité des entreprises
alternative label: fiscalité professionnelle
broader: champ d'application
definition: Dispositions relatives à l'imposition des sociétés, des professionnels (notamment BIC, BNC, BA) ainsi qu'aux taxes liées à l'activité des entreprises (taxe sur les salaires, TVA etc.).
in scheme: FINANCES PUBLIQUES
in scheme: Champ d'Application
in scheme: Fiscalité
narrower: bien d'occasion
narrower: livraison à soi-même
narrower: livraison intra-communautaire
narrower: prix de transfert
narrower: cadeau
narrower: prestation de service
narrower: domiciliation fiscale
narrower: activité lucrative
narrower: produit des jeux
narrower: activité non professionnelle
narrower: bien professionnel
narrower: assujettissement
narrower: refip-REFIP7091
narrower: refip-REFIP881
narrower: refip-REFIP969
notation: REFIP3113

transfert comptable
type: ConceptReFip
type: Concept
broader: procédures et techniques comptables (non-descripteur)
definition: Opération visant à transférer sa comptabilité vers celle d'un autre comptable, ou à procéder à un transfert d'un compte vers un autre, dans le cadre de ses opérations de gestion, de régularisation ou de fin de gestion.
in scheme: FINANCES PUBLIQUES
in scheme: Procédures et Techniques Comptables
in scheme: Comptabilité
notation: REFIP3114

insertion professionnelle
type: ConceptReFip
type: Concept
alternative label: réinsertion professionnelle
broader: refip-REFIP6950
definition: Processus qui permet à un individu, ou à un groupe d'individus, d'entrer sur le marché du travail dans des conditions favorables à l'obtention d'un emploi. Les postulants à la recherche d'un emploi doivent réunir les ressources nécessaires à leur insertion professionnelle sous la forme de savoirs, de savoir-faire, voire de capitaux financiers dans le cas d'une création d'entreprise.
in scheme: FINANCES PUBLIQUES
in scheme: Entreprises
in scheme: Travail
in scheme: 212619
narrower: formation en milieu professionnel
narrower: certificat de qualification professionnelle
narrower: période de mise en situation en milieu professionnel
notation: REFIP3116
related: contrat aide

Bulletin officiel des annonces civiles et commerciales
type: ConceptReFip
type: Concept
alternative label: BODACC
broader: bulletin officiel
definition: Publication officielle qui assure la publicité des actes enregistrés au Registre du commerce et des sociétés (RCS), de l'immatriculation à la radiation, des procédures collectives et des avis de dépôt des comptes des entreprises.
in scheme: FINANCES PUBLIQUES
in scheme: Documentation
in scheme: Communication Documentation Informatique
notation: REFIP3118
related: annonce légale

Ministère de l'Economie de l'Industrie et de l'Emploi (obsolète)
type: ConceptReFip
type: Concept
is replaced by: Ministère de l'Economie et des Finances
broader: ZZ
in scheme: FINANCES PUBLIQUES
notation: REFIP3119

dérogation
type: ConceptReFip
type: Concept
broader: droit général (non-descripteur)
definition: Dispense, au sens large, fait de déroger à une loi, à une convention, à une règle.
in scheme: FINANCES PUBLIQUES
in scheme: Droit et Justice
in scheme: Droit Général
notation: REFIP312

comptabilité supersimplifiée
type: ConceptReFip
type: Concept
broader: comptabilité générale
definition: Système offert aux entreprises sous conditions, qui dispense, en cours d'exercice, de la tenue d'une comptabilité complète de créances et de dettes. Cette comptabilité n'enregistre journellement que le détail des encaissements et des paiements. Les créances et les dettes sont constatées à la clôture de l'exercice sauf en ce qui concerne les dépenses relatives aux frais généraux, qui sont payées à échéances régulières et dont la périodicité n'excède pas un an; les stocks et les travaux en cours peuvent être évalués selon une méthode simplifiée définie par un arrêté du ministre chargé du budget.
in scheme: FINANCES PUBLIQUES
in scheme: Comptabilité générale
in scheme: Comptabilité
notation: REFIP3120

société immobilière pour le commerce et l'industrie
type: ConceptReFip
type: Concept
alternative label: SICOMI
broader: société commerciale
definition: Société ayant pour vocation de construire et de louer des biens immobiliers non équipés destinés à un usage professionnel (locaux industriels, bureaux, boutiques, etc.).
in scheme: FINANCES PUBLIQUES
in scheme: Société
in scheme: Entreprises
in scheme: Forme juridique
notation: REFIP3121

prix de revient
type: ConceptReFip
type: Concept
alternative label: coût de revient
broader: facturation
definition: Somme de tous les coûts supportés pour la production et la distribution d'un produit ou d'un service.
in scheme: FINANCES PUBLIQUES
in scheme: Procédures et Techniques Comptables
in scheme: Comptabilité
notation: REFIP3122

îles Cook
type: ConceptReFip
type: Concept
broader: refip-REFIP78
definition: Pays
in scheme: FINANCES PUBLIQUES
in scheme: Géographie
in scheme: Océanie
notation: REFIP3123

plan de comptes de l'Etat cible
type: ConceptReFip
type: Concept
alternative label: PCE cible
alternative label: plan comptable de l'Etat cible
alternative label: plan de comptes cible
broader: CHORUS (non-descripteur)
definition: Plan comptable de l’État intégré dans CHORUS.
in scheme: FINANCES PUBLIQUES
in scheme: Comptabilité publique
in scheme: Comptabilité
notation: REFIP3124
scope note: Chorus

droit de stationnement
type: ConceptReFip
type: Concept
broader: autres taxes, droits ou redevances (non-descripteur)
definition: Droits acquittés pour le stationnement.
in scheme: FINANCES PUBLIQUES
in scheme: Fiscalité
in scheme: Impôt
notation: REFIP3125

Centre-Val de Loire
type: ConceptReFip
type: Concept
broader: France métropolitaine
definition: Région française dont le chef-lieu est Orléans.
in scheme: FINANCES PUBLIQUES
in scheme: Géographie
in scheme: Europe
narrower: Loiret
narrower: Loir-et-Cher
narrower: Cher
narrower: Indre
narrower: refip-REFIP68
narrower: refip-REFIP857
notation: REFIP3126

Ministère de l'Economie des Finances et de l'Industrie (obsolète)
type: ConceptReFip
type: Concept
is replaced by: Ministère de l'Economie et des Finances
broader: ZZ
in scheme: FINANCES PUBLIQUES
notation: REFIP3127

îles Caimans
type: ConceptReFip
type: Concept
broader: Caraïbes
definition: Territoire du Royaume Uni
in scheme: FINANCES PUBLIQUES
in scheme: Géographie
in scheme: Amérique
notation: REFIP3129
related: Grande-Bretagne

cellule qualité comptable
type: ConceptReFip
type: Concept
broader: direction départementale des finances publiques
definition: Structure chargée d'assurer le pilotage de la fonction comptable de l’Etat dans le département et la garantie de la qualité des comptes de l’État et de la qualité bancaire.
in scheme: FINANCES PUBLIQUES
in scheme: Organisation Structurelle de l'Etat
in scheme: Ministère
in scheme: Administration de L'Etat
notation: REFIP313

loi-cadre
type: ConceptReFip
type: Concept
broader: loi
definition: Loi qui pose des principes généraux, définit un programme et fixe des objectifs et des engagements. Le gouvernement les développe en utilisant son pouvoir réglementaire.
in scheme: FINANCES PUBLIQUES
in scheme: Droit et Justice
in scheme: Sources du Droit
in scheme: Sources du Droit Objectif
notation: REFIP3130

pollution
type: ConceptReFip
type: Concept
alternative label: émission polluante
broader: dégradation de l'environnement
definition: Dégradations d'un milieu naturel par des substances extérieures, introduites de manière directe ou indirecte par les activités humaines.
in scheme: FINANCES PUBLIQUES
in scheme: Environnement
in scheme: Dégradation de l'Environnement
in scheme: Questions de Société
narrower: amiante
narrower: gaz à effet de serre
narrower: nuisance
notation: REFIP3132

droit des sociétés
type: ConceptReFip
type: Concept
broader: droit commercial
definition: Branche du droit privé qui étudie les sociétés civiles et commerciales. Les règles du droit des sociétés prévoient l'ensemble des dispositions nécessaires à la création, au fonctionnement ainsi qu'à l'éventuelle liquidation de la société.
in scheme: FINANCES PUBLIQUES
in scheme: Droit et Justice
in scheme: Divisions du Droit
in scheme: Droit Privé
narrower: siège social
narrower: statuts
narrower: droits sociaux
notation: REFIP3133

Deux-Sèvres
type: ConceptReFip
type: Concept
broader: refip-REFIP7020
definition: Département français
in scheme: FINANCES PUBLIQUES
in scheme: Géographie
in scheme: Europe
notation: REFIP3134

foyer fiscal
type: ConceptReFip
type: Concept
alternative label: imposition par foyer fiscal
broader: fiscalité des particuliers
definition: Règle de l'imposition des revenus des particuliers par foyer fiscal, c'est-à-dire par la globalisation des revenus d'une même famille qui comprend : les revenus personnels du contribuable, de son conjoint le cas échéant et de leurs personnes à charge (enfants mineurs ou infirmes, enfants majeurs rattachés, personnes invalides possédant une carte d'invalidité et vivant sous le même toit).
in scheme: FINANCES PUBLIQUES
in scheme: Champ d'Application
in scheme: Fiscalité
narrower: contribuable
narrower: imposition commune
narrower: imposition distincte
narrower: personne à charge
notation: REFIP3135

contrôle fiscal international
type: ConceptReFip
type: Concept
broader: contrôle fiscal
definition: Contrôle des opérations internationales afin de lutter contre la fraude ou l'évasion fiscale internationale.
in scheme: FINANCES PUBLIQUES
in scheme: Droit de Contrôle de l'Administration
in scheme: Fiscalité
narrower: contrôle multilatéral international
notation: REFIP3136

magistrat
type: ConceptReFip
type: Concept
broader: magistrature
definition: Fonctionnaire du ministère de la justice. Le magistrat du siège est juge. Le magistrat du parquet est procureur.
in scheme: FINANCES PUBLIQUES
in scheme: Profession Juridique
in scheme: Droit et Justice
in scheme: Organisation Juridictionnelle
narrower: Procureur de la République
narrower: juge du fond
narrower: rapporteur public
narrower: juge administratif
narrower: juge des comptes
narrower: juge des référés
narrower: juge judiciaire
narrower: refip-REFIP846
notation: REFIP3137

transparence fiscale
type: ConceptReFip
type: Concept
broader: fiscalité
definition: Fait pour une société d'être considérée comme fiscalement inexistante pour l'application des impôts directs, des droits d'enregistrements et des taxes assimilées notamment.
in scheme: FINANCES PUBLIQUES
in scheme: Fiscalité - Autres notions
in scheme: Fiscalité
notation: REFIP3138

frais de gestion
type: ConceptReFip
type: Concept
broader: frais de fonctionnement
definition: Frais perçus par l'Etat sur les taxes et prélèvements additionnels aux impôts fonciers qu'il recouvre au profit des collectivités locales et organismes divers, en contrepartie des frais de dégrèvement et de non-valeurs qu'il prend à sa charge.
in scheme: FINANCES PUBLIQUES
in scheme: Dépenses publiques
in scheme: Gestion Publique
notation: REFIP3139

ordinateur portable
type: ConceptReFip
type: Concept
broader: refip-REFIP757
definition: Ordinateur qui, grâce à un poids et un encombrement limités, peut être transporté facilement.
in scheme: FINANCES PUBLIQUES
in scheme: Informatique
in scheme: Communication Documentation Informatique
notation: REFIP3141

signification d'acte
type: ConceptReFip
type: Concept
broader: principes généraux (non-descripteur)
definition: Formalité par laquelle un plaideur porte à la connaissance de son adversaire un acte de procédure (assignation, conclusions) ou un jugement. Elle est toujours effectuée par un huissier de justice.
in scheme: FINANCES PUBLIQUES
in scheme: Principes Généraux
in scheme: Droit et Justice
in scheme: Procédure
narrower: refip-REFIP7081
notation: REFIP3142

plan d'action topographique départemental
type: ConceptReFip
type: Concept
alternative label: PATD
broader: cadastre
definition: Plan triennal élaboré en accord avec les orientations nationales et en réponse aux besoins exprimés par les usagers au niveau départemental, il fixe les orientations de travail et le programme d'intervention des différents acteurs topographiques du département.
in scheme: FINANCES PUBLIQUES
in scheme: Cadastre
in scheme: Fiscalité
notation: REFIP3143

guichet fiscal unique
type: ConceptReFip
type: Concept
alternative label: GFU
alternative label: guichet fiscal unifié
broader: qualité de service
definition: Dispositif permettant aux contribuables particuliers d'obtenir des réponses à leurs demandes, qu’elles concernent l’assiette ou le recouvrement de l’impôt, quel que soit le service auquel ils s’adressent.
in scheme: FINANCES PUBLIQUES
in scheme: Missions Transverses des Finances publiques
in scheme: Qualité de service
narrower: accueil fiscal de proximité
narrower: refip-REFIP7239
notation: REFIP3144

protection fonctionnelle
type: ConceptReFip
type: Concept
alternative label: protection du fonctionnaire
broader: droits du fonctionnaire
definition: Droit dont bénéficie l'agent s'il est victime d'une infraction à l'occasion ou en raison de ses fonctions. L'administration doit protéger l'agent, lui apporter une assistance juridique et réparer les préjudices qu'il a subis. La demande de protection doit être formulée par écrit à ses supérieurs hiérarchiques.
in scheme: FINANCES PUBLIQUES
in scheme: Gestion des ressources humaines
in scheme: Statut du fonctionnaire
in scheme: Fonction Publique et Gestion des Ressources Humaines
narrower: action en réparation civile de l'Etat
narrower: refip-REFIP6893
notation: REFIP3145

immeuble par destination
type: ConceptReFip
type: Concept
broader: immeuble
definition: Meuble que la loi répute immeuble parce qu'il est, par volonté de son propriétaire, soit affecté au service et à l'exploitation d'un immeuble, soit attaché à ce dernier à perpétuelle demeure.
in scheme: FINANCES PUBLIQUES
in scheme: Droit et Justice
in scheme: Divisions du Droit
in scheme: Droit Privé
notation: REFIP3146

Défenseur des droits
type: ConceptReFip
type: Concept
alternative label: Commission nationale de déontologie de la sécurité
alternative label: HALDE
alternative label: Haute autorité de lutte contre les discriminations et pour l'égalité
alternative label: Médiateur de la République
broader: autorité administrative indépendante
definition: Autorité constitutionnelle indépendante regroupant les missions du Médiateur de la République, du Défenseur des enfants, de la Haute Autorité de Lutte contre les Discriminations et pour l’Égalité et de la Commission Nationale de Déontologie de la Sécurité (CNDS). Il défend les droits et libertés individuels dans le cadre des relations avec les administrations ; défend et promeut l’intérêt supérieur et les droits de l’enfant ; lutte contre les discriminations prohibées par la loi et promeut l’égalité et veille au respect de la déontologie par les personnes exerçant des activités de sécurité.
in scheme: FINANCES PUBLIQUES
in scheme: Organisation Structurelle de l'Etat
in scheme: Autorité Administrative
in scheme: Administration de L'Etat
notation: REFIP3147

bail à convenant
type: ConceptReFip
type: Concept
alternative label: bail à domaine congéable
alternative label: domaine congéable
broader: bail rural
definition: Contrat par lequel le propriétaire d'un fonds rural en concède la jouissance pour une durée déterminée, moyennant une redevance annuelle, à une autre personne au profit de laquelle sont aliénés tous les édifices et superficies existants ou à établir sur ce fonds, avec réserve pour ledit propriétaire de congédier le preneur à charge d'indemniser celui-ci de la valeur de ces édifices et superficies.
in scheme: FINANCES PUBLIQUES
in scheme: Droit et Justice
in scheme: Divisions du Droit
in scheme: Droit Privé
notation: REFIP3148

application COGNOS
type: ConceptReFip
type: Concept
alternative label: COGNOS
broader: applications fiscales (non-descripteur)
definition: Outil d’interrogation multicritères, qui associé à l’application Erica 3, permet d’obtenir des listes d’affaires répondant aux critères définis par l’utilisateur ; des comptages d’affaires dont les caractéristiques sont définies par l’utilisateur ; l’exportation au format CSV des résultats obtenus par les critères de sélection définis par l’utilisateur.
in scheme: FINANCES PUBLIQUES
in scheme: Applications Informatiques
in scheme: Applications fiscales
notation: REFIP3149

frais professionnels
type: ConceptReFip
type: Concept
broader: frais déductibles
definition: Charges de caractère spécial inhérentes à la fonction ou à l’emploi du salarié, que celui-ci supporte au titre de l’accomplissement de son travail.
in scheme: FINANCES PUBLIQUES
in scheme: Liquidation de l'Impôt
in scheme: Fiscalité
notation: REFIP315

empêchement à poursuites
type: ConceptReFip
type: Concept
broader: poursuites
definition: Veto automatique ou sur l'initiative du comptable à l'édition automatique d'un acte de relance ou de poursuite.
in scheme: FINANCES PUBLIQUES
in scheme: Recouvrement
in scheme: Fiscalité
notation: REFIP3150

compte spécial du Trésor
type: ConceptReFip
type: Concept
broader: compte d'affectation spéciale
definition: État retraçant des dépenses et des recettes de l’État entre lesquelles on veut établir un lien, soit que l’on veuille affecter certaines recettes à la couverture de certaines dépenses (compte d’affectation spéciale) soit que l’on veuille faire apparaître une sorte de bilan entre des opérations qui sont en étroite corrélation (compte de prêts, par exemple).
in scheme: FINANCES PUBLIQUES
in scheme: Élaboration du budget
in scheme: Budget
narrower: Fonds de développement économique et social
narrower: Fonds forestier national
notation: REFIP3152

Lorraine (obsolète)
type: ConceptReFip
type: Concept
is replaced by: refip-REFIP7009
broader: ZZ
in scheme: FINANCES PUBLIQUES
notation: REFIP3153

arrêté municipal
type: ConceptReFip
type: Concept
broader: législation
definition: Décision administrative unilatérale et exécutoire prise par le maire, ou, en son nom, par un maire-adjoint, un conseiller municipal ou certains hauts fonctionnaires municipaux ayant reçu une délégation de signature à cet effet.
in scheme: FINANCES PUBLIQUES
in scheme: Droit et Justice
in scheme: Sources du Droit
in scheme: Sources du Droit Objectif
notation: REFIP3154

Cour européenne des droits de l'homme
type: ConceptReFip
type: Concept
alternative label: CEDH
alternative label: Cour de Strasbourg
broader: juridiction
definition: Juridiction assurant le contrôle du respect de la Convention européenne de sauvegarde des droits de l'Homme et des libertés fondamentales.
in scheme: FINANCES PUBLIQUES
in scheme: Droit et Justice
in scheme: Juridiction
in scheme: Organisation Juridictionnelle
notation: REFIP3155

énergie solaire photovoltaïque
type: ConceptReFip
type: Concept
alternative label: énergie photovoltaïque
alternative label: énergie solaire
broader: énergie renouvelable
definition: Énergie obtenue en convertissant une partie de l'énergie du rayonnement solaire en électricité par le biais d'installations photovoltaïques. Il s'agit d'une énergie renouvelable.
in scheme: FINANCES PUBLIQUES
in scheme: Branche d'activité
in scheme: Questions Economiques
in scheme: Industrie
notation: REFIP3157

application BACO
type: ConceptReFip
type: Concept
alternative label: BACO
alternative label: base de connaissances
broader: applications fiscales (non-descripteur)
definition: Outil d’aide à la réponse aux usagers. Il contient, sous forme de fiches, une documentation rédigée par les agents des Centres Impôts Service visant à apporter des réponses homogènes aux questions générales des usagers posées par téléphone et par courriel.
in scheme: FINANCES PUBLIQUES
in scheme: Applications Informatiques
in scheme: Applications fiscales
notation: REFIP3158

programme COPERNIC
type: ConceptReFip
type: Concept
alternative label: application COPERNIC
broader: applications fiscales (non-descripteur)
definition: Service à compétence nationale chargé de la maîtrise d'ouvrage des différents projets et référentiels de la DGFiP.
in scheme: FINANCES PUBLIQUES
in scheme: Applications Informatiques
in scheme: Applications fiscales
notation: REFIP316

direction locale des finances publiques
type: ConceptReFip
type: Concept
broader: services déconcentrés des finances publiques
definition: Service déconcentré de la DGFIP, les directions locales des finances publiques assurent, dans les collectivités d'outre-mer et en Nouvelle-Calédonie, la mise en œuvre des missions des DDFIP et DRFIP, sous réserve des compétences dévolues à ces collectivités et à la Nouvelle-Calédonie.
in scheme: FINANCES PUBLIQUES
in scheme: Organisation Structurelle de l'Etat
in scheme: Ministère
in scheme: Administration de L'Etat
notation: REFIP3160

siège social
type: ConceptReFip
type: Concept
broader: droit des sociétés
definition: Domicile juridique et centre législatif de l'entreprise.
in scheme: FINANCES PUBLIQUES
in scheme: Droit et Justice
in scheme: Divisions du Droit
in scheme: Droit Privé
notation: REFIP3161

domiciliation fiscale
type: ConceptReFip
type: Concept
alternative label: domiciliation commerciale
alternative label: domiciliation des entreprises
broader: fiscalité des professionnels
definition: Élection de domicile du siège social d'une société qui n'a pas de bureaux, dans les locaux d'une société de domiciliation, moyennant un coût mensuel.
in scheme: FINANCES PUBLIQUES
in scheme: Champ d'Application
in scheme: Fiscalité
notation: REFIP3162

compte administratif
type: ConceptReFip
type: Concept
broader: finances locales (non-descripteur)
definition: L'ordonnateur rend compte annuellement des opérations budgétaires qu’il a exécutées. A la clôture de l’exercice budgétaire, qui intervient au 31 janvier de l’année N+1, il établit le compte administratif du budget principal ainsi que les comptes administratifs correspondant aux différents budgets annexes. Le compte administratif rapproche les prévisions ou autorisations inscrites au budget (au niveau du chapitre ou de l’article selon les dispositions arrêtées lors du vote du budget primitif) des réalisations effectives en dépenses (mandats) et en recettes (titres) ; présente les résultats comptables de l’exercice; est soumis par l'ordonnateur, pour approbation, à l’assemblée délibérante qui l’arrête définitivement par un vote avant le 30 juin de l’année qui suit la clôture de l’exercice.
in scheme: FINANCES PUBLIQUES
in scheme: Secteur public local
in scheme: Gestion Publique
notation: REFIP3164

entreprise
type: ConceptReFip
type: Concept
alternative label: entreprise privée
broader: forme juridique
definition: Unité économique autonome organisée pour la mise en oeuvre d'un ensemble de facteurs de production, en vue de produire des biens ou services pour le marché. C'est une notion avant tout économique et sociale
in scheme: FINANCES PUBLIQUES
in scheme: Entreprise
in scheme: Entreprises
in scheme: Forme juridique
narrower: auto-entrepreneur
narrower: entreprise industrielle
narrower: entreprise artisanale
narrower: entrepreneur individuel à responsabilité limitée
narrower: entreprise nouvelle
narrower: grande entreprise
narrower: groupe d'entreprises
narrower: refip-REFIP6660
narrower: refip-REFIP6704
narrower: refip-REFIP7222
narrower: refip-REFIP7238
notation: REFIP3165

marché de prestations intellectuelles
type: ConceptReFip
type: Concept
alternative label: marché d'études
broader: marché de services
definition: Marché de services qui comportent nécessairement des obligations spécifiques significatives liées à la notion de propriété intellectuelle.
in scheme: FINANCES PUBLIQUES
in scheme: Commande publique
in scheme: Gestion Publique
narrower: convention de recherche
notation: REFIP3167

comité d'hygiène et de sécurité et des conditions de travail
type: ConceptReFip
type: Concept
alternative label: CHSCT
alternative label: comité d'hygiène et sécurité
alternative label: comité hygiène et sécurité
broader: organisme consultatif et représentatif (non-descripteur)
definition: Instance de concertation chargée de contribuer à la protection de la santé physique et mentale et de la sécurité des agents dans leur travail. Elle a pour mission de participer à l'amélioration des conditions de travail et de veiller à la mise en œuvre, par les chefs de service ou d’établissement, des prescriptions du code du travail relatives à la santé et la sécurité au travail qui sont applicables à la fonction publique.
in scheme: FINANCES PUBLIQUES
in scheme: Organisation Structurelle de l'Etat
in scheme: Organisme Consultatif et Représentatif
in scheme: Administration de L'Etat
notation: REFIP3169

immobilisation incorporelle
type: ConceptReFip
type: Concept
alternative label: actif incorporel
broader: immobilisation
definition: Actifs non monétaires identifiables et sans substance physique contrôlés par une entité et dont l'utilisation s'étend sur plus d'un exercice.
in scheme: FINANCES PUBLIQUES
in scheme: Documents comptables
in scheme: Comptabilité
notation: REFIP317
related: actif immatériel

saisine
type: ConceptReFip
type: Concept
broader: procédure civile
definition: C'est la formalité par laquelle un plaideur porte son différend devant une juridiction afin que celle-ci examine la recevabilité et le caractère fondé de ses prétentions.
in scheme: FINANCES PUBLIQUES
in scheme: Procédure Civile
in scheme: Droit et Justice
in scheme: Procédure
notation: REFIP3170

publication interne
type: ConceptReFip
type: Concept
alternative label: journal interne
alternative label: presse interne
broader: publication
definition: Document rendu public au sein d'une organisation.
in scheme: FINANCES PUBLIQUES
in scheme: Communication
in scheme: Communication Documentation Informatique
notation: REFIP3171

extrait d'acte
type: ConceptReFip
type: Concept
broader: document administratif
definition: Copie officielle d'une partie d'un acte authentique.
in scheme: FINANCES PUBLIQUES
in scheme: Documentation
in scheme: Communication Documentation Informatique
notation: REFIP3172

indemnisation
type: ConceptReFip
type: Concept
alternative label: dédommagement
broader: réparation du préjudice
definition: Détermination d'une indemnité afin de dédommager la victime d'un sinistre de manière à ce que sa situation soit la même qu'avant d'avoir subi les dommages.
in scheme: FINANCES PUBLIQUES
in scheme: Droit et Justice
in scheme: Divisions du Droit
in scheme: Droit Privé
narrower: dommages et intérêts
notation: REFIP3173

droit de pêche
type: ConceptReFip
type: Concept
broader: droit de propriété
definition: Droit de rechercher et capturer les animaux vivant dans l'eau appartenant à l'État (dans les fleuves, rivières ou canaux domaniaux) et aux propriétaires riverains (dans les cours d'eau non domaniaux),
in scheme: FINANCES PUBLIQUES
in scheme: Droit et Justice
in scheme: Divisions du Droit
in scheme: Droit Privé
notation: REFIP3175

remise de service
type: ConceptReFip
type: Concept
broader: responsabilité des comptables
definition: Formalité indispensable au transfert de responsabilité personnelle et pécuniaire entre les comptables publics sortant et entrant. Le comptable entrant est responsable des opérations du poste dès son installation, sauf de celles pour lesquelles il a émis des réserves écrites, précises et motivées.
in scheme: FINANCES PUBLIQUES
in scheme: Responsabilité des comptables
in scheme: Missions Transverses des Finances publiques
narrower: réserves du comptable
notation: REFIP3176

schéma des poursuites
type: ConceptReFip
type: Concept
broader: poursuites
definition: Chaîne des poursuites pour les amendes et condamnations pécuniaires.
in scheme: FINANCES PUBLIQUES
in scheme: Recouvrement
in scheme: Fiscalité
notation: REFIP3177

application BNTP
type: ConceptReFip
type: Concept
alternative label: BNTP
alternative label: base nationale de taxe professionnelle
broader: applications fiscales (non-descripteur)
definition: Application qui permettait de visualiser le détail des impositions (taxe foncière et Cotisation foncière des entreprises ) par entreprise et par établissement, et d’effectuer des recoupements sur la valeur ajoutée produite par l’entreprise.
in scheme: FINANCES PUBLIQUES
in scheme: Applications Informatiques
in scheme: Applications fiscales
notation: REFIP3179

activité lucrative
type: ConceptReFip
type: Concept
alternative label: activité non lucrative
alternative label: activité sans but lucratif
alternative label: lucrativité
broader: fiscalité des professionnels
definition: Activité exercée en concurrence avec une entreprise du secteur lucratif, ou activité qui révèle l'entretien de relations privilégiées avec cette même entreprise, ou activité exercée au seul profit de cette dernière.
in scheme: FINANCES PUBLIQUES
in scheme: Champ d'Application
in scheme: Fiscalité
notation: REFIP318

impôt direct
type: ConceptReFip
type: Concept
broader: impôt
definition: Impôt payé et supporté par la même personne.
in scheme: FINANCES PUBLIQUES
in scheme: Fiscalité
in scheme: Impôt
narrower: imposition forfaitaire annuelle
narrower: impôt de solidarité sur la fortune
narrower: impôt sur le revenu
narrower: prélèvements sociaux
narrower: impôt direct local
narrower: contribution sociale de solidarité des sociétés
narrower: contribution sociale libératoire sur les distributions et gains nets des dirigeants de sociétés
narrower: impôt sur les sociétés
narrower: contribution sur les revenus locatifs
narrower: taxe d'expatriation
narrower: contribution sociale sur l'impôt sur les sociétés
narrower: contribution exceptionnelle sur la fortune
narrower: refip-REFIP7096
notation: REFIP3180

marché public
type: ConceptReFip
type: Concept
broader: commande publique
definition: Contrat conclu par un ou plusieurs acheteurs avec un ou plusieurs opérateurs économiques, pour répondre à leurs besoins en matière de travaux, de fournitures ou de services, en contrepartie d'un prix ou de tout équivalent.
in scheme: FINANCES PUBLIQUES
in scheme: Commande publique
in scheme: Gestion Publique
narrower: cahier des charges
narrower: marché alloti
narrower: groupement de commandes
narrower: marché de fournitures
narrower: maîtrise d'oeuvre
narrower: plate-forme des achats de l'Etat
narrower: étude de marché
narrower: marché complémentaire
narrower: marché négocié
narrower: marché de services
narrower: exécution d'un marché public
narrower: marché fractionné
narrower: groupe d'étude des marchés
narrower: marché de maîtrise d'oeuvre
narrower: personne responsable du marché
narrower: passation des marchés publics
narrower: marché à procédure adaptée
narrower: commission consultative des marchés publics
narrower: conducteur d'opération
narrower: marché reconductible
narrower: refip-REFIP699
narrower: refip-REFIP708
narrower: refip-REFIP7225
notation: REFIP3181

bordereau des prix
type: ConceptReFip
type: Concept
alternative label: BPU
alternative label: bordereau des prix unitaires
broader: passation des marchés publics
definition: Document principalement utilisé dans les marchés à bons de commande, listant les prix unitaires relatifs à chaque produit ou élément d'ouvrage prévu par le cahiers des clauses techniques particulières.
in scheme: FINANCES PUBLIQUES
in scheme: Commande publique
in scheme: Gestion Publique
notation: REFIP3182
related: marché à bons de commande
related: refip-REFIP7149

Ardèche
type: ConceptReFip
type: Concept
broader: Auvergne-Rhône-Alpes
definition: Département français
in scheme: FINANCES PUBLIQUES
in scheme: Géographie
in scheme: Europe
notation: REFIP3183

fichier client
type: ConceptReFip
type: Concept
broader: compte de tiers
definition: Document compilant un certain nombre d'informations sur les clients et/ou les consommateurs (actuels et/ou potentiels) de l'entreprise.
in scheme: FINANCES PUBLIQUES
in scheme: Documents comptables
in scheme: Comptabilité
notation: REFIP3184

succession vacante
type: ConceptReFip
type: Concept
alternative label: succession non réclamée
broader: succession
definition: Succession que nul successeur ne réclame y compris l'État.
in scheme: FINANCES PUBLIQUES
in scheme: Domaine
in scheme: Gestion Publique
notation: REFIP3185

plafonnement
type: ConceptReFip
type: Concept
broader: liquidation de l'impôt
definition: Technique permettant de limiter soit un avantage fiscal, soit le taux de l'impôt, soit le montant d'une imposition.
in scheme: FINANCES PUBLIQUES
in scheme: Liquidation de l'Impôt
in scheme: Fiscalité
narrower: plafond de ressources
narrower: plafond pluriannuel
notation: REFIP3187
scope note: Fiscalité

organigramme
type: ConceptReFip
type: Concept
alternative label: organigramme hiérarchique
broader: pilotage
definition: Représentation schématique des liens fonctionnels, organisationnels et hiérarchiques de la DGFIP et de ses structures.
in scheme: FINANCES PUBLIQUES
in scheme: Missions Transverses des Finances publiques
in scheme: Pilotage
notation: REFIP3188

juridiction commerciale
type: ConceptReFip
type: Concept
broader: juridiction civile
definition: Ensemble des tribunaux chargés de juger les affaires commerciales.
in scheme: FINANCES PUBLIQUES
in scheme: Droit et Justice
in scheme: Juridiction
in scheme: Organisation Juridictionnelle
narrower: tribunal de commerce
notation: REFIP3189

formulaire de mise à jour de l'inventaire comptable
type: ConceptReFip
type: Concept
alternative label: FMIC
broader: politique immobilière de l'Etat
definition: Document permettant le suivi et la mise à jour de l'inventaire du parc immobilier de l'État.
in scheme: FINANCES PUBLIQUES
in scheme: Politique immobilière de l'Etat
in scheme: Gestion Publique
notation: REFIP319

Ministère des Affaires sociales de la Santé et des Droits des Femmes (obsolète)
type: ConceptReFip
type: Concept
is replaced by: refip-REFIP7063
broader: ZZ
in scheme: FINANCES PUBLIQUES
notation: REFIP3190

Aisne
type: ConceptReFip
type: Concept
broader: refip-REFIP7010
definition: Département français
in scheme: FINANCES PUBLIQUES
in scheme: Géographie
in scheme: Europe
notation: REFIP3191

certificat de qualification professionnelle
type: ConceptReFip
type: Concept
alternative label: certificat de qualification
broader: insertion professionnelle
definition: Certification créée et délivrée par une branche professionnelle attestant de la maitrise de compétences liées à un métier.
in scheme: FINANCES PUBLIQUES
in scheme: Entreprises
in scheme: Travail
in scheme: 212619
notation: REFIP3192

consignation environnementale
type: ConceptReFip
type: Concept
broader: sanction administrative
definition: Sanction prononcée en cas d’inobservation des prescriptions applicables aux installations, ouvrages, travaux, aménagements, opérations, objets, dispositifs et activités. L’autorité administrative compétente met en demeure la personne à laquelle incombe l’obligation d’y satisfaire dans un délai qu’elle détermine. L’autorité administrative compétente peut prendre diverses mesures notamment obliger la personne concernée à consigner entre les mains d’un comptable public, avant une date qu’elle détermine, une somme correspondant au montant des travaux, opérations ou mesures à réaliser. La somme consignée est restituée au fur et à mesure de l’exécution des travaux ou opérations.
in scheme: FINANCES PUBLIQUES
in scheme: Droit et Justice
in scheme: Sanction
in scheme: Infractions et Sanctions
notation: REFIP3194

fonction de supervision des tiers
type: ConceptReFip
type: Concept
broader: CHORUS (non-descripteur)
definition: Fonctions misent en place afin d'assurer une prise en charge de l’ensemble des demandes formulées par les ordonnateurs dans CHORUS, notamment en charge de l’administration des Tiers et des RIB.
in scheme: FINANCES PUBLIQUES
in scheme: Comptabilité publique
in scheme: Comptabilité
notation: REFIP3195
related: cellule interrégionale de supervision des tiers
related: cellule nationale de supervision des tiers
related: fonction régionale de supervision des tiers

vice caché
type: ConceptReFip
type: Concept
broader: droit des obligations et contrats (non-descripteur)
definition: Défaut de la chose vendue qui ne se révèle pas à premier examen et qui la rend impropre à l'usage auquel elle est destinée, ou qui diminue tellement cet usage que l'acheteur ne l'aurait pas acquise, ou n'en aurait donné qu'un moindre prix, s'il l'avait connu.
in scheme: FINANCES PUBLIQUES
in scheme: Droit et Justice
in scheme: Divisions du Droit
in scheme: Droit Privé
notation: REFIP3196

Agence comptable des services industriels de l'armement
type: ConceptReFip
type: Concept
alternative label: ACSIA
broader: refip-REFIP895
definition: Agence comptable sous tutelle du Ministère de la Défense et de l'Économie et des Finances, chargée de l'exécution des dépenses et des recettes du Ministère de la Défense.
in scheme: FINANCES PUBLIQUES
in scheme: Organisation Structurelle de l'Etat
in scheme: Ministère
in scheme: Administration de L'Etat
notation: REFIP3197

titre de dépense
type: ConceptReFip
type: Concept
broader: crédit budgétaire
definition: Répartition des charges budgétaires de l’État sous sept titres en fonction de la nature des dépenses (personnel, fonctionnement, Investissement...).
in scheme: FINANCES PUBLIQUES
in scheme: Exécution du budget
in scheme: Budget
narrower: catégorie de dépenses
notation: REFIP3198

charges à payer
type: ConceptReFip
type: Concept
broader: passif
definition: Charges utilisées ou consommées au cours d'un exercice mais non encore facturées donc non comptabilisées à la clôture dudit exercice.
in scheme: FINANCES PUBLIQUES
in scheme: Documents comptables
in scheme: Comptabilité
notation: REFIP3199

bulletin municipal
type: ConceptReFip
type: Concept
broader: document administratif
definition: Outil de communication dont une collectivité se sert pour transmettre des informations.
in scheme: FINANCES PUBLIQUES
in scheme: Documentation
in scheme: Communication Documentation Informatique
notation: REFIP320

Autorité de contrôle prudentiel
type: ConceptReFip
type: Concept
alternative label: ACAM
alternative label: ACP
alternative label: Autorité de contrôle des assurances et des mutuelles
alternative label: CECEI
alternative label: Comité des Etablissements de crédit et des entreprises d'investissement
alternative label: Comité des entreprises d'assurance
alternative label: Commission bancaire
broader: autorité administrative indépendante
definition: Autorité administrative indépendante, sans personnalité morale, qui surveille l'activité des banques et des assurances en France.
in scheme: FINANCES PUBLIQUES
in scheme: Organisation Structurelle de l'Etat
in scheme: Autorité Administrative
in scheme: Administration de L'Etat
notation: REFIP3201

application LIDO
type: ConceptReFip
type: Concept
alternative label: LIDO
broader: applications gestion publique (non-descripteur)
definition: Suivi informatique, utilisée notamment par les brigades domaniales, de la mission d'évaluation, des expropriations et établissement des statistiques.
in scheme: FINANCES PUBLIQUES
in scheme: Applications Informatiques
in scheme: Applications gestion publique
notation: REFIP3202

Direction des résidents à l'étranger et des services généraux
type: ConceptReFip
type: Concept
alternative label: DRESG
broader: service à compétence nationale
definition: Service à compétence nationale de la DGFIP ayant pour principales missions fiscales l'assiette, le contrôle des impôts des personnes physiques non résidentes ayant des revenus de source française et des entreprises étrangères sans établissement stable en France. Elle exerce également des missions nationales d'encaissement et de restitution des prélèvements à la source sur les produits financiers, de gestion des timbres fiscaux, de remboursement de la TVA au titre des 8ème et 13ème directives européennes. Elle assure des fonctions « support » ainsi que des missions comptables et de dépenses de l'Etat.
in scheme: FINANCES PUBLIQUES
in scheme: Organisation Structurelle de l'Etat
in scheme: Ministère
in scheme: Administration de L'Etat
notation: REFIP3203
related: refip-REFIP7018
related: refip-REFIP7019
scope note: Scindée en 2 directions, la DINR et le SARH à compter du 4 septembre 2017

frais d'assiette et de recouvrement
type: ConceptReFip
type: Concept
alternative label: FAP
alternative label: FAR
alternative label: frais d'assiette et de perception
broader: recettes fiscales de l'Etat
definition: Recettes non fiscales liées au recouvrement des impôts et taxes établis ou perçus au profit d'organismes tiers ou des collectivités territoriales.
in scheme: FINANCES PUBLIQUES
in scheme: Budget de l’État
in scheme: Budget
notation: REFIP3204

canton
type: ConceptReFip
type: Concept
broader: collectivité territoriale
definition: Subdivision territoriale de l'arrondissement, c'est la circonscription électorale dans le cadre de laquelle est élu le conseiller général. Dans la plupart des cas, les cantons englobent plusieurs communes. Mais les cantons ne respectent pas toujours les limites communales : les communes les plus peuplées appartiennent à plusieurs cantons. Un canton appartient à un et un seul arrondissement.
in scheme: FINANCES PUBLIQUES
in scheme: Organisation Territoriale
in scheme: Structures Territoriales
in scheme: Administration de L'Etat
notation: REFIP3205

aide exceptionnelle à l'élevage
type: ConceptReFip
type: Concept
alternative label: aide exceptionnelle à l'agriculture
alternative label: plan de soutien exceptionnel à l'agriculture
broader: aide aux entreprises
definition: Aide d'urgence allouée aux éleveurs victimes de certains aléas : climatiques, sanitaires, économiques …
in scheme: FINANCES PUBLIQUES
in scheme: Dépenses publiques
in scheme: Gestion Publique
notation: REFIP3206

action en comblement de passif
type: ConceptReFip
type: Concept
broader: droit commercial
definition: Procédure dans laquelle un dirigeant de droit ou de fait est convoqué devant le tribunal de commerce en Chambre du conseil pour répondre de fautes de gestion et dans laquelle le tribunal peut condamner le dirigeant coupable de telles fautes de gestion à régler tout ou partie du passif de l’entreprise après liquidation des actifs, et seulement dans trois cas : cas de résolution du plan de sauvegarde ou du plan de redressement, ou en cas de liquidation judiciaire.
in scheme: FINANCES PUBLIQUES
in scheme: Droit et Justice
in scheme: Divisions du Droit
in scheme: Droit Privé
notation: REFIP3208

titre d'abonnement aux transports en commun
type: ConceptReFip
type: Concept
alternative label: carte d'abonnement
broader: transports en commun
definition: Document qui justifie des abonnements pour tous types de transports en commun.
in scheme: FINANCES PUBLIQUES
in scheme: Branche d'activité
in scheme: Questions Economiques
in scheme: Transports
notation: REFIP3209
related: frais de déplacement
related: frais de mission
related: indemnité compensatrice pour frais de transport

recours gracieux
type: ConceptReFip
type: Concept
alternative label: pourvoi gracieux
broader: recours administratif
definition: Recours administratif porté devant l'autorité même dont émane la mesure critiquée. Il ne constitue pas un préalable obligatoire au recours hiérarchique.
in scheme: FINANCES PUBLIQUES
in scheme: Procédure Administrative
in scheme: Droit et Justice
in scheme: Procédure
notation: REFIP321
related: demande gracieuse

révision des valeurs locatives
type: ConceptReFip
type: Concept
alternative label: révision cadastrale
alternative label: révision du cadastre
broader: évaluation cadastrale
definition: Mise à jour par le cadastre de la valeur locative des biens immobiliers, suite à une modification des critères de calcul des valeurs locatives.
in scheme: FINANCES PUBLIQUES
in scheme: Cadastre
in scheme: Fiscalité
narrower: valeur locative foncière
narrower: refip-REFIP700
notation: REFIP3211

garantie de l'Etat
type: ConceptReFip
type: Concept
broader: engagement hors bilan
definition: Engagement par lequel celui-ci accorde sa caution à un organisme dont il veut faciliter les opérations d'emprunt, en garantissant au prêteur le remboursement en cas de défaillance du débiteur.
in scheme: FINANCES PUBLIQUES
in scheme: Exécution du budget
in scheme: Budget
notation: REFIP3212

programme budgétaire
type: ConceptReFip
type: Concept
broader: refip-REFIP978
definition: Ensemble des crédits destinés à mettre en oeuvre une action ou un ensemble cohérent d'actions relevant d'un même ministère et auquel sont associés des objectifs précis, définis en fonction de finalités d'intérêt général, ainsi que des résultats attendus et faisant l'objet d'une évaluation.
in scheme: FINANCES PUBLIQUES
in scheme: Élaboration du budget
in scheme: Budget
narrower: refip-REFIP7028
notation: REFIP3213
related: refip-REFIP6783

trop-perçu
type: ConceptReFip
type: Concept
broader: mots outils (liste additive)
definition: Somme perçue en sus de ce qui est dû.
in scheme: FINANCES PUBLIQUES
in scheme: Mots Outils
notation: REFIP3216

date d'entrée en vigueur
type: ConceptReFip
type: Concept
broader: mots outils (liste additive)
definition: Jour à partir duquel les dispositifs d'une décision, les stipulations d'un contrat, les dispositions d'une loi, d'un décret ou d'un règlement lient les intéressés.
in scheme: FINANCES PUBLIQUES
in scheme: Mots Outils
notation: REFIP3218

bordereau Dailly
type: ConceptReFip
type: Concept
alternative label: bordereau de cession de créances professionnelles
alternative label: cession Dailly
broader: cession de créance
definition: Forme particulière de cession de créance qui permet de céder selon des formes simples les créances professionnelles ainsi que les garanties et sûretés qui y sont attachées. Cession s'opérant au moyen d'un simple bordereau et qui concerne tous les types de crédit.
in scheme: FINANCES PUBLIQUES
in scheme: Droit et Justice
in scheme: Divisions du Droit
in scheme: Droit Privé
notation: REFIP3219

Fonds de financement de la protection complémentaire de la couverture universelle du risque maladie
type: ConceptReFip
type: Concept
alternative label: Fonds de financement de la CMU
broader: établissement public à caractère administratif
definition: Établissement public national à caractère administratif ayant pour missions : de financer le volet complémentaire de la couverture maladie universelle (CMU-C) ; de suivre et analyser le fonctionnement des dispositifs et à ce titre formuler des propositions d’amélioration ; d'élaborer et publier la liste nationale des organismes complémentaires habilités à gérer la CMU complémentaire.
in scheme: FINANCES PUBLIQUES
in scheme: Organisation Structurelle de l'Etat
in scheme: Opérateur de l'Etat
in scheme: Administration de L'Etat
notation: REFIP322

certificat de décès
type: ConceptReFip
type: Concept
alternative label: acte de décès
broader: acte de l'Etat civil
definition: Acte authentique signé par un officier de l'état civil établi lors du décès d'une personne.
in scheme: FINANCES PUBLIQUES
in scheme: Droit et Justice
in scheme: Divisions du Droit
in scheme: Droit Privé
notation: REFIP3220

Caisse centrale de la mutualité sociale agricole
type: ConceptReFip
type: Concept
alternative label: CCMSA
broader: organisme de sécurité sociale
definition: Organisme de droit privé chargé d'une mission de service public, il régit l'organisation des différentes caisses de la Mutualité Sociale Agricole, placé sous la tutelle des ministères de l'Agriculture, des Affaires Sociales et du Budget, elle gère la protection sociale du monde agricole.
in scheme: FINANCES PUBLIQUES
in scheme: Organisation Structurelle de l'Etat
in scheme: Organisme de Sécurité Sociale
in scheme: Administration de L'Etat
notation: REFIP3221
related: Mutualité sociale agricole

plus-value à long terme
type: ConceptReFip
type: Concept
alternative label: PVLT
broader: plus-value
definition: Différence positive entre le montant de la cession d'un actif détenu depuis plus de 2 ans et sa valeur nette.
in scheme: FINANCES PUBLIQUES
in scheme: Documents comptables
in scheme: Comptabilité
notation: REFIP3222

Fonds de développement économique et social
type: ConceptReFip
type: Concept
alternative label: FDES
broader: compte spécial du Trésor
definition: Compte spécial du Trésor français permettant à l'État de consentir des prêts à des entreprises à des taux inférieurs au marché afin de favoriser le développement économique et social d'une aire géographique, dans le cadre de l'aménagement du territoire.
in scheme: FINANCES PUBLIQUES
in scheme: Élaboration du budget
in scheme: Budget
notation: REFIP3223

groupement foncier rural
type: ConceptReFip
type: Concept
alternative label: GFR
alternative label: groupement foncier agricole
broader: société civile
definition: Société civile particulière, formée en vue de rassembler et de gérer des immeubles à usage agricole et forestier.
in scheme: FINANCES PUBLIQUES
in scheme: Société
in scheme: Entreprises
in scheme: Forme juridique
notation: REFIP3224

cession
type: ConceptReFip
type: Concept
broader: aliénation de biens
definition: Transmission d'un droit entre vifs.
in scheme: FINANCES PUBLIQUES
in scheme: Droit et Justice
in scheme: Divisions du Droit
in scheme: Droit Privé
narrower: cession de créance
narrower: cessionnaire
notation: REFIP3225

Argentine
type: ConceptReFip
type: Concept
broader: Amérique
definition: Pays
in scheme: FINANCES PUBLIQUES
in scheme: Géographie
in scheme: Amérique
notation: REFIP3226

radiation d'un nantissement (supprimé)
type: ConceptReFip
type: Concept
broader: ZZ
in scheme: FINANCES PUBLIQUES
notation: REFIP3227

interface
type: ConceptReFip
type: Concept
broader: informatique
definition: Dispositif qui permet des échanges et interactions entre différents acteurs.
in scheme: FINANCES PUBLIQUES
in scheme: Informatique
in scheme: Communication Documentation Informatique
narrower: échange inter-applicatif
notation: REFIP323

honoraires
type: ConceptReFip
type: Concept
broader: refip-REFIP696
definition: Rétribution des professions libérales, imposables dans la catégorie des bénéfices non commerciaux.
in scheme: FINANCES PUBLIQUES
in scheme: Champ d'Application
in scheme: Fiscalité
notation: REFIP3230

Agence de l'eau
type: ConceptReFip
type: Concept
broader: établissement public à caractère administratif
definition: Etablissement public administratif du ministère chargé du développement durable, ayant pour missions d’initier une utilisation rationnelle des ressources en eau, la lutte contre la pollution et la protection des milieux aquatiques.
in scheme: FINANCES PUBLIQUES
in scheme: Organisation Structurelle de l'Etat
in scheme: Opérateur de l'Etat
in scheme: Administration de L'Etat
notation: REFIP3231
related: contrat de rivière

état exécutoire
type: ConceptReFip
type: Concept
broader: ordre de recette
definition: Acte juridique constatant une créance et permettant au créancier d'en poursuivre l'exécution forcée sur les biens de son débiteur dans les conditions propres à chaque mesure d'exécution.
in scheme: FINANCES PUBLIQUES
in scheme: Documentation budgétaire
in scheme: Budget
notation: REFIP3232

Picardie (obsolète)
type: ConceptReFip
type: Concept
is replaced by: refip-REFIP7010
broader: ZZ
in scheme: FINANCES PUBLIQUES
notation: REFIP3233

application VIDOC
type: ConceptReFip
type: Concept
alternative label: VIDOC
broader: applications fiscales (non-descripteur)
definition: Application permettant la visualisation des déclarations de propriétés bâties et des procès verbaux recensant les locaux de référence.
in scheme: FINANCES PUBLIQUES
in scheme: Applications Informatiques
in scheme: Applications fiscales
notation: REFIP3234

République centrafricaine
type: ConceptReFip
type: Concept
alternative label: Centrafrique
broader: Afrique
definition: Pays
in scheme: FINANCES PUBLIQUES
in scheme: Géographie
in scheme: Afrique
notation: REFIP3235

réforme hospitalière
type: ConceptReFip
type: Concept
broader: réforme de l'Etat
definition: Réforme ayant vocation à définir la stratégie nationale de la santé : organisation interne des établissements publics de santé ; articulation avec la médecine de ville ; gestion financière des établissements ; réforme de la cartographie des établissements de santé sur le territoire; création d’Agences régionales de santé.
in scheme: FINANCES PUBLIQUES
in scheme: Etat
in scheme: Réforme de l'Etat
in scheme: Administration de L'Etat
notation: REFIP3236

juge d'instruction
type: ConceptReFip
type: Concept
broader: juge judiciaire
definition: Magistrat chargé d'instruire à charge et a décharge les enquêtes judiciaires.
in scheme: FINANCES PUBLIQUES
in scheme: Profession Juridique
in scheme: Droit et Justice
in scheme: Organisation Juridictionnelle
notation: REFIP3237

application BAHIA
type: ConceptReFip
type: Concept
alternative label: BAHIA
broader: applications missions transverses (non-descripteur)
definition: Application permettant la gestion des habilitations des agents à certaines applications.
in scheme: FINANCES PUBLIQUES
in scheme: Applications missions transverses
in scheme: Applications Informatiques
notation: REFIP3238

fiscalité directe locale
type: ConceptReFip
type: Concept
broader: finances locales (non-descripteur)
definition: Ressources fiscales directes des collectivités locales, notamment la taxe d'habitation, les taxes foncières sur les propriétés bâties et non bâties ainsi que la contribution économique territoriale.
in scheme: FINANCES PUBLIQUES
in scheme: Secteur public local
in scheme: Gestion Publique
narrower: péréquation
narrower: refip-REFIP7196
notation: REFIP3239
related: impôt direct local

état descriptif de division en volumes
type: ConceptReFip
type: Concept
alternative label: EDD volumes
broader: cadastre
definition: Document représentant la constitution, sur l’assiette foncière, de droits de propriété réels perpétuels, détachés du sol, sans indivision entre eux et s’exerçant, chacun, sur un volume immobilier défini géométriquement.
in scheme: FINANCES PUBLIQUES
in scheme: Cadastre
in scheme: Fiscalité
notation: REFIP324

centre de services partagés
type: ConceptReFip
type: Concept
broader: direction régionale des finances publiques
definition: Structure de la direction générale des finances publiques, créée lors du déploiement de CHORUS au niveau central ainsi que dans chaque DRFIP, qui réalise les opérations matérielles d'engagement juridique et de certification de service fait dans CHORUS par le biais des formulaires Chorus adressés par les ordonnateurs. La certification du service fait par le CSP vaut ordre de payer pour le comptable.
in scheme: FINANCES PUBLIQUES
in scheme: Organisation Structurelle de l'Etat
in scheme: Ministère
in scheme: Administration de L'Etat
notation: REFIP3240

paradis fiscal
type: ConceptReFip
type: Concept
alternative label: Etat et territoire non coopératif
broader: évasion fiscale
definition: Pays dans lequel l'impôt est peu élevé ou nul et qui attire la domiciliation de contribuables ou sociétés désireux d'échapper à une taxation normale.
in scheme: FINANCES PUBLIQUES
in scheme: Droit de Contrôle de l'Administration
in scheme: Fiscalité
notation: REFIP3241

acceptation de communauté
type: ConceptReFip
type: Concept
broader: régime matrimonial
definition: Acte par lequel l'un des époux déclare accepter sa part dans l'actif et le passif de la communauté.
in scheme: FINANCES PUBLIQUES
in scheme: Droit et Justice
in scheme: Divisions du Droit
in scheme: Droit Privé
notation: REFIP3242

République du Congo
type: ConceptReFip
type: Concept
alternative label: Congo-Brazzaville
broader: Afrique
definition: Pays
in scheme: FINANCES PUBLIQUES
in scheme: Géographie
in scheme: Afrique
notation: REFIP3243

fiche financière
type: ConceptReFip
type: Concept
alternative label: fiche AEFF
alternative label: fiche de situation financière
broader: refip-REFIP788
definition: Document découlant de l'analyse financière, comportant les éléments financiers d'un projet, obligatoirement joint à toute proposition ou communication susceptible d'avoir une incidence budgétaire, notamment pour les collectivités locales.
in scheme: FINANCES PUBLIQUES
in scheme: Analyse financière
in scheme: Comptabilité
notation: REFIP3244

propriété non bâtie
type: ConceptReFip
type: Concept
alternative label: immeuble non bâti
broader: cadastre
definition: Natures de cultures ou de propriétés classées en treize grandes catégories : terres ; prés ; vergers ; vignes ; bois ; landes ; carrières, lacs et étangs ; jardins ; terrains à bâtir ; terrains d’agrément ; chemins de fer et canaux ; sols des propriétés bâties.
in scheme: FINANCES PUBLIQUES
in scheme: Cadastre
in scheme: Fiscalité
notation: REFIP3246

emplacement publicitaire
type: ConceptReFip
type: Concept
alternative label: enseigne publicitaire
alternative label: espace publicitaire
alternative label: panneau publicitaire
broader: publicité commerciale
definition: Espace, support, réservé à l'annonce publicitaire.
in scheme: FINANCES PUBLIQUES
in scheme: Branche d'activité
in scheme: Questions Economiques
in scheme: Commerce
notation: REFIP3247
related: support de communication

la Française des Jeux
type: ConceptReFip
type: Concept
alternative label: FDJ
alternative label: Française des Jeux
alternative label: loterie nationale
alternative label: loto
alternative label: loto sportif
broader: entreprise publique
definition: Entreprise publique détenue principalement par l'État qui lui a confié le monopole des jeux de loterie et de paris sportifs sur tout son territoire.
in scheme: FINANCES PUBLIQUES
in scheme: Organisation Structurelle de l'Etat
in scheme: Entreprise Publique
in scheme: Administration de L'Etat
notation: REFIP3249

application VISUDGFIP MULTICRITERE
type: ConceptReFip
type: Concept
alternative label: VISUDGFIP MULTICRITERE
broader: applications fiscales (non-descripteur)
definition: Requêteur qui permet d’interroger et d’extraire des informations cadastrales en situation de référence sur une base départementale.
in scheme: FINANCES PUBLIQUES
in scheme: Applications Informatiques
in scheme: Applications fiscales
notation: REFIP325

dotation de développement rural
type: ConceptReFip
type: Concept
broader: dotation globale d'équipement
definition: Dotation destinée à financer les opérations de maintien et de développement des services publics en milieu rural. La liste des communes et EPCI des départements éligibles à la dotation de développement rural (DDR) est précisée par une circulaire.
in scheme: FINANCES PUBLIQUES
in scheme: Dépenses publiques
in scheme: Gestion Publique
notation: REFIP3250
scope note: Remplacée par la dotation d'équipement des territoires ruraux loi de finance n° 2010-1657

délai de conservation
type: ConceptReFip
type: Concept
broader: documentation
definition: Norme déterminant la durée de conservation de documents, variant selon leur nature.
in scheme: FINANCES PUBLIQUES
in scheme: Documentation
in scheme: Communication Documentation Informatique
narrower: archives
notation: REFIP3251

procédure de sauvegarde
type: ConceptReFip
type: Concept
broader: procédure collective
definition: Procédure collective qui protège les entreprise en difficulté en suspendant le paiement de dettes à l'ouverture de la procédure. Elle concerne les entreprises qui ne sont pas en cessation de paiement. À condition de ne pas être en cessation de paiements, peuvent demander la procédure de sauvegarde toute entreprise commerciale, artisanale, agricole ou libérale (personne physique ou morale); les auto-entrepreneurs; toute association qui rencontre des difficultés qu’elle n’est pas en mesure de surmonter seule. Les entrepreneurs individuels à responsabilité limitée (EIRL) peuvent y recourir uniquement sur leur patrimoine affecté à l’activité professionnelle. La demande d’ouverture de la procédure de sauvegarde ne peut être faite que par le représentant légal de la personne morale ou par le débiteur personne physique, au greffe du tribunal dont dépend l’entreprise. Elle aboutit, en principe, à l'élaboration d'un plan de sauvegarde de l'entreprise.
in scheme: FINANCES PUBLIQUES
in scheme: Vie de l'Entreprise
in scheme: Entreprises
in scheme: Vie et Gestion de l'entreprise
narrower: plan de sauvegarde
notation: REFIP3252

application ILIAD
type: ConceptReFip
type: Concept
alternative label: ILIAD
broader: applications fiscales (non-descripteur)
definition: Applicatif permettant la gestion et le suivi des travaux d'assiette, concernant notamment l'impôt sur le revenu et la taxe d'habitation, le contentieux ainsi que les impositions supplémentaires.
in scheme: FINANCES PUBLIQUES
in scheme: Applications Informatiques
in scheme: Applications fiscales
notation: REFIP3253

Bulletin officiel des services extérieurs du Trésor (supprimé)
type: ConceptReFip
type: Concept
broader: ZZ
in scheme: FINANCES PUBLIQUES
notation: REFIP3254

présomption de propriété (supprimé)
type: ConceptReFip
type: Concept
broader: ZZ
in scheme: FINANCES PUBLIQUES
notation: REFIP3255

avoir sur facture
type: ConceptReFip
type: Concept
broader: facturation
definition: Document commercial émis par un vendeur à un acheteur, reconnaissant une dette à ce dernier. L'avoir est un document qui atteste que l'acheteur peut faire valoir un droit auprès du vendeur pour obtenir un bien ou un service de valeur équivalente ou un remboursement.
in scheme: FINANCES PUBLIQUES
in scheme: Procédures et Techniques Comptables
in scheme: Comptabilité
notation: REFIP3257

aide à finalité régionale
type: ConceptReFip
type: Concept
broader: aide aux entreprises
definition: Fonds alloué permettant de contribuer au développement des territoires en difficulté, en soutenant particulièrement les investissements productifs des grandes entreprises et des PME ou la création d’emplois liés à ces investissements.
in scheme: FINANCES PUBLIQUES
in scheme: Dépenses publiques
in scheme: Gestion Publique
narrower: aide pour la création d'entreprise nouvelle
notation: REFIP3258
related: refip-REFIP6975

compte-rendu
type: ConceptReFip
type: Concept
alternative label: reporting
broader: document
definition: Texte ou exposé, oral ou écrit, qui présente et/ou analyse des faits, des débats, une réunion, le contenu d'un ouvrage, une visite, une mission etc.
in scheme: FINANCES PUBLIQUES
in scheme: Documentation
in scheme: Communication Documentation Informatique
notation: REFIP3259

aide à la création ou reprise d'une entreprise (supprimé)
type: ConceptReFip
type: Concept
broader: ZZ
in scheme: FINANCES PUBLIQUES
notation: REFIP326

téléphonie
type: ConceptReFip
type: Concept
alternative label: téléphone
broader: télécommunication
definition: Forme de télécommunication essentiellement destinée à l'échange d'informations sous forme de parole.
in scheme: FINANCES PUBLIQUES
in scheme: Communication
in scheme: Communication Documentation Informatique
narrower: ligne téléphonique
notation: REFIP3260

ordonnance de délégation
type: ConceptReFip
type: Concept
alternative label: ordonnance de délégation de crédits de paiement
broader: crédit de paiement
definition: Acte par lequel les ministres autorisent les ordonnateurs secondaires à disposer d'une partie de leur crédit par des mandats de paiement au profit d'un ou plusieurs créanciers de l’État.
in scheme: FINANCES PUBLIQUES
in scheme: Exécution du budget
in scheme: Budget
notation: REFIP3261

droits constatés
type: ConceptReFip
type: Concept
broader: principe de permanence des méthodes comptables
definition: Méthode comptable qui comptabilise une transaction lorsque intervient l'activité (ou la décision) qui va générer les recettes ou les dépenses, et ne tient pas compte, comme dans la méthode des paiements, du moment auquel interviennent décaissements ou encaissements.
in scheme: FINANCES PUBLIQUES
in scheme: Principe comptable
in scheme: Comptabilité
notation: REFIP3264

règle d'imputation
type: ConceptReFip
type: Concept
alternative label: modalité d'imputation
alternative label: schéma comptable
broader: comptabilisation
definition: Principe selon lequel le débiteur de plusieurs dettes a le droit de déclarer, lorsqu'il paye, la dette il entend acquitter.
in scheme: FINANCES PUBLIQUES
in scheme: Procédures et Techniques Comptables
in scheme: Comptabilité
narrower: imputation provisoire
narrower: imputation comptable
notation: REFIP3265

sécurité économique
type: ConceptReFip
type: Concept
alternative label: défense économique
broader: mission de service public
definition: Ensemble d'actions menées par les services de l’État pour évaluer, anticiper et protéger les entreprises, les établissements de recherche et plus globalement l’économie française des risques économiques, scientifiques et industriels.
in scheme: FINANCES PUBLIQUES
in scheme: Etat
in scheme: Mission de Service Public
in scheme: Administration de L'Etat
narrower: crise
notation: REFIP3266

service fait
type: ConceptReFip
type: Concept
alternative label: absence de service fait
broader: paiement de la dépense (non-descripteur)
definition: Règle de la comptabilité publique selon laquelle une dépense ne peut être payée que si le service a été fait. Il appartient à l’ordonnateur d’en justifier.
in scheme: FINANCES PUBLIQUES
in scheme: Dépenses publiques
in scheme: Gestion Publique
notation: REFIP3267

plan cadastral
type: ConceptReFip
type: Concept
broader: documentation cadastrale
definition: Document cartographique représentant graphiquement le territoire communal dans tous les détails de son morcellement en propriétés et en natures de cultures ainsi que certains détails utiles à sa compréhension. Il est subdivisé en sections et lieux-dits ; suivant les cas, la section comporte une ou plusieurs feuilles parcellaires.
in scheme: FINANCES PUBLIQUES
in scheme: Cadastre
in scheme: Fiscalité
narrower: document d'arpentage
notation: REFIP3268

fausse monnaie
type: ConceptReFip
type: Concept
alternative label: faux billet
broader: falsification
definition: Devise obtenue par faux-monnayage ou monnaie authentique ayant subi une altération.
in scheme: FINANCES PUBLIQUES
in scheme: Droit et Justice
in scheme: Infractions et Sanctions
in scheme: Infraction
notation: REFIP3270

occupation précaire
type: ConceptReFip
type: Concept
alternative label: occupation sans titre
broader: occupation de locaux
definition: Reconnaissance à l'occupant d'un local du droit de jouissance précaire moyennant une contrepartie financière modique. Une convention peut être rédigée afin d'en définir les conditions.
in scheme: FINANCES PUBLIQUES
in scheme: Domaine
in scheme: Gestion Publique
notation: REFIP3271

gratuite
type: ConceptReFip
type: Concept
broader: mots outils (liste additive)
definition: Fait d'obtenir un bien ou service sans qu'aucune contrepartie, en particulier pécuniaire, ne soit fournie.
in scheme: FINANCES PUBLIQUES
in scheme: Mots Outils
notation: REFIP3272

Vendée
type: ConceptReFip
type: Concept
broader: Pays de la Loire
definition: Département français
in scheme: FINANCES PUBLIQUES
in scheme: Géographie
in scheme: Europe
notation: REFIP3273

crédit d'impôt cinéma
type: ConceptReFip
type: Concept
alternative label: crédit d'impôt audiovisuel
alternative label: crédit d'impôt pour dépenses de production cinématographique
broader: refip-REFIP849
definition: Dispositif institué au profit des sociétés ayant engagé des dépenses relatives à la production d’œuvres cinématographiques de fiction, documentaires ou d'animation, remplissant certaines conditions.
in scheme: FINANCES PUBLIQUES
in scheme: Liquidation de l'Impôt
in scheme: Fiscalité
notation: REFIP3274

vente à perte
type: ConceptReFip
type: Concept
broader: vente
definition: Fait pour un commerçant de revendre un produit à un prix inférieur à son prix d'achat effectif. La vente à perte constitue un délit correctionnel. Relève du droit commercial et du droit pénal.
in scheme: FINANCES PUBLIQUES
in scheme: Droit et Justice
in scheme: Divisions du Droit
in scheme: Droit Privé
notation: REFIP3275

bascule informatique
type: ConceptReFip
type: Concept
alternative label: basculement
alternative label: basculement informatique
broader: chaîne de traitement
definition: Migration de données informatiques d'un système à un autre.
in scheme: FINANCES PUBLIQUES
in scheme: Informatique
in scheme: Communication Documentation Informatique
notation: REFIP3276

dégradation de l'environnement
type: ConceptReFip
type: Concept
alternative label: destruction de l'environnement
alternative label: dégradation climatique
alternative label: détérioration de l'environnement
alternative label: variation climatique
broader: environnement (non-descripteur)
definition: Dégradation d'un milieu par un agent polluant.
in scheme: FINANCES PUBLIQUES
in scheme: Environnement
in scheme: Dégradation de l'Environnement
in scheme: Questions de Société
narrower: intempéries
narrower: pollution
narrower: déchets
narrower: catastrophe naturelle
narrower: incendie
notation: REFIP3277

employeur multiple
type: ConceptReFip
type: Concept
alternative label: cumul d'emplois
alternative label: cumul de contrats de travail
alternative label: employeur secondaire
alternative label: employeur successif
broader: employeur
definition: Terme utilisé soit lorsqu'un salarié a été employé sur une même année par plusieurs employeurs relevant d'une même caisse de retraite; soit lorsqu'un salarié a été employé simultanément par plusieurs employeurs relevant d'une même caisse de retraite.
in scheme: FINANCES PUBLIQUES
in scheme: Entreprises
in scheme: Travail
in scheme: 212619
notation: REFIP3278

mission de coopération internationale
type: ConceptReFip
type: Concept
alternative label: MCI
broader: administration centrale des finances publiques
definition: Service directement rattaché au directeur général la mission de coopération internationale (MCI) chargé d’organiser et de coordonner les actions de coopération internationale de la DGFIP. La MCI inscrit son action dans le contexte d’internationalisation des économies, de poursuite de la construction européenne et de modernisation des Etats, tout particulièrement les pays émergents et en développement. Elle permet d’apporter aux pays partenaires l’expertise et le savoir-faire de la DGFIP et contribue ainsi au renforcement de l’influence française dans le monde.
in scheme: FINANCES PUBLIQUES
in scheme: Organisation Structurelle de l'Etat
in scheme: Ministère
in scheme: Administration de L'Etat
notation: REFIP3281

caution
type: ConceptReFip
type: Concept
broader: cautionnement
definition: Personne qui s'engage envers le créancier, à satisfaire l'exécution de l'obligation, si le débiteur n'y satisfait pas lui-même.
in scheme: FINANCES PUBLIQUES
in scheme: Recouvrement
in scheme: Fiscalité
narrower: caution solidaire
narrower: caution personnelle
notation: REFIP3282

remaniement du cadastre
type: ConceptReFip
type: Concept
alternative label: remaniement cadastral
broader: cadastre
definition: Opérations ayant pour objet d'assurer une nouvelle rénovation du cadastre, lorsque le plan cadastral antérieurement rénové présente des insuffisances qui ne permettent plus d'en assurer la conservation annuelle de manière satisfaisante.
in scheme: FINANCES PUBLIQUES
in scheme: Cadastre
in scheme: Fiscalité
narrower: rénovation du cadastre
notation: REFIP3283

compte annuel de l'Etat
type: ConceptReFip
type: Concept
broader: documents comptables
definition: Compte produit annuellement reposant sur la collecte, le traitement et la sécurisation de l’information comptable et financière, depuis la saisie des opérations courantes jusqu’à la certification des comptes par la Cour des comptes.
in scheme: FINANCES PUBLIQUES
in scheme: Documents comptables
in scheme: Comptabilité
notation: REFIP3284

association pour le logement du personnel des administrations financières
type: ConceptReFip
type: Concept
alternative label: ALPAF
broader: secrétariat général des ministères économiques et financiers
definition: Association « loi 1901 » à but non lucratif ayant pour objet de faciliter le logement des agents des ministères économique et financier et de leurs familles. Elle met en œuvre des prestations sociales concernant le logement, sous forme de réservation et d'attribution de logements sociaux, et d'attribution d'aides et de prêts au logement.
in scheme: FINANCES PUBLIQUES
in scheme: Organisation Structurelle de l'Etat
in scheme: Ministère
in scheme: Administration de L'Etat
notation: REFIP3285

provision pour dépréciation
type: ConceptReFip
type: Concept
broader: provision
definition: Constatation comptable d'un amoindrissement de la valeur d'un élément d'actif résultant de causes dont les effets ne sont pas jugés irréversibles, les dépréciations s'inscrivent au bilan en diminution de la valeur des postes de l'actif auxquels elles correspondent.
in scheme: FINANCES PUBLIQUES
in scheme: Documents comptables
in scheme: Comptabilité
notation: REFIP3286

saisie mobilière
type: ConceptReFip
type: Concept
broader: saisie
definition: Saisie pratiquée sur un objet mobilier, sur une créance ou sur une valeur mobilière, et peut n'avoir qu'un caractère conservatoire ou viser à la vente forcée des biens saisis.
in scheme: FINANCES PUBLIQUES
in scheme: Recouvrement
in scheme: Fiscalité
notation: REFIP3287

comité des finances locales
type: ConceptReFip
type: Concept
broader: Direction générale des collectivités locales
definition: Instance qui a pour objet principal la défense des intérêts financiers des collectivités locales et qui permet d'harmoniser leur position avec celle de l'Etat. Il contrôle la répartition de la dotation globale de fonctionnement (DGF). Il lui revient de fixer l’évolution de certaines parts de la DGF. Le Gouvernement peut par ailleurs le consulter sur tout projet de loi, tout projet d’amendement ou sur toutes dispositions réglementaires à caractère financier concernant les collectivités locales.
in scheme: FINANCES PUBLIQUES
in scheme: Organisation Structurelle de l'Etat
in scheme: Ministère
in scheme: Administration de L'Etat
notation: REFIP3289

annexes budgétaires
type: ConceptReFip
type: Concept
alternative label: fascicules budgétaires
broader: refip-REFIP982
definition: Informations et documents devant figurer ou être joints au budget ou au compte administratif.
in scheme: FINANCES PUBLIQUES
in scheme: Documentation budgétaire
in scheme: Budget
narrower: bleus budgétaires
narrower: refip-REFIP786
notation: REFIP329

application MINOS
type: ConceptReFip
type: Concept
alternative label: MINOS
broader: applications fiscales (non-descripteur)
definition: Gestion des procédures et des décisions de justice au sein des tribunaux de police et des juridictions de proximité pour les contraventions des classes 1 à 4.
in scheme: FINANCES PUBLIQUES
in scheme: Applications Informatiques
in scheme: Applications fiscales
notation: REFIP3290

services informatiques
type: ConceptReFip
type: Concept
broader: service à compétence nationale
definition: Services de la DGFIP se structurant autour de missions opérationnelles réparties entre le réseau et l'administration centrale. Ils sont chargés notamment de la mise en place et l'ouverture de référentiels nationaux (TVA, impôt sur le revenu…) accessibles aux contribuables via internet ; du développement et de la modernisation des téléprocédures utilisées par les contribuables et les entreprises pour déclarer et payer l’impôt ; de l'informatique décisionnelle (entrepôts de données associés à des outils performants pour la collecte, la mise en forme et la restitution d’informations stratégiques…).
in scheme: FINANCES PUBLIQUES
in scheme: Organisation Structurelle de l'Etat
in scheme: Ministère
in scheme: Administration de L'Etat
narrower: établissement de services informatiques
narrower: direction interrégionale des services informatiques
narrower: service assistance utilisateur
notation: REFIP3292

désistement
type: ConceptReFip
type: Concept
broader: procédure civile
definition: Acte par lequel un requérant demande au juge de renoncer à statuer sur les conclusions de sa requête introductive d’instance.
in scheme: FINANCES PUBLIQUES
in scheme: Procédure Civile
in scheme: Droit et Justice
in scheme: Procédure
notation: REFIP3293

consommation
type: ConceptReFip
type: Concept
broader: économie générale (non-descripteur)
definition: Emploi d'un bien ou d'un service en vue de sa transformation dans la production (consommation intermédiaire) ou de la satisfaction d'un besoin (consommation finale) impliquant la destruction immédiate ou progressive du bien.
in scheme: FINANCES PUBLIQUES
in scheme: Questions Economiques
in scheme: Economie générale
narrower: indice des prix à la consommation
notation: REFIP3295

véhicule administratif
type: ConceptReFip
type: Concept
alternative label: véhicule de fonction
alternative label: véhicule de service
broader: véhicule terrestre à moteur
definition: Véhicule appartenant à l'administration.
in scheme: FINANCES PUBLIQUES
in scheme: Branche d'activité
in scheme: Questions Economiques
in scheme: Transports
notation: REFIP3296

reconduction
type: ConceptReFip
type: Concept
broader: droit des obligations et contrats (non-descripteur)
definition: Continuation d'un contrat à durée déterminée au-delà de sa durée initialement convenue et aux conditions originaires.
in scheme: FINANCES PUBLIQUES
in scheme: Droit et Justice
in scheme: Divisions du Droit
in scheme: Droit Privé
narrower: tacite reconduction
notation: REFIP3297
related: marché reconductible

compte financier
type: ConceptReFip
type: Concept
broader: documents comptables
definition: Document commun de l'ordonnateur et du comptable qui décrit l'exécution budgétaire de l'ordonnateur (les dépenses et les recettes), et la traduction de cette exécution dans des écritures comptables.
in scheme: FINANCES PUBLIQUES
in scheme: Documents comptables
in scheme: Comptabilité
narrower: frais financiers
notation: REFIP3298

malfaçon
type: ConceptReFip
type: Concept
broader: construction
definition: Vice de chose vendue, travail défectueux de l'entrepreneur.
in scheme: FINANCES PUBLIQUES
in scheme: Branche d'activité
in scheme: Questions Economiques
in scheme: Construction
notation: REFIP3299
related: vice de construction

comptabilité analytique
type: ConceptReFip
type: Concept
definition: Mode de traitement de données issues de la comptabilité générale qui permet d’identifier les éléments qui concourent à la formation du résultat de l’entreprise, et de les valoriser.
in scheme: FINANCES PUBLIQUES
in scheme: Comptabilité
in scheme: Comptabilité analytique
narrower: solde intermédiaire de gestion
narrower: ventilation comptable
notation: REFIP33

véhicule personnel
type: ConceptReFip
type: Concept
broader: véhicule terrestre à moteur
definition: Véhicule privé.
in scheme: FINANCES PUBLIQUES
in scheme: Branche d'activité
in scheme: Questions Economiques
in scheme: Transports
notation: REFIP3300

référé suspension
type: ConceptReFip
type: Concept
broader: référé fiscal
definition: Procédure juridictionnelle d'urgence à laquelle le contribuable peut recourir, en complément d'un recours en annulation, si l'administration a pris à son encontre une décision exécutoire dont il souhaite obtenir la suspension, en attendant le jugement qui décidera si elle doit ou non être annulée.
in scheme: FINANCES PUBLIQUES
in scheme: Contentieux Fiscal
in scheme: Fiscalité
notation: REFIP3301

créancier hypothécaire
type: ConceptReFip
type: Concept
broader: créancier privilégié
definition: Créancier bénéficiant d'un droit d'hypothèque sur un immeuble du débiteur. Ce droit constitue une garantie lui permettant d'obtenir la remise du produit de la vente de l'immeuble sur saisie, par préférence aux autres créanciers.
in scheme: FINANCES PUBLIQUES
in scheme: Droit et Justice
in scheme: Divisions du Droit
in scheme: Droit Privé
notation: REFIP3302

fonds départemental de la taxe professionnelle
type: ConceptReFip
type: Concept
broader: fonds (non-descripteur)
definition: Fonds créés pour mettre en oeuvre une péréquation horizontale du produit de taxe professionnelle (TP) au niveau départemental, et qui ont été modifiés lors de la réforme de la TP. Cette dotation est désormais prélevée sur les recettes de l'Etat et répartie par le conseil départemental entre les communes et les EPCI défavorisés par la faiblesse de leur potentiel fiscal ou l'importance de leurs charges.
in scheme: FINANCES PUBLIQUES
in scheme: Dépenses publiques
in scheme: Gestion Publique
notation: REFIP3303
scope note: Les Fonds Départementaux de Péréquation de la Taxe Professionnelle (FDPTP) ont été supprimés en 2011

Anguilla
type: ConceptReFip
type: Concept
broader: Caraïbes
definition: Pays
in scheme: FINANCES PUBLIQUES
in scheme: Géographie
in scheme: Amérique
notation: REFIP3304
related: Grande-Bretagne

expérimentation
type: ConceptReFip
type: Concept
alternative label: phase de test
alternative label: période de test
alternative label: période expérimentale
broader: mots outils (liste additive)
definition: Action de tester, d'essayer.
in scheme: FINANCES PUBLIQUES
in scheme: Mots Outils
notation: REFIP3305

Tarn-et-Garonne
type: ConceptReFip
type: Concept
broader: refip-REFIP7036
definition: Département français
in scheme: FINANCES PUBLIQUES
in scheme: Géographie
in scheme: Europe
notation: REFIP3306

application ARCHIPEL
type: ConceptReFip
type: Concept
broader: applications fiscales (non-descripteur)
definition: Application restituant en consultation l'historique des opérations traitées par les centres d'encaissement (TIP et chèques accompagnés de TIP).
in scheme: FINANCES PUBLIQUES
in scheme: Applications Informatiques
in scheme: Applications fiscales
notation: REFIP3307
related: refip-REFIP7044

République Tchèque
type: ConceptReFip
type: Concept
alternative label: Tchéquie
broader: Europe
definition: Pays
in scheme: FINANCES PUBLIQUES
in scheme: Géographie
in scheme: Europe
notation: REFIP3308

établissement public d'aménagement
type: ConceptReFip
type: Concept
broader: établissement public à caractère industriel et commercial
definition: Etablissements publics à caractère industriel et commercial, créés par décret en Conseil d’État, ayant pour objet de favoriser l’aménagement et le développement durable de territoires présentant un caractère d’intérêt national. Pilotés par un conseil d’administration composé de représentants de l’État, de collectivités locales et de personnalités qualifiées, les EPA réalisent des opérations d’aménagement urbain durable. Leur nature partenariale favorise la recherche d’une stratégie partagée autour des projets pour conjuguer l’intérêt national et les enjeux locaux.
in scheme: FINANCES PUBLIQUES
in scheme: Organisation Structurelle de l'Etat
in scheme: Opérateur de l'Etat
in scheme: Administration de L'Etat
notation: REFIP3310

audience publique
type: ConceptReFip
type: Concept
broader: principes généraux (non-descripteur)
definition: Séance au cours de laquelle une juridiction prend connaissance des prétentions des parties, instruit le procès, entend les plaidoiries et rend son jugement. Les débats sont publics. Les portes de la salle d'audience restent ouvertes et toute personne peut y pénétrer pour entendre les litiges présentés au juge.
in scheme: FINANCES PUBLIQUES
in scheme: Principes Généraux
in scheme: Droit et Justice
in scheme: Procédure
notation: REFIP3311

République de Djibouti
type: ConceptReFip
type: Concept
alternative label: Djibouti
broader: Afrique
definition: Pays
in scheme: FINANCES PUBLIQUES
in scheme: Géographie
in scheme: Afrique
notation: REFIP3312

Ministère des Outre-mer
type: ConceptReFip
type: Concept
broader: ministère
definition: Administration exerçant 3 types missions sur l'ensemble des 12 territoires que comptent les Outre-mer. Une mission de souveraineté en exerçant l’autorité de l’Etat Outre-Mer dans les départements d’Outre-Mer. Ses attributions sont celles qu’exerce le Ministère de l’Intérieur en métropole. Dans les territoires d’Outre-Mer, en Nouvelle-Calédonie et dans les autres Collectivités territoriales, il exerce l’autorité de l’Etat dans le respect des statuts et de l’organisation de ces territoires. Une mission d’intervention, au travers du financement du logement social, et des actions d’insertion des jeunes dans les départements d’Outre-Mer. Le Ministère des Outre-Mer exerce également une mission de coordination de l’action des Ministères qui interviennent Outre-Mer dans des domaines précis (par exemple : éducation, culture, jeunesse et sports…) ou pour oeuvrer à son développement économique et social (par exemple : industrie, agriculture, emploi…).
in scheme: FINANCES PUBLIQUES
in scheme: Organisation Structurelle de l'Etat
in scheme: Ministère
in scheme: Administration de L'Etat
notation: REFIP3314
scope note: Depuis le 02/04/2014

publicité d'acte juridique
type: ConceptReFip
type: Concept
alternative label: publicité d'acte administratif
broader: droit civil
definition: Utilisation de procédés divers (affichage, annonces dans les journaux spécialisés ou non, tenue de registres) afin d'assurer la sécurité des transactions et la justice par l'égalité de tous en présence d'une situation donnée.
in scheme: FINANCES PUBLIQUES
in scheme: Droit et Justice
in scheme: Divisions du Droit
in scheme: Droit Privé
narrower: frais de publicité
narrower: annonce légale
narrower: défaut de publication des actes
notation: REFIP3316

contrôle hiérarchisé de la dépense
type: ConceptReFip
type: Concept
alternative label: CHD
broader: dépenses publiques
definition: Méthode de contrôle reposant sur des contrôles plus ciblés et mieux organisés, proportionnés aux risques et aux enjeux les plus importants. Le CHD s'accompagne de restitutions systématiques et périodiques des comptables aux ordonnateurs, qui leur permettent de mieux appréhender la pratique de leurs services en matière de mandatement.
in scheme: FINANCES PUBLIQUES
in scheme: Dépenses publiques
in scheme: Gestion Publique
narrower: référentiel national indicatif
narrower: référentiel national obligatoire
narrower: acquit libératoire
narrower: contrôle allégé en partenariat
notation: REFIP3318

référé conservatoire
type: ConceptReFip
type: Concept
broader: référé administratif
definition: Procédure permettant au juge des référés administratif, en cas d’urgence, d’ordonner toute mesure utile à la demande de l’Administration ou d’un administré, sans faire obstacle à l'exécution d’une décision administrative.
in scheme: FINANCES PUBLIQUES
in scheme: Procédure Administrative
in scheme: Droit et Justice
in scheme: Procédure
notation: REFIP3319

déclaration des résultats
type: ConceptReFip
type: Concept
broader: liasse fiscale
definition: Déclaration des résultats professionnels des contribuables exerçant une activité imposée à l'impôt sur le revenu dans la catégorie des BIC (2031), BNC (2035), BA (2143),RF (2072) ou à l'impôt sur les sociétés (2065).
in scheme: FINANCES PUBLIQUES
in scheme: Documentation Fiscale
in scheme: Fiscalité
notation: REFIP332

déchets
type: ConceptReFip
type: Concept
alternative label: déchets dangereux
alternative label: déchets non dangereux
broader: dégradation de l'environnement
definition: Toute substance ou tout objet dont le détenteur se défait ou dont il a l'intention ou l'obligation de se défaire
in scheme: FINANCES PUBLIQUES
in scheme: Environnement
in scheme: Dégradation de l'Environnement
in scheme: Questions de Société
narrower: déchets d'équipements électriques électroniques
narrower: ordures ménagères
narrower: déchets nucléaires
narrower: déchets industriels et commerciaux
notation: REFIP3320
related: refip-REFIP6886
related: refip-REFIP829

Orne
type: ConceptReFip
type: Concept
broader: refip-REFIP7016
definition: Département français
in scheme: FINANCES PUBLIQUES
in scheme: Géographie
in scheme: Europe
notation: REFIP3323

commande publique
type: ConceptReFip
type: Concept
alternative label: achat public
broader: gestion publique
definition: Contrat passé par les personnes publiques pour satisfaire leurs besoins.
in scheme: FINANCES PUBLIQUES
in scheme: Commande publique
in scheme: Gestion Publique
narrower: commande hors marché
narrower: recensement économique de l'achat public
narrower: marché public
narrower: accord cadre
narrower: contrat de prestations intégrées
narrower: mission d'ingénierie et d'architecture
narrower: marché de partenariat
narrower: délégation de service public
narrower: refip-REFIP7046
notation: REFIP3324

créance
type: ConceptReFip
type: Concept
broader: actif
definition: Titre de paiement qui correspond à une livraison de marchandise ou à une prestation de service et qui est exigible à une échéance définie.
in scheme: FINANCES PUBLIQUES
in scheme: Documents comptables
in scheme: Comptabilité
narrower: créance acquise
narrower: titre d'annulation
narrower: créance client
narrower: créance douteuse
narrower: créance litigieuse
notation: REFIP3325
related: créancier

juge aux affaires familiales
type: ConceptReFip
type: Concept
alternative label: JAF
broader: juge judiciaire
definition: Juge du tribunal de grande instance, délégué par le président aux affaires de la famille. Chargé notamment de trancher les litiges touchant au divorce, à la séparation pour les couples non mariés, et aux questions relevant de l'autorité parentale.
in scheme: FINANCES PUBLIQUES
in scheme: Profession Juridique
in scheme: Droit et Justice
in scheme: Organisation Juridictionnelle
notation: REFIP3326

grand livre
type: ConceptReFip
type: Concept
broader: documents comptables
definition: Document comptable obligatoire regroupant l'ensemble des comptes, et dans lequel sont inscrites les écritures du livre-journal.
in scheme: FINANCES PUBLIQUES
in scheme: Documents comptables
in scheme: Comptabilité
notation: REFIP3327

avis de préinformation des marchés (supprimé)
type: ConceptReFip
type: Concept
broader: ZZ
in scheme: FINANCES PUBLIQUES
notation: REFIP3328

Jordanie
type: ConceptReFip
type: Concept
broader: Asie
definition: Pays
in scheme: FINANCES PUBLIQUES
in scheme: Géographie
in scheme: Asie
notation: REFIP333

dépenses sans ordonnancement préalable
type: ConceptReFip
type: Concept
broader: dépenses sans ordonnancement
definition: Procédure dérogatoire d'exécution,dans laquelle le comptable public intervient et procède à la mise en paiement de la dépense préalablement à l'ordonnancement par l'ordonnateur.
in scheme: FINANCES PUBLIQUES
in scheme: Dépenses publiques
in scheme: Gestion Publique
notation: REFIP3331

radiation du registre du commerce et des sociétés
type: ConceptReFip
type: Concept
broader: registre du commerce et des sociétés
definition: Déclaration faite, par une société ou un commerçant, auprès du greffe du Tribunal de commerce suite à une cessation d'activité, une dissolution, une fusion de sociétés...
in scheme: FINANCES PUBLIQUES
in scheme: Droit et Justice
in scheme: Divisions du Droit
in scheme: Droit Privé
notation: REFIP3332

application GESCO
type: ConceptReFip
type: Concept
alternative label: GESCO
broader: applications fiscales (non-descripteur)
definition: Application permettant la gestion des commissions départementales des impôts directs.
in scheme: FINANCES PUBLIQUES
in scheme: Applications Informatiques
in scheme: Applications fiscales
notation: REFIP3333

police nationale
type: ConceptReFip
type: Concept
broader: Ministère de l'Intérieur
definition: Direction générale du ministère de l'Intérieur, les missions principales de la police nationale sont la sécurité et la paix publiques, consistant à veiller à l'exécution des lois, à assurer la protection des personnes et des biens, à prévenir les troubles à l'ordre public et à la tranquillité publique ainsi que la délinquance ; la recherche et le constat des infractions pénales, d'en rassembler les preuves, d'en rechercher les auteurs et leurs complices, de les arrêter et de les déférer aux autorités judiciaires compétentes, sous la direction, le contrôle et la surveillance de l'autorité judiciaire ; Le renseignement et l'information, permettant d'assurer l'information des autorités gouvernementales, de déceler et de prévenir toute menace susceptible de porter atteinte à l'ordre public, aux institutions, aux intérêts fondamentaux de la Nation ou à la souveraineté nationale.
in scheme: FINANCES PUBLIQUES
in scheme: Organisation Structurelle de l'Etat
in scheme: Ministère
in scheme: Administration de L'Etat
narrower: police judiciaire
notation: REFIP3334

contrat emploi consolidé
type: ConceptReFip
type: Concept
broader: contrat de travail
definition: Contrat de travail à temps partiel créé en 1992 pour une durée déterminée de 12 mois renouvelables dans la limite de cinq ans. Il peut être signé par les collectivités territoriales, les établissements publics et les associations. La rémunération du salarié est partiellement prise en charge par l'État. Il est destiné aux personnes en difficulté sur le marché du travail, en particulier celles qui, ayant bénéficié d'un ou plusieurs contrats emploi-solidarité n'ont pas trouvé d'emploi à l'issue de ces contrats.
in scheme: FINANCES PUBLIQUES
in scheme: Contrat de Travail
in scheme: Entreprises
in scheme: Travail
notation: REFIP3335
scope note: Supprimé par la loi du 18/01/2005

registre des délibérations
type: ConceptReFip
type: Concept
broader: secteur public local
definition: Registre qui permet d'inscrire, de façon chronologique, l'ensemble des délibérations du conseil municipal, communautaire ou syndical et les décisions prises par le maire, le président, par délégation du conseil municipal, communautaire ou syndical, ou par un adjoint, un vice-président, un conseiller, par subdélégation et d'en assurer la conservation.
in scheme: FINANCES PUBLIQUES
in scheme: Secteur public local
in scheme: Gestion Publique
notation: REFIP3339

application SIT
type: ConceptReFip
type: Concept
broader: applications fiscales (non-descripteur)
definition: Traitement automatisé servant à gérer les agréments des professionnels du commerce de l'automobile pour percevoir les taxes liées aux opérations d'immatriculation des véhicules et de gérer le paiement par voie dématérialisée de ces taxes.
in scheme: FINANCES PUBLIQUES
in scheme: Applications Informatiques
in scheme: Applications fiscales
notation: REFIP334

fait du prince
type: ConceptReFip
type: Concept
broader: force majeure
definition: Toute mesure qui, prise par une autorité publique, aboutit à renchérir le coût d'exécution des prestations contractuelles, dans le droit des contrats administratifs. Certaines de ces mesures ouvrent droit à indemnisation en vertu de la théorie de l'imprévision.
in scheme: FINANCES PUBLIQUES
in scheme: Droit et Justice
in scheme: Divisions du Droit
in scheme: Droit Privé
notation: REFIP3340
related: théorie de l'imprévision

crédit d'impôt en faveur des contribuables pour dépenses de garde d'enfants
type: ConceptReFip
type: Concept
broader: refip-REFIP849
definition: Depuis le 1er janvier 2005, destiné aux contribuables fiscalement domiciliés en France. S'applique aux seules dépenses nécessitées par la garde d'enfants de moins de 6 ans, à l'extérieur du domicile familial.
in scheme: FINANCES PUBLIQUES
in scheme: Liquidation de l'Impôt
in scheme: Fiscalité
notation: REFIP3341

action oblique
type: ConceptReFip
type: Concept
broader: solidarités diverses et actions patrimoniales (non-descripteur)
definition: Action indirecte ou subrogatoire permettant au créancier de se substituer au débiteur défaillant pour exercer à sa place les droits et actions appartenant au débiteur, sans avoir besoin de son consentement ni d'une autorisation judiciaire.
in scheme: FINANCES PUBLIQUES
in scheme: Recouvrement
in scheme: Fiscalité
notation: REFIP3342

conjoncture économique
type: ConceptReFip
type: Concept
broader: économie générale (non-descripteur)
definition: Situation générale de l'économie d'un pays faisant référence aux évolutions économiques de court terme d'un ensemble économique. Elle s'apprécie à l'aide d'indicateurs économiques tels que le taux de croissance du PIB, le taux d'inflation, l'évolution du taux de chômage, la balance commerciale, etc.
in scheme: FINANCES PUBLIQUES
in scheme: Questions Economiques
in scheme: Economie générale
narrower: crise économique
narrower: chômage
notation: REFIP3343

contrainte par corps
type: ConceptReFip
type: Concept
broader: procédure pénale
definition: Incarcération ou maintien en détention une personne solvable qui n’est pas acquittée de certaines amendes, auxquelles elle a été condamnée par le Trésor Public ou l’administration des douanes. Remplacée par la contrainte judiciaire depuis 2004.
in scheme: FINANCES PUBLIQUES
in scheme: Procédure Pénale
in scheme: Droit et Justice
in scheme: Procédure
notation: REFIP3344
scope note: Remplacée par la contrainte judiciaire à compter de 2004

comptabilité générale
type: ConceptReFip
type: Concept
definition: Recensement et évaluation des flux générés par des événements commerciaux, matériels, juridiques et économiques d'une entreprise qui concourent au résultat d'une période, c'est-à-dire l'accroissement ou la diminution de la valeur d'une entreprise.
in scheme: FINANCES PUBLIQUES
in scheme: Comptabilité générale
in scheme: Comptabilité
narrower: comptabilité des immobilisations
narrower: comptabilité supersimplifiée
notation: REFIP3345

application FDL
type: ConceptReFip
type: Concept
broader: applications gestion publique (non-descripteur)
definition: Application de fiscalité directe locale servant d'outil de gestion des bases et de calcul des allocations de fiscalité des collectivités et d'outil de restitution des données fiscales.
in scheme: FINANCES PUBLIQUES
in scheme: Applications Informatiques
in scheme: Applications gestion publique
notation: REFIP3346

droit constitutionnel
type: ConceptReFip
type: Concept
broader: droit public
definition: Ensemble des règles qui définissent l'organisation et le fonctionnement des institutions politiques d'un État (gouvernement, parlement, juridictions).
in scheme: FINANCES PUBLIQUES
in scheme: Droit et Justice
in scheme: Divisions du Droit
in scheme: Droit Public
narrower: promulgation
narrower: éligibilité
narrower: référendum
narrower: question prioritaire de constitutionnalité
narrower: droit de véto
narrower: liberté fondamentale
narrower: pouvoir réglementaire
narrower: réponse ministérielle
narrower: laïcité
narrower: contreseing
narrower: cumul de mandats
notation: REFIP3347

dotation d'équipement des territoires ruraux
type: ConceptReFip
type: Concept
alternative label: DETR
broader: dotation globale d'équipement
definition: Dotation ayant pour objectif de soutenir les projets d’investissement structurants en milieu rural. Les communes répondant à certaines conditions démographiques et de richesse fiscale peuvent bénéficier de la DETR.
in scheme: FINANCES PUBLIQUES
in scheme: Dépenses publiques
in scheme: Gestion Publique
notation: REFIP3348

cotation
type: ConceptReFip
type: Concept
broader: mots outils (liste additive)
definition: Action de coter, de fixer un cours ou une valeur.
in scheme: FINANCES PUBLIQUES
in scheme: Mots Outils
notation: REFIP3349

dette certaine
type: ConceptReFip
type: Concept
alternative label: dette exigible
broader: refip-REFIP831
definition: Dette certaine dans son principe, lorsque la créance née corrélativement dans le patrimoine de l'autre contractant est acquise à ce dernier ; autrement dit, lorsque les parties au contrat sont d'accord sur la chose (bien ou service) et sur le prix et que cet accord n'est subordonné à aucune condition.
in scheme: FINANCES PUBLIQUES
in scheme: Documents comptables
in scheme: Comptabilité
notation: REFIP335

contravention de grande voirie
type: ConceptReFip
type: Concept
broader: contravention
definition: Sanction réprimant les atteintes à l'intégrité ou à l'utilisation du domaine public.
in scheme: FINANCES PUBLIQUES
in scheme: Droit et Justice
in scheme: Infractions et Sanctions
in scheme: Infraction
notation: REFIP3352

plus-value
type: ConceptReFip
type: Concept
alternative label: gain de capital
broader: actif
definition: Différence positive entre le montant de la cession d'un bien, d'un titre immobilier ou mobilier et son prix d'acquisition, ou sa valeur comptable si des amortissements ont été pratiqués.
in scheme: FINANCES PUBLIQUES
in scheme: Documents comptables
in scheme: Comptabilité
narrower: plus-value à long terme
narrower: plus-value à court terme
notation: REFIP3353

application TBFEPS
type: ConceptReFip
type: Concept
alternative label: TBFEPS
alternative label: tableau de bord financier des EPS
alternative label: tableau de bord financier des Etablissements publics de santé
broader: applications gestion publique (non-descripteur)
definition: Tableau de bord financier des établissements publics de santé permettant une analyse financière rétrospective.
in scheme: FINANCES PUBLIQUES
in scheme: Applications Informatiques
in scheme: Applications gestion publique
notation: REFIP3354

application OPALE
type: ConceptReFip
type: Concept
alternative label: OPALE
broader: applications fiscales (non-descripteur)
definition: Application offrant aux usagers professionnels un abonnement générique aux différents e-services qui sont mis à leur disposition depuis le portail fiscal des professionnels.
in scheme: FINANCES PUBLIQUES
in scheme: Applications Informatiques
in scheme: Applications fiscales
notation: REFIP3356

bâtiment de l'Etat
type: ConceptReFip
type: Concept
alternative label: bâtiment civil de l'Etat
alternative label: bâtiment militaire
broader: lieu public
definition: Ensemble des biens immeubles appartenant à l’État, à des collectivités locales et à des établissements publics.
in scheme: FINANCES PUBLIQUES
in scheme: Domaine
in scheme: Gestion Publique
narrower: immeuble de bureaux
notation: REFIP3358

actif imposable
type: ConceptReFip
type: Concept
broader: actif
definition: Richesses d'une entreprise ou d'une personne pouvant être soumises à impôt.
in scheme: FINANCES PUBLIQUES
in scheme: Documents comptables
in scheme: Comptabilité
notation: REFIP3359

majoration fiscale
type: ConceptReFip
type: Concept
alternative label: 0
alternative label: majoration de 0
alternative label: majoration de 10 % pour paiement tardif
alternative label: majoration de 10 % pour retard de dépôt de la déclaration
alternative label: majoration de 5 %
broader: sanction fiscale
definition: Augmentation du montant des cotisations à la charge des contribuables. Certaines majorations ont le caractère de sanction.
in scheme: FINANCES PUBLIQUES
in scheme: Droit de Reprise de l'Administration
in scheme: Fiscalité
narrower: manquement délibéré
notation: REFIP336

Pôle national d'analyse financière du secteur public local analyse des risques des collectivités locales et agrégation territorialisée
type: ConceptReFip
type: Concept
alternative label: PNSR de Montpellier
alternative label: Pôle de Montpellier
broader: Pôle national de soutien au réseau
definition: Pôle soutenant l'ensemble des acteurs impliqués dans l'offre de conseil financier et fiscal dans le secteur public local et de la santé au niveau départemental, via l'appui aux chargés de mission analyse financière et au niveau régional, dans le cadre du conseil aux décideurs publics locaux.
in scheme: FINANCES PUBLIQUES
in scheme: Organisation Structurelle de l'Etat
in scheme: Ministère
in scheme: Administration de L'Etat
notation: REFIP3361

taxe additionnelle
type: ConceptReFip
type: Concept
broader: impôt
definition: Taxe qui est ajoutée à une autre taxe et/ou droits ou contributions, et qui est liquidée dans les mêmes conditions que les droits et taxes auxquels elle s'ajoute.
in scheme: FINANCES PUBLIQUES
in scheme: Fiscalité
in scheme: Impôt
narrower: refip-REFIP7211
notation: REFIP3363

Haute-Normandie (obsolète)
type: ConceptReFip
type: Concept
is replaced by: refip-REFIP7016
broader: ZZ
in scheme: FINANCES PUBLIQUES
notation: REFIP3364

taxe locale sur les enseignes et publicités extérieures
type: ConceptReFip
type: Concept
alternative label: TLPE
alternative label: taxe locale sur la publicité extérieure
broader: refip-REFIP934
definition: Impôt instauré de façon facultative par la commune ou l'établissement public de coopération intercommunal (EPCI), sur le territoire desquels sont situés les dispositifs publicitaires. Elle est due par l'exploitant du dispositif publicitaire, le propriétaire ou celui dans l'intérêt duquel le dispositif est réalisé. Son montant varie selon les caractéristiques des supports publicitaires et la taille de la collectivité.
in scheme: FINANCES PUBLIQUES
in scheme: Fiscalité
in scheme: Impôt
notation: REFIP3365

génie civil
type: ConceptReFip
type: Concept
broader: construction
definition: Ensemble des techniques concernant les constructions civiles. Les ingénieurs en génie civil s’occupent de la conception, de la réalisation, de l’exploitation et de la réhabilitation d’ouvrages et d’infrastructures dont ils assurent la gestion et la sécurité du public.
in scheme: FINANCES PUBLIQUES
in scheme: Branche d'activité
in scheme: Questions Economiques
in scheme: Construction
notation: REFIP3366

association générale des institutions de retraite des cadres
type: ConceptReFip
type: Concept
alternative label: AGIRC
broader: organisme de sécurité sociale
definition: Personne morale de droit privé à but non lucratif et remplissant une mission d’intérêt général, l'Institution gère le régime de retraite des cadres du secteur privé de l’industrie, du commerce, des services et de l’agriculture. Elle a pour missions d'informer, de coordonner et de contrôler les institutions Agirc, de centraliser les résultats statistiques et financiers et de réaliser les prévisions.
in scheme: FINANCES PUBLIQUES
in scheme: Organisation Structurelle de l'Etat
in scheme: Organisme de Sécurité Sociale
in scheme: Administration de L'Etat
notation: REFIP3367

délégation d'habilitation
type: ConceptReFip
type: Concept
broader: habilitation
definition: Décision par laquelle une autorité administrative transfère à une personne le droit d'effectuer, au sein d'une application informatique, certaines opérations selon le niveau d'habilitation octroyé.
in scheme: FINANCES PUBLIQUES
in scheme: Informatique
in scheme: Communication Documentation Informatique
notation: REFIP3368

dotation
type: ConceptReFip
type: Concept
alternative label: dotation annuelle
alternative label: dotation particulière
alternative label: dotation supplémentaire
broader: aide publique
definition: Ensemble des revenus assignés à un service public, une collectivité ou un établissement pour son fonctionnement.
in scheme: FINANCES PUBLIQUES
in scheme: Dépenses publiques
in scheme: Gestion Publique
narrower: dotation de solidarité urbaine et de cohésion sociale
narrower: dotation globale d'équipement
narrower: dotation départementale d'équipement des collèges
narrower: dotation de compensation
narrower: dotation de péréquation
narrower: dotation globale des hôpitaux
narrower: dotation de solidarité communautaire
narrower: dotation de développement urbain
narrower: dotation globale de fonctionnement
narrower: dotation d'installation aux jeunes agriculteurs
narrower: dotation régionale d'équipement scolaire
narrower: dotation forfaitaire de recensement
narrower: refip-REFIP7145
notation: REFIP3369
related: ressources propres

finances publiques
type: ConceptReFip
type: Concept
definition: Etude des ressources, des charges et des comptes des collectivités publiques, c’est-à-dire principalement de l’État, des collectivités territoriales, des organismes de Sécurité sociale, de ceux dépendants étroitement de l’État et des collectivités territoriales (établissements publics), de l’Union européenne.
in scheme: FINANCES PUBLIQUES
notation: REFIP3370

rapport d'activité
type: ConceptReFip
type: Concept
alternative label: rapport annuel
broader: pilotage
definition: Document détaillant les résultats obtenus par la DGFiP dans l’exercice de ses missions fiscales, de gestion publique ou transverses.
in scheme: FINANCES PUBLIQUES
in scheme: Missions Transverses des Finances publiques
in scheme: Pilotage
notation: REFIP3372

Pas-de-Calais
type: ConceptReFip
type: Concept
broader: refip-REFIP7010
definition: Département
in scheme: FINANCES PUBLIQUES
in scheme: Géographie
in scheme: Europe
notation: REFIP3375

dessaisissement
type: ConceptReFip
type: Concept
broader: principes généraux (non-descripteur)
definition: Perte du pouvoir de juger une affaire dont elle était saisie, soit avant de la juger soit du fait de l'avoir jugée (dessaisissement résultant du jugement).
in scheme: FINANCES PUBLIQUES
in scheme: Principes Généraux
in scheme: Droit et Justice
in scheme: Procédure
notation: REFIP3376

dissimulation de revenus
type: ConceptReFip
type: Concept
broader: fraude fiscale
definition: Procédé de fraude qui consiste à ne pas déclarer, à ne pas comptabiliser ou à modifier des éléments utiles à l'assiette en vue d'éluder tout ou partie de l'impôt.
in scheme: FINANCES PUBLIQUES
in scheme: Droit de Contrôle de l'Administration
in scheme: Fiscalité
notation: REFIP3378

échéance
type: ConceptReFip
type: Concept
broader: mots outils (liste additive)
definition: Date à laquelle une opération financière doit être réalisée. Cette opération peut être le remboursement partiel ou total d'une dette, la levée d'une option, le paiement d'un loyer, l'encaissement d'un dividende...
in scheme: FINANCES PUBLIQUES
in scheme: Mots Outils
notation: REFIP3379

système d'exploitation
type: ConceptReFip
type: Concept
broader: refip-REFIP98
definition: Ensemble de programmes qui dirige l'utilisation des capacités d'un ordinateur par des logiciels applicatifs.
in scheme: FINANCES PUBLIQUES
in scheme: Informatique
in scheme: Communication Documentation Informatique
notation: REFIP338

dispense
type: ConceptReFip
type: Concept
broader: mots outils (liste additive)
definition: Autorisation spéciale, donnée par une autorité, qui décharge d’une obligation.
in scheme: FINANCES PUBLIQUES
in scheme: Mots Outils
notation: REFIP3381

indu
type: ConceptReFip
type: Concept
broader: répétition de l'indu
definition: Paiement sans cause. En l'absence de base légale.
in scheme: FINANCES PUBLIQUES
in scheme: Droit et Justice
in scheme: Divisions du Droit
in scheme: Droit Privé
notation: REFIP3382

application VENDOM+
type: ConceptReFip
type: Concept
alternative label: VENDOM+
broader: applications gestion publique (non-descripteur)
definition: Nom donné au projet de refonte des applications métier des ventes domaniales de la DNID.
in scheme: FINANCES PUBLIQUES
in scheme: Applications Informatiques
in scheme: Applications gestion publique
notation: REFIP3384
scope note: Remplacée par l'application HERMES à compter du 18/07/2017

législation
type: ConceptReFip
type: Concept
broader: sources du droit objectif (non-descripteur)
definition: Ensemble des lois (y compris les règlements) d'un État ou des lois relatives à une branche du droit.
in scheme: FINANCES PUBLIQUES
in scheme: Droit et Justice
in scheme: Sources du Droit
in scheme: Sources du Droit Objectif
narrower: loi
narrower: conflit de lois
narrower: hiérarchie des normes
narrower: circulaire
narrower: arrêté municipal
narrower: Constitution de 1958
narrower: arrêté préfectoral
narrower: arrêté ministériel
narrower: règlement européen
narrower: traité européen
narrower: accord international
narrower: décret
narrower: directive
notation: REFIP3385

journée professionnelle
type: ConceptReFip
type: Concept
alternative label: colloque
alternative label: congrès
alternative label: journée d'étude
alternative label: manifestation professionnelle
alternative label: réunion professionnelle
alternative label: séminaire
broader: refip-REFIP6950
definition: Rencontre organisée entre professionnels.
in scheme: FINANCES PUBLIQUES
in scheme: Entreprises
in scheme: Travail
in scheme: 212619
notation: REFIP3386

rôle individuel
type: ConceptReFip
type: Concept
alternative label: rôle
alternative label: rôle nominatif
broader: rôle d'imposition
definition: Rôle concernant les impositions établies de manière individualisée à l'initiative de l'administration.
in scheme: FINANCES PUBLIQUES
in scheme: Documentation Fiscale
in scheme: Fiscalité
notation: REFIP3387

suspension des poursuites
type: ConceptReFip
type: Concept
broader: poursuites
definition: Interdiction temporaire d'engager des mesures de poursuites suite à une disposition légale ou suite à un accord , formalisé solennellement et assorti, le cas échéant, de garanties.
in scheme: FINANCES PUBLIQUES
in scheme: Recouvrement
in scheme: Fiscalité
notation: REFIP3388

bulletin de recoupement
type: ConceptReFip
type: Concept
broader: documentation fiscale (non-descripteur)
definition: Document permettant le croisement d'informations entre différents organismes ou structures afin de faciliter leur contrôle.
in scheme: FINANCES PUBLIQUES
in scheme: Documentation Fiscale
in scheme: Fiscalité
notation: REFIP339

nomadisme numérique
type: ConceptReFip
type: Concept
alternative label: accès nomade
broader: outil collaboratif
definition: Accès à distance de ressources informatiques professionnelles de façon autonome ou connectée. Désigne également les usages et usagers des technologies électroniques et informatiques non filaires.
in scheme: FINANCES PUBLIQUES
in scheme: Communication
in scheme: Communication Documentation Informatique
notation: REFIP3390
related: refip-REFIP7141

établissement public local d'enseignement et de formation professionnelle agricole
type: ConceptReFip
type: Concept
alternative label: EPLEFPA
alternative label: établissement d'enseignement agricole
broader: établissement d'enseignement
definition: Etablissement d'enseignement secondaire qui fonctionne sur le même principe qu'un établissement public local d'enseignement. Il assure une formation générale, technologique et professionnelle initiale et peut dispenser une formation continue. Les compétences de l'État sont assurées par le ministère de l'Agriculture et la direction régionale de l'Alimentation, de l'Agriculture et de la Forêt.
in scheme: FINANCES PUBLIQUES
in scheme: Organisation Territoriale
in scheme: Structures Territoriales
in scheme: Administration de L'Etat
narrower: lycée d'enseignement général et technologique agricole
notation: REFIP3391

procédure
type: ConceptReFip
type: Concept
definition: Ensemble des règles d'organisation judiciaire, de compétence, d'instruction des procès et d'exécution des décisions particulières aux tribunaux de l'ordre judiciaire, civil ou pénal selon le cas.
in scheme: FINANCES PUBLIQUES
in scheme: Droit et Justice
in scheme: Procédure
narrower: principes généraux (non-descripteur)
narrower: procédure administrative
narrower: procédure civile
narrower: procédure pénale
notation: REFIP3394

Code du travail
type: ConceptReFip
type: Concept
broader: documentation juridique (non-descripteur)
definition: Ensemble des lois, règlements, décrets applicables aux relations professionnelles, essentiellement dans le secteur privé (employeur salarié et institutions représentantes du personnel).
in scheme: FINANCES PUBLIQUES
in scheme: Droit et Justice
in scheme: Documentation Juridique
in scheme: Sources du Droit
notation: REFIP3396

taxe forfaitaire sur les cessions de terrains nus devenus constructibles
type: ConceptReFip
type: Concept
alternative label: taxe forfaitaire sur cessions de terrains rendus constructibles
alternative label: taxe sur la cession à titre onéreux de terrains nus rendus constructibles
broader: taxes et redevance de nature immobilière (non-descripteur)
definition: Taxe s'appliquant aux cessions réalisées par les personnes physiques et les sociétés et groupements soumis à l'impôt sur le revenu afférent à la plus-value, et par les contribuables domiciliés hors de France assujettis à l'impôt sur le revenu soumis au prélèvement. Taxe pouvant être instituée par les communes et les établissements publics de coopération intercommunale (EPCI) compétents pour l'élaboration des documents locaux d'urbanisme.
in scheme: FINANCES PUBLIQUES
in scheme: Fiscalité
in scheme: Impôt
notation: REFIP3397

droits de douane
type: ConceptReFip
type: Concept
alternative label: taxe douanière
alternative label: taxe fiscale affectée
alternative label: taxe spéciale sur les huiles
alternative label: taxe sur l'horlogerie bijouterie joaillerie orfèvrerie et les arts de la table
broader: refip-REFIP934
definition: Impôt prélevé sur une marchandise importée lors de son passage à la frontière. Ces droits peuvent être forfaitaires ou représenter un pourcentage du prix.
in scheme: FINANCES PUBLIQUES
in scheme: Fiscalité
in scheme: Impôt
narrower: octroi de mer
narrower: refip-REFIP6909
notation: REFIP3399

crédit d'impôt en faveur de l'aide aux personnes
type: ConceptReFip
type: Concept
alternative label: crédit d'impôt pour dépenses d'acquisition d'équipements pour personnes âgées ou handicapées
alternative label: crédit d'impôt pour dépenses engagées pour la prévention des risques technologiques et naturels
alternative label: crédit d'impôt pour les personnes qui louent des logements
broader: refip-REFIP849
definition: Dispositif institué sous certaines conditions, au profit des contribuables fiscalement domiciliés en France réalisant des dépenses d'installation ou de remplacement d'équipements dans leur habitation principale : équipements pour personnes âgées ou handicapées, ascenseurs électriques, travaux de protection contre les risques technologiques.
in scheme: FINANCES PUBLIQUES
in scheme: Liquidation de l'Impôt
in scheme: Fiscalité
notation: REFIP340

patrimoine
type: ConceptReFip
type: Concept
broader: droit civil
definition: Ensemble des droits et des obligations d'une personne physique ou morale. Le patrimoine comporte un actif et un passif : c'est l'ensemble des créances et des biens, quels qu'ils soient, animaux, mobiliers ou immobiliers, corporels ou incorporels, actuels ou futures. Il comporte aussi le passif : ensemble des dettes.
in scheme: FINANCES PUBLIQUES
in scheme: Droit et Justice
in scheme: Divisions du Droit
in scheme: Droit Privé
narrower: patrimoine immobilier
narrower: patrimoine personnel
narrower: patrimoine social
narrower: patrimoine affecté
narrower: patrimoine foncier
notation: REFIP3400

application HTR
type: ConceptReFip
type: Concept
alternative label: HTR
broader: applications gestion publique (non-descripteur)
definition: Application de gestion comptable des établissements publics de santé.
in scheme: FINANCES PUBLIQUES
in scheme: Applications Informatiques
in scheme: Applications gestion publique
notation: REFIP3401

territorialité de l'impôt
type: ConceptReFip
type: Concept
broader: champ d'application
definition: Règle définissant l'application de l'impôt en fonction du lieu de réalisation de la matière imposable : principe suivant lequel l'impôt est dû dans le pays où le bénéfice a été réalisé, le revenu perçu.
in scheme: FINANCES PUBLIQUES
in scheme: Champ d'Application
in scheme: Fiscalité
narrower: résident étranger
narrower: contribuable étranger
narrower: impatrié
narrower: non-résident
narrower: double imposition
notation: REFIP3402

marché négocié
type: ConceptReFip
type: Concept
alternative label: négociation directe
alternative label: procédure négociée
broader: marché public
definition: Procédure par laquelle l’acheteur public choisit le titulaire du marché après consultation de candidats et négociation des conditions du marché avec un ou plusieurs d’entre eux.
in scheme: FINANCES PUBLIQUES
in scheme: Commande publique
in scheme: Gestion Publique
notation: REFIP3403
related: gré à gré
related: prix provisoire

application LASER D'ANALYSE FINANCIERE (obsolète)
type: ConceptReFip
type: Concept
is replaced by: application LAER
broader: ZZ
in scheme: FINANCES PUBLIQUES
notation: REFIP3405

lettre de relance
type: ConceptReFip
type: Concept
alternative label: lettre de rappel
broader: documentation fiscale (non-descripteur)
definition: Lettre simple adressée au redevable n’ayant pas acquitté l’intégralité de son impôt à la date d’échéance. La lettre de rappel doit être envoyée au moins 21 jours avant la notification du premier acte de poursuites ; elle n’est pas nécessaire avant l’envoi d’un avis à tiers détenteur.
in scheme: FINANCES PUBLIQUES
in scheme: Documentation Fiscale
in scheme: Fiscalité
notation: REFIP3406

sursis à exécution
type: ConceptReFip
type: Concept
broader: décision de justice
definition: Décision dans laquelle les tribunaux administratifs (sauf en matière d'ordre public) et le Conseil d'État peuvent ordonner qu'il soit différé à l'exécution d'une décision administrative contre laquelle ils sont saisis d'un recours, ce recours ne faisant pas de lui-même obstacle à cette exécution en raison de son caractère non suspensif.
in scheme: FINANCES PUBLIQUES
in scheme: Principes Généraux
in scheme: Droit et Justice
in scheme: Procédure
notation: REFIP3407

préjudice
type: ConceptReFip
type: Concept
alternative label: dommage
broader: responsabilité civile
definition: Dommage matériel, corporel ou moral subi par une personne par le fait d'un tiers.
in scheme: FINANCES PUBLIQUES
in scheme: Droit et Justice
in scheme: Divisions du Droit
in scheme: Droit Privé
notation: REFIP341

contribution sociale de solidarité des sociétés
type: ConceptReFip
type: Concept
alternative label: contribution sociale de solidarité
broader: impôt direct
definition: Contribution qui finance le régime de protection sociale des travailleurs indépendants (artisans, commerçants, exploitants agricoles par exemple).
in scheme: FINANCES PUBLIQUES
in scheme: Fiscalité
in scheme: Impôt
notation: REFIP3411

société en commandité par action
type: ConceptReFip
type: Concept
broader: société de capitaux
definition: Société de capitaux comprenant deux catégories d'associés : les commandités, considérés comme des associés en nom collectif, et les commanditaires, dont la situation peut être assimilée à celle des actionnaires de société anonyme.
in scheme: FINANCES PUBLIQUES
in scheme: Société
in scheme: Entreprises
in scheme: Forme juridique
notation: REFIP3412

centre régional des œuvres universitaires et scolaires
type: ConceptReFip
type: Concept
alternative label: CROUS
broader: Centre national des œuvres universitaires et scolaires
definition: Etablissement public à caractère administratif chargé principalement de l'aide sociale, de l'accueil des étudiants internationaux, du logement pour étudiants, de la restauration universitaire et de la vie culturelle étudiante. Les CROUS sont animés par un réseau national, le Centre national des œuvres universitaires et scolaires.
in scheme: FINANCES PUBLIQUES
in scheme: Organisation Structurelle de l'Etat
in scheme: Opérateur de l'Etat
in scheme: Administration de L'Etat
notation: REFIP3415

compte de commerce
type: ConceptReFip
type: Concept
broader: refip-REFIP822
definition: État retraçant des opérations de caractère industriel et commercial effectuées à titre accessoire par des services de l'État non dotés de la personnalité morale.
in scheme: FINANCES PUBLIQUES
in scheme: Élaboration du budget
in scheme: Budget
notation: REFIP3419
related: opération commerciale des domaines

contrôle interne comptable et financier
type: ConceptReFip
type: Concept
alternative label: maîtrise des risques financiers et comptables
broader: contrôle interne
definition: Ensemble des processus de production et de communication de l'information comptable et financière et concourrant à la production de données fiables et conformes aux exigences légales et réglementaires.
in scheme: FINANCES PUBLIQUES
in scheme: Missions Transverses des Finances publiques
in scheme: Maîtrise des risques
notation: REFIP342

application CFIR
type: ConceptReFip
type: Concept
broader: applications fiscales (non-descripteur)
definition: Application permettant la gestion des dossiers de contrôle fiscal et en particulier le calcul des conséquences financières (IR et IS) d’un contrôle et l’édition des documents de taxation relatifs à ce contrôle.
in scheme: FINANCES PUBLIQUES
in scheme: Applications Informatiques
in scheme: Applications fiscales
notation: REFIP3420

engagement de tiers
type: ConceptReFip
type: Concept
broader: refip-REFIP880
definition: Élément clé de la gestion des recettes, par symétrie avec l’engagement juridique pour les dépenses. Relèvent notamment de ce cadre, les fonds de concours, les contrats de ventes et prestations de services, les autres produits centralisés en provenance de divers institutionnels, les contrats entre services de l’État...
in scheme: FINANCES PUBLIQUES
in scheme: Budget de l’État
in scheme: Budget
notation: REFIP3421

prescription triennale
type: ConceptReFip
type: Concept
broader: prescription
definition: Mode d’extinction d’un droit résultant de l’inaction de son titulaire dans un délai de 3 ans.
in scheme: FINANCES PUBLIQUES
in scheme: Droit et Justice
in scheme: Droit Général
notation: REFIP3422

cotisation
type: ConceptReFip
type: Concept
broader: mots outils (liste additive)
definition: Somme versée en vue de contribuer à une dépense commune.
in scheme: FINANCES PUBLIQUES
in scheme: Mots Outils
notation: REFIP3423

situation mensuelle des dépenses
type: ConceptReFip
type: Concept
alternative label: SMD
broader: refip-REFIP982
definition: Document présentant la hiérarchie des des dépenses du budget général et des comptes spéciaux.
in scheme: FINANCES PUBLIQUES
in scheme: Documentation budgétaire
in scheme: Budget
notation: REFIP3425

restitution de crédit d'impôt
type: ConceptReFip
type: Concept
alternative label: remboursement de crédit d'impôt
alternative label: restitution d'avoir fiscal
broader: recouvrement
in scheme: FINANCES PUBLIQUES
in scheme: Recouvrement
in scheme: Fiscalité
notation: REFIP3426

fonds d'orientation et de régularisation des marchés agricoles (supprimé)
type: ConceptReFip
type: Concept
broader: ZZ
in scheme: FINANCES PUBLIQUES
notation: REFIP3427

Fonds national de l'emploi
type: ConceptReFip
type: Concept
alternative label: FNE
broader: chapitre budgétaire
definition: Organisme qui contribue au financement de mesures destinées à remédier aux conséquences des mutations et des reconversions industrielles. le FNE n'est pas un organisme doté de la personnalité juridique. C'est un chapitre budgétaire qui regroupe un ensemble de crédits inscrits au budget du ministère chargé de l'emploi.
in scheme: FINANCES PUBLIQUES
in scheme: Exécution du budget
in scheme: Budget
notation: REFIP3429

gestion de fait
type: ConceptReFip
type: Concept
broader: responsabilité des comptables
definition: Maniement de deniers publics par une personne n'ayant pas la qualité de comptable public ou n'agissant pas pour le compte ou sous le contrôle d'un comptable public. Seul le juge des comptes est compétent pour qualifier un tel maniement de gestion de fait et pour déterminer les montants du débet et/ou des amendes.
in scheme: FINANCES PUBLIQUES
in scheme: Responsabilité des comptables
in scheme: Missions Transverses des Finances publiques
notation: REFIP343

concurrence
type: ConceptReFip
type: Concept
broader: économie générale (non-descripteur)
definition: Structure d'un marché se caractérisant par une pluralité d'entreprises en compétition les unes par rapport aux autres pour bénéficier de la préférence des consommateurs.
in scheme: FINANCES PUBLIQUES
in scheme: Questions Economiques
in scheme: Economie générale
narrower: concurrence déloyale
notation: REFIP3430

amortissement Besson neuf
type: ConceptReFip
type: Concept
broader: avantage fiscal
definition: Dispositif de défiscalisation concernant les propriétaires de logements acquis neufs ou en l'état futur d'achèvement, entre le 1er janvier 1999 et le 2 avril 2003, qui peuvent demander à bénéficier d'une déduction au titre de l'amortissement.
in scheme: FINANCES PUBLIQUES
in scheme: Liquidation de l'Impôt
in scheme: Fiscalité
notation: REFIP3431

Direction générale des douanes et droits indirects
type: ConceptReFip
type: Concept
alternative label: DGDDI
alternative label: douanes
broader: refip-REFIP7061
definition: Placée sous l'autorité du Ministère de l'Action et des Comptes publics, elle exerce une mission de régulation et de contrôle des exportations et importations et une mission de soutien à la compétitivité économique des entreprises. Elle est notamment chargée de fluidifier et de sécuriser les échanges économiques, au niveau national, international et européen, en particulier en luttant contre la fraude. Elle participe à la mise en œuvre des mesures tendant à la protection de la sécurité et de la santé publiques. Elle exerce enfin une mission fiscale puisqu’elle perçoit des taxes et droits indirects pour le compte de l’Union européenne, de l’État, de certaines collectivités territoriales et des établissements publics. Elle participe au contrôle des personnes aux frontières.
in scheme: FINANCES PUBLIQUES
in scheme: Organisation Structurelle de l'Etat
in scheme: Ministère
in scheme: Administration de L'Etat
notation: REFIP3432

crédit d'impôt pour dépenses de recherche
type: ConceptReFip
type: Concept
alternative label: crédit d'impôt en faveur de la recherche
alternative label: crédit d'impôt en faveur des entreprises effectuant des dépenses de recherche
alternative label: crédit d'impôt recherche
broader: refip-REFIP849
definition: Dispositif institué au profit des entreprises industrielles, commerciales ou agricoles imposées d'après leur bénéfice réel, ou exonérées selon certaines dispositions du code général des impôts, qui effectuent des opérations de recherche scientifique ou technique, telles que les activités de recherche fondamentale, les activités de recherche appliquée et les activités de développement expérimental.
in scheme: FINANCES PUBLIQUES
in scheme: Liquidation de l'Impôt
in scheme: Fiscalité
notation: REFIP3433

greffier
type: ConceptReFip
type: Concept
broader: charges et offices
definition: Titulaire de charge : officier ministériel chargé de diriger les services d'un greffe de tribunal de commerce et, à titre transitoire, de ceux du siège de cours d'appel, tribunaux de grande instance et tribunaux d'instance,
in scheme: FINANCES PUBLIQUES
in scheme: Profession Juridique
in scheme: Droit et Justice
in scheme: Organisation Juridictionnelle
notation: REFIP3434

sûreté personnelle
type: ConceptReFip
type: Concept
broader: refip-REFIP877
definition: Garantie accordée apportée par un tiers au créancier lui permettant d'obtenir paiement de sa créance en cas de défaillance du débiteur.
in scheme: FINANCES PUBLIQUES
in scheme: Recouvrement
in scheme: Fiscalité
narrower: cautionnement
notation: REFIP3435

régime réel d'imposition
type: ConceptReFip
type: Concept
broader: régime d'imposition
definition: Régime fiscal des exploitants individuels ou les personnes morales soumises à l'IR ou à l'IS, qui s'applique en fonction du chiffres d'affaires basé sur les produits et charges réelles du professionnel et impliquant des obligations déclaratives spécifiques.
in scheme: FINANCES PUBLIQUES
in scheme: Régime d'Imposition
in scheme: Fiscalité
narrower: régime simplifié d'imposition
narrower: régime du réel normal
notation: REFIP3437

marché de définition (supprimé)
type: ConceptReFip
type: Concept
broader: ZZ
in scheme: FINANCES PUBLIQUES
notation: REFIP3439

eau
type: ConceptReFip
type: Concept
broader: milieu naturel
definition: Elément naturel liquide.
in scheme: FINANCES PUBLIQUES
in scheme: Environnement
in scheme: Milieu Naturel
in scheme: Questions de Société
notation: REFIP344

crédit d'impôt pour dépenses de formation des dirigeants
type: ConceptReFip
type: Concept
alternative label: crédit d'impôt formation des dirigeants d'entreprise
alternative label: crédit d'impôt pour formation du chef d'entreprise
broader: refip-REFIP849
definition: Dispositif institué au profit des entreprises imposées d'après leur bénéfice réel ou exonérées en applications de certaines dispositions prévues au code général des impôts. Ce dispositif s'applique quel que soit le mode d'exploitation de ces entreprises (entreprise individuelle, société de personnes, société de capitaux, etc.).
in scheme: FINANCES PUBLIQUES
in scheme: Liquidation de l'Impôt
in scheme: Fiscalité
notation: REFIP3440

incessibilité
type: ConceptReFip
type: Concept
alternative label: cessibilité
broader: aliénation de biens
definition: Synonyme d'inaliénabilité mais employé de préférence quand il s'agit d'un bien incorporel (brevet, fonds de commerce etc,).
in scheme: FINANCES PUBLIQUES
in scheme: Droit et Justice
in scheme: Divisions du Droit
in scheme: Droit Privé
notation: REFIP3441

maîtrise des risques
type: ConceptReFip
type: Concept
definition: Ensemble des dispositifs ou processus organisés, formalisés et permanents, choisis par l'encadrement et mis en oeuvre par les responsables de tous niveaux pour maîtriser le fonctionnement de leurs activités en vue de fournir une assurance raisonnable quant à la réalisation de leurs objectifs.
in scheme: FINANCES PUBLIQUES
in scheme: Missions Transverses des Finances publiques
in scheme: Maîtrise des risques
narrower: système d'information financière de l'Etat
narrower: contrôle interne
narrower: cartographie des processus
narrower: analyse des risques
narrower: cartographie des risques
narrower: grille d'analyse des risques
narrower: guide de procédure
narrower: refip-REFIP7000
notation: REFIP3442

indemnité de licenciement
type: ConceptReFip
type: Concept
broader: indemnité
definition: Rémunération accessoire versée à un fonctionnaire titulaire licencié dans des cas limitativement prévus par la loi.
in scheme: FINANCES PUBLIQUES
in scheme: Gestion des ressources humaines
in scheme: Fonction Publique et Gestion des Ressources Humaines
notation: REFIP3443

Poitou-Charentes (obsolète)
type: ConceptReFip
type: Concept
is replaced by: refip-REFIP7020
broader: ZZ
in scheme: FINANCES PUBLIQUES
notation: REFIP3444

autocontrôle
type: ConceptReFip
type: Concept
broader: contrôle interne de premier niveau
definition: Contrôle exercé par un agent sur ses propres opérations, a priori ou contemporain, intégré à une procédure donnée et obligatoirement formalisé
in scheme: FINANCES PUBLIQUES
in scheme: Missions Transverses des Finances publiques
in scheme: Maîtrise des risques
notation: REFIP3445

agression
type: ConceptReFip
type: Concept
alternative label: menace
alternative label: violences
broader: refip-REFIP660
definition: Acte violent, soudain et non provoqué à l'encontre d'une ou plusieurs personnes. Les agressions sont de trois types : verbales, physiques, sexuelles
in scheme: FINANCES PUBLIQUES
in scheme: Droit et Justice
in scheme: Infractions et Sanctions
in scheme: Infraction
notation: REFIP3447

acte d'engagement
type: ConceptReFip
type: Concept
broader: candidature à un marché public
definition: Document signé par un candidat à un accord-cadre ou à un marché public dans lequel le candidat présente son offre ou sa proposition dans le respect des clauses du cahier des charges.
in scheme: FINANCES PUBLIQUES
in scheme: Commande publique
in scheme: Gestion Publique
narrower: offre à un marché public
notation: REFIP3448

Agence du patrimoine immatériel de l'Etat
type: ConceptReFip
type: Concept
alternative label: APIE
broader: Ministère de l'Economie et des Finances
definition: Service à compétence nationale créé au sein des ministères de l' économie et des finances, l’APIE a pour but d'optimiser l’impact de la gestion du patrimoine immatériel sur l’économie, de tirer parti d’une meilleure valorisation des actifs pour moderniser les services publics, de soutenir la conduite des politiques publiques au profit des usagers et de contribuer au désendettement et, enfin de prémunir l’État et les usagers contre d’éventuels risques de détournement.
in scheme: FINANCES PUBLIQUES
in scheme: Organisation Structurelle de l'Etat
in scheme: Ministère
in scheme: Administration de L'Etat
notation: REFIP3451
related: refip-REFIP7061

étude de faisabilité
type: ConceptReFip
type: Concept
alternative label: étude technique
broader: document
definition: Travaux d'analyse réalisés afin de s'assurer de la réalisation possible d'un projet du point de vue technique, organisationnel, structurel...
in scheme: FINANCES PUBLIQUES
in scheme: Documentation
in scheme: Communication Documentation Informatique
notation: REFIP3453

affirmation de sincérité
type: ConceptReFip
type: Concept
broader: fiscalité du patrimoine
definition: Mention finale portée sur chaque acte de vente immobilière ou cession de fonds de commerce dans laquelle les parties certifient que l'acte comporte l'intégralité du prix (et des charges).
in scheme: FINANCES PUBLIQUES
in scheme: Champ d'Application
in scheme: Fiscalité
notation: REFIP3455

Office français de l'immigration et de l'intégration
type: ConceptReFip
type: Concept
alternative label: Agence nationale de l'accueil des étrangers et des migrations
alternative label: OFII
alternative label: Office des migrations internationales
broader: établissement public à caractère administratif
definition: Etablissement public placé sous la tutelle du Ministère de l’Intérieur, l’OFII remplit 4 principales missions que l’Etat lui a déléguées : la gestion des procédures régulières aux côtés ou pour le compte des préfectures et des postes diplomatiques et consulaires, l’accueil et l’intégration des immigrés autorisés à séjourner durablement en France et signataires à ce titre d’un contrat d’accueil et d’intégration avec l’État, l’accueil des demandeurs d’asile ainsi que l’aide au retour et à la réinsertion des étrangers dans leur pays d’origine. L’OFII est désormais le seul opérateur de l’Etat en charge de l’immigration légale.
in scheme: FINANCES PUBLIQUES
in scheme: Organisation Structurelle de l'Etat
in scheme: Opérateur de l'Etat
in scheme: Administration de L'Etat
notation: REFIP3457

établissement de transfusion sanguine
type: ConceptReFip
type: Concept
broader: refip-REFIP834
definition: Groupement d'intérêt public ou association régie par la loi de juillet 1901, les établissements de transfusion sanguine sont agréés par l'Etat et autorisés à collecter le sang et ses composants, à préparer des produits sanguins labiles et à les distribuer, sous la direction et la responsabilité d'un médecin ou d'un pharmacien.
in scheme: FINANCES PUBLIQUES
in scheme: Organisation Structurelle de l'Etat
in scheme: Opérateur de l'Etat
in scheme: Administration de L'Etat
notation: REFIP3459

démarche stratégique
type: ConceptReFip
type: Concept
broader: pilotage
definition: Projet stratégique résultant de travaux et d’échanges, définissant l’ambition de la DGFiP sur plusieurs années tout en poursuivant son adaptation aux évolutions de la société, de l’économie et des territoires pour répondre aux attentes des citoyens et de ses partenaires.
in scheme: FINANCES PUBLIQUES
in scheme: Missions Transverses des Finances publiques
in scheme: Pilotage
notation: REFIP3460

transport de personnes
type: ConceptReFip
type: Concept
broader: refip-REFIP766
definition: Activité de transport de personnes ou de voyageurs comprenant tout mouvement de voyageurs à bord d'un mode de transport quel qu'il soit ferroviaire, routier, maritime, aérien ...
in scheme: FINANCES PUBLIQUES
in scheme: Branche d'activité
in scheme: Questions Economiques
in scheme: Transports
narrower: ambulance
narrower: transports en commun
notation: REFIP3461

Autorité de gestion
type: ConceptReFip
type: Concept
broader: direction régionale des finances publiques
definition: Autorité publique ou un organisme public ou privé national, régional ou local désigné par l’État membre pour gérer un programme de financement européen. L’Autorité de gestion est responsable de la rédaction du programme, c’est-à-dire, de décider dans un cadre partenarial quelles actions vont être financées par les fonds (dans le respect des obligations réglementaires et de l’Accord de partenariat) et, une fois le programme en marche, elle sélectionne les porteurs de projets et gère l’octroi et le suivi des fonds accordés.
in scheme: FINANCES PUBLIQUES
in scheme: Organisation Structurelle de l'Etat
in scheme: Ministère
in scheme: Administration de L'Etat
notation: REFIP3462

déclaration de recettes
type: ConceptReFip
type: Concept
broader: documents comptables
definition: Document répertoriant l'ensemble des recettes perçues par une entité ou permettant de déclarer la totalité des ventes de produits et de services encaissées par une entreprise.
in scheme: FINANCES PUBLIQUES
in scheme: Documents comptables
in scheme: Comptabilité
notation: REFIP3463

frais déductibles
type: ConceptReFip
type: Concept
broader: déduction fiscale
definition: Terme courant pour désigner les frais venant en déduction du revenu imposable. En Impôt sur le revenu, il s'agit des frais professionnels (régime frais réels ou forfaitaire) ou des charges déductibles.
in scheme: FINANCES PUBLIQUES
in scheme: Liquidation de l'Impôt
in scheme: Fiscalité
narrower: charge déductible
narrower: déduction des intérêts
narrower: frais réels
narrower: réparations locatives
narrower: frais professionnels
narrower: don
notation: REFIP3467

cotraitance
type: ConceptReFip
type: Concept
alternative label: GME
alternative label: groupement momentané d'entreprises
broader: exécution d'un marché public
definition: Type d'entreprise dans laquelle deux ou plusieurs entrepreneurs constituent un groupement momentané dans le but d'entretenir entre eux des liens juridiques économiques et financiers.
in scheme: FINANCES PUBLIQUES
in scheme: Commande publique
in scheme: Gestion Publique
notation: REFIP3468

fiscalité
type: ConceptReFip
type: Concept
alternative label: gestion fiscale
definition: Ensemble des lois, règlements, procédures et pratiques administratives relatives à l'impôt.
in scheme: FINANCES PUBLIQUES
in scheme: Fiscalité - Autres notions
in scheme: Fiscalité
narrower: représentant fiscal
narrower: compte fiscal des particuliers
narrower: civisme fiscal
narrower: identifiant unique du contribuable
narrower: annualité de l'impôt
narrower: transparence fiscale
narrower: compte fiscal des professionnels
narrower: fait générateur
narrower: tiers de confiance
narrower: numéro individuel d'identification
narrower: application mesurée de la loi fiscale
narrower: tiers déclarant
narrower: occurrence fiscale
narrower: télédéclarant
narrower: défiscalisation
narrower: publicité de l'impôt
notation: REFIP3470

mutation à titre gratuit
type: ConceptReFip
type: Concept
alternative label: transmission à titre gratuit
broader: fiscalité du patrimoine
definition: Transfert d'un bien d'un patrimoine dans un autre sans contre-partie (donation, succession) soumis à droits d'enregistrement.
in scheme: FINANCES PUBLIQUES
in scheme: Champ d'Application
in scheme: Fiscalité
narrower: donation
notation: REFIP3471

principe du contradictoire
type: ConceptReFip
type: Concept
broader: principes généraux (non-descripteur)
definition: Principe impliquant la liberté pour chacune des parties de faire connaître tout ce qui est nécessaire au succès de sa demande ou de sa défense. Il impose que toute démarche, toute présentation au juge d'une pièce, d'un document, d'une preuve par l'adversaire soit portée à la connaissance de l'autre partie et librement discutée à l'audience.
in scheme: FINANCES PUBLIQUES
in scheme: Principes Généraux
in scheme: Droit et Justice
in scheme: Procédure
notation: REFIP3473

prescription quinquennale
type: ConceptReFip
type: Concept
alternative label: déchéance quinquennale
broader: prescription
definition: Mode d’extinction d’un droit résultant de l’inaction de son titulaire dans un délai de 5 ans (droit commun).
in scheme: FINANCES PUBLIQUES
in scheme: Droit et Justice
in scheme: Droit Général
notation: REFIP3475

chambre d'agriculture
type: ConceptReFip
type: Concept
broader: chambre consulaire
definition: Etablissement public dirigé par des élus, représentant l'ensemble des acteurs du monde agricole, rurale et forestier (exploitants, propriétaires, salariés, groupements professionnels… ). Elle est investie de 3 missions principales : contribuer à l’amélioration de la performance économique, sociale et environnementale des exploitations agricoles et de leurs filières; accompagner dans les territoires (la démarche entrepreneuriale et responsable des agriculteurs ainsi que la création d’entreprise et le développement de l’emploi); et assurer une fonction de représentation auprès des pouvoirs publics et des collectivités territoriales.
in scheme: FINANCES PUBLIQUES
in scheme: Organisation Structurelle de l'Etat
in scheme: Opérateur de l'Etat
in scheme: Administration de L'Etat
notation: REFIP3476

bail commercial
type: ConceptReFip
type: Concept
broader: refip-REFIP95
definition: Contrat de location auxquels les parties donnent une destination commerciale, industrielle ou artisanale et qui est soumis à un statut dérogatoire au droit commun.
in scheme: FINANCES PUBLIQUES
in scheme: Droit et Justice
in scheme: Divisions du Droit
in scheme: Droit Privé
narrower: refip-REFIP912
notation: REFIP3479

valeur d'équivalence
type: ConceptReFip
type: Concept
alternative label: évaluation par équivalence
broader: passif
definition: Somme égale à la quote-part des capitaux propres correspondant aux titres, augmentée du montant de l'écart d'acquisition.
in scheme: FINANCES PUBLIQUES
in scheme: Documents comptables
in scheme: Comptabilité
notation: REFIP348

Albanie
type: ConceptReFip
type: Concept
broader: Europe
definition: Pays
in scheme: FINANCES PUBLIQUES
in scheme: Géographie
in scheme: Europe
notation: REFIP3480

état annuel des certificats reçus
type: ConceptReFip
type: Concept
alternative label: DC7
alternative label: NOTI2
broader: candidature à un marché public
definition: Document permettant au candidat retenu de justifier de la régularité de sa situation fiscale et sociale. Il se substitue aux attestations et certificats fiscaux et sociaux que le candidat retenu doit produire avant la signature et la notification du marché public.
in scheme: FINANCES PUBLIQUES
in scheme: Commande publique
in scheme: Gestion Publique
notation: REFIP3481

contrôle sur pièces
type: ConceptReFip
type: Concept
broader: contrôle fiscal
definition: Forme de contrôle exercé dans les locaux de la DGFIP à partir des éléments qu'elle a obtenus auprès de tiers et qui s'accompagne d'un débat écrit et contradictoire avec le contribuable.
in scheme: FINANCES PUBLIQUES
in scheme: Droit de Contrôle de l'Administration
in scheme: Fiscalité
narrower: dossier à fort enjeu
notation: REFIP3482

éducation plein-air finances
type: ConceptReFip
type: Concept
alternative label: EPAF
broader: secrétariat général des ministères économiques et financiers
definition: Association régie par la loi du 1er juillet 1901, sous convention avec les ministères économique et financier. L'EPAF propose dans le cadre de l’action sociale de ces ministères des prestations de vacances et de loisirs pour tous les agents et retraités, tout au long de l’année.
in scheme: FINANCES PUBLIQUES
in scheme: Organisation Structurelle de l'Etat
in scheme: Ministère
in scheme: Administration de L'Etat
notation: REFIP3483

taxe sur le transport public aérien et maritime
type: ConceptReFip
type: Concept
alternative label: taxe sur le transport public aérien et maritime en provenance ou à destination de la Corse
broader: refip-REFIP934
definition: Taxe due par les entreprises de transport public aérien et maritime de voyageurs à raison de chaque passager embarqué ou débarqué en Corse. La taxe est assise sur le nombre de passagers titulaires d'un titre de transport ayant donné lieu à paiement quel que soit leur lieu de résidence.
in scheme: FINANCES PUBLIQUES
in scheme: Fiscalité
in scheme: Impôt
notation: REFIP3484

application TIPI
type: ConceptReFip
type: Concept
alternative label: TIPI
alternative label: titre payable sur internet
broader: applications fiscales (non-descripteur)
definition: Application permettant aux usagers de payer les produits locaux par internet.
in scheme: FINANCES PUBLIQUES
in scheme: Applications Informatiques
in scheme: Applications fiscales
notation: REFIP3486

maniement de fonds
type: ConceptReFip
type: Concept
alternative label: maniement de fonds publics
broader: comptabilité de caisse
definition: Ensemble de recouvrement ou de paiement entraînant le maniement de fonds publics.
in scheme: FINANCES PUBLIQUES
in scheme: Comptabilité publique
in scheme: Comptabilité
narrower: deniers publics
notation: REFIP3487

plafond de ressources
type: ConceptReFip
type: Concept
broader: plafonnement
definition: Montant que les ressources d'une personne ne doivent pas dépasser afin de bénéficier de certains avantages ou dispositifs fiscaux.
in scheme: FINANCES PUBLIQUES
in scheme: Liquidation de l'Impôt
in scheme: Fiscalité
notation: REFIP3489

production des oeuvres de l'esprit
type: ConceptReFip
type: Concept
broader: propriété intellectuelle
definition: Production d'œuvres originales et transmissibles à autrui, définies par le code de la propriété intellectuelle (livres, compositions etc.).
in scheme: FINANCES PUBLIQUES
in scheme: Droit et Justice
in scheme: Divisions du Droit
in scheme: Droit Privé
notation: REFIP3490

prescription quadriennale
type: ConceptReFip
type: Concept
alternative label: déchéance quadriennale
broader: prescription
definition: Principe général de droit administratif. Déchéance d'un droit dans le délai de quatre ans à compter du fait générateur.
in scheme: FINANCES PUBLIQUES
in scheme: Droit et Justice
in scheme: Droit Général
notation: REFIP3491

immobilisation
type: ConceptReFip
type: Concept
alternative label: actif immobilisé
broader: actif
definition: Eléments, physiques ou non, destinés à servir de façon durable à l'activité de l'entreprise et qui ne se consomment pas par le premier usage. Les immobilisations peuvent être incorporelles, corporelles ou financières.
in scheme: FINANCES PUBLIQUES
in scheme: Documents comptables
in scheme: Comptabilité
narrower: immobilisation financière
narrower: immobilisation incorporelle
narrower: immobilisation corporelle
notation: REFIP3493

Direction nationale de vérification des situations fiscales
type: ConceptReFip
type: Concept
alternative label: DNVSF
alternative label: Direction nationale de vérification des situations fiscales personnelles
broader: service à compétence nationale
definition: Service à compétence nationale de la DGFIP chargé du contrôle fiscal des personnes physiques redevables dotées d'un patrimoine ou revenu importants ou dont la situation est jugée sensible. Elle a une compétence supplétive à celle des directions territoriales ou spéciales.
in scheme: FINANCES PUBLIQUES
in scheme: Organisation Structurelle de l'Etat
in scheme: Ministère
in scheme: Administration de L'Etat
notation: REFIP3494

revenu de source française
type: ConceptReFip
type: Concept
broader: revenu imposable
definition: Sont considérés comme revenus de source française : les revenus provenant des immeubles situés en France ou des droits relatifs à ces immeubles ·les revenus des valeurs mobilières françaises et de tous autres capitaux mobiliers placés en France ; les revenus provenant des exploitations situées en France ; les revenus tirés d'activités professionnelles, salariées ou non, exercées en France ; les profits immobiliers professionnels et les produits assimilés sur immeubles situés en France ; les plus-values immobilières sur immeubles situés en France ; les plus-values résultant de la cession de droits sociaux, de sociétés soumises à l'impôt sur les sociétés et ayant leur siège en France.
in scheme: FINANCES PUBLIQUES
in scheme: Champ d'Application
in scheme: Fiscalité
notation: REFIP3497

Ministère de la Décentralisation de la Réforme de l'Etat et de la Fonction publique (obsolète)
type: ConceptReFip
type: Concept
is replaced by: refip-REFIP7061
broader: ZZ
in scheme: FINANCES PUBLIQUES
notation: REFIP3498

brigade de contrôle fiscalité immobilière
type: ConceptReFip
type: Concept
alternative label: BCFI
alternative label: brigade départementale de contrôle fiscalité immobilière
broader: direction départementale des finances publiques
definition: Brigade de la direction générale des finances publiques compétente sur l'ensemble du département et, chargée du contrôle des dossiers des particuliers en matière de succession, d’impôt de solidarité sur la fortune et de contrôle des prix et valeurs retenus pour l'assiette des droits d'enregistrement.
in scheme: FINANCES PUBLIQUES
in scheme: Organisation Structurelle de l'Etat
in scheme: Ministère
in scheme: Administration de L'Etat
notation: REFIP3499

plus-value à court terme
type: ConceptReFip
type: Concept
alternative label: PVCT
broader: plus-value
definition: Différence positive entre le montant de la cession d'un actif détenu depuis moins de 2 ans et sa valeur nette.
in scheme: FINANCES PUBLIQUES
in scheme: Documents comptables
in scheme: Comptabilité
notation: REFIP35

bateau de plaisance
type: ConceptReFip
type: Concept
alternative label: yacht
broader: transport maritime
definition: Bateau destiné à la navigation de plaisance, activité nautique qui est pratiquée pour les loisirs.
in scheme: FINANCES PUBLIQUES
in scheme: Branche d'activité
in scheme: Questions Economiques
in scheme: Transports
notation: REFIP3501

analyse des risques
type: ConceptReFip
type: Concept
broader: maîtrise des risques
definition: Ensemble de la chaîne du risque depuis le recensement des différents risques jusqu’à leur évaluation.
in scheme: FINANCES PUBLIQUES
in scheme: Missions Transverses des Finances publiques
in scheme: Maîtrise des risques
notation: REFIP3503

pénibilité
type: ConceptReFip
type: Concept
broader: refip-REFIP6950
definition: Exposition à un ou plusieurs facteurs de risques professionnels susceptibles de laisser des traces durables, identifiables et irréversibles sur la santé. Ces facteurs de pénibilités sont définis par le code du travail.
in scheme: FINANCES PUBLIQUES
in scheme: Entreprises
in scheme: Travail
in scheme: 212619
notation: REFIP3504

compte d'écart
type: ConceptReFip
type: Concept
broader: CHORUS (non-descripteur)
definition: Compte enregistrant automatiquement les différences trouvées lors des rapprochements automatiques de transactions avec des montants différents.
in scheme: FINANCES PUBLIQUES
in scheme: Comptabilité publique
in scheme: Comptabilité
notation: REFIP3505

pourboire
type: ConceptReFip
type: Concept
broader: accessoire du salaire
definition: Somme d'argent remise comme gratification en plus de la rétribution normale d'un travail ou d'un service.
in scheme: FINANCES PUBLIQUES
in scheme: Entreprises
in scheme: Travail
in scheme: 212619
notation: REFIP3506

condition suspensive
type: ConceptReFip
type: Concept
alternative label: clause suspensive
broader: droit civil
definition: Modalité d'un acte juridique faisant dépendre l'existence d'un droit d'un événement futur dont la réalisation est incertaine. Le droit ne naît, rétroactivement, que si l’événement se produit.
in scheme: FINANCES PUBLIQUES
in scheme: Droit et Justice
in scheme: Divisions du Droit
in scheme: Droit Privé
notation: REFIP3507

fonds européen agricole pour le développement rural
type: ConceptReFip
type: Concept
alternative label: FEADER
broader: fonds européens structurels et d'investissement
definition: Instrument de financement et de programmation unique institué par le règlement (CE) 1290/2005 visant à renforcer la politique de développement rural de l’Union et à en simplifier la mise en œuvre . Il améliore la gestion et le contrôle de la politique de développement rural.
in scheme: FINANCES PUBLIQUES
in scheme: Dépenses publiques
in scheme: Gestion Publique
notation: REFIP3508
related: développement rural

frais de publicité
type: ConceptReFip
type: Concept
broader: publicité d'acte juridique
definition: Frais de publicité légale des actes juridiques.
in scheme: FINANCES PUBLIQUES
in scheme: Droit et Justice
in scheme: Divisions du Droit
in scheme: Droit Privé
notation: REFIP3509

taxe pour frais de chambres de métiers et de l'artisanat
type: ConceptReFip
type: Concept
broader: taxes assimilées aux impôts directs locaux (non descripteur)
definition: Taxe pourvoyant à une partie des dépenses des établissements publics constituant le réseau des chambres de métiers et de l'artisanat. Elle est perçue sous la forme d'une taxe additionnelle à la cotisation foncière des entreprises.
in scheme: FINANCES PUBLIQUES
in scheme: Fiscalité
in scheme: Impôt
notation: REFIP351

Côte d'Ivoire
type: ConceptReFip
type: Concept
broader: Afrique
definition: Pays
in scheme: FINANCES PUBLIQUES
in scheme: Géographie
in scheme: Afrique
notation: REFIP3510

plan de relance
type: ConceptReFip
type: Concept
broader: crise économique
definition: Ensemble de mesures de politique économique décidées par le gouvernement d'un pays ou d'une zone économique, dans le but de provoquer une « relance économique », c’est-à-dire une augmentation de l'activité économique lors des périodes de faible croissance ou de récession.
in scheme: FINANCES PUBLIQUES
in scheme: Questions Economiques
in scheme: Economie générale
notation: REFIP3511

travail dissimulé
type: ConceptReFip
type: Concept
alternative label: dissimulation d'activité
alternative label: dissimulation de salarié
alternative label: travail au noir
alternative label: travail clandestin
broader: travail illégal
definition: Dissimulation intentionnelle de tout ou partie d’un emploi salarié du fait de l’absence de déclaration nominative préalable à l’embauche auprès des organismes de protection sociale, l’absence de bulletin de paie ou la mention sur le bulletin de paie d’un nombre d’heures de travail inférieur à celui réellement effectué. Délit au sens du droit du travail qui se caractérise par le fait de ne pas immatriculer l'entreprise au répertoire des métiers ou au registre du commerce et des sociétés.
in scheme: FINANCES PUBLIQUES
in scheme: Droit et Justice
in scheme: Infractions et Sanctions
in scheme: Infraction
notation: REFIP3513
related: économie souterraine

décret d'avance
type: ConceptReFip
type: Concept
broader: exécution du budget
definition: Dérogation infra annuelle qui permet au gouvernement l'ouverture de crédits en cas d'urgence, dans la limite de 1 % des crédits ouverts en loi de finances initiale, gagées par des annulations de crédits ou la constatation de recettes supplémentaires.
in scheme: FINANCES PUBLIQUES
in scheme: Exécution du budget
in scheme: Budget
notation: REFIP3515

remise gracieuse
type: ConceptReFip
type: Concept
broader: décision administrative gracieuse
definition: Annulation, totale ou partielle, d'impôt direct ou de pénalités, accordée pour des raisons de bienveillance par l'administration.
in scheme: FINANCES PUBLIQUES
in scheme: Contentieux Fiscal
in scheme: Fiscalité
notation: REFIP3516

avance remboursable sous conditions (supprimé)
type: ConceptReFip
type: Concept
broader: ZZ
in scheme: FINANCES PUBLIQUES
notation: REFIP3517

centrale électrique
type: ConceptReFip
type: Concept
alternative label: centrale hydraulique
alternative label: centrale nucléaire
alternative label: centrale thermique
broader: électricité
definition: Site industriel dédié à la production d'électricité.
in scheme: FINANCES PUBLIQUES
in scheme: Branche d'activité
in scheme: Questions Economiques
in scheme: Industrie
notation: REFIP3518

ordonnance de référé
type: ConceptReFip
type: Concept
broader: référé
definition: Décision provisoire rendue à la demande d'une partie par le juge qui n'est pas saisi du principal.
in scheme: FINANCES PUBLIQUES
in scheme: Principes Généraux
in scheme: Droit et Justice
in scheme: Procédure
notation: REFIP3519

application GAP
type: ConceptReFip
type: Concept
alternative label: GAP
alternative label: gestion automatisée des personnels
broader: applications missions transverses (non-descripteur)
definition: Gestion informatisée du personnel de l’ex filière GP, application utilisée jusqu'en 2012.
in scheme: FINANCES PUBLIQUES
in scheme: Applications missions transverses
in scheme: Applications Informatiques
notation: REFIP352

Ecole nationale des finances publiques
type: ConceptReFip
type: Concept
alternative label: Direction du recrutement et de la formation
alternative label: ENFIP
alternative label: ENI
alternative label: ENT
alternative label: Ecole nationale des impôts
alternative label: Ecole nationale du Trésor public
broader: service à compétence nationale
definition: Service à compétences nationale, disposant de prérogatives élargies et renforcées, l'ENFiP conduit des actions de recrutement, de formation professionnelle initiale et de formation professionnelle continue, des actions menées en faveur de la diversité, des missions de production documentaire à vocation pédagogique, des actions de coopération internationale, des partenariats avec d'autres écoles du réseau des écoles de service public. Pour la mise en oeuvre de ses missions, l'ENFIP s'appuie par ailleurs sur un réseau national, inter régionale et régional de centres, d'établissements et de services de formation.
in scheme: FINANCES PUBLIQUES
in scheme: Organisation Structurelle de l'Etat
in scheme: Ministère
in scheme: Administration de L'Etat
narrower: Centre national de documentation des finances publiques
notation: REFIP3521

application CERA
type: ConceptReFip
type: Concept
alternative label: CERA
broader: applications fiscales (non-descripteur)
definition: Gestion du recouvrement forcé et comptabilisation des poursuites extérieures de la Redevance.
in scheme: FINANCES PUBLIQUES
in scheme: Applications Informatiques
in scheme: Applications fiscales
notation: REFIP3523

imposition distincte
type: ConceptReFip
type: Concept
alternative label: déclaration distincte
alternative label: imposition séparée
broader: foyer fiscal
definition: Règle d'imposition dérogatoire à la règle de l'imposition par foyer fiscal permettant une imposition séparée dans certains cas prévus par la loi.
in scheme: FINANCES PUBLIQUES
in scheme: Champ d'Application
in scheme: Fiscalité
notation: REFIP3524

délai de paiement
type: ConceptReFip
type: Concept
broader: recouvrement
definition: Délai convenu entre les parties pour régler les sommes dues et qui ne peut dépasser 60 jours nets à compter de la date d'émission de la facture ou, à titre dérogatoire, 45 jours fin de mois, sous réserve que ce délai dérogatoire soit inscrit dans le contrat et qui ne constitue pas une discrimination manifeste à l’égard du créancier.
in scheme: FINANCES PUBLIQUES
in scheme: Recouvrement
in scheme: Fiscalité
narrower: délai baisse brutale de revenu
narrower: délai de règlement conventionnel
narrower: refip-REFIP6992
notation: REFIP3527

compte fiscal des professionnels
type: ConceptReFip
type: Concept
alternative label: CF PRO
broader: fiscalité
definition: Compte personnel sécurisé sur internet dans lequel chaque entreprise adhérente dispose de services et d’informations sur sa situation fiscale. Elle peut, selon le type d'impôt, déclarer, payer, consulter ses déclarations et connaître l’état de ses paiements et de ses créances.
in scheme: FINANCES PUBLIQUES
in scheme: Fiscalité - Autres notions
in scheme: Fiscalité
notation: REFIP353

indice de qualité des comptes de l'Etat
type: ConceptReFip
type: Concept
alternative label: IQCE
broader: indicateur de performance
definition: Indicateur évaluant la qualité des comptes publics et le dispositif de contrôle interne par la mesure du taux de conformité des opérations comptables contrôlées, au regard des critères de qualité comptable définis.
in scheme: FINANCES PUBLIQUES
in scheme: Missions Transverses des Finances publiques
in scheme: Pilotage
notation: REFIP3530

Code rural et de la pêche maritime
type: ConceptReFip
type: Concept
broader: documentation juridique (non-descripteur)
definition: Ensemble de la réglementation de l'activité agricole, de la pêche maritime et l'aquaculture marine.
in scheme: FINANCES PUBLIQUES
in scheme: Droit et Justice
in scheme: Documentation Juridique
in scheme: Sources du Droit
notation: REFIP3531

équilibre financier
type: ConceptReFip
type: Concept
broader: principe budgétaire
definition: Position de la stabilité du rapport entre les ressources financières et les emplois.
in scheme: FINANCES PUBLIQUES
in scheme: Élaboration du budget
in scheme: Budget
notation: REFIP3534

solde intermédiaire de gestion
type: ConceptReFip
type: Concept
broader: comptabilité analytique
definition: Indicateur de gestion qui est utilisé pour apprécier la gestion d'une entreprise d'un point de vue analytique.
in scheme: FINANCES PUBLIQUES
in scheme: Comptabilité
in scheme: Comptabilité analytique
narrower: valeur ajoutée
notation: REFIP3535

bordereau d'inscription
type: ConceptReFip
type: Concept
broader: documentation fiscale (non-descripteur)
definition: Document résumant les caractéristiques essentielles d'un acte et permettant de prendre des garanties (nantissement, hypothèque, privilège etc,) sur le bien d'un débiteur auprès du service concerné.
in scheme: FINANCES PUBLIQUES
in scheme: Documentation Fiscale
in scheme: Fiscalité
narrower: bordereau de renouvellement
notation: REFIP3536

créance rattachée à des participations (supprimé)
type: ConceptReFip
type: Concept
broader: ZZ
in scheme: FINANCES PUBLIQUES
notation: REFIP3537

conseil municipal
type: ConceptReFip
type: Concept
broader: commune
definition: Organe délibérant de la commune, il représente les habitants. Ses attributions sont très larges notamment chargé de régler "par ses délibérations les affaires de la commune". Cette compétence s’étend à de nombreux domaines. Le conseil municipal donne son avis toutes les fois qu’il est requis par les textes ou par le représentant de l’État.
in scheme: FINANCES PUBLIQUES
in scheme: Organisation Territoriale
in scheme: Structures Territoriales
in scheme: Administration de L'Etat
notation: REFIP3538

admission en non-valeur
type: ConceptReFip
type: Concept
broader: apurement des restes à recouvrer
definition: Procédure administrative interne qui a pour but de faire disparaître des écritures de prise en charge du comptable public les créances irrécouvrables. Contrairement à la remise gracieuse, elle ne fait pas obstacle à un recouvrement ultérieur dans l'hypothèse où le débiteur revient à meilleure fortune.
in scheme: FINANCES PUBLIQUES
in scheme: Recouvrement
in scheme: Fiscalité
narrower: créance irrécouvrable
notation: REFIP354

emprise au sol
type: ConceptReFip
type: Concept
broader: cadastre
definition: Projection verticale du volume de la construction, tous débords et surplombs inclus.
in scheme: FINANCES PUBLIQUES
in scheme: Cadastre
in scheme: Fiscalité
notation: REFIP3540

réseau ferré de France (supprimé)
type: ConceptReFip
type: Concept
broader: ZZ
in scheme: FINANCES PUBLIQUES
notation: REFIP3541

tribunal de police
type: ConceptReFip
type: Concept
broader: juridiction pénale
definition: Juridiction pénale française qui juge les contraventions les plus graves ou complexes commises par des personnes majeures classées dans les contraventions de 5ème classe (suffisamment graves pour être inscrites dans le casier judiciaire).
in scheme: FINANCES PUBLIQUES
in scheme: Droit et Justice
in scheme: Juridiction
in scheme: Organisation Juridictionnelle
notation: REFIP3542

publicité commerciale
type: ConceptReFip
type: Concept
alternative label: agence de publicité
alternative label: prestation de publicité
alternative label: publicité
broader: commerce
definition: Forme de communication, dont le but est de fixer l'attention d’une cible visée, le consommateur.
in scheme: FINANCES PUBLIQUES
in scheme: Branche d'activité
in scheme: Questions Economiques
in scheme: Commerce
narrower: emplacement publicitaire
notation: REFIP3543
related: support de communication

réclamation suspensive de paiement
type: ConceptReFip
type: Concept
broader: réclamation contentieuse
definition: Faculté dont dispose le contribuable qui conteste le bien-fondé ou le montant des impositions mises à sa charge de demander à différer le paiement de la fraction litigieuse des droits et pénalités concernés, dans le cadre d'une réclamation contentieuse recevable.
in scheme: FINANCES PUBLIQUES
in scheme: Contentieux Fiscal
in scheme: Fiscalité
narrower: sursis légal de paiement
notation: REFIP3544

Office national d'études et de recherches aérospatiales
type: ConceptReFip
type: Concept
alternative label: ONERA
alternative label: le Laboratoire aérospatial français
broader: établissement public à caractère industriel et commercial
definition: Etablissement public à caractère industriel et commercial, principal centre de recherche français dans le domaine de l'aérospatiale, il réalise des études à portée pratique soit à son initiative soit à la demande de l'industrie aéronautique et spatiale.
in scheme: FINANCES PUBLIQUES
in scheme: Organisation Structurelle de l'Etat
in scheme: Opérateur de l'Etat
in scheme: Administration de L'Etat
notation: REFIP3545

droit de priorité
type: ConceptReFip
type: Concept
broader: droit administratif
definition: Droit au profit des communes et de certains établissements publics de coopération intercommunale, en matière de cessions du domaine privé immobilier de l’État. Le droit de priorité s’applique sur le territoire du titulaire de ce droit à tout projet de cession d’un immeuble ou de droits sociaux donnant vocation à l’attribution en pleine propriété ou en jouissance d’un immeuble ou d’une partie d’immeuble, effectué par l’Etat, par des sociétés dont il détient la majorité du capital par les établissements publics nationaux suivants et par des établissements publics dont la liste sera fixée par décret.
in scheme: FINANCES PUBLIQUES
in scheme: Droit et Justice
in scheme: Divisions du Droit
in scheme: Droit Public
notation: REFIP3546

Agence centrale des organismes de sécurité sociale
type: ConceptReFip
type: Concept
alternative label: ACOSS
broader: organisme de sécurité sociale
definition: Etablissement public national à caractère administratif, caisse nationale des Urssaf. L’Acoss est chargée d’assurer la gestion commune de la trésorerie des différentes branches du régime général, à la fois en termes d’encaissement des cotisations principalement au travers des Urssaf, mais aussi de mise à disposition des caisses des moyens de financement nécessaires à leurs activités.
in scheme: FINANCES PUBLIQUES
in scheme: Organisation Structurelle de l'Etat
in scheme: Organisme de Sécurité Sociale
in scheme: Administration de L'Etat
notation: REFIP3547

principe d'unité budgétaire
type: ConceptReFip
type: Concept
alternative label: principe d'unité du budget de l'Etat
alternative label: unité budgétaire
alternative label: unité du budget de l'Etat
broader: principe budgétaire
definition: Principe recouvrant deux règles : la règle de l'unité, qui exige que le budget de l’État soit retracé dans un document unique (la loi de finances) et la règle de l’exhaustivité, selon laquelle la loi de finances doit prévoir et autoriser l’ensemble des recettes et des charges de l’État.
in scheme: FINANCES PUBLIQUES
in scheme: Élaboration du budget
in scheme: Budget
notation: REFIP3548

apport en société
type: ConceptReFip
type: Concept
alternative label: apport de bien
alternative label: apport en capital
alternative label: apport en nature
alternative label: apport en numéraire
alternative label: souscription au capital
broader: refip-REFIP998
definition: Biens mis en commun lors de la constitution de la société. Ces apports peuvent être de différentes nature en numéraire, en industrie ou en nature. En contrepartie de cet apport, l’associé reçoit des parts sociales (actions).
in scheme: FINANCES PUBLIQUES
in scheme: Gestion de l'Entreprise
in scheme: Entreprises
in scheme: Vie et Gestion de l'entreprise
notation: REFIP3549

indemnité pour recherche d'emploi (supprimé)
type: ConceptReFip
type: Concept
broader: ZZ
in scheme: FINANCES PUBLIQUES
notation: REFIP3550

enchère électronique
type: ConceptReFip
type: Concept
broader: appel d'offres
definition: Procédé par lequel les candidats à un marché public admis à présenter une offre s’engagent sur une offre de prix transmise par voie électronique dans une période de temps préalablement déterminée par l’acheteur et portée à la connaissance de l’ensemble des candidats.
in scheme: FINANCES PUBLIQUES
in scheme: Commande publique
in scheme: Gestion Publique
notation: REFIP3551

travail illégal
type: ConceptReFip
type: Concept
broader: délit
definition: Travail sanctionné par la loi et qui peut revêtir plusieurs formes, notamment le travail dissimulé, le prêt de main d'œuvre en dehors du cadre légal, l'emploi irrégulier de travailleurs étrangers, ou le trafic de main d'œuvre étrangère.
in scheme: FINANCES PUBLIQUES
in scheme: Droit et Justice
in scheme: Infractions et Sanctions
in scheme: Infraction
narrower: travail dissimulé
notation: REFIP3552

deniers publics
type: ConceptReFip
type: Concept
alternative label: fonds publics
broader: maniement de fonds
definition: Fonds appartenant à un organisme public et soumis aux règles de la comptabilité publique.
in scheme: FINANCES PUBLIQUES
in scheme: Comptabilité publique
in scheme: Comptabilité
notation: REFIP3554

avenant
type: ConceptReFip
type: Concept
broader: droit des obligations et contrats (non-descripteur)
definition: Accord modifiant une convention, en l'adaptant ou en la complétant par de nouvelles clauses.
in scheme: FINANCES PUBLIQUES
in scheme: Droit et Justice
in scheme: Divisions du Droit
in scheme: Droit Privé
notation: REFIP3555

titre d'annulation
type: ConceptReFip
type: Concept
broader: créance
definition: Acte émanant de l'ordonnateur qui a pour but de diminuer ou d’annuler une recette effectuée à tort (erreur tarifs, opposition client, erreur client, etc.).
in scheme: FINANCES PUBLIQUES
in scheme: Documents comptables
in scheme: Comptabilité
notation: REFIP3557

taux d'amortissement (supprimé)
type: ConceptReFip
type: Concept
broader: ZZ
in scheme: FINANCES PUBLIQUES
notation: REFIP3558

indicateur de performance
type: ConceptReFip
type: Concept
broader: pilotage
definition: Représentation chiffrée, l'indicateur de performance mesure le degré d’atteinte d’un objectif préalablement fixé pour aider à prendre des décisions de pilotage et de gestion (allouer des moyens, ajuster un objectif, etc.). Il existe trois critères de performance : efficacité socio-économique, qualité de service, efficience.
in scheme: FINANCES PUBLIQUES
in scheme: Missions Transverses des Finances publiques
in scheme: Pilotage
narrower: indicateur de la qualité des comptes locaux
narrower: indicateur de qualité de service
narrower: indice de qualité des comptes de l'Etat
notation: REFIP3559

centre des impôts fonciers
type: ConceptReFip
type: Concept
alternative label: CDIF
broader: direction départementale des finances publiques
definition: Structure départementale en charge du cadastre qui a pour mission de tenir à jour les documents identifiant parfaitement chaque parcelle de terrain du sol français ainsi que la nature des bâtiments qui y sont construits. Interlocuteur des usagers pour toute question sur le calcul de la valeur locative des biens immobiliers ou demande d’extrait de plan cadastral.
in scheme: FINANCES PUBLIQUES
in scheme: Organisation Structurelle de l'Etat
in scheme: Ministère
in scheme: Administration de L'Etat
notation: REFIP356

Constitution de 1958
type: ConceptReFip
type: Concept
broader: législation
definition: Actuelle Constitution de la France. Norme juridique suprême du pays.
in scheme: FINANCES PUBLIQUES
in scheme: Droit et Justice
in scheme: Sources du Droit
in scheme: Sources du Droit Objectif
notation: REFIP3560

Bulletin officiel des finances publiques-gestion comptable publique
type: ConceptReFip
type: Concept
alternative label: BOFIP-GCP
broader: bulletin officiel
definition: Publication regroupant l'ensemble des instructions et notes de service émanant de la DGFiP et concernant la gestion publique.
in scheme: FINANCES PUBLIQUES
in scheme: Documentation
in scheme: Communication Documentation Informatique
notation: REFIP3562

Egypte
type: ConceptReFip
type: Concept
broader: Afrique
definition: Pays
in scheme: FINANCES PUBLIQUES
in scheme: Géographie
in scheme: Afrique
notation: REFIP3563

Danemark
type: ConceptReFip
type: Concept
broader: Europe
definition: Pays
in scheme: FINANCES PUBLIQUES
in scheme: Géographie
in scheme: Europe
notation: REFIP3564

taxe d'enlèvement des ordures ménagères
type: ConceptReFip
type: Concept
alternative label: TEOM
broader: taxes assimilées aux impôts directs locaux (non descripteur)
definition: Taxe instituée par les communes, les EPCI avec ou sans fiscalité propre et les syndicats mixtes,dès lors qu'ils bénéficient de la compétence prévue à l'article L. 2224-13 du code général des collectivités territoriales (CGCT), c'est-à-dire la collecte et le traitement des déchets des ménages, et qu'ils assurent au moins la collecte des déchets des ménages.
in scheme: FINANCES PUBLIQUES
in scheme: Fiscalité
in scheme: Impôt
notation: REFIP3566
related: redevance d'enlèvement des ordures ménagères
related: ordures ménagères

plafond pluriannuel
type: ConceptReFip
type: Concept
broader: plafonnement
definition: Montant maximum des dépenses prises en compte pour le calcul du crédit d’impôt en faveur des économies d’énergie et du développement durable, sur une période "glissante" de cinq années consécutives.
in scheme: FINANCES PUBLIQUES
in scheme: Liquidation de l'Impôt
in scheme: Fiscalité
notation: REFIP3567

Provence-Alpes-Côte d'Azur
type: ConceptReFip
type: Concept
broader: France métropolitaine
definition: Région française
in scheme: FINANCES PUBLIQUES
in scheme: Géographie
in scheme: Europe
narrower: Alpes-de-Haute-Provence
narrower: Var
narrower: Vaucluse
narrower: Bouches-du-Rhône
narrower: Hautes-Alpes
narrower: refip-REFIP981
notation: REFIP3568

opérateur économique
type: ConceptReFip
type: Concept
broader: candidature à un marché public
definition: Entrepreneurs, fournisseurs et prestataires de services candidats à un marché public.
in scheme: FINANCES PUBLIQUES
in scheme: Commande publique
in scheme: Gestion Publique
notation: REFIP3569

domaine public fluvial
type: ConceptReFip
type: Concept
broader: domaine public
definition: Ensemble du domaine public naturel cours d'eau et lacs domaniaux appartenant à l'Etat, à ses établissements publics, aux collectivités territoriales ou à leurs groupements) et du domaine public artificiel (notamment canaux et plans d'eau appartenant à l'Etat, à ses établissements publics, aux collectivités territoriales ou à leurs groupements ou à un port autonome et classés dans son domaine public fluvial, des ouvrages ou installations appartenant à l'une de ces personnes publiques, qui sont destinés à assurer l'alimentation en eau des canaux et plans d'eau ainsi que la sécurité et la facilité de la navigation, du halage ou de l'exploitation...)
in scheme: FINANCES PUBLIQUES
in scheme: Domaine
in scheme: Gestion Publique
notation: REFIP357
related: cours d'eau
related: refip-REFIP71

Franche-Comté (obsolète)
type: ConceptReFip
type: Concept
is replaced by: refip-REFIP7017
broader: ZZ
in scheme: FINANCES PUBLIQUES
notation: REFIP3570

remontée mécanique
type: ConceptReFip
type: Concept
alternative label: funiculaire
alternative label: télésiège
alternative label: téléski
broader: transports en commun
definition: Moyen de transport en commun de personnes utilisé dans les stations de sports d'hiver, mais également pour accéder à des points isolés tels les belvédères.
in scheme: FINANCES PUBLIQUES
in scheme: Branche d'activité
in scheme: Questions Economiques
in scheme: Transports
notation: REFIP3573

groupement à fiscalité propre
type: ConceptReFip
type: Concept
alternative label: GFP
broader: refip-REFIP821
definition: Structure intercommunale ayant la possibilité de lever l'impôt (taxe d'habitation, taxe sur le foncier bâti et le foncier non bâti et la taxe d'enlèvement des ordures ménagères).
in scheme: FINANCES PUBLIQUES
in scheme: Organisation Territoriale
in scheme: Structures Territoriales
in scheme: Administration de L'Etat
notation: REFIP3574

vente à réméré
type: ConceptReFip
type: Concept
broader: vente
definition: Vente comportant une clause par laquelle le vendeur se réserve le droit de racheter la chose dans un délai maximum de 5 ans, en remboursant à l'acquéreur le prix, le coût du contrat, les réparations nécessaires et celles qui ont augmenté la valeur du fonds, Depuis 2009, le terme « réméré » est remplacé par « rachat » dans un souci de clarification du droit.
in scheme: FINANCES PUBLIQUES
in scheme: Droit et Justice
in scheme: Divisions du Droit
in scheme: Droit Privé
notation: REFIP3575

flagrance fiscale
type: ConceptReFip
type: Concept
broader: droit de contrôle de l'administration (non-descripteur)
definition: Procédure caractérisée par le constat d'un fait frauduleux au moment de sa réalisation et par la prise de mesures conservatoires sans autorisation préalable du juge lorsque les circonstances sont susceptibles de menacer le recouvrement des créances fiscales.
in scheme: FINANCES PUBLIQUES
in scheme: Droit de Contrôle de l'Administration
in scheme: Fiscalité
notation: REFIP3576

crédit d'impôt en faveur des maîtres restaurateurs
type: ConceptReFip
type: Concept
broader: refip-REFIP849
definition: Dispositif institué en faveur des entreprises imposées d'après leur bénéfice réel ou exonérées selon certaines conditions, dont le dirigeant ou un salarié a obtenu le titre de maître-restaurateur entre le 15 novembre 2006 et le 31 décembre 2017, et qui ont engagé des dépenses permettant de satisfaire aux normes d'aménagement et de fonctionnement prévues par le cahier des charges relatif au titre de maître-restaurateur.
in scheme: FINANCES PUBLIQUES
in scheme: Liquidation de l'Impôt
in scheme: Fiscalité
notation: REFIP3577

indemnité d'éviction
type: ConceptReFip
type: Concept
broader: droit commercial
definition: Compensation financière versée au locataire en cas de non-renouvellement du bail commercial à l'initiative du bailleur. Le montant de l'indemnité doit être égale au préjudice subi par le commerçant.
in scheme: FINANCES PUBLIQUES
in scheme: Droit et Justice
in scheme: Divisions du Droit
in scheme: Droit Privé
notation: REFIP3578
related: droit au bail

syndicat intercommunal à vocation multiple
type: ConceptReFip
type: Concept
alternative label: SIVOM
broader: syndicat de communes
definition: Etablissement public de coopération intercommunale, le SIVOM exerce des responsabilités variées qui lui ont été transférées par les différentes communes, souvent du même canton : collecte et traitement des ordures ménagères ; création et entretien de voirie, équipements sportifs, action sociale, eau, assainissement, ordures ménagères ; incendie ; affaires scolaires ; développement économique ; urbanisme ; électrification ; habitat ; environnement ; tourisme etc.
in scheme: FINANCES PUBLIQUES
in scheme: Organisation Territoriale
in scheme: Structures Territoriales
in scheme: Administration de L'Etat
notation: REFIP358

recette générale des finances
type: ConceptReFip
type: Concept
alternative label: RGF
broader: direction régionale des finances publiques
definition: Structure régionale de la Direction Générale des Finances publiques pour la ville et le département de PARIS, remplacée par la Direction Régionale des Finances Publiques d’Ile-de-France et du département de Paris.
in scheme: FINANCES PUBLIQUES
in scheme: Organisation Structurelle de l'Etat
in scheme: Ministère
in scheme: Administration de L'Etat
notation: REFIP3580
scope note: Supprimée en 2010 suite à la fusion DGI-DGCP

récolte agricole
type: ConceptReFip
type: Concept
alternative label: perte de récolte
broader: travaux agricoles
definition: Ensemble des travaux agricoles et horticoles permettant à l'homme de collecter les plantes, fruits et légumes, et de les transporter à l'abri pour stockage plus ou moins provisoire avant consommation ou transformation.
in scheme: FINANCES PUBLIQUES
in scheme: Branche d'activité
in scheme: Questions Economiques
in scheme: Agriculture
notation: REFIP3582

Principauté du Liechtenstein
type: ConceptReFip
type: Concept
alternative label: Liechtenstein
broader: Europe
definition: Pays
in scheme: FINANCES PUBLIQUES
in scheme: Géographie
in scheme: Europe
notation: REFIP3583

tiers saisi
type: ConceptReFip
type: Concept
broader: avis à tiers détenteur
definition: Celui entre les mains duquel on a fait une saisie-arrêt, une opposition, c’est à dire la personne morale ou la personne physique détenant des sommes d’argent appartenant ou devant revenir au débiteur défaillant.
in scheme: FINANCES PUBLIQUES
in scheme: Recouvrement
in scheme: Fiscalité
notation: REFIP3584

service d'intérêt économique général
type: ConceptReFip
type: Concept
alternative label: SIEG
broader: service public
definition: Service de nature économique soumis à des obligations de service public dans le cadre d’une mission particulière d’intérêt général. Les SIEG couvrent un large spectre d’activités, depuis les services des entreprises en réseau, jusqu’à une gamme variée de services sociaux, de santé, locaux et culturels. Ces services essentiels peuvent être fournis directement par les autorités publiques ou par des entreprises, publiques ou privées mandatées à cet effet.
in scheme: FINANCES PUBLIQUES
in scheme: Etat
in scheme: Mission de Service Public
in scheme: Administration de L'Etat
notation: REFIP3586

fongibilité asymétrique des crédits
type: ConceptReFip
type: Concept
broader: exécution du budget
definition: Permet à un gestionnaire d'utiliser des crédits pour des dépenses pour lesquelles elles n'étaient pas prévues à l'intérieur d'un programme budgétaire, mais sans qu'il lui soit possible d'accroître les crédits de personnel en utilisant des crédits prévus pour d'autres natures de dépenses.
in scheme: FINANCES PUBLIQUES
in scheme: Exécution du budget
in scheme: Budget
notation: REFIP3588

option
type: ConceptReFip
type: Concept
broader: mots outils (liste additive)
definition: Action ou droit de choisir entre plusieurs situations.
in scheme: FINANCES PUBLIQUES
in scheme: Mots Outils
notation: REFIP3589

comptabilité M 21
type: ConceptReFip
type: Concept
broader: comptabilité publique locale
definition: Instruction comptable M 21 applicable aux établissements publics de santé.
in scheme: FINANCES PUBLIQUES
in scheme: Secteur public local
in scheme: Gestion Publique
notation: REFIP359

cartographie des risques
type: ConceptReFip
type: Concept
alternative label: cartographie des risques opérationnels
broader: maîtrise des risques
definition: Document classifiant les process de travail en quatre niveaux de risques, et constituant un outil de pilotage pour le management qui permet de mettre en place les dispositifs de couverture adéquats sur les risques les plus critiques. La cartographie alimente les plans nationaux et départementaux de contrôle interne en se concentrant sur les activités les plus sensibles.
in scheme: FINANCES PUBLIQUES
in scheme: Missions Transverses des Finances publiques
in scheme: Maîtrise des risques
narrower: refip-REFIP7001
notation: REFIP3590

plan de cession
type: ConceptReFip
type: Concept
broader: liquidation judiciaire
definition: Décision prise par le tribunal de commerce, dans le cadre de procédures de redressement ou de liquidation judiciaire, entraînant le transfert de la totalité ou d'une partie des actifs d'une entreprise.
in scheme: FINANCES PUBLIQUES
in scheme: Vie de l'Entreprise
in scheme: Entreprises
in scheme: Vie et Gestion de l'entreprise
notation: REFIP3591
related: plan de redressement

marché à bons de commande
type: ConceptReFip
type: Concept
alternative label: marché de clientèle
broader: marché fractionné
definition: Marché conclu avec un ou plusieurs opérateurs économiques et exécuté au fur et à mesure de l’émission de bons de commande.
in scheme: FINANCES PUBLIQUES
in scheme: Commande publique
in scheme: Gestion Publique
narrower: montant maximum du marché public
narrower: montant minimum du marché public
notation: REFIP3593
related: bordereau des prix

délégation d'autorisation de programme
type: ConceptReFip
type: Concept
broader: autorisation de programme
definition: Dans le cadre des dépenses d’investissement, l'administration centrale procède à 2 types de délégations au niveau déconcentré : La délégation d'autorisation de programme soit par Notification d ’autorisation de programme affectée (NAPA) sur une base pluriannuelle; soit par Délégation d ’autorisation de programme globale sur une base pluriannuelle (DAPG).
in scheme: FINANCES PUBLIQUES
in scheme: Exécution du budget
in scheme: Budget
notation: REFIP3594

convention simulée
type: ConceptReFip
type: Concept
alternative label: acte simulé
alternative label: convention apparenté
broader: convention
definition: La simulation est l’accord entre contractants tendant à faire croire à l’existence d’une convention apparente ou simulée ne correspondant pas à leur volonté véritable, exprimée par un acte tenu secret, dénommé contre-lettre.
in scheme: FINANCES PUBLIQUES
in scheme: Droit et Justice
in scheme: Divisions du Droit
in scheme: Droit Privé
narrower: contre-lettre
notation: REFIP3595

Rhône
type: ConceptReFip
type: Concept
broader: Auvergne-Rhône-Alpes
definition: Département français
in scheme: FINANCES PUBLIQUES
in scheme: Géographie
in scheme: Europe
notation: REFIP3596

offre économiquement la plus avantageuse
type: ConceptReFip
type: Concept
alternative label: mieux-disant
alternative label: moins-disant
broader: appel d'offres
definition: Offre choisie par la commission d'appel d'offre qui apporte la meilleure réponse économique aux besoins exprimés et attendus par la collectivité.
in scheme: FINANCES PUBLIQUES
in scheme: Commande publique
in scheme: Gestion Publique
notation: REFIP3597

budget de l'Etat
type: ConceptReFip
type: Concept
broader: budget
definition: Acte par lequel sont prévues et autorisées les recettes et les dépenses de l'Etat pour une année civile. Il est constitué d'un ensemble des comptes qui décrivent toutes les ressources et toutes les charges de l'Etat et des ministères.
in scheme: FINANCES PUBLIQUES
in scheme: Budget de l’État
in scheme: Budget
narrower: excédent budgétaire
narrower: ressources propres
narrower: comptes publics
narrower: rétablissement de crédit
narrower: report de crédits
narrower: dette publique
narrower: refip-REFIP880
notation: REFIP3598

taxe additionnelle à la cotisation foncière des entreprises
type: ConceptReFip
type: Concept
alternative label: taxe additionnelle CFE
broader: impôt direct local
definition: Taxe pour frais de chambres de commerce et d'industrie, taxe pour frais de chambres de métiers et de l'artisanat et taxes spéciales d'équipement.
in scheme: FINANCES PUBLIQUES
in scheme: Fiscalité
in scheme: Impôt
notation: REFIP3599

taxe sur les surfaces commerciales
type: ConceptReFip
type: Concept
alternative label: TASCOM
broader: autres taxes, droits ou redevances (non-descripteur)
definition: Taxe due par les établissements commerciaux permanents, quels que soient les produits vendus au détail, situés en France (départements d'outre-mer compris), qui cumulent les caractéristiques suivantes : leur chiffre d'affaires annuel (CAHT imposable de l'année précédente) est supérieur ou égal à 460 000 € hors taxes ; leur surface de vente dépasse m².
in scheme: FINANCES PUBLIQUES
in scheme: Fiscalité
in scheme: Impôt
notation: REFIP36

décharge de responsabilité solidaire
type: ConceptReFip
type: Concept
broader: solidarité au paiement
definition: Dispositif permettant à des époux ou des partenaires liés par un PACS, dont la responsabilité est mise en jeu, de bénéficier d'une décharge de l'obligation légale de paiement, conformément aux dispositions de l'article 1691 bis du code général des impôts.
in scheme: FINANCES PUBLIQUES
in scheme: Recouvrement
in scheme: Fiscalité
notation: REFIP3600

renonciation à succession
type: ConceptReFip
type: Concept
broader: refip-REFIP705
definition: Document, déclaration formaliste par laquelle un héritier refuse la succession à laquelle il est appelé.
in scheme: FINANCES PUBLIQUES
in scheme: Droit et Justice
in scheme: Divisions du Droit
in scheme: Droit Privé
notation: REFIP3603

contrat d'adaptation (supprimé)
type: ConceptReFip
type: Concept
broader: ZZ
in scheme: FINANCES PUBLIQUES
notation: REFIP3605

règlement d'office (supprimé)
type: ConceptReFip
type: Concept
broader: ZZ
in scheme: FINANCES PUBLIQUES
notation: REFIP3606

donnée de base
type: ConceptReFip
type: Concept
broader: base de données
definition: Données indépendantes des programmes qui les utilisent et pouvant servir plusieurs applications.
in scheme: FINANCES PUBLIQUES
in scheme: Informatique
in scheme: Communication Documentation Informatique
notation: REFIP3607

Comité interministériel de l'administration territoriale
type: ConceptReFip
type: Concept
alternative label: CIATER
broader: décentralisation
definition: Instance chargée de délibérer sur l’organisation de l’administration à ses différents échelons et de proposer toutes mesures de déconcentration des pouvoirs détenus par les ministres.
in scheme: FINANCES PUBLIQUES
in scheme: Etat
in scheme: Réforme de l'Etat
in scheme: Administration de L'Etat
notation: REFIP3608

entreprise éphémère
type: ConceptReFip
type: Concept
alternative label: société éphémère
broader: droit de contrôle de l'administration (non-descripteur)
definition: Entreprise régulièrement immatriculée au registre du commerce ou inscrite au répertoire des métiers ne satisfaisant pas, volontairement, à ses obligations déclaratives et dont la durée d'existence est généralement inférieure à un an.
in scheme: FINANCES PUBLIQUES
in scheme: Droit de Contrôle de l'Administration
in scheme: Fiscalité
notation: REFIP361

plan de restructuration
type: ConceptReFip
type: Concept
broader: entreprise en difficulté
definition: Ensemble de mesures prises par une entreprise en vue de mieux faire face à ses obligations financières. Un plan de restructuration est généralement constitué d'une recapitalisation (souvent souscrite par les anciens actionnaires) et d'une ré-négociation des créances. Les créanciers pourront ainsi accepter un abandon partiel de la dette, un moratoire sur les intérêts ou encore un ré-échelonnement des remboursements. La restructuration opérationnelle peut porter sur le besoin en fonds de roulement (BFR), les réductions d'effectifs, l'arrêt ou la cession d'activités.
in scheme: FINANCES PUBLIQUES
in scheme: Vie de l'Entreprise
in scheme: Entreprises
in scheme: Vie et Gestion de l'entreprise
notation: REFIP3611

plan d'épargne pour la retraite collectif
type: ConceptReFip
type: Concept
alternative label: PERCO
broader: fonds de pension
definition: Dispositif d'entreprise qui permet aux salariés de se constituer une épargne. Les sommes sont bloquées jusqu'à la retraite, sauf cas de déblocage exceptionnel. Les versements du salarié peuvent être complétés par des contributions de l'entreprise (abondements). Au moment de la retraite, les sommes sont disponibles sous forme de rente ou, si l'accord collectif le prévoit, sous forme de capital.
in scheme: FINANCES PUBLIQUES
in scheme: Gestion de l'Entreprise
in scheme: Entreprises
in scheme: Vie et Gestion de l'entreprise
notation: REFIP3612

marché de services
type: ConceptReFip
type: Concept
alternative label: marché de services non prioritaires
alternative label: marché de services prioritaires
broader: marché public
definition: Marché public ayant pour objet la réalisation de prestations de services.
in scheme: FINANCES PUBLIQUES
in scheme: Commande publique
in scheme: Gestion Publique
narrower: marché d'enlèvement
narrower: convention de mandat
narrower: marché de prestations intellectuelles
notation: REFIP3613
related: concession de service public

administration centrale des finances publiques
type: ConceptReFip
type: Concept
alternative label: services centraux des finances publiques
broader: Direction générale des finances publiques
definition: Appellation générique qui qualifie l'ensemble des services du ministère de l'Economie et des Finances à compétence nationale.
in scheme: FINANCES PUBLIQUES
in scheme: Organisation Structurelle de l'Etat
in scheme: Ministère
in scheme: Administration de L'Etat
narrower: Mutuelle générale de l'économie des finances et de l'industrie
narrower: centre de gestion des retraites
narrower: brigade nationale d'enquêtes économiques
narrower: comité national de maîtrise des risques
narrower: service France Domaine
narrower: Cabinet et Communication
narrower: Cellule nationale de suivi de l'immobilier de l'Etat
narrower: mission de coopération internationale
narrower: cellule nationale de supervision des tiers
narrower: administration financière
narrower: administration fiscale
narrower: mission risques et audit
narrower: Mutuelle d'action sociale des finances publiques
narrower: Centre national de transfert de données fiscales
narrower: Direction de l'immobilier de l'Etat
narrower: mission nationale d'appui aux organisations innovantes
narrower: refip-REFIP7080
narrower: refip-REFIP7194
notation: REFIP3615

apurement juridictionnel
type: ConceptReFip
type: Concept
broader: apurement des comptes
definition: Décharge de gestion prononcée en faveur du comptable public par le juge des comptes, après examen de ses comptes, pour le ou les exercices au titre desquels aucune charge n'a été retenue.
in scheme: FINANCES PUBLIQUES
in scheme: Responsabilité des comptables
in scheme: Missions Transverses des Finances publiques
notation: REFIP3616

application SIFT
type: ConceptReFip
type: Concept
alternative label: SLFT
alternative label: système d'information France Trésor-suivi de la dette
broader: applications gestion publique (non-descripteur)
definition: Application de gestion de la Dette et de la Trésorerie de l'État, alimentant CHORUS.
in scheme: FINANCES PUBLIQUES
in scheme: Applications Informatiques
in scheme: Applications gestion publique
notation: REFIP3617

certificat de paiement
type: ConceptReFip
type: Concept
alternative label: attestation de non paiement
alternative label: attestation de paiement
alternative label: certificat de non paiement
broader: document
definition: Document attestant d'un paiement ou d'un non paiement.
in scheme: FINANCES PUBLIQUES
in scheme: Documentation
in scheme: Communication Documentation Informatique
notation: REFIP3618

droit de vote
type: ConceptReFip
type: Concept
broader: droits civiques
definition: Droit permettant aux citoyens d'un État de voter pour exprimer leur volonté, à l'occasion d'un scrutin, et ainsi d'élire leurs représentants et leurs gouvernants ou de répondre à la question posée par un plébiscite ou un référendum.
in scheme: FINANCES PUBLIQUES
in scheme: Droit et Justice
in scheme: Divisions du Droit
in scheme: Droit Public
notation: REFIP3619
related: refip-REFIP6952

accessibilité
type: ConceptReFip
type: Concept
broader: mots outils (liste additive)
definition: Fait de rendre accessible un lieu, une chose.
in scheme: FINANCES PUBLIQUES
in scheme: Mots Outils
notation: REFIP362

créancier
type: ConceptReFip
type: Concept
broader: ordre entre créanciers
definition: Titulaire d'un droit de créance, c'est-à-dire personne à qui le débiteur doit quelque chose (en nature ou en argent).
in scheme: FINANCES PUBLIQUES
in scheme: Droit et Justice
in scheme: Divisions du Droit
in scheme: Droit Privé
narrower: créancier privilégié
narrower: créancier chirographaire
notation: REFIP3620
related: créance

action paulienne
type: ConceptReFip
type: Concept
broader: solidarités diverses et actions patrimoniales (non-descripteur)
definition: Action en justice pouvant être mise en œuvre par tout créancier et visant à faire déclarer inopposable un acte passé en fraude de ses droits.
in scheme: FINANCES PUBLIQUES
in scheme: Recouvrement
in scheme: Fiscalité
notation: REFIP3623

Pôle de gestion des consignations
type: ConceptReFip
type: Concept
broader: direction régionale des finances publiques
definition: Pôle régional ou interrégional chargé de la gestion des consignations. En sa qualité de préposé de la Caisse des dépôts, la DGFIP est chargée de recevoir, pour tous les départements, les consignations de toute nature, en numéraire ou en titres financiers.
in scheme: FINANCES PUBLIQUES
in scheme: Organisation Structurelle de l'Etat
in scheme: Ministère
in scheme: Administration de L'Etat
notation: REFIP3625

entretien des immeubles
type: ConceptReFip
type: Concept
alternative label: entretien des bâtiments de l'Etat
broader: gestion des immeubles
definition: Entretien des bâtiments de l’État.
in scheme: FINANCES PUBLIQUES
in scheme: Politique immobilière de l'Etat
in scheme: Gestion Publique
notation: REFIP3626

droit d'entrée
type: ConceptReFip
type: Concept
alternative label: pas-de-porte
broader: droit commercial
definition: Somme d'argent, de montant très variable, versée soit par le locataire d'un bail commercial au propriétaire lors de la conclusion du contrat de bail, soit par le cessionnaire d'un bail commercial au précédent locataire lors de la cession du bail par celui-ci.
in scheme: FINANCES PUBLIQUES
in scheme: Droit et Justice
in scheme: Divisions du Droit
in scheme: Droit Privé
notation: REFIP3627

Ministère de l'Education nationale de l'Enseignement supérieur et de la Recherche (obsolète)
type: ConceptReFip
type: Concept
is replaced by: refip-REFIP7075
broader: ZZ
in scheme: FINANCES PUBLIQUES
notation: REFIP3629

extinction
type: ConceptReFip
type: Concept
broader: droit général (non-descripteur)
definition: Perte d’un droit venu à expiration. Fin d’une situation juridique. Peut également s’agir de l’extinction d’une obligation.
in scheme: FINANCES PUBLIQUES
in scheme: Droit et Justice
in scheme: Droit Général
notation: REFIP363

Rhône-Alpes (supprimé)
type: ConceptReFip
type: Concept
broader: ZZ
in scheme: FINANCES PUBLIQUES
notation: REFIP3630

livraison
type: ConceptReFip
type: Concept
broader: mots outils (liste additive)
definition: Action de livrer, de remettre (une personne ou une chose) à la disposition de quelqu'un.
in scheme: FINANCES PUBLIQUES
in scheme: Mots Outils
notation: REFIP3631

agrément fiscal
type: ConceptReFip
type: Concept
alternative label: retrait d'agrément fiscal
broader: régime d'imposition
definition: Procédure administrative qui permet à un contribuable de bénéficier d'un régime fiscal dérogatoire pour certaines opérations prévues par la loi. Son obtention est subordonnée à une demande de l'intéressé et à une décision de l'autorité compétente.
in scheme: FINANCES PUBLIQUES
in scheme: Régime d'Imposition
in scheme: Fiscalité
notation: REFIP3632

adjonction de service
type: ConceptReFip
type: Concept
broader: responsabilité des comptables
definition: Activité accessoire réservée aux agents comptables, en supplément de leurs missions exercées au sein de la DGFIP.
in scheme: FINANCES PUBLIQUES
in scheme: Responsabilité des comptables
in scheme: Missions Transverses des Finances publiques
notation: REFIP3633
scope note: Réservé aux agents comptables, M9-1.

Cher
type: ConceptReFip
type: Concept
broader: Centre-Val de Loire
definition: Département français
in scheme: FINANCES PUBLIQUES
in scheme: Géographie
in scheme: Europe
notation: REFIP3636
scope note: Département

écart d'équivalence (supprimé)
type: ConceptReFip
type: Concept
broader: ZZ
in scheme: FINANCES PUBLIQUES
notation: REFIP3637

fusion d'établissements publics de coopération intercommunale
type: ConceptReFip
type: Concept
broader: réforme de l'Etat
definition: Des établissements publics de coopération intercommunale, dont au moins l'un d'entre eux est à fiscalité propre, peuvent être autorisés à fusionner dans les conditions suivantes : 1° Soit dans un délai de deux mois à compter de la première délibération transmise, à l'initiative d'un ou de plusieurs conseils municipaux des communes membres ou de l'organe délibérant du ou des établissements publics de coopération intercommunale dont la fusion est envisagée; 2° Soit à l'initiative du ou des représentants de l'Etat; 3° Soit à l'initiative de la ou des commissions départementales de la coopération intercommunale.
in scheme: FINANCES PUBLIQUES
in scheme: Etat
in scheme: Réforme de l'Etat
in scheme: Administration de L'Etat
notation: REFIP3639
related: coopération intercommunale

application ASIA
type: ConceptReFip
type: Concept
alternative label: ASIA
broader: applications missions transverses (non-descripteur)
definition: Application de Suivi Informatisé des Audits au plan local.
in scheme: FINANCES PUBLIQUES
in scheme: Applications missions transverses
in scheme: Applications Informatiques
notation: REFIP364
scope note: Remplacée par l'application SYGMAFIP à compter du 1/1/2013

taxe sur la valeur ajoutée intracommunautaire
type: ConceptReFip
type: Concept
alternative label: TVA intracommunautaire
broader: taxe sur la valeur ajoutée
definition: Taxe sur la valeur ajoutée qui concerne les opérations se déroulant entre plusieurs états membre de l'Union Européenne.
in scheme: FINANCES PUBLIQUES
in scheme: Fiscalité
in scheme: Impôt
notation: REFIP3641

procédure de conception réalisation
type: ConceptReFip
type: Concept
alternative label: conception réalisation
broader: passation des marchés publics
definition: Dispositif de passation des marchés publics dans lequel le pouvoir adjudicateur négocie les conditions du marché avec un ou plusieurs opérateurs économiques
in scheme: FINANCES PUBLIQUES
in scheme: Commande publique
in scheme: Gestion Publique
notation: REFIP3644

dégrèvement spécial
type: ConceptReFip
type: Concept
broader: dégrèvement
definition: Dégrèvements de taxe foncière sur les propriétés non bâties pouvant être obtenus soit sur réclamation du contribuable (pour disparition d'un immeuble non bâti, pertes de récoltes, pertes de bétail par suite d'épizootie), soit par les propriétaires de terres classées dans les catégories 2 et 6, soit pour les parcelles exploitées par de jeunes agriculteurs.
in scheme: FINANCES PUBLIQUES
in scheme: Contentieux Fiscal
in scheme: Fiscalité
notation: REFIP3646

montant minimum du marché public
type: ConceptReFip
type: Concept
broader: marché à bons de commande
definition: Seuil de procédure (qui varie en fonction de l'objet et de la valeur du marché public) et seuil de publicité (modifiant la procédure mais aussi les modalités de publicités à donner à l'avis de marché).
in scheme: FINANCES PUBLIQUES
in scheme: Commande publique
in scheme: Gestion Publique
notation: REFIP3647

taxe sur les déchets réceptionnés dans une installation de stockage (supprimé)
type: ConceptReFip
type: Concept
broader: ZZ
in scheme: FINANCES PUBLIQUES
notation: REFIP3648

juridiction gracieuse
type: ConceptReFip
type: Concept
broader: contentieux fiscal
definition: Possibilité donnée à l'administration de remettre, par mesure de bienveillance, tout ou partie d'un impôt direct ou de pénalités, alors même qu'ils sont fondés en droit
in scheme: FINANCES PUBLIQUES
in scheme: Contentieux Fiscal
in scheme: Fiscalité
narrower: demande gracieuse
narrower: décision administrative gracieuse
notation: REFIP3649

produit des jeux
type: ConceptReFip
type: Concept
broader: fiscalité des professionnels
definition: Gains réalisés à l'occasion de la participation, même habituelle, à des jeux de hasard (loteries, loto, courses etc.). Ils ne constituent pas en principe des revenus imposables mais sont assimilés à des BNC si le joueur en fait sa profession ou si l'aléa normalement inhérent au jeu a pu être supprimé ou fortement atténué.
in scheme: FINANCES PUBLIQUES
in scheme: Champ d'Application
in scheme: Fiscalité
notation: REFIP365
related: prélèvement sur produit des jeux

audit externe
type: ConceptReFip
type: Concept
broader: audit
definition: Examen de l'exactitude des comptes et des résultats d'une organisation par un intervenant externe habilité à cet effet, essentiellement pour aboutir à une certification éventuelle.
in scheme: FINANCES PUBLIQUES
in scheme: Audit
in scheme: Missions Transverses des Finances publiques
notation: REFIP3651
related: certification des comptes

gouvernement
type: ConceptReFip
type: Concept
broader: pouvoirs publics
definition: Institution qui exerce le pouvoir exécutif. Les membres d'un gouvernement sont généralement désignés sous le nom de ministre ou de secrétaire d'État et placés sous l'autorité d'un chef de gouvernement. Le gouvernement décide et entreprend les actions nécessaires à la conduite de l'État.
in scheme: FINANCES PUBLIQUES
in scheme: Organisation Structurelle de l'Etat
in scheme: Pouvoirs Publics
in scheme: Administration de L'Etat
narrower: ministre
narrower: Premier Ministre
narrower: secrétaire d'Etat
notation: REFIP3654

établissement ou service d'aide par le travail
type: ConceptReFip
type: Concept
alternative label: CAT
alternative label: Centre d'aide par le travail
alternative label: ESAT
broader: établissement public social et médicosocial
definition: Organisme médico-social chargé de la mise au travail, accompagnée d’un soutien médical et social, des personnes handicapées dans l’impossibilité de travailler dans un autre cadre, anciennement centre d’aide par le travail. La création d’un ESAT doit être autorisée par le préfet de région.
in scheme: FINANCES PUBLIQUES
in scheme: Organisation Territoriale
in scheme: Structures Territoriales
in scheme: Administration de L'Etat
notation: REFIP3655

centre d'études techniques de l'équipement
type: ConceptReFip
type: Concept
alternative label: CETE
broader: refip-REFIP7060
definition: Services déconcentrés de l'État français, placés sous la tutelle du ministère de l'Écologie, de l'Énergie, du Développement durable et de la Mer.
in scheme: FINANCES PUBLIQUES
in scheme: Organisation Structurelle de l'Etat
in scheme: Ministère
in scheme: Administration de L'Etat
notation: REFIP3656
scope note: Remplacé par le centre d'études et d'expertise sur les risques l'environnement la mobilité et l'aménagement

délit de favoritisme
type: ConceptReFip
type: Concept
broader: délit
definition: Infraction fonctionnelle constituée par le fait de procurer à autrui l'octroi d'un avantage injustifié par un acte contraire aux dispositions législatives et réglementaires qui visent à garantir la liberté d'accès et l'égalité des candidats aux marchés publics et les délégations de services publics.
in scheme: FINANCES PUBLIQUES
in scheme: Droit et Justice
in scheme: Infractions et Sanctions
in scheme: Infraction
notation: REFIP3657

clôture de l'exercice
type: ConceptReFip
type: Concept
broader: fin de gestion
definition: Enregistrement des écritures comptables permettant d'acter la clôture définitive d’un exercice comptable et le passage au prochain exercice, après présentation des comptes annuels.
in scheme: FINANCES PUBLIQUES
in scheme: Procédures et Techniques Comptables
in scheme: Comptabilité
narrower: inventaire
notation: REFIP3658

accès aux documents administratifs
type: ConceptReFip
type: Concept
alternative label: droit à l'accès aux documents administratifs
broader: droit administratif
definition: Droit reconnu aux administrés d'accéder à la plupart des documents administratifs non nominatifs, ou des documents nominatifs les concernant.
in scheme: FINANCES PUBLIQUES
in scheme: Droit et Justice
in scheme: Divisions du Droit
in scheme: Droit Public
narrower: communication de dossier
notation: REFIP366
related: droit à l'information
related: refip-REFIP852

animal
type: ConceptReFip
type: Concept
alternative label: animal domestique
alternative label: animal sauvage
broader: élevage
definition: Etre vivant doué de sensibilité, sous réserve des lois qui les protègent, les animaux sont soumis au régime des biens.
in scheme: FINANCES PUBLIQUES
in scheme: Branche d'activité
in scheme: Questions Economiques
in scheme: Agriculture
narrower: cheval
notation: REFIP3660

valeur locative foncière
type: ConceptReFip
type: Concept
alternative label: VLF
broader: révision des valeurs locatives
definition: Valeur locative cadastrale revalorisée selon un coefficient dans le cadre du calcul de la Cotisation Foncière des Entreprises.
in scheme: FINANCES PUBLIQUES
in scheme: Cadastre
in scheme: Fiscalité
notation: REFIP3661

prévision budgétaire
type: ConceptReFip
type: Concept
broader: refip-REFIP978
definition: Etat prévisionnel des recettes et des dépenses attendues sur une période définie..
in scheme: FINANCES PUBLIQUES
in scheme: Élaboration du budget
in scheme: Budget
notation: REFIP3662

traitement de l'information
type: ConceptReFip
type: Concept
broader: information
definition: Ensemble de méthodes, procédures et outils utilisés pour appréhender le contenu sémantique des informations que contient un document, et les représenter dans un système d'information.
in scheme: FINANCES PUBLIQUES
in scheme: Communication
in scheme: Communication Documentation Informatique
narrower: média
narrower: publication
notation: REFIP3664
related: restitution de l'information
related: échange de données informatisé
related: open data

cadastre
type: ConceptReFip
type: Concept
definition: Ensemble des missions de recensement des propriétés foncières, de recherche de leurs propriétaires apparents ou réels, de reconnaissance et de définition des limites de ces propriétés ainsi que de leur évaluation concourant à l'assiette de l'impôt foncier.
in scheme: FINANCES PUBLIQUES
in scheme: Cadastre
in scheme: Fiscalité
narrower: conservation du cadastre
narrower: documentation cadastrale
narrower: mutation cadastrale
narrower: propriété bâtie
narrower: immeuble type
narrower: agrément cadastral
narrower: inexploitation d'immeuble
narrower: plafond légal de densité
narrower: plan d'action topographique départemental
narrower: état descriptif de division en volumes
narrower: propriété non bâtie
narrower: remaniement du cadastre
narrower: emprise au sol
narrower: délivrance de documents cadastraux
narrower: versement pour sous-densité
narrower: fichier foncier standard
narrower: évaluation cadastrale
narrower: système d'information géographique
narrower: local
narrower: refip-REFIP9
notation: REFIP3667

application ECUME
type: ConceptReFip
type: Concept
broader: applications fiscales (non-descripteur)
definition: Application permettant de calculer les redevances d'occupation concernant les cultures marines sur le Domaine Public Maritime géré par l'Etat.
in scheme: FINANCES PUBLIQUES
in scheme: Applications Informatiques
in scheme: Applications fiscales
notation: REFIP3668

intérêts courus non échus
type: ConceptReFip
type: Concept
alternative label: ICNE
alternative label: intérêts constatés d'avance
broader: passif
definition: Partie des intérêts d'un titre de créance négociable qui a été acquise depuis le précédent règlement des intérêts. En ce qui concerne les entreprises, les intérêts courus non échus constituent des charges ou des produits qui auront une incidence sur le résultat d'un exercice, mais ne pourront être encaissés ou décaissés que lors de l'exercice suivant.
in scheme: FINANCES PUBLIQUES
in scheme: Documents comptables
in scheme: Comptabilité
notation: REFIP3669

condition résolutoire
type: ConceptReFip
type: Concept
broader: droit civil
definition: Modalité d'un acte juridique faisant dépendre l'existence d'un droit d'un événement futur dont la réalisation est incertaine. La survenance de l’événement fait disparaître le droit rétroactivement.
in scheme: FINANCES PUBLIQUES
in scheme: Droit et Justice
in scheme: Divisions du Droit
in scheme: Droit Privé
notation: REFIP367

comptabilité développée du recouvrement
type: ConceptReFip
type: Concept
broader: comptabilité auxiliaire
definition: Type de comptabilité auxiliaire permettant de suivre de façon détaillée le recouvrement.
in scheme: FINANCES PUBLIQUES
in scheme: Comptabilité générale de l'Etat
in scheme: Comptabilité
narrower: excédent de versement
notation: REFIP3670

liquidation
type: ConceptReFip
type: Concept
broader: mots outils (liste additive)
definition: Opération par laquelle on apure, règle et solde des comptes après en avoir déterminé le montant de manière définitive.
in scheme: FINANCES PUBLIQUES
in scheme: Mots Outils
notation: REFIP3671

taxe sur la provision pour hausse de prix des entreprises pétrolières
type: ConceptReFip
type: Concept
broader: autres taxes, droits ou redevances (non-descripteur)
definition: Taxe exceptionnelle à la charge des entreprises ayant en France une activité principale de première transformation du pétrole brut ou de distribution des carburants issus de cette transformation au titre du premier exercice clos à compter du 31 décembre 2007.
in scheme: FINANCES PUBLIQUES
in scheme: Fiscalité
in scheme: Impôt
notation: REFIP3673

moins-value à court terme
type: ConceptReFip
type: Concept
broader: moins-value
definition: Moins-value réalisée à l'occasion de la cession d'immobilisations de toute nature acquises ou créées par l'entreprise depuis moins de deux ans. Le cas échéant, ces plus-values sont majorées du montant des amortissements expressément exclus des charges déductibles ainsi que de ceux qui ont été différés ; ou qui proviennent de la cession d'éléments détenus depuis au moins deux ans, dans la mesure ou elles correspondent à des amortissements déduits pour l'assiette de l'impôt. Le cas échéant ces plus-values sont majorées du montant des amortissements expressément exclus des charges déductibles, ainsi que de ceux qui ont été différés. Par amortissements déduits pour l'assiette de l'impôt il convient d'entendre tous les amortissements qui ont affecté la détermination du bénéfice imposable. Il s'agit des amortissements normalement pratiqués, y compris les amortissements exceptionnels ou accélérés.
in scheme: FINANCES PUBLIQUES
in scheme: Documents comptables
in scheme: Comptabilité
notation: REFIP3674

astreinte d'urbanisme
type: ConceptReFip
type: Concept
broader: astreinte pécuniaire
definition: Contrainte qui prend la forme d'une condamnation pécuniaire prononcée en matière d'infraction aux règles d'urbanisme et recouvrée par les comptables du Trésor public.
in scheme: FINANCES PUBLIQUES
in scheme: Droit et Justice
in scheme: Sanction
in scheme: Infractions et Sanctions
notation: REFIP3675
related: recouvrement des produits divers

date d'effet
type: ConceptReFip
type: Concept
broader: mots outils (liste additive)
definition: Date à laquelle tout contrat entre en vigueur.
in scheme: FINANCES PUBLIQUES
in scheme: Mots Outils
notation: REFIP3676

plan de continuité d'activité
type: ConceptReFip
type: Concept
broader: crise
definition: Ensemble de mesures prises par l’État ou la collectivité, visant à assurer, selon divers scénarios de crises, y compris face à des chocs extrêmes, le maintien, le cas échéant de façon temporaire selon un mode dégradé, des prestations de services essentielles de l'entité puis la reprise planifiée des activités.
in scheme: FINANCES PUBLIQUES
in scheme: Etat
in scheme: Mission de Service Public
in scheme: Administration de L'Etat
notation: REFIP3677

ordonnance pénale
type: ConceptReFip
type: Concept
broader: procédure pénale
definition: Procédure simplifiée de jugement des contraventions et de certains délits (code de la route, réglementation des transports, code du commerce en matière de concurrence, usage de stupéfiants...),
in scheme: FINANCES PUBLIQUES
in scheme: Procédure Pénale
in scheme: Droit et Justice
in scheme: Procédure
notation: REFIP3679

véhicule d'occasion
type: ConceptReFip
type: Concept
broader: véhicule terrestre à moteur
definition: Véhicule qui n'est pas neuf, mis à la vente. Véhicule de seconde main.
in scheme: FINANCES PUBLIQUES
in scheme: Branche d'activité
in scheme: Questions Economiques
in scheme: Transports
notation: REFIP368

mutation d'immeuble
type: ConceptReFip
type: Concept
broader: fiscalité du patrimoine
definition: Transfert d'un bien immobilier d'un patrimoine dans un autre.
in scheme: FINANCES PUBLIQUES
in scheme: Champ d'Application
in scheme: Fiscalité
narrower: échange d'immeubles
notation: REFIP3682

lait
type: ConceptReFip
type: Concept
alternative label: produit laitier
broader: denrée alimentaire
definition: Aliment, secrété par les glandes mammaires des mammifères femelles.
in scheme: FINANCES PUBLIQUES
in scheme: Branche d'activité
in scheme: Questions Economiques
in scheme: Industrie
notation: REFIP3683

gestion de contexte
type: ConceptReFip
type: Concept
broader: informatique
definition: Fonctionnalité transverse qui permet une navigation inter-applicative en restant sur le même dossier.
in scheme: FINANCES PUBLIQUES
in scheme: Informatique
in scheme: Communication Documentation Informatique
notation: REFIP3684

imposition forfaitaire sur les centrales de production d'énergie électrique d'origine photovoltaïque ou hydraulique
type: ConceptReFip
type: Concept
alternative label: IFEP
broader: imposition forfaitaire sur les entreprises de réseaux
definition: Imposition qui s'applique aux centrales de production d'énergie électrique d'origine photovoltaïque ou hydraulique, dont la puissance électrique installée est supérieure ou égale à 100 kilowatts. Constitue une composante de l'IFER.
in scheme: FINANCES PUBLIQUES
in scheme: Fiscalité
in scheme: Impôt
notation: REFIP3685

répétition de l'indu
type: ConceptReFip
type: Concept
broader: enrichissement sans cause
definition: Quasi-contrat dans lequel celui qui a fait un paiement indu, par erreur, peut obliger celui qui a reçu le paiement à le lui restituer.
in scheme: FINANCES PUBLIQUES
in scheme: Droit et Justice
in scheme: Divisions du Droit
in scheme: Droit Privé
narrower: indu
notation: REFIP3688

Autorité de certification
type: ConceptReFip
type: Concept
broader: direction régionale des finances publiques
definition: Autorité ou un organisme public national, régional ou local désigné par l’État membre pour certifier les états des dépenses et les demandes de paiement avant leur envoi à la Commission. En France, la DGFiP et son réseau, a été désigné autorité de certification des programmes opérationnels financés par le FEDER et par le FSE.
in scheme: FINANCES PUBLIQUES
in scheme: Organisation Structurelle de l'Etat
in scheme: Ministère
in scheme: Administration de L'Etat
notation: REFIP3689

procédure de rectification contradictoire
type: ConceptReFip
type: Concept
alternative label: procédure de redressement contradictoire
broader: procédure contradictoire
definition: Procédure de droit commun de rectification des bases d'imposition. Elle s'applique dès lors que le contribuable respecte ses obligations déclaratives et dans tous les cas où l'administration ayant constaté une insuffisance, inexactitude, omission ou dissimulation des éléments servant au calcul des impôts, désire apporter des rectifications aux déclarations des contribuables. Elle se caractérise par un dialogue entre l'administration et le contribuable, elle est également assortie de garanties au profit de ce dernier.
in scheme: FINANCES PUBLIQUES
in scheme: Droit de Reprise de l'Administration
in scheme: Fiscalité
notation: REFIP369

écotaxe
type: ConceptReFip
type: Concept
broader: autres taxes, droits ou redevances (non-descripteur)
definition: Mesure fiscale qui permet de taxer un produit commercialisé provoquant des dommages sur l'environnement selon le principe pollueur-payeur, afin de faire porter les choix des consommateurs sur des produits moins polluants ou recyclables.
in scheme: FINANCES PUBLIQUES
in scheme: Fiscalité
in scheme: Impôt
notation: REFIP3690

Allemagne
type: ConceptReFip
type: Concept
broader: Europe
definition: Pays
in scheme: FINANCES PUBLIQUES
in scheme: Géographie
in scheme: Europe
notation: REFIP3691

consultation sur place
type: ConceptReFip
type: Concept
broader: centre de documentation
definition: Mise à disposition sur place de documents.
in scheme: FINANCES PUBLIQUES
in scheme: Documentation
in scheme: Communication Documentation Informatique
notation: REFIP3692

vérification de comptabilité
type: ConceptReFip
type: Concept
broader: contrôle fiscal externe
definition: Contrôle sur place de la comptabilité permettant à l’administration d’apprécier les conditions d’exploitation de l’entreprise et de recueillir les informations et observations de la personne vérifiée.
in scheme: FINANCES PUBLIQUES
in scheme: Droit de Contrôle de l'Administration
in scheme: Fiscalité
narrower: reconstitution de recettes
narrower: reconstitution du bénéfice
narrower: contrôle inopiné des entreprises
narrower: refip-REFIP667
notation: REFIP3693
scope note: Contrôle fiscal

liquidation des recettes
type: ConceptReFip
type: Concept
broader: refip-REFIP880
definition: Détermination du montant des créances dues par des tiers à l’établissement.
in scheme: FINANCES PUBLIQUES
in scheme: Budget de l’État
in scheme: Budget
notation: REFIP3694

stocks
type: ConceptReFip
type: Concept
broader: actif
definition: Ensemble des biens qui interviennent dans le cycle d'exploitation de l'entreprise.
in scheme: FINANCES PUBLIQUES
in scheme: Documents comptables
in scheme: Comptabilité
notation: REFIP3695

droit à l'image
type: ConceptReFip
type: Concept
broader: droit civil
definition: Droit de chaque personne de disposer de son image et ainsi de s'opposer à la reproduction et publication de celle-ci. En tant qu'attribut de la personnalité, il fait partie de la vie privée, Toute atteinte au droit à l'image constitue de ce fait une violation de la vie privée.
in scheme: FINANCES PUBLIQUES
in scheme: Droit et Justice
in scheme: Divisions du Droit
in scheme: Droit Privé
notation: REFIP3696

architecte
type: ConceptReFip
type: Concept
broader: architecture
definition: Créateur artistique et technique d'un bâtiment et de tout ouvrage de génie civil, ayant pour mission de concevoir la structure, d'organiser l'agencement des espaces, et éventuellement de diriger la réalisation d'œuvres architecturales.
in scheme: FINANCES PUBLIQUES
in scheme: Branche d'activité
in scheme: Questions Economiques
in scheme: Services et professions libérales
notation: REFIP3698

paiement sans ordonnancement préalable
type: ConceptReFip
type: Concept
broader: paiement de la dépense (non-descripteur)
definition: Dépenses exécutées directement par le comptable pour lesquelles un ordonnancement de régularisation intervient a posteriori notamment les dépenses qu font l'objet d'un débit d'office, prélèvement bancaire ou payées par une régie d'avances.
in scheme: FINANCES PUBLIQUES
in scheme: Dépenses publiques
in scheme: Gestion Publique
notation: REFIP3699

solde d'un marché public
type: ConceptReFip
type: Concept
broader: exécution d'un marché public
definition: Opération de clôture du marché public. Permet à l’administration d’établir le montant restant encore à verser au titulaire. Ce dernier n’est toutefois pas, par la suite, délié totalement de ses obligations envers l’administration en vertu des garanties légales et contractuelles.
in scheme: FINANCES PUBLIQUES
in scheme: Commande publique
in scheme: Gestion Publique
notation: REFIP370

énergie éolienne
type: ConceptReFip
type: Concept
alternative label: éolienne
broader: énergie renouvelable
definition: Énergie tirée du vent au moyen d’un dispositif aéro-générateur comme une éolienne ou un moulin à vent. L’énergie éolienne est une des formes d'énergie renouvelable.
in scheme: FINANCES PUBLIQUES
in scheme: Branche d'activité
in scheme: Questions Economiques
in scheme: Industrie
notation: REFIP3700

dissolution
type: ConceptReFip
type: Concept
broader: droit général (non-descripteur)
definition: Dissociation d'un groupe qui met fin légalement à une communauté d'intérêts et à l'existence juridique de ce groupe.
in scheme: FINANCES PUBLIQUES
in scheme: Droit et Justice
in scheme: Droit Général
notation: REFIP3702

diesel
type: ConceptReFip
type: Concept
alternative label: gasoil
alternative label: gazole
alternative label: moteur diesel
broader: carburant
definition: Carburant pour moteur diesel issu du raffinage de pétrole.
in scheme: FINANCES PUBLIQUES
in scheme: Branche d'activité
in scheme: Questions Economiques
in scheme: Industrie
notation: REFIP3703

renseignement
type: ConceptReFip
type: Concept
broader: information
definition: Information analysée pouvant être exploitée.
in scheme: FINANCES PUBLIQUES
in scheme: Communication
in scheme: Communication Documentation Informatique
notation: REFIP3704

Etat
type: ConceptReFip
type: Concept
definition: Personne morale de droit public qui, sur le plan juridique, représente une collectivité, un peuple ou une nation, à l'intérieur ou à l'extérieur d'un territoire déterminé sur lequel elle exerce le pouvoir suprême, la souveraineté.
in scheme: FINANCES PUBLIQUES
in scheme: Etat
in scheme: Administration de L'Etat
narrower: réforme de l'Etat
narrower: mission de service public
notation: REFIP3705
scope note: Personne morale titulaire de la souveraineté

marchandise
type: ConceptReFip
type: Concept
broader: commerce
definition: Objet, produit qui se vend ou s'achète, soit en gros, soit en détail dans les boutiques, magasins, foires, marchés, etc
in scheme: FINANCES PUBLIQUES
in scheme: Branche d'activité
in scheme: Questions Economiques
in scheme: Commerce
notation: REFIP3706

Code de la construction et de l'habitation
type: ConceptReFip
type: Concept
broader: documentation juridique (non-descripteur)
definition: Ensemble des dispositions législatives et réglementaires relatives à la construction, à la promotion immobilière, aux logements sociaux et à d'autres questions relatives à l'immobilier.
in scheme: FINANCES PUBLIQUES
in scheme: Droit et Justice
in scheme: Documentation Juridique
in scheme: Sources du Droit
notation: REFIP3707

distribution de l'énergie
type: ConceptReFip
type: Concept
alternative label: distribution de l'électricité
alternative label: distribution du gaz
broader: énergie
definition: Acheminement et distribution de l'énergie gazière ou électrique à l'échelle locale, des centres de distribution vers le client final.
in scheme: FINANCES PUBLIQUES
in scheme: Branche d'activité
in scheme: Questions Economiques
in scheme: Industrie
notation: REFIP3708

Ile-de-France
type: ConceptReFip
type: Concept
alternative label: Ile de France
broader: France métropolitaine
definition: Région française
in scheme: FINANCES PUBLIQUES
in scheme: Géographie
in scheme: Europe
narrower: Val-de-Marne
narrower: Val-d'Oise
narrower: Seine-et-Marne
narrower: Hauts-de-Seine
narrower: Yvelines
narrower: Essonne
narrower: Paris
narrower: refip-REFIP931
notation: REFIP3709

centralisation comptable
type: ConceptReFip
type: Concept
broader: procédures et techniques comptables (non-descripteur)
definition: Intégration d’une comptabilité de niveau inférieur dans une comptabilité de niveau supérieur, par le jeu de comptes internes de liaison fonctionnant de façon réciproque et qui sont soldés lorsque la centralisation est achevée. Elle permet de reconstituer l’unité de la comptabilité de l’État en cours d’année et en fin de gestion (pour déterminer les résultats et la présentation des comptes annuels).
in scheme: FINANCES PUBLIQUES
in scheme: Procédures et Techniques Comptables
in scheme: Comptabilité
notation: REFIP3711

décision de rejet
type: ConceptReFip
type: Concept
broader: dégrèvement
definition: Décision prise par l'administration en matière contentieuse ou gracieuse consistant à ne pas donner une suite favorable à la réclamation du contribuable ou, pour le service de la publicité foncière, à ne pas exécuter la formalité de l'enregistrement.
in scheme: FINANCES PUBLIQUES
in scheme: Contentieux Fiscal
in scheme: Fiscalité
notation: REFIP3712

workflow
type: ConceptReFip
type: Concept
alternative label: flux de travail
alternative label: flux de travaux
alternative label: gestion automatique des flux
alternative label: gestion des flux d'informations
broader: chaîne de traitement
definition: Modélisation et gestion informatique de l'ensemble des tâches à accomplir et des différents acteurs impliqués.
in scheme: FINANCES PUBLIQUES
in scheme: Informatique
in scheme: Communication Documentation Informatique
notation: REFIP3713

référé contractuel
type: ConceptReFip
type: Concept
broader: référé administratif
definition: Procédure permettant la saisine du juge dans le mois qui suit la publication de l’avis d’attribution d’un marché.
in scheme: FINANCES PUBLIQUES
in scheme: Procédure Administrative
in scheme: Droit et Justice
in scheme: Procédure
notation: REFIP3714

avertissement de payer
type: ConceptReFip
type: Concept
broader: poursuites
definition: Avertissement préalablement envoyé au redevable d'une amende avant poursuites. Il peut prendre diverses formes (commandement, lettre de rappel etc.).
in scheme: FINANCES PUBLIQUES
in scheme: Recouvrement
in scheme: Fiscalité
narrower: commandement à parquet
narrower: commandement valant saisie
narrower: refip-REFIP674
notation: REFIP3715

régie directe
type: ConceptReFip
type: Concept
broader: régie
definition: Mode de gestion par lequel la collectivité locale gère directement le service public par le bais d'une régie.
in scheme: FINANCES PUBLIQUES
in scheme: Secteur public local
in scheme: Gestion Publique
notation: REFIP3716

application AGATHE
type: ConceptReFip
type: Concept
alternative label: AGATHE
broader: applications gestion publique (non-descripteur)
definition: Outil de gestion de trésorerie des CEPL, permettant d'effectuer des situations prévisionnelles de trésorerie.
in scheme: FINANCES PUBLIQUES
in scheme: Applications Informatiques
in scheme: Applications gestion publique
notation: REFIP3717

service de la documentation nationale du cadastre
type: ConceptReFip
type: Concept
alternative label: SDNC
broader: service à compétence nationale
definition: Service à compétence nationale, le SDNC est rattaché à la sous-direction des affaires foncières de la Direction générale des Finances publiques. Il réalise des travaux d'imprimerie et de reprographie, la dématérialisation de documents, la mise en ligne d'imprimés, la conception et maintien de sites. Partenaire des bureaux métiers, le SDNC fournit aux services déconcentrés les supports nécessaires à leurs activités ainsi que des renforts humains dans la sphère cadastrale.
in scheme: FINANCES PUBLIQUES
in scheme: Organisation Structurelle de l'Etat
in scheme: Ministère
in scheme: Administration de L'Etat
notation: REFIP3718

clause d'accroissement
type: ConceptReFip
type: Concept
broader: droit des obligations et contrats (non-descripteur)
definition: Clause d'un contrat prévoyant la réversibilité de la portion des pré-mourants au profit des survivants.
in scheme: FINANCES PUBLIQUES
in scheme: Droit et Justice
in scheme: Divisions du Droit
in scheme: Droit Privé
notation: REFIP3719
related: tontine

négociation
type: ConceptReFip
type: Concept
broader: mots outils (liste additive)
definition: Recherche d'un accord, centrée sur des intérêts matériels ou des enjeux quantifiables entre deux ou plusieurs interlocuteurs, dans un temps limité.
in scheme: FINANCES PUBLIQUES
in scheme: Mots Outils
notation: REFIP3722

rapporteur public
type: ConceptReFip
type: Concept
broader: magistrat
definition: Magistrat d'une juridiction administrative chargé de donner, en toute indépendance, son appréciation sur les faits et les règles de droit applicables ainsi que son avis sur la solution à donner au litige.
in scheme: FINANCES PUBLIQUES
in scheme: Profession Juridique
in scheme: Droit et Justice
in scheme: Organisation Juridictionnelle
notation: REFIP3723
scope note: Depuis le 01/02/2009 remplace le commissaire du gouvernement devant les juridictions administratives

taxe sur les huiles végétales destinées à l'alimentation humaine
type: ConceptReFip
type: Concept
broader: autres taxes, droits ou redevances (non-descripteur)
definition: Taxe spéciale sur les huiles végétales, fluides ou concrètes, effectivement destinées, en l’état ou après incorporation dans tous produits alimentaires, à l’alimentation humaine. Taxe due pour les huiles fabriquées en France continentale et en Corse, sur toutes les ventes ou livraisons à soi-même de ces huiles par les producteurs; pour les huiles importées en France continentale et en Corse (y compris les huiles d’animaux marins qui, pour l’assujettissement à la taxe spéciale, sont assimilées aux huiles végétales alimentaires), lors de l’importation ; pour les huiles qui font l’objet d’une acquisition intracommunautaire lors de l’acquisition.
in scheme: FINANCES PUBLIQUES
in scheme: Fiscalité
in scheme: Impôt
notation: REFIP3724

référé civil
type: ConceptReFip
type: Concept
broader: procédure civile
definition: Procédure contradictoire et accélérée grâce à laquelle une partie peut, dans certains cas, obtenir d’un magistrat unique une décision provisoire. Le juge des référés peut même ordonner des mesures conservatoires ou ordonner des remises en état afin de faire cesser un trouble manifestement contraire à la loi ou prévenir un dommage imminent.
in scheme: FINANCES PUBLIQUES
in scheme: Procédure Civile
in scheme: Droit et Justice
in scheme: Procédure
notation: REFIP3725

salaire minimum interprofessionnel de croissance
type: ConceptReFip
type: Concept
alternative label: SMIC
broader: refip-REFIP868
definition: Salaire horaire minimum légal en dessous duquel le salarié ne peut pas être rémunéré.
in scheme: FINANCES PUBLIQUES
in scheme: Entreprises
in scheme: Travail
in scheme: 212619
notation: REFIP3727

certificat de cessibilité
type: ConceptReFip
type: Concept
broader: passation des marchés publics
definition: Document remis par le pouvoir adjudicateur au titulaire du marché public. Le certificat de cessibilité est remis par l’organisme bénéficiaire de la cession ou du nantissement au comptable assignataire en tant que pièce justificative pour le paiement.
in scheme: FINANCES PUBLIQUES
in scheme: Commande publique
in scheme: Gestion Publique
notation: REFIP3728

procuration
type: ConceptReFip
type: Concept
broader: principes généraux (non-descripteur)
definition: Pouvoir qu'une personne donne à une autre d'agir en son nom, désigne aussi l'acte qui confère ce pouvoir.
in scheme: FINANCES PUBLIQUES
in scheme: Principes Généraux
in scheme: Droit et Justice
in scheme: Procédure
notation: REFIP3730

don manuel
type: ConceptReFip
type: Concept
broader: fiscalité du patrimoine
definition: Remise d'espèces, de valeurs mobilières ou d'objets de la main à la main, et soumise aux droits d'enregistrement le cas échéant.
in scheme: FINANCES PUBLIQUES
in scheme: Champ d'Application
in scheme: Fiscalité
notation: REFIP3731

vente amiable
type: ConceptReFip
type: Concept
broader: vente
definition: Vente où le vendeur transmet la propriété d'une chose et s'engage à la livrer à l'acquéreur, celui-ci s'engageant à lui en payer le prix, et ce en vertu du seul consentement des parties. Elle s'oppose à la vente forcée (vente judiciaire par exemple).
in scheme: FINANCES PUBLIQUES
in scheme: Droit et Justice
in scheme: Divisions du Droit
in scheme: Droit Privé
notation: REFIP3732

franchise douanière (supprimé)
type: ConceptReFip
type: Concept
broader: ZZ
in scheme: FINANCES PUBLIQUES
notation: REFIP3733

exploitant agricole
type: ConceptReFip
type: Concept
alternative label: agriculteur
broader: exploitation agricole
definition: Gestionnaire d'une exploitation agricole. Il peut s'agir du propriétaire ou du locataire de l'exploitation, ou encore d'un gérant engagé.
in scheme: FINANCES PUBLIQUES
in scheme: Branche d'activité
in scheme: Questions Economiques
in scheme: Agriculture
narrower: jeune agriculteur
notation: REFIP3734

imprescriptibilité
type: ConceptReFip
type: Concept
broader: droit général (non-descripteur)
definition: Qualité d'un droit ou d'une action qui ne peuvent être atteints par la prescription.
in scheme: FINANCES PUBLIQUES
in scheme: Droit et Justice
in scheme: Droit Général
notation: REFIP3735

Haute-Vienne
type: ConceptReFip
type: Concept
broader: refip-REFIP7020
definition: Département français
in scheme: FINANCES PUBLIQUES
in scheme: Géographie
in scheme: Europe
notation: REFIP3736

indicateur de programme
type: ConceptReFip
type: Concept
broader: objectif de performance
definition: Grandeur chiffrée de la progression attendue et obtenue de la performance. Chaque indicateur porte une valeur prévisionnelle pour l’année et pour une échéance de moyen terme.
in scheme: FINANCES PUBLIQUES
in scheme: Élaboration du budget
in scheme: Budget
notation: REFIP3739

Pyrénées-Orientales
type: ConceptReFip
type: Concept
broader: refip-REFIP7036
definition: Département français
in scheme: FINANCES PUBLIQUES
in scheme: Géographie
in scheme: Europe
notation: REFIP374

République de Vanuatu
type: ConceptReFip
type: Concept
alternative label: Nouvelles-Hébrides
alternative label: Vanuatu
broader: Océanie
definition: Pays
in scheme: FINANCES PUBLIQUES
in scheme: Géographie
in scheme: Océanie
notation: REFIP3740

taxe de risque systémique sur les banques (supprimé)
type: ConceptReFip
type: Concept
in scheme: FINANCES PUBLIQUES
notation: REFIP3741

taxe d'apprentissage
type: ConceptReFip
type: Concept
alternative label: contribution au développement de l'apprentissage
alternative label: contribution supplémentaire à l'apprentissage
broader: taxes et participations assises sur les salaires (non-descripteur)
definition: Taxe ayant pour objet de favoriser l'égal accès à l'apprentissage sur le territoire national et de contribuer au financement d'actions visant au développement de l'apprentissage. La soumission à la taxe d'apprentissage tient à deux conditions relatives, d'une part, à la nature de la personne et, d'autre part, à la nature de l'activité exercée.
in scheme: FINANCES PUBLIQUES
in scheme: Fiscalité
in scheme: Impôt
notation: REFIP3743

taxe intérieure de consommation sur le gaz naturel
type: ConceptReFip
type: Concept
broader: autres taxes, droits ou redevances (non-descripteur)
definition: Soumission du gaz naturel à la taxe en fonction de l'usage qui est fait de ce produit et dont le redevable est le fournisseur de gaz naturel qui doit acquitter cette taxe auprès de l’administration des douanes. Plusieurs types d'exonérations peuvent être accordés sous certaines conditions.
in scheme: FINANCES PUBLIQUES
in scheme: Fiscalité
in scheme: Impôt
notation: REFIP3744

acquiescement au jugement
type: ConceptReFip
type: Concept
broader: refip-REFIP977
definition: L'acquiescement au jugement emporte soumission aux chefs de celui-ci et renonciation aux voies de recours.
in scheme: FINANCES PUBLIQUES
in scheme: Procédure Civile
in scheme: Droit et Justice
in scheme: Procédure
notation: REFIP3745

district européen (supprimé)
type: ConceptReFip
type: Concept
broader: ZZ
in scheme: FINANCES PUBLIQUES
notation: REFIP3746

restitution d'avance ou d'acompte
type: ConceptReFip
type: Concept
broader: acompte d'impôt
in scheme: FINANCES PUBLIQUES
in scheme: Recouvrement
in scheme: Fiscalité
notation: REFIP3748

hypothèque légale (supprimé)
type: ConceptReFip
type: Concept
in scheme: FINANCES PUBLIQUES
notation: REFIP375

aide aux entreprises
type: ConceptReFip
type: Concept
alternative label: aide publique aux entreprises
broader: aide publique
definition: Mesures d'aides financières par l'octroi de subventions aux entreprises.
in scheme: FINANCES PUBLIQUES
in scheme: Dépenses publiques
in scheme: Gestion Publique
narrower: avance remboursable
narrower: ingénierie publique
narrower: prime d'aménagement du territoire
narrower: aide à l'investissement et à l'emploi
narrower: aide exceptionnelle à l'élevage
narrower: aide à finalité régionale
narrower: aide aux entreprises en difficulté
narrower: ingénierie financière
narrower: aide de minimis
narrower: aide à l'exportation
narrower: refip-REFIP7048
narrower: refip-REFIP734
narrower: refip-REFIP763
narrower: refip-REFIP828
notation: REFIP3750

recouvrement spontané (obsolète)
type: ConceptReFip
type: Concept
is replaced by: recouvrement amiable
in scheme: FINANCES PUBLIQUES
notation: REFIP3752

prime à l'amélioration de l'habitat rural
type: ConceptReFip
type: Concept
broader: prime (non-descripteur)
definition: Prime accordée (sous condition de ressources) par l'Etat aux propriétaires qui occupent un logement dans lequel des travaux doivent être effectués.
in scheme: FINANCES PUBLIQUES
in scheme: Dépenses publiques
in scheme: Gestion Publique
notation: REFIP3755

abrogation
type: ConceptReFip
type: Concept
broader: droit général (non-descripteur)
definition: Annulation pour l'avenir de l'application de dispositions législatives, réglementaires ou d'un acte administratif par des dispositions de mêmes valeurs.
in scheme: FINANCES PUBLIQUES
in scheme: Droit et Justice
in scheme: Droit Général
notation: REFIP3756

tourisme
type: ConceptReFip
type: Concept
alternative label: touriste
broader: branche d'activité
definition: Ensemble des activités économiques liées aux voyages et aux loisirs.
in scheme: FINANCES PUBLIQUES
in scheme: Branche d'activité
in scheme: Questions Economiques
in scheme: Tourisme
narrower: gîte rural
narrower: station de tourisme
narrower: agence de voyage
narrower: résidence de tourisme
narrower: camping
notation: REFIP3758

acte ampliatif
type: ConceptReFip
type: Concept
broader: sources des droits subjectifs (non-descripteur)
definition: Acte dont le contenu est destiné à renforcer ou compléter un acte précédent.
in scheme: FINANCES PUBLIQUES
in scheme: Droit et Justice
in scheme: Sources du Droit
in scheme: Sources des Droits Subjectifs
notation: REFIP3759

fraude fiscale
type: ConceptReFip
type: Concept
alternative label: lutte contre la fraude fiscale
broader: droit de contrôle de l'administration (non-descripteur)
definition: Soustraction illégale à la législation fiscale de tout ou partie de la matière imposable.
in scheme: FINANCES PUBLIQUES
in scheme: Droit de Contrôle de l'Administration
in scheme: Fiscalité
narrower: dissimulation de prix
narrower: comptabilité occulte
narrower: comptabilité irrégulière
narrower: acte anormal de gestion
narrower: distribution occulte
narrower: fraude carrousel
narrower: organisation d'insolvabilité
narrower: distribution indirecte
narrower: achat sans facture
narrower: dissimulation de revenus
narrower: insuffisance de déclaration
narrower: comptabilité non présentée
narrower: activité occulte
notation: REFIP376

lettre comminatoire
type: ConceptReFip
type: Concept
broader: documentation fiscale (non-descripteur)
definition: Relance amiable préalable aux poursuites à l'encontre de contribuables ciblés (dette de faible montant, primo-défaillant notamment) dans le cadre de la progressivité des poursuites.
in scheme: FINANCES PUBLIQUES
in scheme: Documentation Fiscale
in scheme: Fiscalité
notation: REFIP3760

comptabilité M 43
type: ConceptReFip
type: Concept
broader: comptabilité publique locale
definition: Instruction comptable M 43 abrégé applicable aux services publics locaux de transport de personnes.
in scheme: FINANCES PUBLIQUES
in scheme: Secteur public local
in scheme: Gestion Publique
notation: REFIP3762

Brésil
type: ConceptReFip
type: Concept
broader: Amérique
definition: Pays
in scheme: FINANCES PUBLIQUES
in scheme: Géographie
in scheme: Amérique
notation: REFIP3763

crématorium
type: ConceptReFip
type: Concept
alternative label: columbarium
broader: refip-REFIP86
definition: Lieu où l'on incinère les défunts.
in scheme: FINANCES PUBLIQUES
in scheme: Domaine
in scheme: Gestion Publique
notation: REFIP3765

société par actions simplifiée
type: ConceptReFip
type: Concept
broader: société de capitaux
definition: Société commerciale constituée par une personne dite "associé unique" ou par plusieurs personnes. Les règles concernant le fonctionnement du Conseil d'administration ou celle relatives au Directoire des SA lui sont applicables. Le fonctionnement interne de la SAS est essentiellement défini dans ses statuts et peut être indépendant de la répartition du capital.
in scheme: FINANCES PUBLIQUES
in scheme: Société
in scheme: Entreprises
in scheme: Forme juridique
notation: REFIP3766

propriété intellectuelle
type: ConceptReFip
type: Concept
alternative label: droits d'auteur
alternative label: propriété industrielle
alternative label: propriété littéraire et artistique
broader: droit commercial
definition: Ensemble des droits exclusifs accordés sur les créations intellectuelles à l'auteur ou à l'ayant droit d'une œuvre de l'esprit. Elle comporte deux branches : la propriété littéraire et artistique (s'applique aux œuvres de l'esprit, est composée du droit d'auteur,et des droits voisins) ; la propriété industrielle, qui regroupe, d'une part, les créations utilitaires (comme le brevet d'invention et le certificat d'obtention végétale) et, d'autre part, les signes distinctifs, notamment la marque commerciale, le nom de domaine et l'appellation d'origine.
in scheme: FINANCES PUBLIQUES
in scheme: Droit et Justice
in scheme: Divisions du Droit
in scheme: Droit Privé
narrower: droit de reproduction
narrower: production des oeuvres de l'esprit
narrower: droit de la propriété industrielle
notation: REFIP3767

alcool
type: ConceptReFip
type: Concept
alternative label: boisson alcoolisée
broader: agroalimentaire
definition: Boisson contenant de l'alcool.
in scheme: FINANCES PUBLIQUES
in scheme: Branche d'activité
in scheme: Questions Economiques
in scheme: Industrie
narrower: vin
notation: REFIP3769
related: alcoolisme

taxe due par les titulaires d'ouvrages hydroélectriques
type: ConceptReFip
type: Concept
broader: autres taxes, droits ou redevances (non-descripteur)
definition: L'établissement public « VOIES NAVIGABLES DE FRANCE » perçoit à son profit une taxe sur les titulaires d'ouvrages de prise d'eau, rejet d'eau ou autres ouvrages hydrauliques destinés à prélever ou évacuer des volumes d'eau sur le domaine public fluvial.
in scheme: FINANCES PUBLIQUES
in scheme: Fiscalité
in scheme: Impôt
notation: REFIP377

cession de droits sociaux
type: ConceptReFip
type: Concept
alternative label: acquisition de droits sociaux
alternative label: cession d'action
alternative label: cession de participation
alternative label: cession de parts
broader: droits sociaux
definition: Cession totale ou partielle de parts sociales ou d'action d'une société commerciale permettant de sortir de celle-ci en laissant intact son capital social.
in scheme: FINANCES PUBLIQUES
in scheme: Droit et Justice
in scheme: Divisions du Droit
in scheme: Droit Privé
notation: REFIP3771

frais de justice
type: ConceptReFip
type: Concept
broader: principes généraux (non-descripteur)
definition: Ensemble des frais de procédure exposés à l'occasion d'une instance judiciaire.
in scheme: FINANCES PUBLIQUES
in scheme: Principes Généraux
in scheme: Droit et Justice
in scheme: Procédure
narrower: frais de procédure
notation: REFIP3772

application FI3S
type: ConceptReFip
type: Concept
alternative label: FI3S
broader: applications fiscales (non-descripteur)
definition: Outil servant à automatiser les travaux de surveillance et de relance des déclarations de succession confiés aux inspections de fiscalité immobilière.
in scheme: FINANCES PUBLIQUES
in scheme: Applications Informatiques
in scheme: Applications fiscales
notation: REFIP3773
scope note: Remplacée par l'application Suivi succession à compter du 24/06/19

délégation d'autorisation d'engagement
type: ConceptReFip
type: Concept
broader: autorisation d'engagement
definition: Acte par lequel un acteur de niveau central (responsable de programme ou responsable de Budget Opérationnel de Programme) met une enveloppe d’autorisation d’engagement à disposition d’un acteur de niveau local (Responsable de BOP ou Responsable d'Unité Opérationnelle) afin de lui permettre d’exécuter tout ou partie du BOP au niveau déconcentré.
in scheme: FINANCES PUBLIQUES
in scheme: Exécution du budget
in scheme: Budget
notation: REFIP3774

La Réunion
type: ConceptReFip
type: Concept
alternative label: île de La Réunion
broader: collectivités et territoires d'outre mer (non-descripteur)
definition: Département d'outre mer
in scheme: FINANCES PUBLIQUES
in scheme: Géographie
in scheme: Europe
notation: REFIP3775

contrôle juridictionnel
type: ConceptReFip
type: Concept
broader: droit administratif
definition: Contrôle exercé par le juge administratif sur les actes de l'Administration à l'occasion des recours dont il est saisi.
in scheme: FINANCES PUBLIQUES
in scheme: Droit et Justice
in scheme: Divisions du Droit
in scheme: Droit Public
notation: REFIP3776

application VISUDGFIP CADASTRE
type: ConceptReFip
type: Concept
alternative label: VISUDGFIP CADASTRE
broader: applications fiscales (non-descripteur)
definition: Application permettant la consultation et l'édition de la documentation cadastrale.
in scheme: FINANCES PUBLIQUES
in scheme: Applications Informatiques
in scheme: Applications fiscales
notation: REFIP3777

décision administrative contentieuse
type: ConceptReFip
type: Concept
broader: contentieux fiscal
definition: Décision de l'administration statuant sur la réclamation contentieuse d'un contribuable. Cette décision peut consister en une admission totale, partielle ou un rejet.
in scheme: FINANCES PUBLIQUES
in scheme: Contentieux Fiscal
in scheme: Fiscalité
narrower: dégrèvement
notation: REFIP3779

réception de travaux
type: ConceptReFip
type: Concept
broader: exécution d'un marché public
definition: Acte par lequel le maître d'ouvrage déclare accepter l'ouvrage qui a été construit, en émettant des réserves si besoin est. Elle se concrétise par un procès-verbal, document écrit et signé par l'ensemble des intervenants à la construction.
in scheme: FINANCES PUBLIQUES
in scheme: Commande publique
in scheme: Gestion Publique
narrower: procès-verbal de réception des travaux
narrower: réserves à la réception de travaux
notation: REFIP3783

agent administratif hospitalier (supprimé)
type: ConceptReFip
type: Concept
broader: ZZ
in scheme: FINANCES PUBLIQUES
notation: REFIP3784

intérêts moratoires
type: ConceptReFip
type: Concept
broader: pénalité de retard
definition: Compensation financière destinée à réparer le préjudice subi par le retard dans l'exécution d'une obligation.
in scheme: FINANCES PUBLIQUES
in scheme: Droit et Justice
in scheme: Sanction
in scheme: Infractions et Sanctions
notation: REFIP3786

honorariat
type: ConceptReFip
type: Concept
alternative label: distinction
broader: droit civil
definition: Distinction conférée discrétionnairement à certains fonctionnaires ou à certains membres des professions libérales qui quittent définitivement leurs fonctions et qui leur permet de conserver leur titre et certaines prérogatives ou distinctions honorifiques.
in scheme: FINANCES PUBLIQUES
in scheme: Droit et Justice
in scheme: Divisions du Droit
in scheme: Droit Privé
notation: REFIP3787

heure mensuelle d'information syndicale (obsolète)
type: ConceptReFip
type: Concept
is replaced by: information syndicale
broader: ZZ
in scheme: FINANCES PUBLIQUES
notation: REFIP3789

non-affectation des recettes
type: ConceptReFip
type: Concept
broader: principe budgétaire
definition: Règle de non-affectation qui interdit l’affectation d’une recette à une dépense déterminée. Elle implique de verser toutes les recettes dans une caisse unique où l’origine des fonds est indéterminée. Elle permet à l’autorité budgétaire de conserver son pouvoir de décision et de gérer les fonds publics en respectant les notions de solidarité et d’unité nationales.
in scheme: FINANCES PUBLIQUES
in scheme: Élaboration du budget
in scheme: Budget
notation: REFIP379

comptabilisation
type: ConceptReFip
type: Concept
broader: procédures et techniques comptables (non-descripteur)
definition: Enregistrement dans une comptabilité.
in scheme: FINANCES PUBLIQUES
in scheme: Procédures et Techniques Comptables
in scheme: Comptabilité
narrower: boni
narrower: écriture comptable
narrower: ajustement comptable
narrower: règle d'imputation
narrower: arrondi
notation: REFIP3792

agence de voyage
type: ConceptReFip
type: Concept
alternative label: voyagiste
broader: tourisme
definition: Entreprise qui propose et vend des offres de voyages à ses clients.
in scheme: FINANCES PUBLIQUES
in scheme: Branche d'activité
in scheme: Questions Economiques
in scheme: Tourisme
notation: REFIP3793

mandat de paiement
type: ConceptReFip
type: Concept
broader: mandatement
definition: Pièce délivrée par une administration publique et en vertu de laquelle un créancier se fait payer par le Trésor public.
in scheme: FINANCES PUBLIQUES
in scheme: Dépenses publiques
in scheme: Gestion Publique
notation: REFIP3796

aéroports de Paris (supprimé)
type: ConceptReFip
type: Concept
broader: ZZ
in scheme: FINANCES PUBLIQUES
notation: REFIP3797

transport de marchandises
type: ConceptReFip
type: Concept
alternative label: fret
broader: refip-REFIP766
definition: Activité économique réglementée, à la fois au niveau d'un pays et au niveau international. Le transporteur de marchandises, utilise des moyens de transport (véhicules automobiles, trains, vélo cargos, aéronefs, navires, etc.) et des infrastructures.
in scheme: FINANCES PUBLIQUES
in scheme: Branche d'activité
in scheme: Questions Economiques
in scheme: Transports
narrower: affrètement
notation: REFIP3798
related: transport routier

droit budgétaire
type: ConceptReFip
type: Concept
broader: droit public
definition: Ensemble des règles juridiques qui déterminent la structure, le contenu et l'élaboration des budgets des personnes morales de droit public, dont l'État. Avec le droit fiscal ils forment le droit des finances publiques.
in scheme: FINANCES PUBLIQUES
in scheme: Droit et Justice
in scheme: Divisions du Droit
in scheme: Droit Public
notation: REFIP3799

taxation sur la marge
type: ConceptReFip
type: Concept
broader: régime d'imposition
definition: Taxation s’appliquant sur la différence entre le prix de vente et le prix d'achat, calculée opération par opération. Sont ainsi soumises de plein droit au régime de taxation sur la marge les livraisons par un assujetti-revendeur de biens achetés auprès d'un non-redevable.
in scheme: FINANCES PUBLIQUES
in scheme: Régime d'Imposition
in scheme: Fiscalité
notation: REFIP38

Guadeloupe
type: ConceptReFip
type: Concept
broader: collectivités et territoires d'outre mer (non-descripteur)
definition: Département d'outre mer
in scheme: FINANCES PUBLIQUES
in scheme: Géographie
in scheme: Europe
notation: REFIP380
related: Antilles

cellule nationale de supervision des tiers
type: ConceptReFip
type: Concept
alternative label: CNST
broader: administration centrale des finances publiques
definition: Service qui supervise l’ensemble du dispositif et veille à l’aiguillage et au traitement des demandes. Vérifie à échéance régulière que les demandes de validation de RIB sont traitées dans un délai acceptable pour les ministères. La cellule assure un rôle de conseil et d’assistance auprès des fonctions régionales de supervision des tiers.
in scheme: FINANCES PUBLIQUES
in scheme: Organisation Structurelle de l'Etat
in scheme: Ministère
in scheme: Administration de L'Etat
notation: REFIP3801
related: fonction de supervision des tiers

Roumanie
type: ConceptReFip
type: Concept
broader: Europe
definition: Pays
in scheme: FINANCES PUBLIQUES
in scheme: Géographie
in scheme: Europe
notation: REFIP3802

dispense de production du bilan (supprimé)
type: ConceptReFip
type: Concept
broader: ZZ
in scheme: FINANCES PUBLIQUES
notation: REFIP3803

commission de surendettement des particuliers
type: ConceptReFip
type: Concept
alternative label: commission de surendettement
broader: Banque de France
definition: Organisme public, implanté dans chaque département, qu'un particulier peut saisir lorsqu'il rencontre de graves difficultés financières pour rembourser des dettes non professionnelles. La commission a pour mission de préserver les intérêts des particuliers et de leurs créanciers en établissant, lorsque cela est possible, un plan conventionnel de redressement. Ce plan amiable de remboursement est approuvé par le débiteur et les principaux créanciers. En cas d'échec, elle pourra, si le débiteur la saisit à nouveau, établir un second plan en imposant des mesures aux créanciers. Si la situation financière du débiteur rend manifestement impossible la mise en œuvre de ces mesures, la procédure de rétablissement personnel pourra être engagée.
in scheme: FINANCES PUBLIQUES
in scheme: Organisation Structurelle de l'Etat
in scheme: Institutions
in scheme: Administration de L'Etat
notation: REFIP3804

application BORIS
type: ConceptReFip
type: Concept
alternative label: BORIS
broader: applications missions transverses (non-descripteur)
definition: Application de gestion électronique de suivi du courrier et des dossiers à disposition des agents de la Direction de la Législation Fiscale (DLF) et du Service Juridique (JF).
in scheme: FINANCES PUBLIQUES
in scheme: Applications missions transverses
in scheme: Applications Informatiques
notation: REFIP3805

Caisse nationale d'allocations familiales
type: ConceptReFip
type: Concept
alternative label: CNAF
broader: établissement public à caractère administratif
definition: Etablissement public administratif qui gère la branche « famille » de la sécurité sociale au travers du réseau formé par les caisses d’allocations familiales (CAF) réparties sur tout le territoire. La CNAF gère plusieurs fonds dont le fonds national des prestations familiales ; le fonds national d'action sociale.
in scheme: FINANCES PUBLIQUES
in scheme: Organisation Structurelle de l'Etat
in scheme: Opérateur de l'Etat
in scheme: Administration de L'Etat
narrower: Caisse d'allocations familiales
notation: REFIP3806

amende pénale
type: ConceptReFip
type: Concept
broader: amende
definition: Sanction pécuniaire prononcée par une juridiction répressive obligeant la personne condamnée à verser une certaine somme d'argent au Trésor Public en réparation du préjudice qu'elle a provoqué du fait de l'infraction commise.
in scheme: FINANCES PUBLIQUES
in scheme: Droit et Justice
in scheme: Sanction
in scheme: Infractions et Sanctions
notation: REFIP3807

trajectoire comptable
type: ConceptReFip
type: Concept
broader: comptabilité générale de l'Etat
definition: Ultime phase du projet permettant à Chorus de devenir l'outil maître de la comptabilité de l'Etat, en remplacement des anciennes applications, la trajectoire comptable a permis de mettre en œuvre les dernières fonctionnalités comptables comme la Comptabilité Développée du Recouvrement qui porte notamment la consolidation comptable des applications fiscales, mais aussi la Comptabilité Générale de l’État sous ses trois dimensions (Comptabilités générale, budgétaire et d’analyse des Coûts).
in scheme: FINANCES PUBLIQUES
in scheme: Comptabilité générale de l'Etat
in scheme: Comptabilité
notation: REFIP3809
related: comptabilité d'analyse des coûts
related: comptabilité budgétaire

conseil d'administration
type: ConceptReFip
type: Concept
broader: gestion de l'entreprise (non-descripteur)
definition: Groupe de personnes morales ou physiques (les administrateurs) chargé d'administrer une institution : une association, une entreprise ou un établissement public. Il comprend plusieurs membres, dont un président désigné ou élu, et un secrétaire. Dans l’entreprise, il est constitué par un collège d’actionnaires appelés « administrateurs ». Le Conseil d’administration est un organe délibérant que est dirigé par le Président du conseil d’administration. Les attributions du conseil d’administration peuvent être limitées aux seuls pouvoirs de gestion et d’administration courante ou être largement entendues comme étant toutes les décisions pour lesquelles la compétence n’a pas été expressément attribuée à l’assemblée générale.
in scheme: FINANCES PUBLIQUES
in scheme: Gestion de l'Entreprise
in scheme: Entreprises
in scheme: Vie et Gestion de l'entreprise
narrower: jeton de présence
notation: REFIP381

application ACTES
type: ConceptReFip
type: Concept
broader: applications gestion publique (non-descripteur)
definition: Application permettant d'effectuer les contrôles de légalité des actes télétransmis par les collectivités territoriales, leurs établissements publics locaux et les établissements publics de coopération intercommunale.
in scheme: FINANCES PUBLIQUES
in scheme: Applications Informatiques
in scheme: Applications gestion publique
notation: REFIP3810

guide d'utilisation
type: ConceptReFip
type: Concept
alternative label: guide utilisateur
broader: document
definition: Manuel contenant le mode d'emploi d'un appareil, d'une application...
in scheme: FINANCES PUBLIQUES
in scheme: Documentation
in scheme: Communication Documentation Informatique
notation: REFIP3811

connexion
type: ConceptReFip
type: Concept
broader: application informatique
definition: Procédure permettant à un utilisateur de se mettre en relation avec un système informatique et, si nécessaire, de se faire reconnaître de celui-ci.
in scheme: FINANCES PUBLIQUES
in scheme: Informatique
in scheme: Communication Documentation Informatique
notation: REFIP3812
related: internet

insuffisance de déclaration
type: ConceptReFip
type: Concept
broader: fraude fiscale
definition: Minoration par un contribuable d'une base ou d'un élément d'imposition qui, lorsqu'elle est réparée se traduit par un supplément d'imposition.
in scheme: FINANCES PUBLIQUES
in scheme: Droit de Contrôle de l'Administration
in scheme: Fiscalité
notation: REFIP3813

personne morale de droit public
type: ConceptReFip
type: Concept
broader: personnalité morale
definition: Groupement de la personnalité juridique investie d'une mission d'intérêt général et titulaires de prérogatives privées : l'État, les collectivités territoriales, les établissements publics comme les établissements d'assistance – hôpitaux, bureaux, établissements culturels, universités, lycées et certains établissements corporatifs : chambres de commerce et d'industrie, chambres des métiers ou d'agriculture...
in scheme: FINANCES PUBLIQUES
in scheme: Droit et Justice
in scheme: Droit Général
notation: REFIP3814

cotisation sur la valeur ajoutée des entreprises
type: ConceptReFip
type: Concept
alternative label: CVAE
broader: contribution économique territoriale
definition: Cotisation destinée à assurer le financement des communes et de leurs EPCI, des départements et des régions. Elle constitue, avec la cotisation foncière des entreprises (CFE), l'une des deux composantes de la contribution économique territoriale (CET). Elle est due par les personnes exerçant une activité soumise à la CFE et dont le chiffre d'affaires excède un certain montant.
in scheme: FINANCES PUBLIQUES
in scheme: Fiscalité
in scheme: Impôt
notation: REFIP3815

greffe de juridiction
type: ConceptReFip
type: Concept
alternative label: greffe
alternative label: secrétariat-greffe
broader: juridiction
definition: Office ministériel placé sous l'autorité et la responsabilité d'un greffier titulaire de charge, assurant l'ensemble des services administratifs des tribunaux de commerce et, à titre transitoire, de ceux du siège de cours d'appel, tribunaux de grande instance et tribunaux d'instance.
in scheme: FINANCES PUBLIQUES
in scheme: Droit et Justice
in scheme: Juridiction
in scheme: Organisation Juridictionnelle
notation: REFIP3816

coopération décentralisée
type: ConceptReFip
type: Concept
broader: coopération intercommunale
definition: Toutes les formes de coopération que les collectivités territoriales françaises ou leurs groupements peuvent développer avec des autorités ou des collectivités locales étrangères, "dans le respect des engagements internationaux de la France"
in scheme: FINANCES PUBLIQUES
in scheme: Secteur public local
in scheme: Gestion Publique
notation: REFIP3817

le Belize
type: ConceptReFip
type: Concept
alternative label: Belize
broader: Amérique
definition: Pays
in scheme: FINANCES PUBLIQUES
in scheme: Géographie
in scheme: Amérique
notation: REFIP3818

sauvegarde informatique
type: ConceptReFip
type: Concept
alternative label: sauvegarde de données
broader: informatique
definition: Opération qui consiste à dupliquer et à mettre en sécurité les données contenues dans un système informatique.
in scheme: FINANCES PUBLIQUES
in scheme: Informatique
in scheme: Communication Documentation Informatique
notation: REFIP3819

périmètre
type: ConceptReFip
type: Concept
broader: mots outils (liste additive)
definition: Zone, limites, étendue d’un champ d’action, d’une opération, d’attributions ou encore de notions plus abstraites.
in scheme: FINANCES PUBLIQUES
in scheme: Mots Outils
notation: REFIP382

corruption
type: ConceptReFip
type: Concept
broader: délit
definition: Détournement d'un pouvoir reçu et diriger à des fins personnelles. Sollicitation d'une personne pour qu'elle accomplisse ou n'accomplisse pas un acte de sa fonction.
in scheme: FINANCES PUBLIQUES
in scheme: Droit et Justice
in scheme: Infractions et Sanctions
in scheme: Infraction
narrower: concussion
narrower: prise illégale d'intérêt
notation: REFIP3820

application GESVI
type: ConceptReFip
type: Concept
alternative label: GESVI
broader: applications gestion publique (non-descripteur)
definition: Application de gestion des valeurs inactives au service comptabilité des postes centralisateurs.
in scheme: FINANCES PUBLIQUES
in scheme: Applications Informatiques
in scheme: Applications gestion publique
notation: REFIP3821

avance à régulariser
type: ConceptReFip
type: Concept
broader: avance
definition: Paiement partiel sur une charge ou un produit constatée d'avance devant être régularisé.
in scheme: FINANCES PUBLIQUES
in scheme: Procédures et Techniques Comptables
in scheme: Comptabilité
notation: REFIP3825

Bulgarie
type: ConceptReFip
type: Concept
broader: Europe
definition: Pays
in scheme: FINANCES PUBLIQUES
in scheme: Géographie
in scheme: Europe
notation: REFIP3826

collectivité territoriale
type: ConceptReFip
type: Concept
alternative label: collectivité locale
broader: structures territoriales (non-descripteur)
definition: Ensemble des communes, départements, régions, collectivités à statut particulier et les collectivités d’outre-mer.
in scheme: FINANCES PUBLIQUES
in scheme: Organisation Territoriale
in scheme: Structures Territoriales
in scheme: Administration de L'Etat
narrower: région
narrower: canton
narrower: commune
narrower: département d'outre-mer
narrower: département
notation: REFIP3828

restitution de l'information
type: ConceptReFip
type: Concept
alternative label: outil de restitution
alternative label: restitution informatique
broader: informatique
definition: Ensemble d'outils, de processus et méthodes qui permettent de collecter, traiter et restituer les données.
in scheme: FINANCES PUBLIQUES
in scheme: Informatique
in scheme: Communication Documentation Informatique
narrower: requêtage
narrower: extraction
notation: REFIP3829
related: moteur de recherche
related: information
related: traitement de l'information

restauration collective
type: ConceptReFip
type: Concept
alternative label: cantine scolaire
alternative label: restaurant administratif
alternative label: restaurant d'entreprise
alternative label: restaurant scolaire
alternative label: restaurant universitaire
alternative label: restauration administrative
alternative label: restauration d'entreprise
alternative label: restauration scolaire
alternative label: restauration universitaire
broader: fourniture de repas
definition: Activité faisant partie d'un ensemble appelé, la restauration Hors Domicile (RHD), regroupant aussi la restauration commerciale (restaurant, cafétéria, snacks...). La restauration collective se distingue par son caractère social qui vise à produire un repas aux convives d'une collectivité déterminée (jeune, patient, salarié...) à un prix moindre que celui pratiqué par des restaurants commerciaux.
in scheme: FINANCES PUBLIQUES
in scheme: Branche d'activité
in scheme: Questions Economiques
in scheme: Commerce
notation: REFIP383

association touristique sportive et culturelle des administrations financières
type: ConceptReFip
type: Concept
alternative label: ATSCAF
broader: secrétariat général des ministères économiques et financiers
definition: Association de la loi 1901 offrant la possibilité au personnel des Ministères économique et financier d’exercer des activités sportives, culturelles et sportives complétant celles proposées par les services sociaux du ministère.
in scheme: FINANCES PUBLIQUES
in scheme: Organisation Structurelle de l'Etat
in scheme: Ministère
in scheme: Administration de L'Etat
notation: REFIP3831

procédure des annulations d'opérations compensées à tort
type: ConceptReFip
type: Concept
alternative label: AOCT
alternative label: annulations d'opérations compensées à tort
broader: procédures et techniques comptables (non-descripteur)
definition: Opération de contre-passation d'une opération initiale émise à tort.
in scheme: FINANCES PUBLIQUES
in scheme: Procédures et Techniques Comptables
in scheme: Comptabilité
notation: REFIP3832

Togo
type: ConceptReFip
type: Concept
broader: Afrique
definition: Pays
in scheme: FINANCES PUBLIQUES
in scheme: Géographie
in scheme: Afrique
notation: REFIP3834

recherche scientifique
type: ConceptReFip
type: Concept
alternative label: recherche
broader: industrie
definition: Activité de production et de développement des connaissances scientifiques, dans les domaines de la santé, des transports, de l' énergie, de la communication et des technologies.
in scheme: FINANCES PUBLIQUES
in scheme: Branche d'activité
in scheme: Questions Economiques
in scheme: Industrie
narrower: laboratoire
notation: REFIP3835

Pôle national ressources humaines
type: ConceptReFip
type: Concept
alternative label: PNRH de Toulouse
alternative label: PNSR de Toulouse
alternative label: Pôle de Toulouse
broader: Pôle national de soutien au réseau
definition: Structure qui apporte une assistance concrète et rapide aux gestionnaires des Ressources Humaines dans l'instruction et le traitement des dossiers complexes. Les compétences du PNSR RH s'étendent à l'ensemble des domaines de la sphère Ressources Humaines (gestion du temps, congés, autorisations d'absence, congés pour raisons de santé, frais de déplacement, positions, …) à l'exclusion des régimes indemnitaires et des cumuls d'activités.
in scheme: FINANCES PUBLIQUES
in scheme: Organisation Structurelle de l'Etat
in scheme: Ministère
in scheme: Administration de L'Etat
notation: REFIP3836

exécution d'un marché public
type: ConceptReFip
type: Concept
alternative label: durée d'exécution
alternative label: durée d'un marché public
broader: marché public
definition: Phase de mise en œuvre de tous les éléments préparés lors de la passation du marché public.
in scheme: FINANCES PUBLIQUES
in scheme: Commande publique
in scheme: Gestion Publique
narrower: garantie de parfait achèvement
narrower: urgence impérieuse
narrower: compte prorata
narrower: retenue de garantie
narrower: avance facultative
narrower: décompte général et définitif
narrower: comité consultatif règlement amiable des différends ou litiges
narrower: délai d'exécution
narrower: travaux supplémentaires
narrower: cotraitance
narrower: solde d'un marché public
narrower: réception de travaux
narrower: ordre de service
narrower: faute du cocontractant
narrower: règlement partiel définitif
narrower: achèvement des travaux
narrower: sous-traitant
narrower: avance forfaitaire
narrower: mise en régie
narrower: délai de garantie
narrower: refip-REFIP7047
narrower: refip-REFIP793
narrower: refip-REFIP83
notation: REFIP3837

chômage partiel
type: ConceptReFip
type: Concept
alternative label: activité partielle
alternative label: chômage technique
alternative label: réduction partielle d'activité
broader: chômage
definition: Situation faisant suite à une baisse d'activité anormale de l'entreprise qui est obligée de réduire les horaires de travail ou de suspendre temporairement leur activité.
in scheme: FINANCES PUBLIQUES
in scheme: Questions Economiques
in scheme: Economie générale
notation: REFIP3838
related: entreprise en difficulté

Conseil constitutionnel
type: ConceptReFip
type: Concept
broader: juridiction
definition: Organe institué par la Constitution de 1958 pour assurer le contrôle de constitutionnalité des lois et des traités internationaux avant promulgation, veiller à la régularité des référendums et des élections législatives ou présidentielles, jouer un rôle consultatif etc.
in scheme: FINANCES PUBLIQUES
in scheme: Droit et Justice
in scheme: Juridiction
in scheme: Organisation Juridictionnelle
notation: REFIP3839

application PCI
type: ConceptReFip
type: Concept
alternative label: application PCI image
alternative label: application PCI vecteur
broader: applications fiscales (non-descripteur)
definition: Application de gestion et de diffusion du plan cadastral informatisé.
in scheme: FINANCES PUBLIQUES
in scheme: Applications Informatiques
in scheme: Applications fiscales
notation: REFIP3840

extrait cadastral
type: ConceptReFip
type: Concept
broader: refip-REFIP7189
definition: Copie conforme d'informations figurant sur un document du cadastre délivré par le service du Cadastre.
in scheme: FINANCES PUBLIQUES
in scheme: Cadastre
in scheme: Fiscalité
narrower: relevé de propriété
narrower: extrait de plan
notation: REFIP3841

ordre de service
type: ConceptReFip
type: Concept
broader: exécution d'un marché public
definition: Décision écrite du pouvoir adjudicateur qui précise les modalités prévues au marché pour l'exécution des prestations.
in scheme: FINANCES PUBLIQUES
in scheme: Commande publique
in scheme: Gestion Publique
notation: REFIP3842

licitation partage
type: ConceptReFip
type: Concept
broader: partage
definition: Vente aux enchères d'un bien meuble ou immeuble faisant l'objet d'une indivision (le plus souvent à la suite d'une succession).
in scheme: FINANCES PUBLIQUES
in scheme: Droit et Justice
in scheme: Divisions du Droit
in scheme: Droit Privé
notation: REFIP3843

application WIN-OMP
type: ConceptReFip
type: Concept
alternative label: WIN-OMP
broader: applications fiscales (non-descripteur)
definition: Application permettant la gestion des amendes forfaitaires majorées.
in scheme: FINANCES PUBLIQUES
in scheme: Applications Informatiques
in scheme: Applications fiscales
notation: REFIP3844

convention-type
type: ConceptReFip
type: Concept
broader: document
definition: Modèle de convention.
in scheme: FINANCES PUBLIQUES
in scheme: Documentation
in scheme: Communication Documentation Informatique
notation: REFIP3845

agenda électronique
type: ConceptReFip
type: Concept
alternative label: agenda
alternative label: agenda partagé
broader: outil collaboratif
definition: Logiciel pour la gestion de données personnelles telles que rendez-vous, adresses, emploi du temps.
in scheme: FINANCES PUBLIQUES
in scheme: Communication
in scheme: Communication Documentation Informatique
notation: REFIP3846

application ASTER
type: ConceptReFip
type: Concept
alternative label: ASTER
broader: applications gestion publique (non-descripteur)
definition: Outil informatique de gestion comptable des trésoreries à l’étranger.
in scheme: FINANCES PUBLIQUES
in scheme: Applications Informatiques
in scheme: Applications gestion publique
notation: REFIP3847

bilan d'activité
type: ConceptReFip
type: Concept
broader: document
definition: Document périodique qui récapitule les principales données chiffrées reflétant la situation de l'activité d'une entreprise ou d'une administration.
in scheme: FINANCES PUBLIQUES
in scheme: Documentation
in scheme: Communication Documentation Informatique
notation: REFIP3848

contrat à exécution successive
type: ConceptReFip
type: Concept
broader: contrat
definition: Contrat qui implique pour son exécution l'écoulement d'un certain temps, soit que les prestations aient été échelonnées, soit qu'il existe entre les parties un rapport continu d'obligation,
in scheme: FINANCES PUBLIQUES
in scheme: Droit et Justice
in scheme: Divisions du Droit
in scheme: Droit Privé
notation: REFIP3850

déontologie
type: ConceptReFip
type: Concept
broader: refip-REFIP6565
definition: Règles de bonne conduite qui permettent de définir collectivement et dans la pratique comment servir au mieux l’intérêt général. Ces règles et devoirs s’imposent aux fonctionnaires, magistrats, militaires, ainsi qu’aux agents contractuels et aux employeurs publics.
in scheme: FINANCES PUBLIQUES
in scheme: Gestion des ressources humaines
in scheme: Statut du fonctionnaire
in scheme: Fonction Publique et Gestion des Ressources Humaines
narrower: égalité de traitement
narrower: refip-REFIP6669
notation: REFIP3852

Caisse des écoles
type: ConceptReFip
type: Concept
broader: établissement public communal
definition: Etablissement public communal présidé par le maire, intervenant en faveur des enfants relevant de l’enseignement du premier et du second degrés dans tous les domaines de la vie scolaire, que ce soit dans l'enseignement public ou l'enseignement privé.
in scheme: FINANCES PUBLIQUES
in scheme: Organisation Territoriale
in scheme: Structures Territoriales
in scheme: Administration de L'Etat
notation: REFIP3853

avis d'intention de conclure un marché public (supprimé)
type: ConceptReFip
type: Concept
broader: ZZ
in scheme: FINANCES PUBLIQUES
notation: REFIP3856

purge des hypothèques
type: ConceptReFip
type: Concept
broader: hypothèque
definition: Procédure ouverte à l'acquéreur d'un immeuble d'affranchir cet immeuble des hypothèques qui le grèvent, en offrant aux créanciers hypothécaires son prix d'acquisition ou la valeur estimative de l'immeuble et en payant ou consignant la somme offerte, pour prévenir ou arrêter les poursuites auxquelles l’exposerait le droit de suite.
in scheme: FINANCES PUBLIQUES
in scheme: Recouvrement
in scheme: Fiscalité
notation: REFIP3859

contrat de performance
type: ConceptReFip
type: Concept
broader: pilotage
definition: Contrat pluriannuel fixant les objectifs à atteindre, précisant les moyens alloués pour y parvenir, afin de réaliser des réformes et faire des gains de productivité.
in scheme: FINANCES PUBLIQUES
in scheme: Missions Transverses des Finances publiques
in scheme: Pilotage
notation: REFIP386

service facturier
type: ConceptReFip
type: Concept
alternative label: SFACT
broader: direction régionale des finances publiques
definition: Centre de traitement et de paiement unique des factures, placé sous l’autorité de l’agent comptable, composé d'agents issus des services de l'ordonnateur et de l'agence comptable. Le service facturier saisit les factures, effectue le rapprochement entre engagement juridique, facture et certification du service fait, constitue les dossiers de liquidation et procède au paiement après avoir exercé ses contrôles. Il permet une plus grande fluidité du circuit de la dépense en rationalisant les contrôles et en réduisant des délais de paiement.
in scheme: FINANCES PUBLIQUES
in scheme: Organisation Structurelle de l'Etat
in scheme: Ministère
in scheme: Administration de L'Etat
notation: REFIP3861

application ECC (supprimé)
type: ConceptReFip
type: Concept
broader: ZZ
in scheme: FINANCES PUBLIQUES
notation: REFIP3862

rôle d'imposition
type: ConceptReFip
type: Concept
broader: documentation fiscale (non-descripteur)
definition: Titre de créance établi par les services fiscaux en vertu duquel les comptables assurent le recouvrement des impôts directs. Le rôle est rendu exécutoire par la formule d’homologation apposée par le Préfet. Au plan matériel, le rôle est composé d’articles ; c’est une liste des contribuables imposés dans une même commune, à la même date et pour une même catégorie d’impôts (par exemple : rôle de taxe d’habitation, d’impôts sur le revenu, …).
in scheme: FINANCES PUBLIQUES
in scheme: Documentation Fiscale
in scheme: Fiscalité
narrower: émission de rôle d'imposition
narrower: rôle général
narrower: rôle supplémentaire
narrower: rôle individuel
narrower: homologation
narrower: refip-REFIP987
notation: REFIP3863
related: ordre de recette

Inspection du travail
type: ConceptReFip
type: Concept
broader: refip-REFIP7068
definition: Corps de contrôle spécialisé, rattaché au Ministère du Travail et chargé de veiller à la bonne application du droit du travail au sein des entreprises. Les agents sont soumis à un certain nombre d’obligations (impartialité, confidentialité des plaintes, …) et de droits, en tête desquels la protection contre les obstacles à l’exercice de ses missions.
in scheme: FINANCES PUBLIQUES
in scheme: Organisation Structurelle de l'Etat
in scheme: Ministère
in scheme: Administration de L'Etat
notation: REFIP3864

Isère
type: ConceptReFip
type: Concept
broader: Auvergne-Rhône-Alpes
definition: Département français
in scheme: FINANCES PUBLIQUES
in scheme: Géographie
in scheme: Europe
notation: REFIP3865

application RCT
type: ConceptReFip
type: Concept
alternative label: RCT
broader: applications gestion publique (non-descripteur)
definition: Application permettant la gestion comptable des collectivités locales et des EPL.
in scheme: FINANCES PUBLIQUES
in scheme: Applications Informatiques
in scheme: Applications gestion publique
notation: REFIP3866

mandatement
type: ConceptReFip
type: Concept
broader: refip-REFIP996
definition: Acte administratif adressé par l’ordonnateur au comptable donnant, conformément aux résultats de la liquidation, l’ordre de payer la dette de l’organisme public.
in scheme: FINANCES PUBLIQUES
in scheme: Dépenses publiques
in scheme: Gestion Publique
narrower: mandatement d'office
narrower: mandat de paiement
notation: REFIP3867

contrôle d'identité
type: ConceptReFip
type: Concept
broader: principes généraux (non-descripteur)
definition: Enquête de police visant à établir l’identité de la personne contrôlée. Le droit distingue le contrôle d’identité de police judiciaire, qui s’effectue dans le contexte d’une infraction, et le contrôle d’identité de police administrative, qui peut avoir pour objectif de prévenir des infractions, et non simplement de les réprimer.
in scheme: FINANCES PUBLIQUES
in scheme: Principes Généraux
in scheme: Droit et Justice
in scheme: Procédure
notation: REFIP3869

frais de port
type: ConceptReFip
type: Concept
broader: dépenses de fonctionnement
definition: Indemnité financière pour le transport d'un colis ou d'une marchandise.
in scheme: FINANCES PUBLIQUES
in scheme: Dépenses publiques
in scheme: Gestion Publique
narrower: refip-REFIP85
notation: REFIP3873

application DEMAT
type: ConceptReFip
type: Concept
alternative label: DEMAT
broader: applications gestion publique (non-descripteur)
definition: Application permettant la dématérialisation des effets de commerce et lettres de change.
in scheme: FINANCES PUBLIQUES
in scheme: Applications Informatiques
in scheme: Applications gestion publique
notation: REFIP3874

valeur d'apport
type: ConceptReFip
type: Concept
alternative label: valeur d'apport en fusion
alternative label: valeur d'apport fusion
broader: fusion de sociétés
definition: Valeur comptable pour laquelle les biens sont transmis de l’absorbée à l’absorbante lors d'une fusion de sociétés. La détermination de la valeur d’apport dépasse largement le seul cadre de l’enregistrement comptable : elle s’étend également à la question de l’information comptable et à la présentation des états financiers sans oublier une dimension fiscale importante. En effet, la détermination de la valeur d’apport servira de base pour le calcul des éventuelles plus-values de fusion.
in scheme: FINANCES PUBLIQUES
in scheme: Vie de l'Entreprise
in scheme: Entreprises
in scheme: Vie et Gestion de l'entreprise
notation: REFIP3876

gréviste
type: ConceptReFip
type: Concept
alternative label: personnel gréviste
alternative label: salarié gréviste
broader: grève
definition: Personne qui fait grève.
in scheme: FINANCES PUBLIQUES
in scheme: Entreprises
in scheme: Travail
in scheme: 212619
notation: REFIP3877

établissement public régional
type: ConceptReFip
type: Concept
broader: refip-REFIP973
definition: Etablissement public contrôlé par la collectivité publique dont il dépend, la région.
in scheme: FINANCES PUBLIQUES
in scheme: Organisation Territoriale
in scheme: Structures Territoriales
in scheme: Administration de L'Etat
notation: REFIP3878

contentieux de série
type: ConceptReFip
type: Concept
broader: contentieux fiscal
definition: Grand nombre de réclamations portant sur le même objet.
in scheme: FINANCES PUBLIQUES
in scheme: Contentieux Fiscal
in scheme: Fiscalité
notation: REFIP3879

grille d'analyse des risques
type: ConceptReFip
type: Concept
alternative label: GAR
alternative label: grille d'analyse risque
alternative label: grille d'évaluation des risques
broader: maîtrise des risques
definition: Grille permettant de recenser, d'évaluer les risques présents dans le service et/ou unité de travail,
in scheme: FINANCES PUBLIQUES
in scheme: Missions Transverses des Finances publiques
in scheme: Maîtrise des risques
notation: REFIP388

Code de la consommation
type: ConceptReFip
type: Concept
broader: documentation juridique (non-descripteur)
definition: Ensemble des dispositions législatives relatives au droit de la consommation, qui est un sous-ensemble du droit des affaires.
in scheme: FINANCES PUBLIQUES
in scheme: Droit et Justice
in scheme: Documentation Juridique
in scheme: Sources du Droit
notation: REFIP3880

clause de bonne fin (supprimé)
type: ConceptReFip
type: Concept
broader: ZZ
in scheme: FINANCES PUBLIQUES
notation: REFIP3882

centre communal d'action sociale
type: ConceptReFip
type: Concept
alternative label: CCAS
alternative label: bureau d'aide sociale
broader: établissement public communal
definition: Etablissement public communal disposant d'un conseil d'administration qui est présidé par le maire. Le rôle du CCAS est d'animer l'action sociale dans la commune. Il effectue de nombreuses actions vers les parties de la population entrant dans son domaine d'intervention.
in scheme: FINANCES PUBLIQUES
in scheme: Organisation Territoriale
in scheme: Structures Territoriales
in scheme: Administration de L'Etat
notation: REFIP3883

qualité de service
type: ConceptReFip
type: Concept
definition: Qualité d’une prestation rendue par un service public appréciée sur les plans relationnel et de son contenu par rapport aux attentes des usagers et aux contraintes d’intérêt général.
in scheme: FINANCES PUBLIQUES
in scheme: Missions Transverses des Finances publiques
in scheme: Qualité de service
narrower: relations avec le public
narrower: guichet fiscal unique
narrower: enquête
narrower: programme PVFI
narrower: refip-REFIP722
notation: REFIP3884

application SCORE
type: ConceptReFip
type: Concept
broader: applications gestion publique (non-descripteur)
definition: Application support du dispositif de réseau d'alerte des finances communales en collaboration avec les services préfectoraux.
in scheme: FINANCES PUBLIQUES
in scheme: Applications Informatiques
in scheme: Applications gestion publique
notation: REFIP3885

redevance d'archéologie préventive
type: ConceptReFip
type: Concept
alternative label: archéologie préventive
alternative label: fouille archéologique
broader: taxes et redevance de nature immobilière (non-descripteur)
definition: Redevance destinée à procurer à l'INRAP (Institut National de Recherches Archéologiques Préventives) ainsi qu'aux services archéologiques dépendant des collectivités territoriales, une partie des ressources nécessaires à l'exercice de leurs missions, et à abonder un Fonds national pour l'archéologie préventive (FNAP) pouvant subventionner les opérations de fouilles archéologiques les plus Onéreuses.
in scheme: FINANCES PUBLIQUES
in scheme: Fiscalité
in scheme: Impôt
notation: REFIP3886

Autorité chargée du contrôle financier (supprimé)
type: ConceptReFip
type: Concept
broader: ZZ
in scheme: FINANCES PUBLIQUES
notation: REFIP3887

bon de réduction
type: ConceptReFip
type: Concept
alternative label: coupon de réduction
broader: pièce comptable
definition: Document permettant de bénéficier d’une réduction sur le prix de vente d’un produit au moment du passage en caisse ou lors d’un achat ultérieur.
in scheme: FINANCES PUBLIQUES
in scheme: Documents comptables
in scheme: Comptabilité
notation: REFIP3888

personnalité morale
type: ConceptReFip
type: Concept
broader: droit général (non-descripteur)
definition: Nom donné à la personnalité juridique des personnes morales.
in scheme: FINANCES PUBLIQUES
in scheme: Droit et Justice
in scheme: Droit Général
narrower: personne morale de droit privé
narrower: personne morale de droit public
notation: REFIP389

opération triangulaire
type: ConceptReFip
type: Concept
broader: fiscalité internationale
definition: Opération intracommunautaire de vente de bien ou marchandise faisant intervenir trois assujettis à la TVA dans trois états membres différents.
in scheme: FINANCES PUBLIQUES
in scheme: Champ d'Application
in scheme: Fiscalité
notation: REFIP3890

application ATENE
type: ConceptReFip
type: Concept
alternative label: ATENE
broader: applications fiscales (non-descripteur)
definition: Application qui permet aux services de transmettre sous forme dématérialisée à l’INSEE les éléments nécessaires à la prise en compte des événements déclarés par l’entreprise.
in scheme: FINANCES PUBLIQUES
in scheme: Applications Informatiques
in scheme: Applications fiscales
notation: REFIP3891

Commission nationale de la coopération décentralisée (supprimé)
type: ConceptReFip
type: Concept
broader: ZZ
in scheme: FINANCES PUBLIQUES
notation: REFIP3892

détention provisoire
type: ConceptReFip
type: Concept
broader: procédure pénale
definition: Mesure d'incarcération d'un mis en examen pendant l'information judiciaire, ou d'un prévenu dans le cadre de la comparution immédiate,
in scheme: FINANCES PUBLIQUES
in scheme: Procédure Pénale
in scheme: Droit et Justice
in scheme: Procédure
notation: REFIP3893

exploitation agricole
type: ConceptReFip
type: Concept
alternative label: entreprise agricole
alternative label: ferme
alternative label: propriété agricole
broader: agriculture
definition: Entreprise constituée en vue de la production agricole et caractérisée par une gestion unique et des moyens de production propres.
in scheme: FINANCES PUBLIQUES
in scheme: Branche d'activité
in scheme: Questions Economiques
in scheme: Agriculture
narrower: bâtiment agricole
narrower: exploitant agricole
notation: REFIP3896
related: refip-REFIP6899

émission de titre de perception
type: ConceptReFip
type: Concept
broader: refip-REFIP880
definition: Titre de perception ou d'un ordre de recette émis par l'ordonnateur du budget concerné qui en a seul l'initiative, pour toute créance constatée et liquidée.
in scheme: FINANCES PUBLIQUES
in scheme: Budget de l’État
in scheme: Budget
notation: REFIP3897

administration financière
type: ConceptReFip
type: Concept
broader: administration centrale des finances publiques
definition: Appellation générique qui qualifie l'ensemble des services des administrations chargés des Finances publiques.
in scheme: FINANCES PUBLIQUES
in scheme: Organisation Structurelle de l'Etat
in scheme: Ministère
in scheme: Administration de L'Etat
narrower: Trésor public
notation: REFIP3898

site internet
type: ConceptReFip
type: Concept
alternative label: site web
broader: internet
definition: Ensemble des pages et des documents reliés par des liens hypertextes, mis en ligne à une adresse Web.
in scheme: FINANCES PUBLIQUES
in scheme: Communication
in scheme: Communication Documentation Informatique
narrower: service en ligne
narrower: flux rss
notation: REFIP3899

application FICOBA
type: ConceptReFip
type: Concept
alternative label: FICOBA
alternative label: fichier des comptes bancaires
broader: applications fiscales (non-descripteur)
definition: Applicatif permettant l'interrogation et la gestion du fichier des comptes bancaires des personnes physiques et morales.
in scheme: FINANCES PUBLIQUES
in scheme: Applications Informatiques
in scheme: Applications fiscales
notation: REFIP39

carnet à souches
type: ConceptReFip
type: Concept
broader: document
definition: Document composé de la partie reliée des feuilles d'un registre, d'un carnet, et qui sert à vérifier l'authenticité de la partie détachée.
in scheme: FINANCES PUBLIQUES
in scheme: Documentation
in scheme: Communication Documentation Informatique
narrower: carnet de tickets de jeux
notation: REFIP390

auditeur de justice
type: ConceptReFip
type: Concept
broader: magistrature
definition: Élève à l'École Nationale de la Magistrature recruté par concours. Au cours de sa formation, il participe à l’activité juridictionnelle des tribunaux auprès desquels il est affecté, notamment en assistant le juge d’instruction ou le ministère public, et en participant, avec voix consultative, aux délibérations des juridictions civiles. A la sortie de l'École, il est nommé magistrat.
in scheme: FINANCES PUBLIQUES
in scheme: Profession Juridique
in scheme: Droit et Justice
in scheme: Organisation Juridictionnelle
notation: REFIP3900

démarchage
type: ConceptReFip
type: Concept
broader: agent commercial
definition: Métier qui consiste à faire du porte-à-porte afin de proposer l’achat, la vente, la location, la location-vente ou la location avec option d'achat de biens ou la fourniture de services.
in scheme: FINANCES PUBLIQUES
in scheme: Branche d'activité
in scheme: Questions Economiques
in scheme: Commerce
notation: REFIP3901

registre du commerce et des sociétés
type: ConceptReFip
type: Concept
alternative label: RCS
alternative label: frais d'inscription au registre du commerce et des sociétés
alternative label: registre du commerce
broader: droit commercial
definition: Fichier qui centralise un certain nombre d'informations légales. En France, toute personne physique ou morale qui a la qualité de commerçant doit s'inscrire à ce registre.
in scheme: FINANCES PUBLIQUES
in scheme: Droit et Justice
in scheme: Divisions du Droit
in scheme: Droit Privé
narrower: radiation du registre du commerce et des sociétés
notation: REFIP3903

commerce international
type: ConceptReFip
type: Concept
alternative label: commerce extérieur
alternative label: échanges internationaux
broader: commerce
definition: Ensemble des échanges internationaux de biens et de services.
in scheme: FINANCES PUBLIQUES
in scheme: Branche d'activité
in scheme: Questions Economiques
in scheme: Commerce
notation: REFIP3904

internet
type: ConceptReFip
type: Concept
alternative label: accès internet
alternative label: accès restreint internet
alternative label: full internet
alternative label: web
broader: technologie de l'information et de la communication
definition: Système d'interconnexion de machines qui constitue un réseau informatique mondial, utilisant un ensemble standardisé de protocoles de transfert de données.
in scheme: FINANCES PUBLIQUES
in scheme: Communication
in scheme: Communication Documentation Informatique
narrower: intranet
narrower: moteur de recherche
narrower: site internet
narrower: extranet
narrower: fournisseur d'accès à internet
notation: REFIP3906
related: connexion
related: informatique

comptes sociaux
type: ConceptReFip
type: Concept
broader: documents comptables
definition: Comptes d'une société qui n'intègrent pas les comptes de ses éventuelles filiales. Les comptes sociaux comportent le bilan, le compte de résultats et les annexes, le rapport de gestion, les documents portant sur l'affectation du résultat, le rapport des commissaires aux comptes et enfin, le rapport du conseil de surveillance.
in scheme: FINANCES PUBLIQUES
in scheme: Documents comptables
in scheme: Comptabilité
notation: REFIP3907

Hong-Kong
type: ConceptReFip
type: Concept
broader: Chine
definition: Pays
in scheme: FINANCES PUBLIQUES
in scheme: Géographie
in scheme: Asie
notation: REFIP3908

usufruitier
type: ConceptReFip
type: Concept
broader: usufruit
definition: Titulaire de l'usufruit.
in scheme: FINANCES PUBLIQUES
in scheme: Droit et Justice
in scheme: Divisions du Droit
in scheme: Droit Privé
notation: REFIP3909

Fichier national des incidents de remboursement des crédits aux particuliers
type: ConceptReFip
type: Concept
alternative label: FICP
broader: Banque de France
definition: Fichier national géré par la Banque de France recensant les incidents de paiement liés aux crédits accordés aux personnes physiques pour des besoins non professionnels.
in scheme: FINANCES PUBLIQUES
in scheme: Organisation Structurelle de l'Etat
in scheme: Institutions
in scheme: Administration de L'Etat
notation: REFIP3912

compensation fiscale
type: ConceptReFip
type: Concept
alternative label: compensation fiscale de recouvrement
broader: paiement de l'impôt
definition: Mécanisme par lequel un comptable public affecte au paiement des impôts, droits, taxes, pénalités ou intérêts de retard dus par un redevable les remboursements, dégrèvements ou restitutions d'impôts, droits, taxes, pénalités ou intérêts de retard constatés à son bénéfice.
in scheme: FINANCES PUBLIQUES
in scheme: Recouvrement
in scheme: Fiscalité
notation: REFIP3913

Slovaquie
type: ConceptReFip
type: Concept
alternative label: République Slovaque
broader: Europe
definition: Pays
in scheme: FINANCES PUBLIQUES
in scheme: Géographie
in scheme: Europe
notation: REFIP3914

scellés
type: ConceptReFip
type: Concept
broader: principes généraux (non-descripteur)
definition: Bande de papier ou d'étoffe fixée par un cachet de cire marqué d'un sceau par le greffier en chef du tribunal d'instance, afin d'empêcher provisoirement l'ouverture d'un appartement, meuble ou pièce.
in scheme: FINANCES PUBLIQUES
in scheme: Principes Généraux
in scheme: Droit et Justice
in scheme: Procédure
notation: REFIP3915

distribution de l'eau
type: ConceptReFip
type: Concept
broader: énergie
definition: Service public confié aux collectivités territoriales qui déterminent librement leur mode de gestion soit directement, soit en déléguant ce service à une entreprise privée.
in scheme: FINANCES PUBLIQUES
in scheme: Branche d'activité
in scheme: Questions Economiques
in scheme: Industrie
notation: REFIP3916
related: service public d'eau et d'assainissement

identité
type: ConceptReFip
type: Concept
broader: refip-REFIP859
definition: Nom, prénom, nationalité filiation etc, d'une personne.
in scheme: FINANCES PUBLIQUES
in scheme: Droit et Justice
in scheme: Divisions du Droit
in scheme: Droit Privé
narrower: nom de famille
notation: REFIP3917

société concessionnaire
type: ConceptReFip
type: Concept
broader: société
definition: Entité qui se procure auprès d'une autre société dite "concédant" des marchandises qu'elle s'engage à commercialiser sous la marque du concédant, lequel lui confère une exclusivité pour un temps et dans une ère géographique délimitée. C'est également une des formes de contrat que peut prendre une délégation de service public. Elle se distingue de l'affermage par la prise en charge par le concessionnaire non seulement des frais d'exploitation et d'entretien courant mais également des investissements. Elle concerne la quasi-totalité de la distribution publique d'électricité et de gaz ainsi que l'exploitation du réseau autoroutier.
in scheme: FINANCES PUBLIQUES
in scheme: Société
in scheme: Entreprises
in scheme: Forme juridique
narrower: société d'autoroutes
notation: REFIP3918
related: concession de service public

cellule opérationnelle de suivi
type: ConceptReFip
type: Concept
alternative label: CODSAE
alternative label: Cellule opérationnelle départementale de suivi et d'accompagnement des entreprises
broader: structure locale (non-descripteur)
definition: Structure départementale de suivi et d’accompagnement des entreprises, composée des services de la DDFiP, de la DIRECCTE, de la Banque de France, de l’URSSAF, d’Oseo/FSI, se réunissant à l’initiative du Préfet. La cellule opérationnelle de suivi et d'accompagnement des entreprises (CODSAE) est chargée de centraliser l’information économique permettant de détecter au plus tôt les entreprises en difficulté et de s’assurer que tous les dossiers sont traités selon la procédure appropriée et suivre leur évolution.
in scheme: FINANCES PUBLIQUES
in scheme: Organisation Territoriale
in scheme: Structures Territoriales
in scheme: Administration de L'Etat
notation: REFIP3919

certificat électronique
type: ConceptReFip
type: Concept
broader: document
definition: Document électronique attestant du lien entre les données de vérification de signature électronique et un signataire.
in scheme: FINANCES PUBLIQUES
in scheme: Documentation
in scheme: Communication Documentation Informatique
notation: REFIP392

Caisse des dépôts et consignations
type: ConceptReFip
type: Concept
alternative label: CDC
broader: institutions (non-descripteur)
definition: Groupe public au service de l'intérêt général et du développement économique du pays constitué par la caisse des dépôts et consignations et ses filiales. Ce groupe remplit des missions d'intérêt général en appui des politiques publiques conduites par l'État et les collectivités territoriales et peut exercer des activités concurrentielles. Il est un investisseur de long terme et contribue, dans le respect de ses intérêts patrimoniaux, au développement des entreprises.
in scheme: FINANCES PUBLIQUES
in scheme: Organisation Structurelle de l'Etat
in scheme: Institutions
in scheme: Administration de L'Etat
narrower: fonds spécial des pensions des ouvriers des Etablissements industriels de l'Etat
narrower: Fonds national des solidarités actives
narrower: fonds pour l'insertion des personnes handicapées dans la fonction publique
narrower: Fonds national de compensation du supplément familial de traitement
notation: REFIP3921

représentation en justice
type: ConceptReFip
type: Concept
broader: principes généraux (non-descripteur)
definition: Fonction consistant pour une personne à agir en justice au nom d'une autre, comme demandeur ou défendeur, les effets juridiques se produisant au profit ou à la charge de cette dernière.
in scheme: FINANCES PUBLIQUES
in scheme: Principes Généraux
in scheme: Droit et Justice
in scheme: Procédure
notation: REFIP3923

arrêté préfectoral
type: ConceptReFip
type: Concept
broader: législation
definition: Acte exécutoire à portée générale ou individuelle émanant du préfet.
in scheme: FINANCES PUBLIQUES
in scheme: Droit et Justice
in scheme: Sources du Droit
in scheme: Sources du Droit Objectif
narrower: refip-REFIP833
notation: REFIP3924

construction navale
type: ConceptReFip
type: Concept
broader: construction
definition: Processus par lequel un bateau ou un navire est fabriqué et assemblé.
in scheme: FINANCES PUBLIQUES
in scheme: Branche d'activité
in scheme: Questions Economiques
in scheme: Construction
notation: REFIP3925

demande de justification
type: ConceptReFip
type: Concept
broader: droit de contrôle de l'administration (non-descripteur)
in scheme: FINANCES PUBLIQUES
in scheme: Droit de Contrôle de l'Administration
in scheme: Fiscalité
notation: REFIP3926

référentiel de contrôle interne
type: ConceptReFip
type: Concept
alternative label: référentiel organisationnel de contrôle interne
broader: contrôle interne
definition: Document identifiant, pour les procédures à risque élevé ou très élevé, les risques majeurs associés aux différentes tâches d’une procédure, présentant pour chaque risque les mesures de couverture les plus adaptées pour sécuriser le fonctionnement des services ; et mettant à la disposition du chef de service, pour les risques majeurs, les outils de contrôle de supervision a posteriori que sont les grilles de diagnostic et de dépouillement.
in scheme: FINANCES PUBLIQUES
in scheme: Missions Transverses des Finances publiques
in scheme: Maîtrise des risques
notation: REFIP3927

fait générateur
type: ConceptReFip
type: Concept
broader: fiscalité
definition: Fait par lequel sont réalisées les conditions légales nécessaires pour l'exigibilité de la créance fiscale.
in scheme: FINANCES PUBLIQUES
in scheme: Fiscalité - Autres notions
in scheme: Fiscalité
notation: REFIP3928

Comité médical
type: ConceptReFip
type: Concept
broader: refip-REFIP7063
definition: Instance consultative chargée de donner des avis sur les questions médicales concernant les fonctionnaires. Il comprend deux médecins généralistes, un médecin spécialiste de l'affection pour laquelle l'avis du comité est demandé. Il est obligatoirement consulté sur la prolongation des congés de maladie ordinaire au-delà de 6 mois consécutifs, l'attribution et le renouvellement des congés de longue maladie (CLM), de grave maladie et de longue durée (CLD), la réintégration après 12 mois consécutifs de congé de maladie ordinaire ou à l'issue d'un CLM, d'un congé de grave maladie ou d'un CLD, l'aménagement des conditions de travail d'un fonctionnaire après congé de maladie ou disponibilité d'office, la mise en disponibilité d'office pour raison de santé et son renouvellement, le reclassement d'un fonctionnaire dans un autre emploi à la suite d'une modification de son état physique.
in scheme: FINANCES PUBLIQUES
in scheme: Organisation Structurelle de l'Etat
in scheme: Ministère
in scheme: Administration de L'Etat
notation: REFIP393

liberté fondamentale
type: ConceptReFip
type: Concept
alternative label: libertés publiques
broader: droit constitutionnel
definition: Ensemble des droits essentiels pour l'individu, assurés dans un État de droit et une démocratie. Elle recouvre en partie les droits de l'homme au sens large.
in scheme: FINANCES PUBLIQUES
in scheme: Droit et Justice
in scheme: Divisions du Droit
in scheme: Droit Public
narrower: droits civiques
narrower: vie privée
notation: REFIP3932

commission intercommunale des impôts directs
type: ConceptReFip
type: Concept
alternative label: CIID
broader: structure locale (non-descripteur)
definition: Commission créée dans chaque établissement public de coopération intercommunale soumis de plein droit ou sur option au régime de la fiscalité professionnelle unique. Elle intervient en matière de fiscalité directe locale en ce qui concerne les locaux commerciaux et biens divers : elle participe, en lieu et place des commissions communales des impôts directs, à la désignation des locaux types à retenir pour l’évaluation par comparaison des locaux commerciaux et biens divers ; elle donne un avis, en lieu et place des commissions communales des impôts directs, sur les évaluations foncières des locaux commerciaux et biens divers proposées par l’administration fiscale. Son rôle est consultatif.
in scheme: FINANCES PUBLIQUES
in scheme: Organisation Territoriale
in scheme: Structures Territoriales
in scheme: Administration de L'Etat
notation: REFIP3934

édition électronique
type: ConceptReFip
type: Concept
alternative label: médiatique
alternative label: édition informatique
alternative label: édition multimédia
alternative label: édition numérique
broader: éditeur
definition: Domaine de l'édition relatif aux publications réalisées sur des supports électroniques. Par extension, s'emploie pour désigner une publication assistée par ordinateur.
in scheme: FINANCES PUBLIQUES
in scheme: Communication
in scheme: Communication Documentation Informatique
notation: REFIP3935

didacticiel
type: ConceptReFip
type: Concept
alternative label: tutoriel
broader: refip-REFIP98
definition: Programme interactif destiné à l'enseignement ou à l'apprentissage souvent présent dans les logiciels pour apprendre à en utiliser les principales fonctions.
in scheme: FINANCES PUBLIQUES
in scheme: Informatique
in scheme: Communication Documentation Informatique
notation: REFIP3936

créancier gagiste
type: ConceptReFip
type: Concept
broader: créancier nanti
definition: Créancier dont la créance est garantie par un gage, à savoir une convention par laquelle le constituant accorde à un créancier le droit de se faire payer par préférence aux autres créanciers sur un bien mobilier corporel.
in scheme: FINANCES PUBLIQUES
in scheme: Droit et Justice
in scheme: Divisions du Droit
in scheme: Droit Privé
notation: REFIP3937

aide aux entreprises liée à la crise économique et financière (supprimé)
type: ConceptReFip
type: Concept
broader: ZZ
in scheme: FINANCES PUBLIQUES
notation: REFIP3939

dation en paiement
type: ConceptReFip
type: Concept
broader: paiement de l'impôt
definition: Mode d'extinction des obligations consistant dans la remise du créancier d'une chose autre que celle qui est l'objet de l'obligation. Il faut naturellement que le créancier accepte cette dation et donne ainsi son consentement à la libération du débiteur.
in scheme: FINANCES PUBLIQUES
in scheme: Recouvrement
in scheme: Fiscalité
notation: REFIP394

conseil régional
type: ConceptReFip
type: Concept
broader: région
definition: Assemblée délibérante de la région, composée des conseillers régionaux. Il règle par ses délibérations les affaires de la région. Il émet des avis sur les problèmes de développement et d’aménagement pour lesquels il doit être obligatoirement consulté. Le conseil régional élabore son règlement intérieur qui détermine notamment le nombre, les compétences et le mode de fonctionnement des commissions.
in scheme: FINANCES PUBLIQUES
in scheme: Organisation Territoriale
in scheme: Structures Territoriales
in scheme: Administration de L'Etat
notation: REFIP3942

Code civil
type: ConceptReFip
type: Concept
broader: documentation juridique (non-descripteur)
definition: Ensemble des lois relatives au droit civil français, c'est-à-dire l'ensemble des règles qui déterminent le statut des personnes (livre 1er), celui des biens (livre II), et celui des relations entre personnes privées (livres III et IV).
in scheme: FINANCES PUBLIQUES
in scheme: Droit et Justice
in scheme: Documentation Juridique
in scheme: Sources du Droit
notation: REFIP3945

agriculture
type: ConceptReFip
type: Concept
broader: branche d'activité
definition: Secteur d'activité qui produit un revenu financier à partir de l’exploitation de la terre (culture), de la forêt (sylviculture), de la mer, des lacs et des rivières (aquaculture, pêche), de l'élevage et de la chasse.
in scheme: FINANCES PUBLIQUES
in scheme: Branche d'activité
in scheme: Questions Economiques
in scheme: Agriculture
narrower: horticulture
narrower: tabac
narrower: pêche
narrower: travaux agricoles
narrower: entraide agricole
narrower: calamité agricole
narrower: groupement de producteurs
narrower: exploitation forestière
narrower: exploitation agricole
narrower: agriculture biologique
narrower: appellation d'origine contrôlée
narrower: viticulture
narrower: élevage
notation: REFIP3946

action en justice
type: ConceptReFip
type: Concept
broader: principes généraux (non-descripteur)
definition: Droit de pouvoir engager une procédure devant une juridiction pour obtenir le respect ou la reconnaissance d'un droit ou d'un intérêt légitime.
in scheme: FINANCES PUBLIQUES
in scheme: Principes Généraux
in scheme: Droit et Justice
in scheme: Procédure
narrower: action directe
narrower: action à fins de subsides
narrower: action récursoire
notation: REFIP3947

développement économique et social
type: ConceptReFip
type: Concept
broader: économie générale (non-descripteur)
definition: Ensemble des mutations positives (économiques, techniques, démographiques, sociales, sanitaires...) que connaît une zone géographique (monde, continent, pays, région...).
in scheme: FINANCES PUBLIQUES
in scheme: Questions Economiques
in scheme: Economie générale
narrower: refip-REFIP986
notation: REFIP3948
related: refip-REFIP6970

préfecture de police
type: ConceptReFip
type: Concept
broader: Ministère de l'Intérieur
definition: Administration dirigée par un préfet de police chargée de prévenir et de lutter contre une multitude de dangers : délinquance, troubles à l’ordre public, catastrophes naturelles ou technologiques, risques urbains, routiers ou sanitaires, terrorisme, etc. dans un ou plusieurs départements. Elle est aussi chargée de la délivrance des titres administratifs, la gestion de la circulation et du stationnement ou la protection des consommateurs. Elle remplit enfin des missions d’expertise à travers notamment une police technique et scientifique.
in scheme: FINANCES PUBLIQUES
in scheme: Organisation Structurelle de l'Etat
in scheme: Ministère
in scheme: Administration de L'Etat
notation: REFIP3949

délégation de pouvoir
type: ConceptReFip
type: Concept
alternative label: délégation de compétence
broader: droit administratif
definition: Transfert par une autorité administrative, dans les limites légales, d'une ou plusieurs de ses compétences à un autre agent (désigné par son titre). Pendant sa durée, l'autorité délégataire est substituée, dans les responsabilités encourues et dans l'exercice des compétences déléguées, à l'autorité délégante qui cesse de pouvoir exercer ces dernières.
in scheme: FINANCES PUBLIQUES
in scheme: Droit et Justice
in scheme: Divisions du Droit
in scheme: Droit Public
notation: REFIP3950

marché fractionné
type: ConceptReFip
type: Concept
broader: marché public
definition: Procédure spécifique d'un marché public lorsque l'acheteur public n'est pas en mesure, au stade de la passation, de définir avec exactitude toutes les modalités de ses besoins (quantité, fréquence, nature). Il peut avoir recours à des procédures spécifiques en deux temps, distinguant une phase de présélection des fournisseurs de la phase d’attribution des marchés ou commandes.
in scheme: FINANCES PUBLIQUES
in scheme: Commande publique
in scheme: Gestion Publique
narrower: marché à bons de commande
narrower: refip-REFIP7149
notation: REFIP3951

séquestre
type: ConceptReFip
type: Concept
alternative label: séquestre conventionnel
alternative label: séquestre judiciaire
broader: refip-REFIP783
definition: Mesure conservatoire à caractère provisoire permettant de mettre " sous main de justice" une somme d'argent, un bien meuble ou immeuble pour le rendre momentanément indisponible jusqu'à ce que, une transaction intervienne entre les parties, ou bien jusqu'à ce que soit rendue une décision de justice. Désigne aussi la personne à laquelle un Tribunal confie le soin d'assurer la garde et l'administration d'un bien
in scheme: FINANCES PUBLIQUES
in scheme: Recouvrement
in scheme: Fiscalité
narrower: consignation
notation: REFIP3952

revenu d'origine indéterminée
type: ConceptReFip
type: Concept
broader: revenu imposable
definition: Sommes que le contribuable, de bonne foi ou pas, n'est pas en mesure de justifier lors d'un contrôle fiscal et qui sont alors imposées dans la catégorie des revenus d'origine indéterminée.
in scheme: FINANCES PUBLIQUES
in scheme: Champ d'Application
in scheme: Fiscalité
notation: REFIP3953

prestation compensatoire
type: ConceptReFip
type: Concept
broader: droit civil
definition: Prestation permettant d'effacer les déséquilibres financiers causés par le divorce dans les conditions de vie des ex-époux. La demande doit être formée au cours de la procédure de divorce. Le montant de la prestation peut être déterminé par les époux. En cas de désaccord, la prestation est déterminée par le juge.
in scheme: FINANCES PUBLIQUES
in scheme: Droit et Justice
in scheme: Divisions du Droit
in scheme: Droit Privé
notation: REFIP3954

créance client
type: ConceptReFip
type: Concept
broader: créance
definition: Somme due par le client de l'entreprise.
in scheme: FINANCES PUBLIQUES
in scheme: Documents comptables
in scheme: Comptabilité
notation: REFIP3955

contribution sociale libératoire sur les distributions et gains nets des dirigeants de sociétés
type: ConceptReFip
type: Concept
broader: impôt direct
definition: Contribution sociale libératoire assise sur les distributions et gains nets des dirigeants de sociétés, affectée à la Caisse nationale des allocations familiales.
in scheme: FINANCES PUBLIQUES
in scheme: Fiscalité
in scheme: Impôt
notation: REFIP3957

abonnement
type: ConceptReFip
type: Concept
broader: services et professions libérales (non-descripteur)
definition: Convention entre un fournisseur et ses clients pour la livraison régulière de produits ou l'usage habituel d'un service en échange d'un paiement forfaitaire.
in scheme: FINANCES PUBLIQUES
in scheme: Branche d'activité
in scheme: Questions Economiques
in scheme: Services et professions libérales
notation: REFIP3959

documentation
type: ConceptReFip
type: Concept
definition: Ensemble des techniques permettant le traitement permanent et systématique de documents ou de données, incluant la collecte, le signalement, l'analyse, le stockage, la recherche, la diffusion de ceux-ci, pour l'information des usagers.
in scheme: FINANCES PUBLIQUES
in scheme: Documentation
in scheme: Communication Documentation Informatique
narrower: classement
narrower: document
narrower: centre de documentation
narrower: documentation administrative
narrower: délai de conservation
narrower: reprographie
narrower: dématérialisation
notation: REFIP396
related: support de communication

ordre de reversement
type: ConceptReFip
type: Concept
broader: refip-REFIP996
definition: Document émis par l'ordonnateur lorsqu'un ordre de dépense a été émis pour une somme supérieure aux droits effectifs du créancier pour en réduire le montant.
in scheme: FINANCES PUBLIQUES
in scheme: Dépenses publiques
in scheme: Gestion Publique
notation: REFIP3960

application OTR
type: ConceptReFip
type: Concept
alternative label: OTR
broader: applications fiscales (non-descripteur)
definition: Application permettant le suivi des recouvrements des offices publics de l'habitat (OPH).
in scheme: FINANCES PUBLIQUES
in scheme: Applications Informatiques
in scheme: Applications fiscales
notation: REFIP3962

déféré préfectoral
type: ConceptReFip
type: Concept
alternative label: déféré administratif
broader: contrôle de légalité
definition: Acte par lequel le préfet défère au tribunal administratif les décisions des collectivités locales qu'il considère comme illégales.
in scheme: FINANCES PUBLIQUES
in scheme: Droit et Justice
in scheme: Divisions du Droit
in scheme: Droit Public
notation: REFIP3963

contentieux administratif
type: ConceptReFip
type: Concept
broader: refip-REFIP689
definition: Ensemble des litiges auxquels donnent lieu l'application du Droit administratif et portés devant les juridictions administratives. Par extension, ensemble des règles applicables à ces litiges.
in scheme: FINANCES PUBLIQUES
in scheme: Principes Généraux
in scheme: Droit et Justice
in scheme: Procédure
notation: REFIP3964
related: contentieux fiscal

guide de procédure
type: ConceptReFip
type: Concept
broader: maîtrise des risques
definition: Mode opératoire de référence offrant, pour les procédures à risque élevé ou très élevé, une vue approfondie d’une activité et sa décomposition en tâches et opérations.
in scheme: FINANCES PUBLIQUES
in scheme: Missions Transverses des Finances publiques
in scheme: Maîtrise des risques
notation: REFIP3965

délégation de gestion
type: ConceptReFip
type: Concept
broader: droit administratif
definition: Technique juridique, dans le cadre de la coopération entre services de l'État, permettant à un ou plusieurs de charger l'un d'eux de réaliser pour leur compte des actes juridiques ou des prestations déterminées concourant à l'accomplissement de leurs missions.
in scheme: FINANCES PUBLIQUES
in scheme: Droit et Justice
in scheme: Divisions du Droit
in scheme: Droit Public
notation: REFIP3966

entreprise publique
type: ConceptReFip
type: Concept
broader: organisation structurelle de l'Etat (non-descripteur)
definition: Entreprise sur laquelle l’État peut exercer directement ou indirectement une influence dominante du fait de la propriété ou de la participation financière, en disposant soit de la majorité du capital, soit de la majorité des voix attachées aux parts émises.
in scheme: FINANCES PUBLIQUES
in scheme: Organisation Structurelle de l'Etat
in scheme: Entreprise Publique
in scheme: Administration de L'Etat
narrower: société de valorisation foncière et immobilière
narrower: la Française des Jeux
narrower: La Poste
narrower: port autonome
narrower: Caisse centrale de réassurance
notation: REFIP3967

gré à gré
type: ConceptReFip
type: Concept
broader: droit civil
definition: A l'amiable, d'un commun accord. Une transaction de gré à gré est une transaction entre deux parties libres de contracter et normalement informées (notamment en immobilier).
in scheme: FINANCES PUBLIQUES
in scheme: Droit et Justice
in scheme: Divisions du Droit
in scheme: Droit Privé
notation: REFIP3968
related: marché négocié

accusé de réception
type: ConceptReFip
type: Concept
alternative label: avis de réception
broader: courrier
definition: Avis informant l'expéditeur que l'envoi est parvenu à son destinataire.
in scheme: FINANCES PUBLIQUES
in scheme: Communication
in scheme: Communication Documentation Informatique
notation: REFIP397

chambre consulaire
type: ConceptReFip
type: Concept
broader: établissement public économique (non-descripteur)
definition: Établissement publics de l'État, dotés d'un statut et d’une gouvernance spécifique, regroupant les chambres de métiers et de l'artisanat et les chambres de commerce et d'industrie. Celles-ci constituent des partenaires incontournables pour le développement des petites et moyennes entreprises, de l’industrie, du commerce, de l'artisanat et des services.
in scheme: FINANCES PUBLIQUES
in scheme: Organisation Structurelle de l'Etat
in scheme: Opérateur de l'Etat
in scheme: Administration de L'Etat
narrower: chambre d'agriculture
narrower: chambre de commerce et d'industrie
narrower: refip-REFIP875
notation: REFIP3970

présomption
type: ConceptReFip
type: Concept
broader: preuve par tout moyen
definition: Admission de l'existence d'un fait juridique même en l'absence de preuve.
in scheme: FINANCES PUBLIQUES
in scheme: Droit et Justice
in scheme: Divisions du Droit
in scheme: Droit Privé
notation: REFIP3971

actif
type: ConceptReFip
type: Concept
broader: bilan
definition: Ensemble du patrimoine d'une entité.
in scheme: FINANCES PUBLIQUES
in scheme: Documents comptables
in scheme: Comptabilité
narrower: charges à repartir
narrower: actif professionnel
narrower: dépréciation d'un élément d'actif
narrower: actif immatériel
narrower: charges constatées d'avance
narrower: retrait d'actif
narrower: créance
narrower: plus-value
narrower: actif imposable
narrower: immobilisation
narrower: stocks
narrower: valeur nette comptable
narrower: moins-value
notation: REFIP3972

annonce légale
type: ConceptReFip
type: Concept
alternative label: annonces légales
broader: publicité d'acte juridique
definition: Information légale publiée obligatoirement par une entreprise dans des bulletins ou publications spécifiques.
in scheme: FINANCES PUBLIQUES
in scheme: Droit et Justice
in scheme: Divisions du Droit
in scheme: Droit Privé
notation: REFIP3974
related: Bulletin officiel des annonces civiles et commerciales

trésorerie de proximité
type: ConceptReFip
type: Concept
alternative label: guichet fiscal unique de proximité
alternative label: poste comptable
broader: direction départementale des finances publiques
definition: Structure chargée du recouvrement (spécialisée ou mixte) destinée à prendre en charge l'accueil fiscal de proximité, afin d'offrir aux usagers un seul interlocuteur en matière de calcul et/ou de paiement de l'impôt.
in scheme: FINANCES PUBLIQUES
in scheme: Organisation Structurelle de l'Etat
in scheme: Ministère
in scheme: Administration de L'Etat
notation: REFIP3975

compensation légale
type: ConceptReFip
type: Concept
broader: droit des obligations et contrats (non-descripteur)
definition: Mécanisme juridique qui consiste à remettre à quelqu'un, une valeur ou un bien en réparation d'une prestation voire, en réparation d'un dommage.
in scheme: FINANCES PUBLIQUES
in scheme: Droit et Justice
in scheme: Divisions du Droit
in scheme: Droit Privé
notation: REFIP3976

moratoire
type: ConceptReFip
type: Concept
broader: effet suspensif
definition: Délai qui suspend les poursuites contre tous les débiteurs ou contre certaines catégories seulement, et que la loi accorde lorsque les circonstances générales rendent difficiles ou impossible le paiement des obligations.
in scheme: FINANCES PUBLIQUES
in scheme: Principes Généraux
in scheme: Droit et Justice
in scheme: Procédure
notation: REFIP3978

nomenclature comptable
type: ConceptReFip
type: Concept
broader: documents comptables
definition: Liste méthodique des éléments entrant dans le champ de la comptabilité et constituée d’une suite de catégories homogène, elles même subdivisées en catégories plus fines.
in scheme: FINANCES PUBLIQUES
in scheme: Documents comptables
in scheme: Comptabilité
narrower: norme comptable
narrower: refip-REFIP900
notation: REFIP398

Centre national du cinéma et de l'image animée
type: ConceptReFip
type: Concept
alternative label: CNC
broader: établissement public à caractère administratif
definition: Etablissement public à caractère administratif ayant pour missions la réglementation du cinéma, le soutien à l'économie du cinéma, de l'audiovisuel et du multimédia, la promotion du cinéma et de l'audiovisuel et leur diffusion auprès de tous les public, la protection et la diffusion du patrimoine cinématographique.
in scheme: FINANCES PUBLIQUES
in scheme: Organisation Structurelle de l'Etat
in scheme: Opérateur de l'Etat
in scheme: Administration de L'Etat
notation: REFIP3980

marché industriel
type: ConceptReFip
type: Concept
broader: marché de fournitures
definition: Marché ayant pour objet la fourniture d’équipements ou de prototypes conçus et réalisés spécialement pour répondre aux besoins du pouvoir adjudicateur.
in scheme: FINANCES PUBLIQUES
in scheme: Commande publique
in scheme: Gestion Publique
notation: REFIP3981

application OCFI
type: ConceptReFip
type: Concept
alternative label: OCFI
broader: applications fiscales (non-descripteur)
definition: Référentiel des occurrences fiscales.
in scheme: FINANCES PUBLIQUES
in scheme: Applications Informatiques
in scheme: Applications fiscales
notation: REFIP3982

quitus fiscal
type: ConceptReFip
type: Concept
broader: documentation fiscale (non-descripteur)
definition: Formulaire 1993-PRO-D-SD ou 1993-PART-D utilisé pour les demandes de certificat d'acquisition d'un véhicule en provenance de l'Union Européenne par un professionnel identifié à la TVA ou un particulier.
in scheme: FINANCES PUBLIQUES
in scheme: Documentation Fiscale
in scheme: Fiscalité
notation: REFIP3983

mesure de capital investissement (supprimé)
type: ConceptReFip
type: Concept
broader: ZZ
in scheme: FINANCES PUBLIQUES
notation: REFIP3984

Caisse nationale de retraite des agents des collectivités locales
type: ConceptReFip
type: Concept
alternative label: CNRACL
broader: établissement public à caractère administratif
definition: Etablissement public national, géré par la direction des retraites et de la solidarité de la Caisse des Dépôts sous l’autorité et le contrôle d’un conseil d’administration, la Caisse Nationale de Retraites des Agents des Collectivités Locales (CNRACL) est le régime spécial de la Sécurité Sociale chargé de l’assurance vieillesse des fonctionnaires territoriaux et hospitaliers.
in scheme: FINANCES PUBLIQUES
in scheme: Organisation Structurelle de l'Etat
in scheme: Opérateur de l'Etat
in scheme: Administration de L'Etat
notation: REFIP3985

Fonds national des solidarités actives
type: ConceptReFip
type: Concept
broader: Caisse des dépôts et consignations
definition: Organisme français ayant pour rôle le cofinancement du revenu de solidarité active (RSA), aux côtés des conseils généraux. La Caisse des dépôts et consignations en assure la gestion administrative, comptable et financière.
in scheme: FINANCES PUBLIQUES
in scheme: Organisation Structurelle de l'Etat
in scheme: Institutions
in scheme: Administration de L'Etat
notation: REFIP3986

Haute-Savoie
type: ConceptReFip
type: Concept
broader: Auvergne-Rhône-Alpes
definition: Département français
in scheme: FINANCES PUBLIQUES
in scheme: Géographie
in scheme: Europe
notation: REFIP3988

cautionnement
type: ConceptReFip
type: Concept
broader: sûreté personnelle
definition: Contrat par lequel la caution s'engage envers le créancier.
in scheme: FINANCES PUBLIQUES
in scheme: Recouvrement
in scheme: Fiscalité
narrower: caution
notation: REFIP3989
scope note: Garantie prise par le comptable en matière de recouvrement

cessation de paiement
type: ConceptReFip
type: Concept
broader: procédure collective
definition: Situation dans laquelle se trouve un débiteur qui ne peut plus faire face à son passif exigible avec ses actifs disponibles. La constatation de cet état par un tribunal de commerce est la condition d’ouverture des procédures de redressement judiciaire et de liquidation.
in scheme: FINANCES PUBLIQUES
in scheme: Vie de l'Entreprise
in scheme: Entreprises
in scheme: Vie et Gestion de l'entreprise
notation: REFIP3991

motivation
type: ConceptReFip
type: Concept
broader: acte administratif
definition: Obligation instituée à la charge de l'administration en vue de garantir les droits des intéressés d'informer ceux-ci des motifs de droit et de fait ayant fondé certaines catégories de décisions individuelles défavorables qui les concernent,
in scheme: FINANCES PUBLIQUES
in scheme: Droit et Justice
in scheme: Divisions du Droit
in scheme: Droit Public
notation: REFIP3993
related: lettre de motivation
scope note: Motivation d'un acte administratif

radio
type: ConceptReFip
type: Concept
alternative label: radiodiffusion
broader: média
definition: Média qui utilise les ondes radio. Désigne également l' appareil qui permet de capter les émissions de radiodiffusion pour les transformer en son.
in scheme: FINANCES PUBLIQUES
in scheme: Communication
in scheme: Communication Documentation Informatique
notation: REFIP3994

référé
type: ConceptReFip
type: Concept
alternative label: procédure de référé
broader: principes généraux (non-descripteur)
definition: Procédure juridictionnelle d’urgence, de caractère contradictoire. Elle permet de demander au juge qu’il ordonne des mesures provisoires mais rapides tendant à préserver les droits du demandeur. Un référé est très souvent introduit dans l’attente d’un jugement sur le fond.
in scheme: FINANCES PUBLIQUES
in scheme: Principes Généraux
in scheme: Droit et Justice
in scheme: Procédure
narrower: ordonnance de référé
notation: REFIP3995

date de notification
type: ConceptReFip
type: Concept
broader: mots outils (liste additive)
definition: Date de réception d'un document.
in scheme: FINANCES PUBLIQUES
in scheme: Mots Outils
notation: REFIP3997

réforme de l'administration territoriale de l'Etat
type: ConceptReFip
type: Concept
alternative label: REATE
broader: réforme de l'Etat
definition: Réforme territoriale s’articulant autour de cinq objectifs : simplification, mise en cohérence de l’action de l’État sur le territoire, proximité, efficacité et équilibre des territoires.
in scheme: FINANCES PUBLIQUES
in scheme: Etat
in scheme: Réforme de l'Etat
in scheme: Administration de L'Etat
notation: REFIP3998

opposition à partage
type: ConceptReFip
type: Concept
broader: opposition
definition: L'administration fiscale (et tout créancier) peut s'opposer au partage d'une succession afin de préserver ses droits par notification de l'huissier de justice auprès du notaire chargé de la succession.
in scheme: FINANCES PUBLIQUES
in scheme: Recouvrement
in scheme: Fiscalité
notation: REFIP4

portage financier
type: ConceptReFip
type: Concept
broader: gestion de l'entreprise (non-descripteur)
definition: Technique, dans le domaine financier, donnant à un investisseur la possibilité de se substituer à un autre investisseur en portant à sa place, pendant une période donnée et moyennant rémunération, ses titres.
in scheme: FINANCES PUBLIQUES
in scheme: Gestion de l'Entreprise
in scheme: Entreprises
in scheme: Vie et Gestion de l'entreprise
notation: REFIP40

bascule comptable
type: ConceptReFip
type: Concept
alternative label: report comptable
alternative label: reprise comptable
broader: fin de gestion
definition: Opérations liées au changement d'exercice comptable.
in scheme: FINANCES PUBLIQUES
in scheme: Procédures et Techniques Comptables
in scheme: Comptabilité
notation: REFIP400

dialogue compétitif
type: ConceptReFip
type: Concept
broader: passation des marchés publics
definition: Procédure formalisée par laquelle l'acheteur dialogue avec les candidats admis à y participer en vue de définir ou développer les solutions de nature à répondre à ses besoins et sur la base desquelles ces candidats sont invités à remettre une offre.
in scheme: FINANCES PUBLIQUES
in scheme: Commande publique
in scheme: Gestion Publique
notation: REFIP4000

délivrance de documents cadastraux
type: ConceptReFip
type: Concept
broader: cadastre
definition: Service offert aux usagers sur commande par la DGFiP, les mairies, et les partenaires aux conventions de numérisation, pour la délivrance d'extraits de plans ou de registres, de reproductions ou de fichiers numériques.
in scheme: FINANCES PUBLIQUES
in scheme: Cadastre
in scheme: Fiscalité
notation: REFIP4001

domaine fonctionnel
type: ConceptReFip
type: Concept
broader: nomenclature budgétaire de l'Etat
definition: Nomenclature budgétaire de l’État offrant un axe supplémentaire de budget.
in scheme: FINANCES PUBLIQUES
in scheme: Exécution du budget
in scheme: Budget
notation: REFIP4002

bien d'équipement
type: ConceptReFip
type: Concept
alternative label: bien productif
broader: dépenses d'équipement
definition: Bien de production utilisé dans un processus de fabrication.
in scheme: FINANCES PUBLIQUES
in scheme: Dépenses publiques
in scheme: Gestion Publique
notation: REFIP4005
related: matériel
related: équipement de sécurité
related: mobilier
related: refip-REFIP757

restes à recouvrer
type: ConceptReFip
type: Concept
broader: recouvrement
definition: Liste des créances exigibles non encore recouvrées par la DGFIP.
in scheme: FINANCES PUBLIQUES
in scheme: Recouvrement
in scheme: Fiscalité
narrower: apurement des restes à recouvrer
notation: REFIP4006
related: refip-REFIP7191

action en déclaration de simulation
type: ConceptReFip
type: Concept
broader: solidarités diverses et actions patrimoniales (non-descripteur)
definition: Action en justice ouverte aux tiers et pouvant être engagée par toute personne qui se verrait opposer un acte simulé, aux fins d'obtenir de rétablir la véritable qualification de l'acte.
in scheme: FINANCES PUBLIQUES
in scheme: Recouvrement
in scheme: Fiscalité
notation: REFIP4007

garantie accordée à l'usager
type: ConceptReFip
type: Concept
alternative label: garantie accordée au contribuable
broader: droit de reprise de l'administration
definition: Droits accordés aux contribuables en cas de vérification et de rectification de leurs déclarations.
in scheme: FINANCES PUBLIQUES
in scheme: Droit de Reprise de l'Administration
in scheme: Fiscalité
narrower: rescrit
narrower: audition des contribuables
narrower: refip-REFIP7003
narrower: refip-REFIP7169
narrower: refip-REFIP728
notation: REFIP4009

dossier de clôture
type: ConceptReFip
type: Concept
alternative label: dossier de clôture local
broader: clôture des comptes
definition: Ensemble de pièces justificatives expliquant le solde de chaque compte de l'Etat arrêté au 31/12
in scheme: FINANCES PUBLIQUES
in scheme: Procédures et Techniques Comptables
in scheme: Comptabilité
notation: REFIP4010

principe budgétaire
type: ConceptReFip
type: Concept
broader: refip-REFIP978
definition: Norme de présentation à respecter pour le budget de l’État, qui doit respecter 5 grands principes : le principe d'annualité budgétaire ; le principe d'unité budgétaire ; le principe de spécialité budgétaire ; le principe d'universalité budgétaire et le principe de sincérité budgétaire.
in scheme: FINANCES PUBLIQUES
in scheme: Élaboration du budget
in scheme: Budget
narrower: ressource affectée
narrower: principe d'annualité budgétaire
narrower: principe de sincérité budgétaire
narrower: équilibre budgétaire
narrower: équilibre financier
narrower: principe d'unité budgétaire
narrower: non-affectation des recettes
narrower: principe de spécialité budgétaire
narrower: soutenabilité budgétaire
narrower: refip-REFIP792
notation: REFIP4011

avocat
type: ConceptReFip
type: Concept
broader: charges et offices
definition: Auxiliaire de justice dont la mission consiste à assister et à représenter en justice une personne qui se présente à lui et à défendre ses intérêts devant les différentes juridictions.
in scheme: FINANCES PUBLIQUES
in scheme: Profession Juridique
in scheme: Droit et Justice
in scheme: Organisation Juridictionnelle
notation: REFIP4012

webmail
type: ConceptReFip
type: Concept
broader: outil collaboratif
definition: Service de courrier électronique utilisable directement en ligne, permettant un usage nomade.
in scheme: FINANCES PUBLIQUES
in scheme: Communication
in scheme: Communication Documentation Informatique
notation: REFIP4013

indemnité d'occupation
type: ConceptReFip
type: Concept
broader: droit commercial
definition: Somme mensuelle fixée par le juge, que la personne expulsée est condamnée à payer au bailleur au cas où elle ne quitterait pas les lieux.
in scheme: FINANCES PUBLIQUES
in scheme: Droit et Justice
in scheme: Divisions du Droit
in scheme: Droit Privé
notation: REFIP4015

intérêts de retard
type: ConceptReFip
type: Concept
broader: pénalité de retard
definition: Majoration pécuniaire d'origine civile ou fiscale attachée à l'exécution tardive d'une obligation personnelle ou d'un impôt prévu par un contrat ou une loi destinée à réparer le préjudice subi par le paiement différé.
in scheme: FINANCES PUBLIQUES
in scheme: Droit et Justice
in scheme: Sanction
in scheme: Infractions et Sanctions
notation: REFIP4016
related: refip-REFIP7089
related: refip-REFIP7090

groupe d'étude des marchés
type: ConceptReFip
type: Concept
alternative label: GPEM
alternative label: groupe permanent d'études des marchés de travaux publics
broader: marché public
definition: Entités chargés d'élaborer, des recommandations techniques, des cahiers des clauses techniques ou des guides techniques destinés à faciliter la passation et l’exécution des marchés publics.
in scheme: FINANCES PUBLIQUES
in scheme: Commande publique
in scheme: Gestion Publique
notation: REFIP4018
related: refip-REFIP7046

tutelle
type: ConceptReFip
type: Concept
broader: protection juridique
definition: Régime juridique le plus lourd de protection de certaines personnes, (les autres régimes sont la curatelle et la sauvegarde de justice). Il consiste en une représentation continue dans les actes de la vie civile.
in scheme: FINANCES PUBLIQUES
in scheme: Droit et Justice
in scheme: Divisions du Droit
in scheme: Droit Privé
narrower: gérant de tutelle
notation: REFIP4019

Fonds forestier national
type: ConceptReFip
type: Concept
alternative label: FFN
broader: compte spécial du Trésor
definition: Compte spécial du Trésor relevant de la catégorie " comptes d'affectation spéciale ".
in scheme: FINANCES PUBLIQUES
in scheme: Élaboration du budget
in scheme: Budget
notation: REFIP402

droit syndical
type: ConceptReFip
type: Concept
broader: droit du travail
definition: Droit qui régit les droits accordés aux syndicats et les relations entre direction et syndicats. Il définit les conditions de regroupement et d'exercice des organisations et également comment les organisations syndicales peuvent prendre la défense des intérêts de leurs membres. Dans les secteurs publics et privés, le droit syndical régit la protection des représentants syndicaux : absences, indemnités, ainsi que les conditions matérielles à accorder aux syndicats : local, droit d'affichage.
in scheme: FINANCES PUBLIQUES
in scheme: Droit et Justice
in scheme: Divisions du Droit
in scheme: Droit Privé
notation: REFIP4020
related: dialogue social

application OSATIS
type: ConceptReFip
type: Concept
alternative label: OSATIS
broader: applications fiscales (non-descripteur)
definition: Application permettant le suivi de l’état d’un dépôt de déclaration ou de paiement (tva ou tdfc) au fur et à mesure de leur prise en compte dans le système informatique dans un but de traçabilité et à des fins statistiques.
in scheme: FINANCES PUBLIQUES
in scheme: Applications Informatiques
in scheme: Applications fiscales
notation: REFIP4022

audit interne
type: ConceptReFip
type: Concept
broader: audit
definition: Activité exercée de manière indépendante et objective qui donne à chaque ministre une assurance sur le degré de maîtrise de ses opérations et lui apporte ses conseils pour l'améliorer. L'audit interne s'assure ainsi que les dispositifs de contrôle interne sont efficaces.
in scheme: FINANCES PUBLIQUES
in scheme: Audit
in scheme: Missions Transverses des Finances publiques
notation: REFIP4023

commissariat aux ventes
type: ConceptReFip
type: Concept
broader: Direction nationale d'intervention domaniale
definition: Service de la Direction nationale d'interventions domaniales (DNID) chargé des opérations de préparation et de réalisation des ventes des biens remis au Domaine.
in scheme: FINANCES PUBLIQUES
in scheme: Organisation Structurelle de l'Etat
in scheme: Ministère
in scheme: Administration de L'Etat
notation: REFIP4024

numérisation
type: ConceptReFip
type: Concept
broader: numérique
definition: Fait de convertir un signal analogique en un signal numérique.
in scheme: FINANCES PUBLIQUES
in scheme: Communication
in scheme: Communication Documentation Informatique
notation: REFIP4025

application DVP
type: ConceptReFip
type: Concept
alternative label: DVP
broader: applications gestion publique (non-descripteur)
definition: Outil de dématérialisation des avis de prélèvements ou de virements domestiques de masse.
in scheme: FINANCES PUBLIQUES
in scheme: Applications Informatiques
in scheme: Applications gestion publique
notation: REFIP4026

revenu de source étrangère
type: ConceptReFip
type: Concept
broader: revenu imposable
definition: Revenus, bénéfices et plus-values de toute nature encaissés hors de la France métropolitaine et des départements d'Outre-Mer (Guadeloupe, Martinique, Réunion, Guyane) ou reçus directement d'un territoire ou pays autre que la France métropolitaine et les départements d'Outre-Mer.
in scheme: FINANCES PUBLIQUES
in scheme: Champ d'Application
in scheme: Fiscalité
notation: REFIP4027

marché de maîtrise d'oeuvre
type: ConceptReFip
type: Concept
broader: marché public
definition: Marché ayant pour objet en vue de la réalisation d’un ouvrage ou d’un projet urbain ou paysager, l’exécution d’un ou plusieurs éléments de mission définis pat la législation en vigueur
in scheme: FINANCES PUBLIQUES
in scheme: Commande publique
in scheme: Gestion Publique
notation: REFIP4028

personne responsable du marché
type: ConceptReFip
type: Concept
broader: marché public
definition: Entité adjudicatrice ou pouvoir adjudicateur selon le type de marché.
in scheme: FINANCES PUBLIQUES
in scheme: Commande publique
in scheme: Gestion Publique
narrower: entité adjudicatrice
narrower: pouvoir adjudicateur
notation: REFIP4029
scope note: Notion remplacée par celles de pouvoir adjudicateur et entité adjudicatrice (droit communautaire code de 2006)

indivisaire
type: ConceptReFip
type: Concept
alternative label: coindivisaire
broader: indivision
definition: Celui qui est dans l'indivision, possède des droits sur un bien en indivision.
in scheme: FINANCES PUBLIQUES
in scheme: Droit et Justice
in scheme: Divisions du Droit
in scheme: Droit Privé
notation: REFIP403

application PERS
type: ConceptReFip
type: Concept
alternative label: PERS
broader: applications fiscales (non-descripteur)
definition: Référentiel des personnes physiques et morales.
in scheme: FINANCES PUBLIQUES
in scheme: Applications Informatiques
in scheme: Applications fiscales
notation: REFIP4030

contrôle interne de premier niveau
type: ConceptReFip
type: Concept
broader: contrôle interne
definition: Contrôle, intégré au fonctionnement courant, soit a priori, contemporain, ou a posteriori et exercé au sein de l’entité attributaire des tâches .
in scheme: FINANCES PUBLIQUES
in scheme: Missions Transverses des Finances publiques
in scheme: Maîtrise des risques
narrower: contrôle mutuel
narrower: autocontrôle
narrower: contrôle de supervision
notation: REFIP4031

comptabilité non présentée
type: ConceptReFip
type: Concept
broader: fraude fiscale
definition: Documents comptables non présentés aux services de la DGFiP par refus ou omission.
in scheme: FINANCES PUBLIQUES
in scheme: Droit de Contrôle de l'Administration
in scheme: Fiscalité
notation: REFIP4032

parc automobile
type: ConceptReFip
type: Concept
alternative label: flotte de véhicules
broader: domaine public
definition: Ensemble de véhicules détenus ou gérés par l'Administration.
in scheme: FINANCES PUBLIQUES
in scheme: Domaine
in scheme: Gestion Publique
notation: REFIP4033

Mayotte
type: ConceptReFip
type: Concept
broader: collectivités et territoires d'outre mer (non-descripteur)
definition: Département d'outre mer
in scheme: FINANCES PUBLIQUES
in scheme: Géographie
in scheme: Europe
notation: REFIP4034
related: Comores

Caisse régionale d'assurance maladie
type: ConceptReFip
type: Concept
alternative label: CRAM
broader: organisme de sécurité sociale
definition: Organisme de droit privé exerçant une mission de service public, Compétent en matière de risques professionnels, de retraite et d’actions sanitaires et médico-sociales. Depuis le 1er juillet 2010, les CRAM sont devenues des Carsat - à l'exception de la CRAM Ile-de-France. Ce changement intervient à la suite de la création des agences régionales de santé (ARS) à qui sont transférées les missions auparavant exercées par les CRAM en matière de politique sanitaire et médico-sociale.
in scheme: FINANCES PUBLIQUES
in scheme: Organisation Structurelle de l'Etat
in scheme: Organisme de Sécurité Sociale
in scheme: Administration de L'Etat
notation: REFIP4035
related: assurance maladie
scope note: Devient CARSAT à compter du 01/07/2010

accréditation
type: ConceptReFip
type: Concept
broader: droit général (non-descripteur)
definition: Reconnaissance de compétence pour agir ou accéder à des fonctions ou fonctionnalités.
in scheme: FINANCES PUBLIQUES
in scheme: Droit et Justice
in scheme: Droit Général
notation: REFIP4036

application OPERA CDG
type: ConceptReFip
type: Concept
alternative label: OPERA CDG
broader: applications missions transverses (non-descripteur)
definition: Tableau de bord de la performance de la DGFiP.
in scheme: FINANCES PUBLIQUES
in scheme: Applications missions transverses
in scheme: Applications Informatiques
notation: REFIP4037

secrétaire d'Etat
type: ConceptReFip
type: Concept
broader: gouvernement
definition: Membre du gouvernement, le secrétaire d'État est souvent placé sous la tutelle d'un ministre ou parfois du Premier ministre, il a en charge un secteur d'activité particulier.
in scheme: FINANCES PUBLIQUES
in scheme: Organisation Structurelle de l'Etat
in scheme: Pouvoirs Publics
in scheme: Administration de L'Etat
notation: REFIP4038

Tchad
type: ConceptReFip
type: Concept
broader: Afrique
definition: Pays
in scheme: FINANCES PUBLIQUES
in scheme: Géographie
in scheme: Afrique
notation: REFIP4039

taxe sur les certificats d'immatriculation des véhicules
type: ConceptReFip
type: Concept
broader: droits d'enregistrement
definition: Taxe instituée au profit des régions et de la collectivité territoriale de Corse. Proportionnelle ou fixe, elle est assise et recouvrée comme un droit de timbre.
in scheme: FINANCES PUBLIQUES
in scheme: Fiscalité
in scheme: Impôt
notation: REFIP404

Code électoral
type: ConceptReFip
type: Concept
broader: documentation juridique (non-descripteur)
definition: Ensemble des dispositions législatives et réglementaires relatives aux élections des députés, des conseillers généraux et municipaux (code électoral municipales), des sénateurs, les dispositions spécifiques aux députés élus par les Français établis hors de France et les élections relatives au DOM-TOM. Il traite aussi des conditions pour être électeur ou éligible et des règles concernant l’organisation d’une campagne électorale (certains l'appellent code des élections).
in scheme: FINANCES PUBLIQUES
in scheme: Droit et Justice
in scheme: Documentation Juridique
in scheme: Sources du Droit
notation: REFIP4040

lettre de commande
type: ConceptReFip
type: Concept
broader: passation des marchés publics
definition: Document écrit par lequel le pouvoir adjudicateur passe commande à un opérateur économique dans le cadre de marchés à procédure adaptée de très faible montant.
in scheme: FINANCES PUBLIQUES
in scheme: Commande publique
in scheme: Gestion Publique
notation: REFIP4041
related: commande hors marché
related: marché à procédure adaptée

Parlement
type: ConceptReFip
type: Concept
broader: pouvoirs publics
definition: Organe collégial qui exerce le pouvoir législatif. Il est bicaméral : le Sénat, dit « chambre haute » et l’Assemblée nationale, dite « chambre basse ». Il vote la loi, contrôle l'action du gouvernement et évalue les politiques publiques.
in scheme: FINANCES PUBLIQUES
in scheme: Organisation Structurelle de l'Etat
in scheme: Pouvoirs Publics
in scheme: Administration de L'Etat
narrower: Sénat
narrower: assemblée nationale
notation: REFIP4042

commission centrale des impôts directs
type: ConceptReFip
type: Concept
broader: Ministère de l'Economie et des Finances
definition: Commission centrale permanente, placée sous l'autorité du ministre chargé du budget. Il existe 2 types de commissions centrales : une commission centrale compétente pour fixer les éléments à retenir pour le calcul des bénéfices forfaitaires agricoles, une commission centrale compétente pour statuer sur les appels dirigés contre les tarifs des évaluations foncières des propriétés non bâties.
in scheme: FINANCES PUBLIQUES
in scheme: Organisation Structurelle de l'Etat
in scheme: Ministère
in scheme: Administration de L'Etat
notation: REFIP4044

recettes non fiscales de l'Etat
type: ConceptReFip
type: Concept
broader: recettes de l'Etat
definition: Recettes qui ne sont liées ni à un impôt ni à une taxe. Ce sont, par exemple, les dividendes perçus par l’État actionnaire ou les loyers recouvrés par l’État propriétaire. Au sein des documents budgétaires, elles sont réparties en six catégories : les dividendes et recettes assimilées, les produits du domaine de l’État, les produits de la vente de biens et services, les remboursements et intérêts des prêts, les avances et autres immobilisations financières, les amendes, sanctions, pénalités et frais de poursuite et les produits divers.
in scheme: FINANCES PUBLIQUES
in scheme: Budget de l’État
in scheme: Budget
narrower: loyer budgétaire
narrower: opération commerciale des domaines
notation: REFIP4046

fiabilisation des données
type: ConceptReFip
type: Concept
broader: qualité des données
definition: Opération consistant à contrôler et améliorer la qualité des données d’un système d’information, par rapport à ses règles d’intégrité et de gestion.
in scheme: FINANCES PUBLIQUES
in scheme: Informatique
in scheme: Communication Documentation Informatique
notation: REFIP4047

obligation de dépôt de déclaration
type: ConceptReFip
type: Concept
alternative label: obligation déclarative
broader: obligation fiscale du contribuable
definition: Obligation pour le contribuable de souscrire une déclaration, selon le revenu concerné et le régime d'imposition.
in scheme: FINANCES PUBLIQUES
in scheme: Fiscalité - Autres notions
in scheme: Fiscalité
notation: REFIP4048

Suède
type: ConceptReFip
type: Concept
broader: Europe
definition: Pays
in scheme: FINANCES PUBLIQUES
in scheme: Géographie
in scheme: Europe
notation: REFIP405

établissement public de santé
type: ConceptReFip
type: Concept
alternative label: EPS
alternative label: centre hospitalier
alternative label: hôpital public
broader: structures territoriales (non-descripteur)
definition: Personne morale de droit public, dotée de l’autonomie financière. Les établissements publics de santé assurent une mission de service public et sont soumis au contrôle de l'État. Ils peuvent être communaux, intercommunaux, départementaux, régionaux, inter-régionaux ou nationaux.
in scheme: FINANCES PUBLIQUES
in scheme: Organisation Territoriale
in scheme: Structures Territoriales
in scheme: Administration de L'Etat
narrower: centre hospitalier spécialisé en psychiatrie
narrower: établissement de cure
narrower: syndicat interhospitalier
narrower: centre hospitalier régional
narrower: comité technique d'établissement
narrower: groupement hospitalier de territoire
notation: REFIP4050
related: facturation individuelle des établissements de santé
related: hospitalisation

curatelle
type: ConceptReFip
type: Concept
broader: protection juridique
definition: Régime de protection intermédiaire des majeurs qui permet d'assister une personne lorsque, sans être hors d'état d'agir elle-même, elle est dans l'impossibilité de pourvoir seule à ses intérêts en raison d'une altération de ses facultés mentales ou corporelles.
in scheme: FINANCES PUBLIQUES
in scheme: Droit et Justice
in scheme: Divisions du Droit
in scheme: Droit Privé
notation: REFIP4051

versement pour sous-densité
type: ConceptReFip
type: Concept
broader: cadastre
definition: Outil destiné à permettre une utilisation plus économe de l’espace et à lutter contre l’étalement urbain. Il se substitue au versement pour dépassement du plafond légal de densité (VDPLD). Ce dispositif permet aux communes et EPCI compétents en matière de PLU qui le souhaitent d’instaurer un seuil minimal de densité par secteur (SMD). En deçà de ce seuil, les constructeurs devront s’acquitter d’un versement égal au produit de la moitié de la valeur du terrain par le rapport entre la surface manquante pour que la construction atteigne le seuil minimal de densité et la surface de la construction résultant de l’application de ce seuil. Le versement pour sous-densité (VSD) est réservé aux zones U (urbaines) et AU (à urbaniser) des PLU ou des POS.
in scheme: FINANCES PUBLIQUES
in scheme: Cadastre
in scheme: Fiscalité
notation: REFIP4052

communauté de communes
type: ConceptReFip
type: Concept
broader: refip-REFIP821
definition: Etablissement public de coopération intercommunale regroupant plusieurs communes d'un seul tenant et sans enclave. Elle a pour objet d'associer des communes au sein d'un espace de solidarité, en vue de l'élaboration d'un projet commun de développement et d'aménagement de l'espace.
in scheme: FINANCES PUBLIQUES
in scheme: Organisation Territoriale
in scheme: Structures Territoriales
in scheme: Administration de L'Etat
notation: REFIP4054

échange d'immeubles
type: ConceptReFip
type: Concept
broader: mutation d'immeuble
definition: Contrat d'échange portant sur des biens immobiliers, soumis au régime de droit commun des mutations et donc aux droits d'enregistrement.
in scheme: FINANCES PUBLIQUES
in scheme: Champ d'Application
in scheme: Fiscalité
notation: REFIP4055

convention de partenariat
type: ConceptReFip
type: Concept
alternative label: partenariat
broader: contrat et mode de gestion (non-descripteur)
definition: Accord de volonté destiné à la collaboration entre les parties signataires formalisant les engagements réciproques.
in scheme: FINANCES PUBLIQUES
in scheme: Secteur public local
in scheme: Gestion Publique
notation: REFIP4056

contrat initiative emploi
type: ConceptReFip
type: Concept
alternative label: CUI-CIE
broader: contrat unique d'insertion
definition: Contrat de travail du secteur marchand, dont l'objectif est d'inciter à l'embauche des personnes en difficulté sur le marché du travail, en allégeant le coût du travail. Contrat ayant fait l'objet d'une profonde réforme dans le cadre de la loi de programmation pour la cohésion sociale du 18 janvier 2005, ce qui conduit à évoquer un « ancien » et un « nouveau » CIE. Initialement ciblé sur les chômeurs de longue durée, le CIE s'adresse désormais aux personnes sans emploi, inscrites ou non à Pôle Emploi rencontrant des difficultés sociales et professionnelles d'accès à l'emploi.
in scheme: FINANCES PUBLIQUES
in scheme: Contrat de Travail
in scheme: Entreprises
in scheme: Travail
notation: REFIP4057
scope note: Jusqu'au 31/12/2009

commission des infractions fiscales
type: ConceptReFip
type: Concept
broader: Ministère de l'Economie et des Finances
definition: Autorité administrative indépendante française, elle intervient dans le domaine de la lutte contre la fraude fiscale.
in scheme: FINANCES PUBLIQUES
in scheme: Organisation Structurelle de l'Etat
in scheme: Ministère
in scheme: Administration de L'Etat
notation: REFIP4058

commissaire-priseur
type: ConceptReFip
type: Concept
broader: charges et offices
definition: Officier ministériel chargé de procéder, à l’estimation et à la vente publique aux enchères des meubles et effets mobiliers corporels, prescrites par la loi ou par décision de justice. Il est un professionnel libéral placé sous la tutelle du Ministère de la Justice au même titre que les autres officiers ministériels (Notaires, Huissiers de justice…).
in scheme: FINANCES PUBLIQUES
in scheme: Profession Juridique
in scheme: Droit et Justice
in scheme: Organisation Juridictionnelle
notation: REFIP406

société d'aménagement foncier et d'établissement rural
type: ConceptReFip
type: Concept
alternative label: SAFER
broader: organisme privé assurant service public (non-descripteur)
definition: Organisme d'intervention sur le marché foncier rural dont la mission est notamment de contribuer à l'amélioration des structures foncières du secteur agricole et d'assurer la transparence du marché foncier rural.
in scheme: FINANCES PUBLIQUES
in scheme: Organisation Structurelle de l'Etat
in scheme: Organisme Privé Assurant Service Public
in scheme: Administration de L'Etat
notation: REFIP4062

garde alternée
type: ConceptReFip
type: Concept
alternative label: garde partagée
alternative label: résidence alternée
broader: droit de garde
definition: En cas de séparation des parents, l'enfant est élevé par ses 2 parents et partage son temps de manière équilibrée entre les 2.
in scheme: FINANCES PUBLIQUES
in scheme: Droit et Justice
in scheme: Divisions du Droit
in scheme: Droit Privé
notation: REFIP4063

procès-verbal de recherches
type: ConceptReFip
type: Concept
broader: documentation fiscale (non-descripteur)
definition: Imprimé P 744 établi par l'huissier de justice lorsque la personne à qui l'acte doit être signifié n'a ni domicile, ni résidence, ni lieu de travail connus, où il relate avec précision les diligences qu'il a accomplies pour rechercher le destinataire de l'acte. Il est interruptif de prescription.
in scheme: FINANCES PUBLIQUES
in scheme: Documentation Fiscale
in scheme: Fiscalité
notation: REFIP4065

syndicat intercommunal à vocation unique
type: ConceptReFip
type: Concept
alternative label: SIVU
broader: syndicat de communes
definition: Etablissement public de coopération intercommunale, les SIVU correspondent à une association de communes, même non limitrophes, regroupées afin de gérer une seule activité d'intérêt intercommunal. Généralement de taille réduite, les SIVU sont limités à une œuvre ou un service d’intérêt intercommunal.
in scheme: FINANCES PUBLIQUES
in scheme: Organisation Territoriale
in scheme: Structures Territoriales
in scheme: Administration de L'Etat
notation: REFIP4066

comptabilité M 99
type: ConceptReFip
type: Concept
broader: comptabilité publique locale
definition: Plan comptable M 99 applicable aux EPLE et de formation professionnelle agricole (EPLEFPA).
in scheme: FINANCES PUBLIQUES
in scheme: Secteur public local
in scheme: Gestion Publique
notation: REFIP4067

licence des débits de boissons
type: ConceptReFip
type: Concept
broader: débit de boissons
definition: Permis d'exploitation, soumis à conditions, permettant la vente de l’alcool autorisé à la vente aux heures officielles d’ouverture des débits de boissons reprises par arrêté préfectoral. Les consommations ont lieu sur place à table ou au bar sans accompagnement de nourriture.
in scheme: FINANCES PUBLIQUES
in scheme: Branche d'activité
in scheme: Questions Economiques
in scheme: Commerce
notation: REFIP4069

nationalité française
type: ConceptReFip
type: Concept
broader: refip-REFIP859
definition: Lien juridique qui relie un individu à la France. De ce lien découlent des obligations à la charge des personnes qui possèdent la qualité de Français, en contrepartie desquelles sont conférés des droits politiques, civils et professionnels, ainsi que le bénéfice des libertés publiques. La nationalité française peut résulter du droit du sang, du droit du sol ou d'une acquisition à la suite d’événements personnels ou d'une décision des autorités françaises.
in scheme: FINANCES PUBLIQUES
in scheme: Droit et Justice
in scheme: Divisions du Droit
in scheme: Droit Privé
narrower: naturalisation
notation: REFIP407

recours de plein contentieux
type: ConceptReFip
type: Concept
alternative label: recours de pleine juridiction
broader: refip-REFIP885
definition: Résultat d'une demande formulée devant un tribunal administratif, par lequel le requérant sollicite du juge administratif le constat à son profit de l'existence d'un droit personnel tel qu'un droit de créance. Ce contentieux englobe le contentieux des contrats publics, le contentieux de l'indemnisation, le contentieux des élections, le contentieux fiscal, etc.
in scheme: FINANCES PUBLIQUES
in scheme: Procédure Administrative
in scheme: Droit et Justice
in scheme: Procédure
notation: REFIP4072

royaume de Bahreïn
type: ConceptReFip
type: Concept
alternative label: Bahreïn
broader: Asie
definition: Pays
in scheme: FINANCES PUBLIQUES
in scheme: Géographie
in scheme: Asie
notation: REFIP4075

résidence mobile terrestre
type: ConceptReFip
type: Concept
alternative label: mobil-home
broader: camping
definition: Véhicule pouvant être affecté à l’habitation et constituer l’habitat principal.
in scheme: FINANCES PUBLIQUES
in scheme: Branche d'activité
in scheme: Questions Economiques
in scheme: Tourisme
notation: REFIP4076
related: refip-REFIP6709

application DUERPAP
type: ConceptReFip
type: Concept
alternative label: DUERPAP
broader: applications missions transverses (non-descripteur)
definition: Application servant au pilotage de la demande d'évaluation des risques professionnels.
in scheme: FINANCES PUBLIQUES
in scheme: Applications missions transverses
in scheme: Applications Informatiques
notation: REFIP4077

élection professionnelle
type: ConceptReFip
type: Concept
alternative label: candidature à une élection professionnelle
broader: refip-REFIP6950
definition: Action permettant aux salariés d'élire les délégués du personnel et les membres des comités d'entreprise. Les élections des représentants du personnel varient selon les effectifs des entreprises. Dans les entreprises de moins de 11 salariés, où ne sont élus ni délégués du personnel, ni comité d'entreprise, ainsi que pour les employés à domicile et les salariés d'association, la représentation syndicale repose sur la mesure de la représentativité des organisations syndicales au niveau des branches professionnelles et au niveau national et interprofessionnel.
in scheme: FINANCES PUBLIQUES
in scheme: Entreprises
in scheme: Travail
in scheme: 212619
notation: REFIP4079

application ARIANE
type: ConceptReFip
type: Concept
alternative label: ARIANE
broader: applications fiscales (non-descripteur)
definition: Logiciel qui gère les enquêtes, les prélèvements de dossiers et le système GED des procédés frauduleux et des productions documentaires libres. Permet d'effectuer des statistiques dans le cadre d'un contrôle fiscal.
in scheme: FINANCES PUBLIQUES
in scheme: Applications Informatiques
in scheme: Applications fiscales
notation: REFIP4080

privilège de pluviôse
type: ConceptReFip
type: Concept
broader: privilège
definition: Privilège conférant aux fournisseurs d’entrepreneurs de tous travaux ayant le caractère de travaux publics un droit de paiement préférentiel sur tout autre créancier à raison des créances qu’ils détiennent sur lesdites entreprises au titre des fournitures et matériaux qu’ils apportent pour l’exécution du marché public.
in scheme: FINANCES PUBLIQUES
in scheme: Droit et Justice
in scheme: Divisions du Droit
in scheme: Droit Privé
notation: REFIP4081

cessionnaire
type: ConceptReFip
type: Concept
broader: cession
definition: Celui qui acquiert dans le cadre d'une cession.
in scheme: FINANCES PUBLIQUES
in scheme: Droit et Justice
in scheme: Divisions du Droit
in scheme: Droit Privé
notation: REFIP4082

prélèvement sur produit des jeux
type: ConceptReFip
type: Concept
alternative label: gain de jeux
alternative label: impôt progressif sur les jeux
broader: refip-REFIP934
definition: Dans le cadre de l'ouverture à la concurrence et à la régulation du secteur des jeux d'argent et de hasard en ligne, ont été instaurés trois prélèvements sur les jeux et paris : un prélèvement sur les sommes engagées par les parieurs pour le pari mutuel organisé et exploité par les sociétés de courses ; un prélèvement sur les sommes engagées par les parieurs pour les paris sportifs; un prélèvement sur les sommes engagées par les joueurs pour les jeux de cercle en ligne.
in scheme: FINANCES PUBLIQUES
in scheme: Fiscalité
in scheme: Impôt
notation: REFIP4083
related: produit des jeux

gestionnaire d'engagement juridique (supprimé)
type: ConceptReFip
type: Concept
in scheme: FINANCES PUBLIQUES
notation: REFIP4084

section de commune
type: ConceptReFip
type: Concept
broader: commune
definition: Toute partie d’une commune possédant à titre permanent et exclusif des biens ou des droits distincts de ceux de la commune, l'existence de la section de commune est reconnue lorsque des habitants d'une partie déterminée de la commune possèdent certains intérêts (biens, droits) à titre permanent et exclusif prouvés par un titre, par une décision de justice ou une sentence arbitrale ou par un usage public, paisible, continu et non équivoque. La section de commune a la personnalité juridique. Les habitants de la section ont la jouissance des biens dont les fruits sont perçus en nature (affouage, cueillette), les revenus en espèces doivent être employés dans l’intérêt des membres de la section, à la mise en valeur et à l’entretien des biens de la section ainsi qu’aux équipements nécessaires.
in scheme: FINANCES PUBLIQUES
in scheme: Organisation Territoriale
in scheme: Structures Territoriales
in scheme: Administration de L'Etat
notation: REFIP4085

légalité
type: ConceptReFip
type: Concept
broader: droit général (non-descripteur)
definition: Ensemble des actions qui ne transgressent pas la loi. Principe fondamental de droit administratif qui soumet l'Administration au Droit.
in scheme: FINANCES PUBLIQUES
in scheme: Droit et Justice
in scheme: Droit Général
notation: REFIP4089

audition des contribuables
type: ConceptReFip
type: Concept
broader: garantie accordée à l'usager
definition: Garantie offerte au contribuable lui permettant de présenter oralement ses observations, dans le cadre des recours prévus par la législation, lorsque l'administration fiscale a mis en œuvre une procédure de rectification contradictoire.
in scheme: FINANCES PUBLIQUES
in scheme: Droit de Reprise de l'Administration
in scheme: Fiscalité
narrower: Commission nationale des impôts directs et des taxes sur le chiffre d'affaires
narrower: Commission départementale des impôts directs et des taxes sur le chiffre d'affaires
notation: REFIP4090

Agence de développement rural et d'aménagement foncier (supprimé)
type: ConceptReFip
type: Concept
broader: ZZ
in scheme: FINANCES PUBLIQUES
notation: REFIP4091

assemblée d'actionnaires
type: ConceptReFip
type: Concept
alternative label: assemblée d'associés
broader: assemblée générale
definition: Réunion des actionnaires d’une société au moins une fois par an en assemblée. L’assemblée générale peut être ordinaire (AGO) ou extraordinaire (AGE). L’objet de l’assemblée est d’approuver les comptes de l’exercice présenté par le directoire ou le conseil d’administration Par ailleurs, différentes résolutions, tels que le montant du dividende ou des opérations sur le capital, sont soumis aux votes des actionnaires.
in scheme: FINANCES PUBLIQUES
in scheme: Gestion de l'Entreprise
in scheme: Entreprises
in scheme: Vie et Gestion de l'entreprise
notation: REFIP4092

dépenses d'équipement
type: ConceptReFip
type: Concept
broader: dépenses d'investissement
definition: Dépenses comprenant l'acquisition de biens, meubles et immeubles et travaux en cours.
in scheme: FINANCES PUBLIQUES
in scheme: Dépenses publiques
in scheme: Gestion Publique
narrower: bien d'équipement
notation: REFIP4095

bibliothèque
type: ConceptReFip
type: Concept
alternative label: médiathèque
broader: centre de documentation
definition: Lieu où est conservée et lue une collection organisée de livres.
in scheme: FINANCES PUBLIQUES
in scheme: Documentation
in scheme: Communication Documentation Informatique
notation: REFIP4096

établissement d'enseignement
type: ConceptReFip
type: Concept
broader: structures territoriales (non-descripteur)
definition: Etablissement dans lequel des enseignements ou des formations sont dispensés, qu'ils soient publics ou privés. On distingue notamment les établissements d’enseignement primaire, secondaire, supérieur et les centres de formation professionnelle.
in scheme: FINANCES PUBLIQUES
in scheme: Organisation Territoriale
in scheme: Structures Territoriales
in scheme: Administration de L'Etat
narrower: établissement public local d'enseignement
narrower: établissement d'enseignement français à l'étranger
narrower: école
narrower: établissement public local d'enseignement et de formation professionnelle agricole
narrower: établissement d'enseignement privé sous contrat
notation: REFIP4097

date de dépôt
type: ConceptReFip
type: Concept
alternative label: date de remise
broader: mots outils (liste additive)
definition: Date à laquelle un document a été remis à son destinataire
in scheme: FINANCES PUBLIQUES
in scheme: Mots Outils
notation: REFIP4098

personne physique de droit privé
type: ConceptReFip
type: Concept
alternative label: personne physique
alternative label: personne privée
broader: droit civil
definition: Sujet de droits et d'obligations par opposition à la personne morale de droit privé.
in scheme: FINANCES PUBLIQUES
in scheme: Droit et Justice
in scheme: Divisions du Droit
in scheme: Droit Privé
notation: REFIP41

insaisissabilité
type: ConceptReFip
type: Concept
alternative label: saisissabilité
broader: saisie
definition: Caractère d'un bien ou d'un revenu que l'on ne peu appréhender en recouvrement des dettes, comme notamment divers biens et objets nécessaires à la vie et au travail du débiteur saisi et de sa famille.
in scheme: FINANCES PUBLIQUES
in scheme: Recouvrement
in scheme: Fiscalité
notation: REFIP410

avis de mise en recouvrement
type: ConceptReFip
type: Concept
alternative label: AMR
broader: documentation fiscale (non-descripteur)
definition: Titre exécutoire par lequel le comptable chargé du recouvrement authentifie la créance fiscale non acquittée ou acquittée partiellement dans les délais réglementaires.
in scheme: FINANCES PUBLIQUES
in scheme: Documentation Fiscale
in scheme: Fiscalité
notation: REFIP4100

prise en charge
type: ConceptReFip
type: Concept
broader: recouvrement
definition: Opération administrative d'ordre interne permettant de constater le défaut de paiement à la date d'exigibilité des impôts, taxes et redevances incombant aux comptables publics et d'organiser la surveillance de l'apurement des créances, et comportant des conséquences juridiques. La prise en charge est également la transformation d’un titre de recettes en pièce comptable constatant le montant des produits à recouvrer.
in scheme: FINANCES PUBLIQUES
in scheme: Recouvrement
in scheme: Fiscalité
notation: REFIP4101

employeur
type: ConceptReFip
type: Concept
broader: refip-REFIP6950
definition: Personne qui emploie du personnel salarié. Dans un contrat de travail, il est celui qui exerce l'autorité et donne des tâches à accomplir contre paiement.
in scheme: FINANCES PUBLIQUES
in scheme: Entreprises
in scheme: Travail
in scheme: 212619
narrower: attestation de l'employeur
narrower: employeur multiple
notation: REFIP4102

Croatie
type: ConceptReFip
type: Concept
alternative label: République de Croatie
broader: Europe
definition: Pays
in scheme: FINANCES PUBLIQUES
in scheme: Géographie
in scheme: Europe
notation: REFIP4104

administration pénitentiaire
type: ConceptReFip
type: Concept
broader: Ministère de la Justice
definition: Direction du ministère de la Justice, se composant notamment d'une administration centrale, de services déconcentrés. Elle regroupe l’ensemble des moyens matériels et humains destinés à assurer l’exécution des condamnations pénales ainsi que la prévention de la récidive par la réinsertion sociale.
in scheme: FINANCES PUBLIQUES
in scheme: Organisation Structurelle de l'Etat
in scheme: Ministère
in scheme: Administration de L'Etat
notation: REFIP4105

Savoie
type: ConceptReFip
type: Concept
broader: Auvergne-Rhône-Alpes
definition: Département français
in scheme: FINANCES PUBLIQUES
in scheme: Géographie
in scheme: Europe
notation: REFIP4106

impôt sur les sociétés
type: ConceptReFip
type: Concept
alternative label: IS
broader: impôt direct
definition: Impôt direct payé sur les bénéfices ou revenus réalisés par les sociétés commerciales et autres personnes morales.
in scheme: FINANCES PUBLIQUES
in scheme: Fiscalité
in scheme: Impôt
notation: REFIP4107

dialogue de gestion
type: ConceptReFip
type: Concept
broader: pilotage
definition: Temps d’échange professionnel privilégié qui doit permettre, chaque année, de dresser le bilan d’activité global d’une structure et d’en définir les objectifs, mission par mission, ainsi que les actions prioritaires à mener au vu des moyens humains et budgétaires pour satisfaire ces ambitions. Il vise à donner du sens à l’action collective en adoptant une approche qualitative (vision d’ensemble des missions, des moyens et des priorités, mesures de priorisation des tâches et de mutualisation des bonnes pratiques).
in scheme: FINANCES PUBLIQUES
in scheme: Missions Transverses des Finances publiques
in scheme: Pilotage
narrower: refip-REFIP7033
notation: REFIP4109

travailleur handicapé
type: ConceptReFip
type: Concept
broader: travailleur salarié
definition: Personne dont les possibilités d'obtenir ou de conserver un emploi sont réduites, à cause d'un handicap. Se faire reconnaître travailleur handicapé ouvre l'accès à un ensemble de mesures mises en place pour favoriser l’insertion professionnelle des personnes handicapées. Les formalités de reconnaissance s’effectuent auprès de la Commission des droits et de l’autonomie des personnes handicapées (CDAPH).
in scheme: FINANCES PUBLIQUES
in scheme: Entreprises
in scheme: Travail
in scheme: 212619
notation: REFIP411

revenu de participation (obsolète)
type: ConceptReFip
type: Concept
is replaced by: épargne salariale
broader: ZZ
in scheme: FINANCES PUBLIQUES
notation: REFIP4110

travail saisonnier
type: ConceptReFip
type: Concept
alternative label: saisonnier
alternative label: travailleur saisonnier
broader: refip-REFIP6950
definition: Exécution de tâches normalement appelées à se répéter chaque année, à des dates à peu près fixes, en fonction du rythme des saisons (récolte, cueillette) ou des modes de vie collectifs (tourisme). Cette variation d'activité doit être indépendante de la volonté de l'employeur. Sont notamment concernés le secteur agricole, les industries agroalimentaires et le tourisme.
in scheme: FINANCES PUBLIQUES
in scheme: Entreprises
in scheme: Travail
in scheme: 212619
notation: REFIP4111

délai de réception
type: ConceptReFip
type: Concept
alternative label: délai de réception des offres
broader: appel d'offres
definition: Temps fixé par le code des marchés publics devant être strictement respectés sous peine d’irrégularité de la procédure. Ce sont des délais minimaux ; il appartient à la personne responsable du marché de fixer des délais suffisants tenant compte notamment de l’importance des études à réaliser par les candidats.
in scheme: FINANCES PUBLIQUES
in scheme: Commande publique
in scheme: Gestion Publique
notation: REFIP4112

application VFP
type: ConceptReFip
type: Concept
alternative label: VFP
alternative label: application VIREMENTS DE FONDS PARTICULIERS-ACCT
broader: applications gestion publique (non-descripteur)
definition: Outil permettant la gestion des Virements de Fonds Particuliers.
in scheme: FINANCES PUBLIQUES
in scheme: Applications Informatiques
in scheme: Applications gestion publique
notation: REFIP4114

fonds de mobilisation départementale pour l'insertion
type: ConceptReFip
type: Concept
alternative label: FMDI
broader: fonds (non-descripteur)
definition: Fonds finançant dans chaque département , le le développement et la consolidation des initiatives locales en matière d'insertion par l'activité économique.
in scheme: FINANCES PUBLIQUES
in scheme: Dépenses publiques
in scheme: Gestion Publique
notation: REFIP4115

redressement judiciaire
type: ConceptReFip
type: Concept
alternative label: liquidation de biens
alternative label: règlement judiciaire
broader: procédure collective
definition: La procédure de redressement judiciaire est une procédure collective mise en œuvre par toute entreprise en cessation de paiements dont le redressement est jugé possible. Elle permet la poursuite de l’activité de l’entreprise, l’apurement de ses dettes et le maintien de l’emploi. Elle peut donner lieu à l’adoption d'un plan de redressement à l'issue d'une période d'observation, pendant laquelle un bilan économique et social de l'entreprise est réalisé. Toute personne exerçant une activité commerciale ou artisanale, tout agriculteur ou autre personne exerçant une activité professionnelle indépendante (y compris une profession libérale), toute personne morale de droit privé (société, association) qui se trouve en état de cessation des paiements mais dont la situation n’est pas définitivement compromise, peut être placée en redressement judiciaire. La procédure peut être ouverte : à la demande du débiteur au plus tard dans les 45 jours suivant la cessation des paiements ; à la demande d’un créancier, sauf si une procédure de conciliation est en cours ; à la demande du procureur de la République sauf si une procédure de conciliation est en cours. La procédure de redressement judiciaire commence par une période d’observation de 6 mois maximum, renouvelable sans pouvoir dépasser 18 mois. Pendant cette phase, un bilan économique et social est réalisé.
in scheme: FINANCES PUBLIQUES
in scheme: Vie de l'Entreprise
in scheme: Entreprises
in scheme: Vie et Gestion de l'entreprise
narrower: plan de redressement
narrower: plan de continuation
notation: REFIP4116

application CORINTHE
type: ConceptReFip
type: Concept
alternative label: CORINTHE
broader: applications gestion publique (non-descripteur)
definition: Application permettant l'acquisition des pré-requis bureautiques nécessaires à l'utilisation d'Helios.
in scheme: FINANCES PUBLIQUES
in scheme: Applications Informatiques
in scheme: Applications gestion publique
notation: REFIP4117

dénonciation
type: ConceptReFip
type: Concept
broader: notification
definition: Notification d'un acte de procédure à une personne qui n'en est pas le destinataire mais qui a néanmoins intérêt à le connaître. Cas de l'acte de saisie-attribution qui est adressé directement au tiers-saisi.
in scheme: FINANCES PUBLIQUES
in scheme: Principes Généraux
in scheme: Droit et Justice
in scheme: Procédure
notation: REFIP4119

prix provisoire
type: ConceptReFip
type: Concept
broader: passation des marchés publics
definition: Prix initial d’un marché destiné à être remplacé par un prix définitif après enquête de coût de revient.
in scheme: FINANCES PUBLIQUES
in scheme: Commande publique
in scheme: Gestion Publique
notation: REFIP412
related: marché négocié

lycée d'enseignement général et technologique agricole
type: ConceptReFip
type: Concept
alternative label: lycée agricole
alternative label: lycée professionnel agricole
broader: établissement public local d'enseignement et de formation professionnelle agricole
definition: Etablissement public secondaire d'enseignement agricole dépendant du ministère de l'agriculture.
in scheme: FINANCES PUBLIQUES
in scheme: Organisation Territoriale
in scheme: Structures Territoriales
in scheme: Administration de L'Etat
notation: REFIP4120

bail à durée illimitée
type: ConceptReFip
type: Concept
broader: refip-REFIP95
definition: Bail dont la durée n'a pas de limite, soit fixée par contrat, soit susceptible d'être déterminée par les circonstances ou par l'usage des lieux.
in scheme: FINANCES PUBLIQUES
in scheme: Droit et Justice
in scheme: Divisions du Droit
in scheme: Droit Privé
notation: REFIP4121

opération immobilière
type: ConceptReFip
type: Concept
broader: immobilier
definition: Transaction se concrétisant sur le marché immobilier par l'échange entre un acheteur et un vendeur d'un bien immobilier.
in scheme: FINANCES PUBLIQUES
in scheme: Branche d'activité
in scheme: Questions Economiques
in scheme: Services et professions libérales
notation: REFIP4122

engagement hors bilan
type: ConceptReFip
type: Concept
broader: engagement de l'Etat
definition: Actif, dette ou activité de financement ne figurant pas au bilan.
in scheme: FINANCES PUBLIQUES
in scheme: Exécution du budget
in scheme: Budget
narrower: garantie de l'Etat
notation: REFIP4123

monopole
type: ConceptReFip
type: Concept
alternative label: monopole de commerce
alternative label: monopole économique
broader: économie générale (non-descripteur)
definition: Situation d'un marché dans lequel il y a de nombreux acheteurs et un seul vendeur qui, n'ayant pas à subir la concurrence d'autres producteurs, est libre de fixer ses prix.
in scheme: FINANCES PUBLIQUES
in scheme: Questions Economiques
in scheme: Economie générale
notation: REFIP4125

revenu immobilier
type: ConceptReFip
type: Concept
alternative label: revenu locatif
broader: revenu du patrimoine
definition: Revenu provenant d'un bien immobilier.
in scheme: FINANCES PUBLIQUES
in scheme: Champ d'Application
in scheme: Fiscalité
notation: REFIP4127

matières premières
type: ConceptReFip
type: Concept
broader: industrie
definition: Ensemble des produits initiaux servant à la production ou à la fabrication de produits finis ou manufacturés. Il s'agit de matières produites par la nature qui nécessitent une transformation pour utilisation.
in scheme: FINANCES PUBLIQUES
in scheme: Branche d'activité
in scheme: Questions Economiques
in scheme: Industrie
narrower: pétrole
narrower: métal
narrower: refip-REFIP7219
notation: REFIP413
related: gaz
related: carburant

plan de continuation
type: ConceptReFip
type: Concept
broader: redressement judiciaire
definition: Dispositif mis en place après la période d'observation, lorsqu'il existe une possibilité sérieuse pour l'entreprise d'être sauvegardée. Il est arrêté par le tribunal, pour que le débiteur en reprenant la tête de ses affaires, puisse continuer à conserver tout ou partie des emplois existants et puisse désintéresser ses créanciers selon des modalités prévues par le plan dont l'exécution est étroitement contrôlée. Le jugement du tribunal met fin à la période d'observation.
in scheme: FINANCES PUBLIQUES
in scheme: Vie de l'Entreprise
in scheme: Entreprises
in scheme: Vie et Gestion de l'entreprise
notation: REFIP4130

budget principal
type: ConceptReFip
type: Concept
broader: finances locales (non-descripteur)
definition: Budget comportant les recettes et les dépenses d'une collectivité locale sans celles des budgets annexes et des budgets rattachés.
in scheme: FINANCES PUBLIQUES
in scheme: Secteur public local
in scheme: Gestion Publique
notation: REFIP4131

éducateur de jeunes enfants
type: ConceptReFip
type: Concept
broader: fonction publique territoriale
definition: Fonctionnaire territorial de catégorie B intervenant auprès d’enfants âgés de 0 à 7 ans, en relation avec leurs parents. Il les accompagne dans leur apprentissage de l’autonomie et de la vie sociale. Son rôle consiste à stimuler leurs potentialités intellectuelles, affectives et artistiques à travers des activités ludiques et éducatives.
in scheme: FINANCES PUBLIQUES
in scheme: Personnels et fonctions
in scheme: Fonction Publique et Gestion des Ressources Humaines
notation: REFIP4132

libre circulation des biens et des personnes
type: ConceptReFip
type: Concept
alternative label: convention Schengen
alternative label: espace Schengen
broader: droit européen
definition: Principe fondamental de l'Union Européenne, consacré par le Traité de Rome en 1957. Les biens peuvent circuler librement à l'intérieur de l'Union européenne (UE). Il n'existe plus de formalités fiscales et douanières au franchissement des frontières. Toutefois, certains produits sensibles restent soumis à des contrôles et/ou à déclaration ou interdits d'entrée.
in scheme: FINANCES PUBLIQUES
in scheme: Droit et Justice
in scheme: Divisions du Droit
in scheme: Droit Européen
notation: REFIP4133

loi de finances rectificative
type: ConceptReFip
type: Concept
broader: refip-REFIP978
definition: Collectif budgétaire. Texte permettant de modifier, en cours d’année, les dispositions de la loi de finances initiale concernant notamment le plafonds des dépenses du budget de l’État et les données générales de l’équilibre budgétaire.
in scheme: FINANCES PUBLIQUES
in scheme: Élaboration du budget
in scheme: Budget
notation: REFIP4134

Ecole nationale d'administration
type: ConceptReFip
type: Concept
alternative label: ENA
broader: établissement public à caractère administratif
definition: Etablissement public de l'Etat à caractère administratif, doté de l'autonomie financière, placé sous la tutelle du Premier ministre. Son siège est à Strasbourg. L'ENA a pour principes fondateurs de démocratiser l’accès à la haute fonction publique et de professionnaliser la formation des hauts fonctionnaires.
in scheme: FINANCES PUBLIQUES
in scheme: Organisation Structurelle de l'Etat
in scheme: Opérateur de l'Etat
in scheme: Administration de L'Etat
notation: REFIP4136

livre des procédures fiscales
type: ConceptReFip
type: Concept
alternative label: LPF
broader: documentation juridique (non-descripteur)
definition: Ensemble des textes législatifs et réglementaires relatifs aux procédures de contrôle, de contentieux et de recouvrement de l'impôt.
in scheme: FINANCES PUBLIQUES
in scheme: Droit et Justice
in scheme: Documentation Juridique
in scheme: Sources du Droit
notation: REFIP4137

déductibilité
type: ConceptReFip
type: Concept
alternative label: caractère déductible
broader: liquidation de l'impôt
definition: Caractère déductible des charges fiscales, des taxes et autres impôts.
in scheme: FINANCES PUBLIQUES
in scheme: Liquidation de l'Impôt
in scheme: Fiscalité
narrower: charge non déductible
narrower: coefficient de déduction
narrower: déduction fiscale
notation: REFIP4138

juridiction pénale
type: ConceptReFip
type: Concept
broader: juridiction judiciaire
definition: Tribunal de police, tribunal correctionnel et cour d'assises. Les juridictions pénales jugent les personnes physiques ou morales soupçonnées d'avoir commis une infraction (contravention, délit ou crime)
in scheme: FINANCES PUBLIQUES
in scheme: Droit et Justice
in scheme: Juridiction
in scheme: Organisation Juridictionnelle
narrower: tribunal de police
narrower: Cour d'assises
narrower: tribunal correctionnel
notation: REFIP4140

accord cadre
type: ConceptReFip
type: Concept
broader: commande publique
definition: Contrat qui permet de présélectionner un ou plusieurs opérateurs économiques en vue de conclure un contrat établissant tout ou partie des règles relatives aux commandes à passer au cours d'une période donnée.
in scheme: FINANCES PUBLIQUES
in scheme: Commande publique
in scheme: Gestion Publique
notation: REFIP4141

Conseil national des barreaux
type: ConceptReFip
type: Concept
broader: organisme consultatif et représentatif (non-descripteur)
definition: Etablissement d'utilité publique doté de la personnalité morale qui représente l’ensemble des avocats de France. Il a reçu de la loi des missions spécifiques qui régissent l’organisation de la profession unifier et faire évoluer les règles et usages de la profession d’avocat, organiser la formation initiale et continue des avocats, décider de l’admission des avocats étrangers, représenter la profession d’avocat en France et à l’étranger .
in scheme: FINANCES PUBLIQUES
in scheme: Organisation Structurelle de l'Etat
in scheme: Organisme Consultatif et Représentatif
in scheme: Administration de L'Etat
notation: REFIP4142

crédit d'impôt pour emploi de salariés réservistes (supprimé)
type: ConceptReFip
type: Concept
broader: ZZ
in scheme: FINANCES PUBLIQUES
notation: REFIP4144

transfert du recouvrement
type: ConceptReFip
type: Concept
broader: recouvrement
definition: Transfert des missions de recouvrement d'une structure, d'un service à un autre.
in scheme: FINANCES PUBLIQUES
in scheme: Recouvrement
in scheme: Fiscalité
notation: REFIP4145

Cour d'assises
type: ConceptReFip
type: Concept
broader: juridiction pénale
definition: Juridiction compétente pour juger les personnes accusées d'avoir commis un crime.
in scheme: FINANCES PUBLIQUES
in scheme: Droit et Justice
in scheme: Juridiction
in scheme: Organisation Juridictionnelle
notation: REFIP4146

prélèvement à l'échéance
type: ConceptReFip
type: Concept
broader: paiement de l'impôt
definition: Paiement de l'impôt aux dates prévues avec un report de paiement de 10 jours.
in scheme: FINANCES PUBLIQUES
in scheme: Recouvrement
in scheme: Fiscalité
notation: REFIP4148

personne à charge
type: ConceptReFip
type: Concept
broader: foyer fiscal
definition: Personne, autre que le contribuable et son conjoint, rattachée au foyer fiscal de droit ou par voie de rattachement.
in scheme: FINANCES PUBLIQUES
in scheme: Champ d'Application
in scheme: Fiscalité
notation: REFIP4149

commissaire aux comptes
type: ConceptReFip
type: Concept
broader: profession juridique (non-descripteur)
definition: Personne physique ou morale exerçant une activité réglementée consistant à contrôler très strictement la régularité, la sincérité, et la fidélité des comptes sociaux des sociétés par actions et de certains autres groupements ou entités.
in scheme: FINANCES PUBLIQUES
in scheme: Profession Juridique
in scheme: Droit et Justice
in scheme: Organisation Juridictionnelle
notation: REFIP415

télédéclaration
type: ConceptReFip
type: Concept
alternative label: déclaration sur internet
broader: refip-REFIP804
definition: Déclaration souscrite sur internet.
in scheme: FINANCES PUBLIQUES
in scheme: Documentation Fiscale
in scheme: Fiscalité
notation: REFIP4151
related: téléprocédure

assignation
type: ConceptReFip
type: Concept
alternative label: assignation à comparaître
alternative label: citation à comparaître
broader: procédure civile
definition: Acte de procédure adressé par le demandeur au défendeur par l'intermédiaire d'un huissier de justice pour l'inviter à comparaître devant une juridiction de l'ordre judiciaire.
in scheme: FINANCES PUBLIQUES
in scheme: Procédure Civile
in scheme: Droit et Justice
in scheme: Procédure
notation: REFIP4152

enquête mystère
type: ConceptReFip
type: Concept
alternative label: appel mystère
alternative label: courriel mystère
alternative label: visite mystère
broader: enquête
definition: Test réalisé par un enquêteur (par appel téléphonique, visite sur place, courrier ou courriel) procédant de façon anonyme en agissant comme un usager ordinaire et fondant son évaluation sur des éléments factuels.
in scheme: FINANCES PUBLIQUES
in scheme: Missions Transverses des Finances publiques
in scheme: Qualité de service
notation: REFIP4153
scope note: Référentiel MARIANNE

syndicat mixte
type: ConceptReFip
type: Concept
broader: refip-REFIP821
definition: Etablissement public qui s’apparente aux autres formes de regroupement intercommunal mais il n’en partage pas forcément la nature administrative. Il existe deux catégories de syndicat mixte, devant comprendre au moins une collectivité territoriale ou un groupement de collectivités : - Syndicats mixtes fermés, associant uniquement des communes et des EPCI - Syndicats mixtes ouverts, associant des collectivités territoriales, des EPCI (à fiscalité propre ou non) et d’autres personnes morales de droit public (institutions d’utilité commune interrégionales, institutions interdépartementales, des chambres de commerce et d’industrie, d’agriculture, de métiers).
in scheme: FINANCES PUBLIQUES
in scheme: Organisation Territoriale
in scheme: Structures Territoriales
in scheme: Administration de L'Etat
narrower: Pôle métropolitain
notation: REFIP4154

patrimoine affecté
type: ConceptReFip
type: Concept
alternative label: patrimoine d'affectation
alternative label: patrimoine professionnel
broader: patrimoine
definition: Éléments de son patrimoine qu’un entrepreneur, ayant constitué une entreprise à responsabilité limitée (EURL), affecte à l’usage de son activité et qui sera seul engagé pour garantir cette activité. Il est distinct de son patrimoine personnel et il est le gage général de ses créanciers professionnels. Ainsi, en cas de difficultés inhérentes à l’exercice de son activité professionnelle, les créanciers ne pourront saisir que les biens, droits ou sûretés compris dans le patrimoine affecté. Le patrimoine affecté est composé de tous les biens, droits, obligations ou sûretés dont l’entrepreneur individuel est propriétaire et qui sont nécessaires à l’exercice de son activité.
in scheme: FINANCES PUBLIQUES
in scheme: Droit et Justice
in scheme: Divisions du Droit
in scheme: Droit Privé
notation: REFIP4155

préavis de grève
type: ConceptReFip
type: Concept
broader: grève
definition: Délai entre la décision de faire grève et la cessation du travail. Dans le secteur privé, la jurisprudence exige simplement que les revendications professionnelles sur lesquelles porte la grève soient connues de l'employeur lorsque l'arrêt de travail débute. En dehors de cette condition, aucun préavis formel n'est exigé. Dans la fonction publique, les établissements publics et les entreprises privées qui gèrent un service public, un préavis de grève doit être établi par une organisation syndicale représentative et être adressé à la direction dans le délai prévu par la loi avant le début de la grève.
in scheme: FINANCES PUBLIQUES
in scheme: Entreprises
in scheme: Travail
in scheme: 212619
notation: REFIP4156

condamnation
type: ConceptReFip
type: Concept
broader: décision de justice
definition: Décision prononcée par une autorité ayant pouvoir de juridiction et imposant à un individu une sanction à raison des agissements qui lui sont imputés.
in scheme: FINANCES PUBLIQUES
in scheme: Principes Généraux
in scheme: Droit et Justice
in scheme: Procédure
narrower: condamnation solidaire
narrower: condamnation pénale
narrower: condamnation pécuniaire
notation: REFIP4157

inflation
type: ConceptReFip
type: Concept
broader: économie générale (non-descripteur)
definition: Perte du pouvoir d'achat de la monnaie qui se traduit par une augmentation générale et durable des prix.
in scheme: FINANCES PUBLIQUES
in scheme: Questions Economiques
in scheme: Economie générale
notation: REFIP4159

Guinée équatoriale
type: ConceptReFip
type: Concept
alternative label: République de Guinée équatoriale
broader: Afrique
definition: Pays
in scheme: FINANCES PUBLIQUES
in scheme: Géographie
in scheme: Afrique
notation: REFIP416

administrateur provisoire
type: ConceptReFip
type: Concept
broader: administrateur de société
definition: Mandataire de justice pouvant être désigné en cas de difficultés graves empêchant le fonctionnement normal de la société (dysfonctionnement des organes sociaux, conflit entre associés, etc.) et menaçant celle-ci d’un péril imminent. Sa mission consiste à gérer de façon temporaire les affaires sociales. Il est désigné par le Juge des référés, dont l’ordonnance définit sa mission.
in scheme: FINANCES PUBLIQUES
in scheme: Gestion de l'Entreprise
in scheme: Entreprises
in scheme: Vie et Gestion de l'entreprise
notation: REFIP4160

brigade dossiers à fort enjeu
type: ConceptReFip
type: Concept
alternative label: BDFE
broader: direction départementale des finances publiques
definition: Service de la direction générale des finances publiques à compétence départementale en charge du contrôle des dossiers à fort enjeu.
in scheme: FINANCES PUBLIQUES
in scheme: Organisation Structurelle de l'Etat
in scheme: Ministère
in scheme: Administration de L'Etat
notation: REFIP4162

société anonyme
type: ConceptReFip
type: Concept
alternative label: SA
broader: société de capitaux
definition: Forme sociétale destinée au fonctionnement d'entreprises importantes nécessitant des moyens financiers détenus par un grand nombre d'investisseurs, les actionnaires, qui ne supportent les pertes qu'à concurrence de leurs apports. Elle est gérée, soit, par un conseil d'associés élus réunis en Conseil d'administration présidé par un Président, soit par un Directoire qui exerce ses fonctions sous le contrôle d'un Conseil de surveillance.
in scheme: FINANCES PUBLIQUES
in scheme: Société
in scheme: Entreprises
in scheme: Forme juridique
narrower: société anonyme de crédit immobilier
narrower: société publique locale
narrower: société d'économie mixte
narrower: refip-REFIP6815
notation: REFIP4163

cabinet ministériel
type: ConceptReFip
type: Concept
broader: ministère
definition: Organisme restreint, formé de collaborateurs personnels choisis par le ministre, ayant pour mission de le conseiller et de l’assister dans la réalisation de l’ensemble de ses missions.
in scheme: FINANCES PUBLIQUES
in scheme: Organisation Structurelle de l'Etat
in scheme: Ministère
in scheme: Administration de L'Etat
notation: REFIP4164

groupement d'intérêt économique
type: ConceptReFip
type: Concept
alternative label: GIE
broader: forme juridique
definition: Groupement de deux ou plusieurs personnes physiques ou morales pour une durée déterminée. Le but du groupement est de faciliter ou de développer l'activité économique de ses membres, d'améliorer ou d'accroître les résultats de cette activité. Il n'est pas de réaliser des bénéfices pour lui-même. Son activité doit se rattacher à l'activité économique de ses membres et ne peut avoir qu'un caractère auxiliaire par rapport à celle-ci.
in scheme: FINANCES PUBLIQUES
in scheme: Entreprises
in scheme: Forme juridique
in scheme: Groupement d'Intérêt Economique
narrower: refip-REFIP6656
notation: REFIP4165

crédit budgétaire
type: ConceptReFip
type: Concept
broader: exécution du budget
definition: Dotation destinée à couvrir la dépense annuelle correspondant à l’exécution d’une dépense ordinaire ou d'une dépense d'investissement.
in scheme: FINANCES PUBLIQUES
in scheme: Exécution du budget
in scheme: Budget
narrower: titre de dépense
notation: REFIP4166

autorisation de programme
type: ConceptReFip
type: Concept
broader: exécution du budget
definition: Limite supérieure des dépenses qui peuvent être engagées pour l'exécution des investissements.
in scheme: FINANCES PUBLIQUES
in scheme: Exécution du budget
in scheme: Budget
narrower: subdélégation d'autorisation de programme globale
narrower: délégation d'autorisation de programme
narrower: délégation d'autorisation de programme globale
notation: REFIP4167

application IHT2 (supprimé)
type: ConceptReFip
type: Concept
broader: ZZ
in scheme: FINANCES PUBLIQUES
notation: REFIP4169

textile
type: ConceptReFip
type: Concept
alternative label: confection
alternative label: habillement
alternative label: industrie de l'habillement
alternative label: industrie textile
alternative label: vêtement
broader: industrie
definition: Matière filamenteuse susceptible d'être transformée en fil puis en tissu.
in scheme: FINANCES PUBLIQUES
in scheme: Branche d'activité
in scheme: Questions Economiques
in scheme: Industrie
notation: REFIP4172

indemnité de remploi
type: ConceptReFip
type: Concept
broader: expropriation pour cause d'utilité publique
definition: Indemnité, en cas d'expropriation pour cause d'utilité, calculée compte tenu des frais de tous ordres que devra supporter l’exproprié pour acquérir des biens de même nature.
in scheme: FINANCES PUBLIQUES
in scheme: Domaine
in scheme: Gestion Publique
notation: REFIP4173

tiers de confiance
type: ConceptReFip
type: Concept
broader: fiscalité
definition: Dispositif fiscal permettant à un expert-comptable, avocat ou notaire de passer un contrat avec un contribuable aux termes duquel il s’engage à conserver pour le compte de celui-ci l’ensemble des justificatifs lui ayant permis d’obtenir une réduction d’impôt, un crédit d’impôt ou une déduction du revenu global.
in scheme: FINANCES PUBLIQUES
in scheme: Fiscalité - Autres notions
in scheme: Fiscalité
notation: REFIP4174

codification codique
type: ConceptReFip
type: Concept
alternative label: CODIQUE
broader: codification
definition: Identification par code, par numéro identifiant au sein de la DGFiP.
in scheme: FINANCES PUBLIQUES
in scheme: Documentation
in scheme: Communication Documentation Informatique
notation: REFIP4175

Commission nationale des comptes de campagnes et des financements politiques (supprimé)
type: ConceptReFip
type: Concept
broader: ZZ
in scheme: FINANCES PUBLIQUES
notation: REFIP4177

dévolution successorale
type: ConceptReFip
type: Concept
broader: dévolution
definition: Opération qui consiste à déterminer les personnes que la loi appelle à la succession et l'ordre dans le quel elles devront se présenter. Il s'agit de l'application des règles dites de la dévolution successorale légale en l'absence de testament.
in scheme: FINANCES PUBLIQUES
in scheme: Droit et Justice
in scheme: Divisions du Droit
in scheme: Droit Privé
notation: REFIP4178

application TPV
type: ConceptReFip
type: Concept
alternative label: terminal paiement virtuel
broader: applications fiscales (non-descripteur)
definition: Application de prise de règlement des amendes non télépayables mise à disposition des agents des finances publiques.
in scheme: FINANCES PUBLIQUES
in scheme: Applications Informatiques
in scheme: Applications fiscales
notation: REFIP4180

coffre-fort
type: ConceptReFip
type: Concept
broader: équipement de sécurité
definition: Meuble sécurisé servant à protéger des objets ou des valeurs.
in scheme: FINANCES PUBLIQUES
in scheme: Lieu de Travail
in scheme: Entreprises
in scheme: Travail
notation: REFIP4182

garantie conventionnelle de paiement
type: ConceptReFip
type: Concept
broader: garanties
definition: Garantie de paiement des sommes dues lorsque le montant du marché dépasse un certain seuil par le maître de l’ouvrage (le client) qui conclut un marché de travaux privés à l'entrepreneur. Deux types de garanties sont prévus : le versement direct ou le cautionnement solidaire.
in scheme: FINANCES PUBLIQUES
in scheme: Droit et Justice
in scheme: Divisions du Droit
in scheme: Droit Privé
notation: REFIP4184

forclusion
type: ConceptReFip
type: Concept
broader: principes généraux (non-descripteur)
definition: Perte par expiration d'un délai, de la faculté de faire valoir un droit.
in scheme: FINANCES PUBLIQUES
in scheme: Principes Généraux
in scheme: Droit et Justice
in scheme: Procédure
narrower: relevé de forclusion
notation: REFIP4185

conformité
type: ConceptReFip
type: Concept
alternative label: non-conformité
broader: droit général (non-descripteur)
definition: Concordance d'un écrit ou d'un bien avec les prescriptions légales ou réglementaires.
in scheme: FINANCES PUBLIQUES
in scheme: Droit et Justice
in scheme: Droit Général
notation: REFIP4186

Institut national de la statistique et des études économiques
type: ConceptReFip
type: Concept
alternative label: INSEE
broader: Ministère de l'Economie et des Finances
definition: Direction générale du ministère de l'Economie et des Finances, l' INSEE collecte, produit, analyse et diffuse des informations sur l'économie et la société françaises. Elle est également chargée de coordonner les méthodes, les moyens et les travaux statistiques des administrations publiques et d’organismes privés. Ces informations intéressent les pouvoirs publics, les administrations, les entreprises, les chercheurs, les médias, les enseignants, les étudiants et les particuliers. Elles leur permettent d'enrichir leurs connaissances, d'effectuer des études, de faire des prévisions et de prendre des décisions. Elle assure la coordination du système statistique public français et participe à l’harmonisation statistique européenne et internationale.
in scheme: FINANCES PUBLIQUES
in scheme: Organisation Structurelle de l'Etat
in scheme: Ministère
in scheme: Administration de L'Etat
notation: REFIP4187

calendrier
type: ConceptReFip
type: Concept
broader: mots outils (liste additive)
definition: Tableau des jours d'une année, avec l'indication des semaines et des mois, comportant en général quelques renseignements accessoires.
in scheme: FINANCES PUBLIQUES
in scheme: Mots Outils
notation: REFIP4188

Comité du contentieux fiscal douanier et des changes
type: ConceptReFip
type: Concept
alternative label: CCFDC
broader: Ministère de l'Economie et des Finances
definition: Instance accordant des garanties de procédure aux contribuables en matière fiscale et douanière. Son rôle consiste à émettre un avis sur les transactions, remises et modérations excédant les limites de compétence des services déconcentrés de la Direction Générale des Finances Publiques et de la Direction Générale des Douanes et Droits Indirects. Le CCFDC est amené à se prononcer sur des dossiers dont les enjeux financiers sont élevés et nécessitant le plus souvent une grande expertise technique. Il est composé, sous la présidence d'un conseiller d'État, de conseillers d'État, de conseillers à la Cour de cassation et de conseillers maîtres à la Cour des comptes.
in scheme: FINANCES PUBLIQUES
in scheme: Organisation Structurelle de l'Etat
in scheme: Ministère
in scheme: Administration de L'Etat
notation: REFIP4189

vente à emporter
type: ConceptReFip
type: Concept
broader: vente
definition: Type de vente dans laquelle l'acheteur doit retirer ses marchandises immédiatement après les avoir achetées dans le point de vente, et par ses propres moyens.
in scheme: FINANCES PUBLIQUES
in scheme: Droit et Justice
in scheme: Divisions du Droit
in scheme: Droit Privé
notation: REFIP419

contribuable particulier
type: ConceptReFip
type: Concept
broader: contribuable
definition: Contribuable personne physique sans activité commerciale.
in scheme: FINANCES PUBLIQUES
in scheme: Champ d'Application
in scheme: Fiscalité
notation: REFIP4190

droit successoral
type: ConceptReFip
type: Concept
alternative label: droit des successions
broader: droit privé
definition: Ensemble des règles juridiques et fiscales qui régissent la transmission du patrimoine d'une personne lors de son décès. C'est une branche du droit civil.
in scheme: FINANCES PUBLIQUES
in scheme: Droit et Justice
in scheme: Divisions du Droit
in scheme: Droit Privé
narrower: dévolution
narrower: conjoint survivant
narrower: certificat de propriété
narrower: porte-fort
narrower: héritier
narrower: testament
narrower: acte de notoriété
narrower: certificat d'hérédité
narrower: refip-REFIP705
narrower: refip-REFIP752
notation: REFIP4191

référé précontractuel
type: ConceptReFip
type: Concept
broader: référé administratif
definition: Procédure permettant de saisir le président du tribunal administratif en cas de violation des obligations de publicité et de mise en concurrence applicables à la passation des marchés publics et des délégations de service public.
in scheme: FINANCES PUBLIQUES
in scheme: Procédure Administrative
in scheme: Droit et Justice
in scheme: Procédure
notation: REFIP4192

arrondi
type: ConceptReFip
type: Concept
alternative label: règle d'arrondi
alternative label: règle d'arrondissement
broader: comptabilisation
definition: Valeur approchée d'un nombre. Il convient de comptabiliser les différences dues aux arrondis pour l'équilibre des écritures comptables.
in scheme: FINANCES PUBLIQUES
in scheme: Procédures et Techniques Comptables
in scheme: Comptabilité
notation: REFIP4193

contrôle de l'opportunité
type: ConceptReFip
type: Concept
broader: contrôle administratif
definition: Contrôle qui porte sur la pertinence de la décision prise et sur son fondement. En raison du principe de libre administration des collectivités territoriales et de certains établissements publics, le contrôle administratif ne porte pas sur l'opportunité des actes pris par ces collectivités mais sur leur conformité à la loi.
in scheme: FINANCES PUBLIQUES
in scheme: Droit et Justice
in scheme: Divisions du Droit
in scheme: Droit Public
notation: REFIP4194

Journal officiel de l'Union européenne
type: ConceptReFip
type: Concept
alternative label: JOUE
broader: Journal officiel
definition: Publication périodique publiée chaque jour ouvrable dans toutes les langues officielles de l'Union européenne.
in scheme: FINANCES PUBLIQUES
in scheme: Documentation
in scheme: Communication Documentation Informatique
notation: REFIP4195

application GESTPART
type: ConceptReFip
type: Concept
alternative label: GESTPART
broader: applications fiscales (non-descripteur)
definition: Application permettant le traitement des déclarations en ligne d'impôt sur les revenus ainsi que les déclarations en anomalie de taxation.
in scheme: FINANCES PUBLIQUES
in scheme: Applications Informatiques
in scheme: Applications fiscales
notation: REFIP4196

Caisse de la dette publique
type: ConceptReFip
type: Concept
alternative label: CDP
broader: établissement public à caractère administratif
definition: Etablissement public à caractère administratif ayant pour objet de soutenir sur les marchés financiers la qualité de la signature de l’État. Il peut à cette fin acheter des titres émis par l’État, garantis par lui ou émis par des établissements ou des entreprises publics, en vue de leur conservation, leur annulation ou leur cession. Il peut notamment, se voir attribuer tout titre de dette négociable émis par l’État dans le cadre de l’autorisation donnée annuellement au ministre chargé de l’économie et il est autorisée à prêter et à vendre ces titres.
in scheme: FINANCES PUBLIQUES
in scheme: Organisation Structurelle de l'Etat
in scheme: Opérateur de l'Etat
in scheme: Administration de L'Etat
notation: REFIP4197

avis d'attribution de marché public
type: ConceptReFip
type: Concept
alternative label: avis d'attribution de marché public sans publicité
broader: attribution de marché public
definition: Avis publié par la personne publique destiné à fournir des informations sur le marché qui a été attribué.
in scheme: FINANCES PUBLIQUES
in scheme: Commande publique
in scheme: Gestion Publique
notation: REFIP4198

plan de facturation
type: ConceptReFip
type: Concept
broader: convention de règlement
definition: Document permettant une gestion programmée des paiements échelonnés à l'initiative de l'administration afin d'améliorer le traitement interne des factures.
in scheme: FINANCES PUBLIQUES
in scheme: Dépenses publiques
in scheme: Gestion Publique
notation: REFIP4199

application CADRAN
type: ConceptReFip
type: Concept
broader: applications gestion publique (non-descripteur)
definition: Application qui permet la consultation des mouvements bancaires imputés quotidiennement sur les relevés de comptes Banque de France des comptables de la DGFiP.
in scheme: FINANCES PUBLIQUES
in scheme: Applications Informatiques
in scheme: Applications gestion publique
notation: REFIP420

soumissionnaire des marchés publics
type: ConceptReFip
type: Concept
broader: concours à un marché public
definition: Opérateur économique qui présente une offre dans le cadre d'une procédure de passation d'un marché public.
in scheme: FINANCES PUBLIQUES
in scheme: Commande publique
in scheme: Gestion Publique
notation: REFIP4200

Commission d'accès aux documents administratifs
type: ConceptReFip
type: Concept
alternative label: CADA
broader: autorité administrative indépendante
definition: Autorité administrative indépendante et consultative qui reconnaît à toute personne le droit d'obtenir communication des documents détenus dans le cadre de sa mission de service public par une administration, quels que soient leur forme ou leur support.
in scheme: FINANCES PUBLIQUES
in scheme: Organisation Structurelle de l'Etat
in scheme: Autorité Administrative
in scheme: Administration de L'Etat
notation: REFIP4201

certificat de non contestation
type: ConceptReFip
type: Concept
broader: documentation fiscale (non-descripteur)
definition: Document délivré par le greffe ou établi par l'huissier de justice ayant procédé à une saisie, en vue d'une vente forcée demandée par le créancier, et attestant qu'aucune contestation n'a été formée dans le mois suivant la dénonciation de la saisie ou, le cas échéant, d'un jugement rejetant la contestation soulevée par le débiteur.
in scheme: FINANCES PUBLIQUES
in scheme: Documentation Fiscale
in scheme: Fiscalité
notation: REFIP4202

Irlande
type: ConceptReFip
type: Concept
broader: Europe
definition: Pays
in scheme: FINANCES PUBLIQUES
in scheme: Géographie
in scheme: Europe
notation: REFIP4204

plan de comptes de l'Etat palier
type: ConceptReFip
type: Concept
alternative label: PCE palier
alternative label: plan comptable de l'Etat palier
alternative label: plan de comptes palier
broader: CHORUS (non-descripteur)
definition: Plan comptable de l’État, palier 2006, institué pour la mise en place de la LOLF.
in scheme: FINANCES PUBLIQUES
in scheme: Comptabilité publique
in scheme: Comptabilité
notation: REFIP4205

bonification indiciaire
type: ConceptReFip
type: Concept
broader: refip-REFIP6879
definition: Points d’indice pouvant être attribués pour des fonctions particulières ou une affectation particulière.
in scheme: FINANCES PUBLIQUES
in scheme: Gestion des ressources humaines
in scheme: Statut du fonctionnaire
in scheme: Fonction Publique et Gestion des Ressources Humaines
notation: REFIP4206

taxe sur les achats de viande
type: ConceptReFip
type: Concept
broader: refip-REFIP934
definition: Taxe due par toute personne qui réalise des ventes au détail de viandes et de certains produits, instituée à compter du 1er janvier 1997 afin d’assurer le financement du service public de l’équarrissage. La taxe sur les achats de viande également dénommée taxe d’équarrissage, a été supprimée par la loi de finances pour 2004.
in scheme: FINANCES PUBLIQUES
in scheme: Fiscalité
in scheme: Impôt
notation: REFIP4207
scope note: Supprimée par la loi de finances pour 2004

télécommunication
type: ConceptReFip
type: Concept
broader: communication
definition: Transmission, émission ou réception d'informations par fil, radioélectricité, optique, ou d'autres systèmes électromagnétiques.
in scheme: FINANCES PUBLIQUES
in scheme: Communication
in scheme: Communication Documentation Informatique
narrower: téléphonie
narrower: telétransmission
narrower: refip-REFIP7088
narrower: refip-REFIP739
notation: REFIP4208

réserve pour aléas de gestion
type: ConceptReFip
type: Concept
broader: exécution du budget
definition: Réserve placée sous la responsabilité directe du responsable de programme, qui peut la réduire ou l'accroître en cours d'année en fonction de son appréciation des risques et des aléas de gestion du programme. En cas d'événement imprévu nécessitant la mobilisation de crédits non programmés, le responsable de programme peut utiliser les crédits mis en réserve au niveau du programme à titre de précaution.
in scheme: FINANCES PUBLIQUES
in scheme: Exécution du budget
in scheme: Budget
notation: REFIP4209

administration fiscale
type: ConceptReFip
type: Concept
broader: administration centrale des finances publiques
definition: Appellation générique qui qualifie l'ensemble des services de l'État qui œuvre à la fois à la détermination de l'assiette des différents impôts mais aussi à leurs recouvrements puis, le cas échéant, à leurs contrôles.
in scheme: FINANCES PUBLIQUES
in scheme: Organisation Structurelle de l'Etat
in scheme: Ministère
in scheme: Administration de L'Etat
notation: REFIP421

Institut de la gestion publique et du développement économique
type: ConceptReFip
type: Concept
alternative label: IGPDE
broader: secrétariat général des ministères économiques et financiers
definition: Service à compétence nationale, rattaché au secrétariat général commun aux ministères économiques et financiers. Il assure des actions de formation permanente au bénéfice prioritaire mais pas exclusif des agents des ministères économiques et financiers ; accompagne la modernisation de l’État, les réformes des administrations ou la mise en œuvre des politiques publiques menées par les ministères économiques et financiers ; déploie des activités de recherche et de diffusion des savoirs en matière de gestion publique et d'économie.
in scheme: FINANCES PUBLIQUES
in scheme: Organisation Structurelle de l'Etat
in scheme: Ministère
in scheme: Administration de L'Etat
notation: REFIP4210

charges financières de l'Etat
type: ConceptReFip
type: Concept
broader: dépenses de l'Etat
definition: Dépenses de l'Etat liées notamment aux intérêts d'emprunt, aux frais financiers, aux pertes de change...
in scheme: FINANCES PUBLIQUES
in scheme: Dépenses publiques
in scheme: Gestion Publique
notation: REFIP4211

revendication d'objets saisis
type: ConceptReFip
type: Concept
broader: contentieux du recouvrement
definition: Action par laquelle un tiers à la saisie tend à faire reconnaître son droit de propriété sur des meubles placés sous main de justice.
in scheme: FINANCES PUBLIQUES
in scheme: Recouvrement
in scheme: Fiscalité
notation: REFIP4212

responsabilité solidaire
type: ConceptReFip
type: Concept
broader: droit des obligations et contrats (non-descripteur)
definition: Responsabilité qui prévoit que le créancier d’une somme due par plus d’un débiteur peut réclamer la totalité de sa créance à un seul débiteur. Ce type de responsabilité doit, sauf dans les cas prévus par la loi, être clairement indiqué dans le contrat.
in scheme: FINANCES PUBLIQUES
in scheme: Droit et Justice
in scheme: Divisions du Droit
in scheme: Droit Privé
narrower: obligation solidaire
notation: REFIP4213

pouvoir adjudicateur
type: ConceptReFip
type: Concept
broader: personne responsable du marché
definition: Notion utilisée pour désigner l'acheteur public.
in scheme: FINANCES PUBLIQUES
in scheme: Commande publique
in scheme: Gestion Publique
notation: REFIP4216

promesse de vente
type: ConceptReFip
type: Concept
alternative label: compromis de vente
alternative label: promesse synallagmatique de vente
alternative label: promesse unilatérale de vente
broader: vente
definition: Document signé lorsque le vendeur et l'acquéreur sont parvenus à un accord sur la vente,pouvant prendre la forme soit d'une promesse unilatérale de vente, soit d'un compromis de vente. Cet acte fixe d'ores et déjà les conditions précises dans lesquelles la vente s'effectuera. Il est donc nécessaire de faire attention aux engagements pris lors de sa réalisation.
in scheme: FINANCES PUBLIQUES
in scheme: Droit et Justice
in scheme: Divisions du Droit
in scheme: Droit Privé
notation: REFIP4217

date d'émission
type: ConceptReFip
type: Concept
broader: mots outils (liste additive)
definition: Date à laquelle le document est émis.
in scheme: FINANCES PUBLIQUES
in scheme: Mots Outils
notation: REFIP4219

mobilier
type: ConceptReFip
type: Concept
broader: aménagement du lieu de travail
definition: Objet ou dispositif installé dans l'espace public, professionnel ou privé.
in scheme: FINANCES PUBLIQUES
in scheme: Lieu de Travail
in scheme: Entreprises
in scheme: Travail
narrower: bureau
notation: REFIP422
related: bien d'équipement

crédit limitatif
type: ConceptReFip
type: Concept
broader: exécution du budget
definition: Montant plafonné d'une somme inscrite dans le projet de loi de finances que les administrations ne peuvent pas dépasser durant la période d'exécution du budget, telles les dépenses de personnel ou de matériel.
in scheme: FINANCES PUBLIQUES
in scheme: Exécution du budget
in scheme: Budget
notation: REFIP4220

contrôle inopiné des entreprises
type: ConceptReFip
type: Concept
alternative label: vérification inopinée
broader: vérification de comptabilité
definition: Dans le cadre des vérifications de comptabilité des entreprises, les agents envoient l’avis de vérification environ 3 semaines avant la date prévue pour la première intervention. En cas de contrôle inopiné tendant à la constatation matérielle des éléments physiques de l’exploitation ou de l’existence et de l’état des documents comptables, l’avis de vérification est remis au début des opérations de constatations matérielles.
in scheme: FINANCES PUBLIQUES
in scheme: Droit de Contrôle de l'Administration
in scheme: Fiscalité
notation: REFIP4223

pouvoir réglementaire
type: ConceptReFip
type: Concept
broader: droit constitutionnel
definition: Pouvoir appartenant à l'État et aux collectivités territoriales de prendre des actes à portée générale et impersonnelle, par opposition au pouvoir législatif du Parlement,
in scheme: FINANCES PUBLIQUES
in scheme: Droit et Justice
in scheme: Divisions du Droit
in scheme: Droit Public
notation: REFIP4224

manquement délibéré
type: ConceptReFip
type: Concept
alternative label: mauvaise foi
broader: majoration fiscale
definition: Manquement (inexactitude ou omission de déclaration) à caractère intentionnel et qui entraîne par l'administration fiscale l'application d'une majoration de 40% (article 1729 a du CGI). Remplace l'ancienne terminologie de "mauvaise foi". La charge du manquement délibéré incombe à l'administration fiscale.
in scheme: FINANCES PUBLIQUES
in scheme: Droit de Reprise de l'Administration
in scheme: Fiscalité
notation: REFIP4225
scope note: Fiscalité

responsabilité civile
type: ConceptReFip
type: Concept
broader: droit civil
definition: Obligation de réparer le préjudice résultant soit de l'inexécution d'un contrat (responsabilité contractuelle), soit de la violation du devoir général de ne causer aucun dommage à autrui (responsabilité délictuelle).
in scheme: FINANCES PUBLIQUES
in scheme: Droit et Justice
in scheme: Divisions du Droit
in scheme: Droit Privé
narrower: réparation du préjudice
narrower: responsabilité personnelle
narrower: préjudice
narrower: responsabilité contractuelle
notation: REFIP4226

vectorisation
type: ConceptReFip
type: Concept
broader: topographie
definition: Technique d'informatisation du plan cadastral déterminée par le biais de conventions de vectorisation avec les partenaires de la DGFiP.
in scheme: FINANCES PUBLIQUES
in scheme: Cadastre
in scheme: Fiscalité
notation: REFIP4228

débit d'office
type: ConceptReFip
type: Concept
broader: procédures et techniques comptables (non-descripteur)
definition: Processus comptable particulier permettant de régler certaines dépenses de manière automatique.
in scheme: FINANCES PUBLIQUES
in scheme: Procédures et Techniques Comptables
in scheme: Comptabilité
notation: REFIP4229

réponse ministérielle
type: ConceptReFip
type: Concept
broader: droit constitutionnel
definition: Écrit dans lequel un ministre saisi pour une question écrite, donne son avis ou son interprétation sur le point qui lui est soumis. Il n'a aucune force obligatoire mais simplement indicative. N’est pas une source de droit au même titre qu’une Loi, qu’un décret ou qu’une jurisprudence.
in scheme: FINANCES PUBLIQUES
in scheme: Droit et Justice
in scheme: Divisions du Droit
in scheme: Droit Public
notation: REFIP423

responsabilité de l'Etat
type: ConceptReFip
type: Concept
alternative label: responsabilité de l'administration
broader: droit administratif
definition: Principe auquel est soumis l'administration, et qui l’oblige à réparer les dommages causés par son fait. Ce principe peut prendre plusieurs formes. La responsabilité contractuelle concerne les relations de l’administration et des personnes signataires d’un contrat avec elle. Si l’administration, ou son cocontractant, n’exécute pas les obligations prévues au contrat, l’autre partie peut saisir le juge afin d’obtenir réparation à ces manquements contractuels. Dans les autres cas, la responsabilité est dite « extra-contractuelle », car elle ne trouve pas son fondement dans un contrat.
in scheme: FINANCES PUBLIQUES
in scheme: Droit et Justice
in scheme: Divisions du Droit
in scheme: Droit Public
narrower: responsabilité sans faute
notation: REFIP4230

alarme
type: ConceptReFip
type: Concept
alternative label: système d'alarme
broader: équipement de sécurité
definition: Signal avertissant d'un danger.
in scheme: FINANCES PUBLIQUES
in scheme: Lieu de Travail
in scheme: Entreprises
in scheme: Travail
notation: REFIP4231

indemnités (non-descripteur)
type: ConceptReFip
type: Concept
broader: aide publique
definition: Terme ne servant pas à l'indexation.
in scheme: FINANCES PUBLIQUES
in scheme: Dépenses publiques
in scheme: Gestion Publique
narrower: indemnité d'expropriation
narrower: refip-REFIP858
notation: REFIP4232
note: Étiquette de Nœud

déclaration des frais généraux
type: ConceptReFip
type: Concept
broader: liasse fiscale
definition: Formulaire n° 2067-SD servant à déclarer les frais généraux (notamment les rémunérations des personnes les mieux rémunérées au sein de l'entreprise, leurs dépenses de voyage et de déplacement, les dépenses de réception ou de cadeaux) des entreprises soumises à l'impôt sur le revenu dans la catégorie BIC ou à l'impôt sur les sociétés.
in scheme: FINANCES PUBLIQUES
in scheme: Documentation Fiscale
in scheme: Fiscalité
notation: REFIP4233

Var
type: ConceptReFip
type: Concept
broader: Provence-Alpes-Côte d'Azur
definition: Département français
in scheme: FINANCES PUBLIQUES
in scheme: Géographie
in scheme: Europe
notation: REFIP4234

les Bermudes
type: ConceptReFip
type: Concept
alternative label: Bermudes
broader: Caraïbes
definition: Territoire d'outre-mer de la Grande Bretagne
in scheme: FINANCES PUBLIQUES
in scheme: Géographie
in scheme: Amérique
notation: REFIP4235
related: Grande-Bretagne

numéro individuel d'identification
type: ConceptReFip
type: Concept
broader: fiscalité
definition: Identifiant attribué a tout assujetti redevable de la TVA et destiné à garantir la sécurité des échanges entre les assujettis au sein de la Communauté européenne.
in scheme: FINANCES PUBLIQUES
in scheme: Fiscalité - Autres notions
in scheme: Fiscalité
notation: REFIP4236

Paraguay
type: ConceptReFip
type: Concept
broader: Amérique
definition: Pays
in scheme: FINANCES PUBLIQUES
in scheme: Géographie
in scheme: Amérique
notation: REFIP4237

débit de boissons
type: ConceptReFip
type: Concept
broader: commerce de détail
definition: Établissement dans lequel sont vendues des boissons alcoolisées ou non, destinées à être consommées sur place ou emportées.
in scheme: FINANCES PUBLIQUES
in scheme: Branche d'activité
in scheme: Questions Economiques
in scheme: Commerce
narrower: licence des débits de boissons
notation: REFIP4238

mise en recouvrement
type: ConceptReFip
type: Concept
broader: recouvrement
definition: Opération par laquelle la créance acquiert un caractère certain à une date déterminée, date à partir de laquelle le comptable public est chargé de recouvrer l'impôt.
in scheme: FINANCES PUBLIQUES
in scheme: Recouvrement
in scheme: Fiscalité
notation: REFIP4239

mise au point de marché
type: ConceptReFip
type: Concept
broader: appel d'offres
definition: Technique consistant en une précision, une rectification ou une adaptation de l'offre retenue ou, plus généralement, d'une ou plusieurs pièces contractuelles du marché public, sans pour autant s'apparenter à une négociation.
in scheme: FINANCES PUBLIQUES
in scheme: Commande publique
in scheme: Gestion Publique
notation: REFIP424

contrôle de supervision
type: ConceptReFip
type: Concept
broader: contrôle interne de premier niveau
definition: Au sein d’une entité, contrôle régulier de premier niveau exercé et formalisé par l’encadrement sur les opérations des agents, contemporain ou a posteriori.
in scheme: FINANCES PUBLIQUES
in scheme: Missions Transverses des Finances publiques
in scheme: Maîtrise des risques
narrower: revue analytique
notation: REFIP4240

Fonds de compensation pour la taxe sur la valeur ajoutée
type: ConceptReFip
type: Concept
alternative label: Fonds de compensation pour la TVA
broader: fonds (non-descripteur)
definition: Dotation versée aux collectivités territoriales et à leurs groupements destinée à assurer une compensation, à un taux forfaitaire, de la charge de TVA qu’ils supportent sur leurs dépenses réelles d’investissement et qu’ils ne peuvent pas récupérer par la voie fiscale puisqu’ils ne sont pas considérés comme des assujettis pour les activités ou opérations qu’ils accomplissent en tant qu’autorités publiques.
in scheme: FINANCES PUBLIQUES
in scheme: Dépenses publiques
in scheme: Gestion Publique
notation: REFIP4241

état de synthèse
type: ConceptReFip
type: Concept
broader: documents comptables
definition: Ensemble de documents servis, lors du processus de l'enregistrement comptable, en se basant sur les pièces comptables.
in scheme: FINANCES PUBLIQUES
in scheme: Documents comptables
in scheme: Comptabilité
notation: REFIP4243

faute du cocontractant
type: ConceptReFip
type: Concept
alternative label: faute du titulaire
alternative label: résiliation pour faute
broader: exécution d'un marché public
definition: Chaque partie au marché public peut mettre en jeu sa responsabilité si elle ne respecte pas ses engagements. Le marché est alors résilié ou entaché de nullité.
in scheme: FINANCES PUBLIQUES
in scheme: Commande publique
in scheme: Gestion Publique
notation: REFIP4245
scope note: Marché public

établissement public communal
type: ConceptReFip
type: Concept
broader: refip-REFIP973
definition: Personne morale de droit public disposant d’une autonomie administrative et financière afin de remplir une mission d’intérêt général, précisément définie, sous le contrôle de la collectivité publique dont il dépend. Un établissement public communal est rattaché à une commune.
in scheme: FINANCES PUBLIQUES
in scheme: Organisation Territoriale
in scheme: Structures Territoriales
in scheme: Administration de L'Etat
narrower: Caisse des écoles
narrower: centre communal d'action sociale
narrower: office de tourisme
narrower: accueil collectif de mineurs
narrower: refip-REFIP717
notation: REFIP4246

créance certaine
type: ConceptReFip
type: Concept
alternative label: créance exigible
broader: recouvrement
definition: Créance dont on peut contestée son fondement.
in scheme: FINANCES PUBLIQUES
in scheme: Recouvrement
in scheme: Fiscalité
notation: REFIP4248

Code général des impôts
type: ConceptReFip
type: Concept
alternative label: CGI
broader: documentation juridique (non-descripteur)
definition: Ensemble des lois relatives au droit général des impôts. Il définit les revenus imposables et leur plafond, ou les cas d'exonération, ainsi que la nature et les conditions de prélèvement des impôts directs et indirects.
in scheme: FINANCES PUBLIQUES
in scheme: Droit et Justice
in scheme: Documentation Juridique
in scheme: Sources du Droit
notation: REFIP4249

tranche d'imposition
type: ConceptReFip
type: Concept
alternative label: tranche d'impôt
broader: liquidation de l'impôt
definition: Fraction de revenu imposable comprise entre une limite inférieure et une limite supérieure définies par la loi, et à laquelle s'applique un taux d'imposition pour le calcul de l'impôt sur le revenu.
in scheme: FINANCES PUBLIQUES
in scheme: Liquidation de l'Impôt
in scheme: Fiscalité
notation: REFIP425

référé administratif
type: ConceptReFip
type: Concept
broader: procédure administrative
definition: Procédure accélérée qui permet d'obtenir une décision rapide, devant le juge administratif permettant que des mesures provisoires soient prises rapidement dans des situations liées à une décision de l'administration, en particulier en cas d'urgence.
in scheme: FINANCES PUBLIQUES
in scheme: Procédure Administrative
in scheme: Droit et Justice
in scheme: Procédure
narrower: référé provision
narrower: référé liberté
narrower: référé conservatoire
narrower: référé contractuel
narrower: référé précontractuel
notation: REFIP4250

actif de succession
type: ConceptReFip
type: Concept
alternative label: actif successoral
broader: fiscalité du patrimoine
definition: Ensemble des biens immobiliers et mobiliers dont la valeur est déterminée au jour du décès.
in scheme: FINANCES PUBLIQUES
in scheme: Champ d'Application
in scheme: Fiscalité
notation: REFIP4255

impôt déductible
type: ConceptReFip
type: Concept
alternative label: impôt non déductible
broader: charge déductible
definition: En vertu de l'article 39 du CGI , le bénéfice net est établi sous déduction de toutes charges, Certains impôts viennent en déduction et d'autres ne sont pas déductibles comme l'impôt sur les sociétés.
in scheme: FINANCES PUBLIQUES
in scheme: Liquidation de l'Impôt
in scheme: Fiscalité
notation: REFIP4257

schéma directeur immobilier régional
type: ConceptReFip
type: Concept
alternative label: SDIR
alternative label: schéma directeur immobilier
broader: politique immobilière de l'Etat
definition: Outil de la politique immobilière de l'Etat dont l’objectif est d’optimiser le parc immobilier de l’État en rationalisant l’implantation des services et en offrant des conditions satisfaisantes d’accueil du public et de travail des agents. Le préfet de région assure le pilotage régional du SDIR en coordination avec les préfets de département.
in scheme: FINANCES PUBLIQUES
in scheme: Politique immobilière de l'Etat
in scheme: Gestion Publique
notation: REFIP4258

Polynésie française
type: ConceptReFip
type: Concept
broader: collectivités et territoires d'outre mer (non-descripteur)
definition: Collectivité d'outre-mer
in scheme: FINANCES PUBLIQUES
in scheme: Géographie
in scheme: Europe
notation: REFIP4259

mandataire liquidateur
type: ConceptReFip
type: Concept
alternative label: liquidateur
alternative label: liquidateur judiciaire
broader: mandataire judiciaire
definition: Personne désignée pour représenter les créanciers et défendre leurs intérêts, dans une procédure de redressement judiciaire. Il les invite à déclarer leur dû et les consulte sur les propositions de règlement émises par l'administrateur. Il s'informe auprès du chef d’entreprise de la situation réelle de l'entreprise, analyse les comptes, examine les factures et les commandes, établit et vérifie le montant exact des dettes. Il étudie les contrats de travail et assure le règlement des sommes dues aux salariés (sur avance du fonds national de garantie des salaires).
in scheme: FINANCES PUBLIQUES
in scheme: Vie de l'Entreprise
in scheme: Entreprises
in scheme: Vie et Gestion de l'entreprise
notation: REFIP426

cession de clientèle
type: ConceptReFip
type: Concept
alternative label: transfert de clientèle
broader: cession d'entreprise
definition: Transfert d'un potentiel de clients dans le cadre de rachat d'une activité. On reconnaît aux clientèles commerciales une valeur patrimoniale ce qui permet aux entrepreneurs et commerçants de la céder. Par contre, une clientèle civile est incessible en vertu du principe selon lequel la clientèle est hors commerce (article 1128 du code civil) pour un professionnel exerçant à titre libéral. Toutefois, la jurisprudence admet la transmission du cabinet libéral en reconnaissant au professionnel le droit de présenter un successeur à sa clientèle. Ce droit a une valeur patrimoniale (indemnité de droit de présentation à clientèle) qui doit faire l'objet d'une convention.
in scheme: FINANCES PUBLIQUES
in scheme: Vie de l'Entreprise
in scheme: Entreprises
in scheme: Vie et Gestion de l'entreprise
notation: REFIP4260

transports en commun
type: ConceptReFip
type: Concept
alternative label: tramway
alternative label: transports collectifs
broader: transport de personnes
definition: Transport collectif consistant à transporter plusieurs personnes ensemble sur un même trajet. Il est généralement accessible en contrepartie d'un titre de transport (billet, ticket, carte).
in scheme: FINANCES PUBLIQUES
in scheme: Branche d'activité
in scheme: Questions Economiques
in scheme: Transports
narrower: autobus
narrower: titre d'abonnement aux transports en commun
narrower: remontée mécanique
narrower: transport scolaire
narrower: refip-REFIP8
notation: REFIP4261

centre régional de pensions (obsolète)
type: ConceptReFip
type: Concept
is replaced by: centre de gestion des retraites
broader: ZZ
in scheme: FINANCES PUBLIQUES
notation: REFIP4263

Commission départementale des impôts directs et des taxes sur le chiffre d'affaires
type: ConceptReFip
type: Concept
broader: audition des contribuables
definition: Lorsque dans le cadre d'une procédure de rectification contradictoire, un désaccord subsiste entre un contribuable et l'administration, le litige peut être soumis pour avis à la commission départementale des impôts directs et des taxes sur le chiffre d'affaires (CDIDTCA).
in scheme: FINANCES PUBLIQUES
in scheme: Droit de Reprise de l'Administration
in scheme: Fiscalité
notation: REFIP4264

porte-fort
type: ConceptReFip
type: Concept
alternative label: porte fort
broader: droit successoral
definition: Promettant qui s'engage au profit d'une autre (le bénéficiaire) à ce qu'une troisième (le tiers) ratifie ou exécute un engagement, en droit des obligations. Ce contrat s'appelle une promesse de porte-fort.
in scheme: FINANCES PUBLIQUES
in scheme: Droit et Justice
in scheme: Divisions du Droit
in scheme: Droit Privé
notation: REFIP4265

vente sans facture
type: ConceptReFip
type: Concept
broader: refip-REFIP660
definition: Infraction au Droit Commercial, tout achat de produit ou toute prestation de service pour une activité professionnelle devant donner lieu à la délivrance d'une facture.
in scheme: FINANCES PUBLIQUES
in scheme: Droit et Justice
in scheme: Infractions et Sanctions
in scheme: Infraction
notation: REFIP4266

photogrammétrie
type: ConceptReFip
type: Concept
broader: topographie
definition: Technique qui but de définir la position dans l'espace, la forme et les dimensions d'un objet en utilisant essentiellement des mesures faites sur plusieurs photographies de ce dernier. Le traitement de ces mesures peut être analytique (prise de vues argentiques) ou numérique (prise de vues numériques).
in scheme: FINANCES PUBLIQUES
in scheme: Cadastre
in scheme: Fiscalité
notation: REFIP4267

titre de recette
type: ConceptReFip
type: Concept
broader: ordre de recette
definition: Pièce matérialisant l'ordre donné par l'ordonnateur à l'agent comptable de prendre en charge l'ordre de recouvrer.
in scheme: FINANCES PUBLIQUES
in scheme: Documentation budgétaire
in scheme: Budget
notation: REFIP4268
related: titre exécutoire

fichier foncier standard
type: ConceptReFip
type: Concept
broader: cadastre
definition: Fichier issu de l'application MAJIC, comprenant le fichier des propriétaires d'immeubles, le fichier des propriétés bâties (locaux), le fichier des propriétés non bâties (parcelles), le fichier des propriétés divisées en lots (lots de copropriété) qui est fourni en complément du fichier des propriétés non bâties et du fichier des propriétés bâties, et le fichier des liens-lots fourni en complément du fichier des propriétés bâties.
in scheme: FINANCES PUBLIQUES
in scheme: Cadastre
in scheme: Fiscalité
notation: REFIP427

taxe spéciale d'équipement
type: ConceptReFip
type: Concept
broader: taxes assimilées aux impôts directs locaux (non descripteur)
definition: Taxe due sauf cas d'exonération, par toutes les personnes imposées à la taxe foncière sur les propriétés bâties, à la taxe foncière sur les propriétés non bâties, à la taxe d'habitation ou à la cotisation foncière des entreprises dans les communes comprises dans le ressort géographique de l'établissement public concerné.
in scheme: FINANCES PUBLIQUES
in scheme: Fiscalité
in scheme: Impôt
notation: REFIP4270

certificat de qualité
type: ConceptReFip
type: Concept
alternative label: certificat qualité
alternative label: certification de qualité
alternative label: certification qualité
broader: candidature à un marché public
definition: Document attestant de la capacité des candidats à exécuter un marché public.
in scheme: FINANCES PUBLIQUES
in scheme: Commande publique
in scheme: Gestion Publique
notation: REFIP4271

domaine public routier
type: ConceptReFip
type: Concept
broader: domaine public
definition: Ensemble des voies de communication terrestres, affectées à la circulation générale du public (routes nationales, voiries communales...),
in scheme: FINANCES PUBLIQUES
in scheme: Domaine
in scheme: Gestion Publique
narrower: permission de voirie
narrower: infrastructure routière
notation: REFIP4272

société d'intérêt collectif agricole
type: ConceptReFip
type: Concept
alternative label: SICA
broader: refip-REFIP707
definition: Société ayant pour objet de créer ou de gérer des installations et équipements ou d’assurer des services soit dans l’intérêt des agriculteurs, soit de façon plus générale dans celui des habitants de la région sans distinction professionnelle. Les Sica ont le statut de société coopérative.
in scheme: FINANCES PUBLIQUES
in scheme: Société
in scheme: Entreprises
in scheme: Forme juridique
notation: REFIP4273

Ministère du Logement de l'Egalité des Territoires et de la Ruralité (obsolète)
type: ConceptReFip
type: Concept
is replaced by: refip-REFIP7067
broader: ZZ
in scheme: FINANCES PUBLIQUES
notation: REFIP4274

taxe sur la publicité diffusée par voie de radiodiffusion sonore et de télévision
type: ConceptReFip
type: Concept
broader: refip-REFIP934
definition: Taxe sur les opérations d’émission et de diffusion en France des messages publicitaires par voie de radiodiffusion et de télévision. Les redevables de la taxe sont les personnes qui assurent la régie des messages de publicité et qui peuvent être soit les organismes de programmes ou de diffusion, soit des régisseurs mandatés par eux. La taxe n’est due que pour les messages publicitaires émis et diffusés à partir du territoire français. Sont ainsi taxés les messages émis et diffusés à partir du territoire français et reçus en France. Les messages publicitaires émis et diffusés à partir du territoire français et destinés à être reçus hors de France sont également soumis à cette taxe.
in scheme: FINANCES PUBLIQUES
in scheme: Fiscalité
in scheme: Impôt
notation: REFIP4275

stéréopréparation
type: ConceptReFip
type: Concept
broader: topographie
definition: Méthode de lever photogrammétrique s'appuyant sur un canevas cadastral ou sur le canevas géodésique et ayant pour but d'équiper le chantier d'un certain nombre de points indispensables au calcul de l'aérocanevas.
in scheme: FINANCES PUBLIQUES
in scheme: Cadastre
in scheme: Fiscalité
notation: REFIP4277
scope note: Cadastre : méthode de lever photogrammétrique

acheteur public
type: ConceptReFip
type: Concept
broader: passation des marchés publics
definition: Personne en charge de la passation des marchés au sein d'une administration ou d'une entreprise publique.
in scheme: FINANCES PUBLIQUES
in scheme: Commande publique
in scheme: Gestion Publique
notation: REFIP4278

fonds pour l'insertion des personnes handicapées dans la fonction publique
type: ConceptReFip
type: Concept
alternative label: FIPHFP
broader: Caisse des dépôts et consignations
definition: Etablissement public administratif géré par la Caisse des dépôts et consignations ayant pour mission de favoriser l'insertion professionnelle des personnes handicapées au sein des trois fonctions publiques, ainsi que la formation et l'information des agents.
in scheme: FINANCES PUBLIQUES
in scheme: Organisation Structurelle de l'Etat
in scheme: Institutions
in scheme: Administration de L'Etat
notation: REFIP428

application CDG-D
type: ConceptReFip
type: Concept
alternative label: CDG-D
alternative label: compte de gestion dématérialisé
broader: applications gestion publique (non-descripteur)
definition: Outil de production des comptes de gestion dématérialisés du SPL.
in scheme: FINANCES PUBLIQUES
in scheme: Applications Informatiques
in scheme: Applications gestion publique
notation: REFIP4280

assujetti revendeur (supprimé)
type: ConceptReFip
type: Concept
broader: ZZ
in scheme: FINANCES PUBLIQUES
notation: REFIP4282

délai de réclamation
type: ConceptReFip
type: Concept
alternative label: délai général de réclamation
alternative label: délai spécial de réclamation
broader: contentieux fiscal
definition: Délai dont dispose le contribuable pour présenter une réclamation en matière fiscale,ce délai varie en fonction de l'impôt concerné.
in scheme: FINANCES PUBLIQUES
in scheme: Contentieux Fiscal
in scheme: Fiscalité
notation: REFIP4284

société de cautionnement mutuel
type: ConceptReFip
type: Concept
broader: refip-REFIP707
definition: Etablissements de crédit constitués en sociétés coopératives entre commerçants, industriels, artisans, sociétés commerciales et membres de professions libérales ayant pour objet d'apporter une garantie bancaire à leurs membres.
in scheme: FINANCES PUBLIQUES
in scheme: Société
in scheme: Entreprises
in scheme: Forme juridique
notation: REFIP4287

service des achats de l'Etat
type: ConceptReFip
type: Concept
broader: refip-REFIP7061
definition: Service interministériel à compétence nationale, le Service des achats de l’Etat (SAE) peut se comparer à une direction des achats « groupe » au niveau de l’Etat, chaque entité - les ministères -, étant dotée d’un responsable de la fonction achat, le RMA (responsable ministériel achats).
in scheme: FINANCES PUBLIQUES
in scheme: Organisation Structurelle de l'Etat
in scheme: Ministère
in scheme: Administration de L'Etat
notation: REFIP4288
scope note: La Direction des achats de l’État se substitue au service des achats de l’État depuis mars 2016

pompes funèbres
type: ConceptReFip
type: Concept
broader: commerce de détail
definition: Entreprise chargée de l'organisation des obsèques.
in scheme: FINANCES PUBLIQUES
in scheme: Branche d'activité
in scheme: Questions Economiques
in scheme: Commerce
notation: REFIP4289

accueil internet
type: ConceptReFip
type: Concept
broader: accueil du public
definition: Accueil des usagers des administrations des finances publiques par voie dématérialisée : courriel, messagerie sécurisée, site internet.
in scheme: FINANCES PUBLIQUES
in scheme: Missions Transverses des Finances publiques
in scheme: Qualité de service
notation: REFIP429

Ministère de la Ville de la Jeunesse et des Sports (obsolète)
type: ConceptReFip
type: Concept
is replaced by: refip-REFIP7065
broader: ZZ
in scheme: FINANCES PUBLIQUES
notation: REFIP4290

charge non déductible
type: ConceptReFip
type: Concept
broader: déductibilité
definition: Dépense qui ne répond pas aux critères posés par les articles du CGI et qui ne peut venir en diminution de la base d’imposition de l’Impôt.
in scheme: FINANCES PUBLIQUES
in scheme: Liquidation de l'Impôt
in scheme: Fiscalité
narrower: dépenses somptuaires
notation: REFIP4291

frais
type: ConceptReFip
type: Concept
broader: mots outils (liste additive)
definition: Charges ou dépenses.
in scheme: FINANCES PUBLIQUES
in scheme: Mots Outils
notation: REFIP4293

fonction régionale de supervision des tiers
type: ConceptReFip
type: Concept
alternative label: FRST
broader: direction régionale des finances publiques
definition: Fonction assurée par des comptables présents dans les DDFiP et DRFiP. Ils sont les interlocuteurs directs et uniques de leurs services gestionnaires régionaux dans le cadre de la gestion de la base tiers fournisseurs et clients. Ils jouent un rôle d’assistance et de conseil auprès d’eux.
in scheme: FINANCES PUBLIQUES
in scheme: Organisation Structurelle de l'Etat
in scheme: Ministère
in scheme: Administration de L'Etat
notation: REFIP4294
related: fonction de supervision des tiers
scope note: Service supprimé en 2017

déchets nucléaires
type: ConceptReFip
type: Concept
alternative label: déchets radioactifs
broader: déchets
definition: Résidus non réutilisables issus des centrales nucléaires et essentiellement caractérisés par la présence de produits radioactifs émetteurs de rayonnements.
in scheme: FINANCES PUBLIQUES
in scheme: Environnement
in scheme: Dégradation de l'Environnement
in scheme: Questions de Société
notation: REFIP4295

réponse aux observations du contribuable
type: ConceptReFip
type: Concept
broader: contrôle fiscal
definition: Dans le cadre d'un contrôle fiscal, le contribuable peut faire valoir ses observations sur les rehaussements proposés par l'administration. En cas de mise en oeuvre de la procédure de rectification contradictoire, l'administration est tenue d'adresser une réponse motivant le rejet total ou partiel des observations présentées.
in scheme: FINANCES PUBLIQUES
in scheme: Droit de Contrôle de l'Administration
in scheme: Fiscalité
notation: REFIP4298

investissement
type: ConceptReFip
type: Concept
alternative label: opération d'investissement
broader: refip-REFIP893
definition: Dépense de l’entreprise ayant pour but de modifier durablement le cycle d’exploitation, d’acquérir de nouveaux moyens de production, d’améliorer leur rendement ou de placer des capitaux.
in scheme: FINANCES PUBLIQUES
in scheme: Gestion de l'Entreprise
in scheme: Entreprises
in scheme: Vie et Gestion de l'entreprise
notation: REFIP43

signature
type: ConceptReFip
type: Concept
alternative label: signature manuscrite
alternative label: signature numérique
alternative label: signature électronique
broader: preuve par écrit
definition: Paraphe constituant une condition de validité d'un acte juridique.
in scheme: FINANCES PUBLIQUES
in scheme: Droit et Justice
in scheme: Divisions du Droit
in scheme: Droit Privé
notation: REFIP430

application informatique
type: ConceptReFip
type: Concept
alternative label: service applicatif
broader: informatique
definition: Logiciel applicatif.
in scheme: FINANCES PUBLIQUES
in scheme: Informatique
in scheme: Communication Documentation Informatique
narrower: connexion
narrower: habilitation
narrower: refip-REFIP972
notation: REFIP4301
related: refip-REFIP98

procédure européenne d'injonction de payer
type: ConceptReFip
type: Concept
broader: droit européen
definition: Procédure simplifiée applicable aux créances transnationales (entre entreprises et/ou particuliers européens) non contestées par le défendeur. Elle repose sur l'utilisation de formulaires types. Elle est délivrée par des tribunaux.
in scheme: FINANCES PUBLIQUES
in scheme: Droit et Justice
in scheme: Divisions du Droit
in scheme: Droit Européen
notation: REFIP4302

application TDFC
type: ConceptReFip
type: Concept
alternative label: TDFC
alternative label: transfert de données fiscales
alternative label: transfert des données fiscales et comptables
broader: applications fiscales (non-descripteur)
definition: Application de réception/contrôle des déclarations de revenus professionnels en mode dématérialisé.
in scheme: FINANCES PUBLIQUES
in scheme: Applications Informatiques
in scheme: Applications fiscales
notation: REFIP4303

application mesurée de la loi fiscale
type: ConceptReFip
type: Concept
alternative label: mesure de tempérament fiscale
alternative label: mesure de tolérance fiscale
broader: fiscalité
definition: Appréciation par l'administration fiscale de la situation propre à chaque contribuable pour l'application de la norme fiscale, pouvant conduire à abandonner certains rappels fondés sur le non-respect de la lettre de loi mais sans incidences financières, aux fins de limiter le contentieux et favoriser le consentement à l'impôt.
in scheme: FINANCES PUBLIQUES
in scheme: Fiscalité - Autres notions
in scheme: Fiscalité
notation: REFIP4304

déclaration de la cotisation sur la valeur ajoutée des entreprises
type: ConceptReFip
type: Concept
alternative label: déclaration CVAE
broader: refip-REFIP804
definition: Déclaration de la valeur ajoutée et des effectifs salariés n° 1330-CVAE-SD ou n°1330-CVAE-ETE (cerfa n° 14 030) devant être souscrite par les entreprises en fonction du chiffre d'affaires hors taxes. La déclaration de liquidation et de régularisation est souscrite sur le formulaire n° 1329-DEF.
in scheme: FINANCES PUBLIQUES
in scheme: Documentation Fiscale
in scheme: Fiscalité
notation: REFIP4305

fonds de compensation de la fiscalité transférée
type: ConceptReFip
type: Concept
alternative label: FCFT
broader: fonds (non-descripteur)
definition: Compte spécial du trésor ayant vocation à accueillir le montant des prélèvements opérés sur la fiscalité transférée aux départements, lorsque cette fiscalité est supérieure au droit à compensation. Les crédits ainsi collectés sont reversés aux départements dont le montant des ressources fiscales transférées ne couvre que partiellement leur droit à compensation.
in scheme: FINANCES PUBLIQUES
in scheme: Dépenses publiques
in scheme: Gestion Publique
notation: REFIP4306

droit de pacage
type: ConceptReFip
type: Concept
broader: droit de propriété
definition: Droit pour un éleveur/agriculteur d’envoyer son bétail paître dans certains pâturages, comme les forêts communales ou domaniales, les communaux, les terrains en vaine-pâture.
in scheme: FINANCES PUBLIQUES
in scheme: Droit et Justice
in scheme: Divisions du Droit
in scheme: Droit Privé
notation: REFIP4307

date
type: ConceptReFip
type: Concept
broader: mots outils (liste additive)
definition: Indication du jour, du mois et de l'année.
in scheme: FINANCES PUBLIQUES
in scheme: Mots Outils
notation: REFIP4310

responsabilité sans faute
type: ConceptReFip
type: Concept
broader: responsabilité de l'Etat
definition: Responsabilité de l’administration qui peut parfois être engagée en l’absence de toute faute de sa part, du seul préjudice causé par l’activité administrative, c’est ce qu’on appelle la responsabilité de plein droit. La victime n’aura donc à prouver son préjudice et le lien de causalité entre celui-ci et l’activité de l’Administration.
in scheme: FINANCES PUBLIQUES
in scheme: Droit et Justice
in scheme: Divisions du Droit
in scheme: Droit Public
notation: REFIP4311

prix forfaitaire
type: ConceptReFip
type: Concept
broader: passation des marchés publics
definition: Prix qui rémunère le titulaire du marché pour une prestation ou un ensemble de prestations, quelles que soient les quantités livrées ou exécutées.
in scheme: FINANCES PUBLIQUES
in scheme: Commande publique
in scheme: Gestion Publique
notation: REFIP4312

application LASCOT
type: ConceptReFip
type: Concept
alternative label: LASCOT
broader: applications fiscales (non-descripteur)
definition: Application permettant de suivre et de relancer les propriétaires pour le dépôt des déclarations sur les propriétés bâties ainsi que de programmer et de suivre les travaux de mise à jour du plan cadastral par les géomètres.
in scheme: FINANCES PUBLIQUES
in scheme: Applications Informatiques
in scheme: Applications fiscales
notation: REFIP4313

pacte commissoire
type: ConceptReFip
type: Concept
broader: garanties
definition: Clause par laquelle un créancier gagiste ou hypothécaire obtient de son débiteur qu'il deviendra propriétaire de la chose gagée ou hypothéquée en cas de non-paiement.
in scheme: FINANCES PUBLIQUES
in scheme: Droit et Justice
in scheme: Divisions du Droit
in scheme: Droit Privé
notation: REFIP4314

relais services publics
type: ConceptReFip
type: Concept
broader: structure locale (non-descripteur)
definition: Structure d’accueil polyvalent du public, les relais services publics (RSP) peuvent être portés par une mairie, une structure intercommunale, un service de l’État ou même une association. Ils permettent au public d’obtenir des informations et d’effectuer des démarches administratives relevant de plusieurs administrations ou organismes publics, principalement en matière d’emploi et de prestations sociales.
in scheme: FINANCES PUBLIQUES
in scheme: Organisation Territoriale
in scheme: Structures Territoriales
in scheme: Administration de L'Etat
notation: REFIP4316

arrêté ministériel
type: ConceptReFip
type: Concept
broader: législation
definition: Acte exécutoire à portée générale ou individuelle émanant du ministre.
in scheme: FINANCES PUBLIQUES
in scheme: Droit et Justice
in scheme: Sources du Droit
in scheme: Sources du Droit Objectif
notation: REFIP4317

prix actualisable
type: ConceptReFip
type: Concept
broader: passation des marchés publics
definition: Prix qui peut être modifié pour tenir compte des variations économiques.
in scheme: FINANCES PUBLIQUES
in scheme: Commande publique
in scheme: Gestion Publique
notation: REFIP4318

patrimoine foncier
type: ConceptReFip
type: Concept
broader: patrimoine
definition: Terrain qui sert de support à la construction immobilière, et par extension il comprend l'ensemble des propriétés bâties et non bâties.
in scheme: FINANCES PUBLIQUES
in scheme: Droit et Justice
in scheme: Divisions du Droit
in scheme: Droit Privé
notation: REFIP4319

Sainte-Lucie
type: ConceptReFip
type: Concept
broader: Caraïbes
definition: Pays
in scheme: FINANCES PUBLIQUES
in scheme: Géographie
in scheme: Amérique
notation: REFIP432

candidature à une délégation de service public (supprimé)
type: ConceptReFip
type: Concept
broader: ZZ
in scheme: FINANCES PUBLIQUES
notation: REFIP4320

Haute-Corse
type: ConceptReFip
type: Concept
broader: Corse
definition: Département français
in scheme: FINANCES PUBLIQUES
in scheme: Géographie
in scheme: Europe
notation: REFIP4322

comptabilité budgétaire
type: ConceptReFip
type: Concept
broader: exécution du budget
definition: Comptabilité retraçant l’ouverture et la consommation des autorisations d’engager et de payer, ainsi que l’enregistrement des recettes autorisées. Elle permet de rendre compte de l’utilisation des crédits et, le cas échéant, des emplois mis à la disposition des ordonnateurs, conformément à la spécialisation de ces crédits et de ces emplois
in scheme: FINANCES PUBLIQUES
in scheme: Exécution du budget
in scheme: Budget
narrower: compte budgétaire
notation: REFIP4324
related: trajectoire comptable

produits divers
type: ConceptReFip
type: Concept
broader: recouvrement
in scheme: FINANCES PUBLIQUES
in scheme: Recouvrement
in scheme: Fiscalité
narrower: créance de l'Etat étrangère à l'impôt et aux domaines
narrower: recouvrement des produits divers
notation: REFIP4325

arrérages
type: ConceptReFip
type: Concept
broader: droit des obligations et contrats (non-descripteur)
definition: Ce qui est dû, échu, d'un revenu, d'une rente, d'un loyer, d'une ferme.
in scheme: FINANCES PUBLIQUES
in scheme: Droit et Justice
in scheme: Divisions du Droit
in scheme: Droit Privé
notation: REFIP4327

apprenti
type: ConceptReFip
type: Concept
broader: apprentissage
definition: Jeune professionnel qui suit une formation en alternance entre une entreprise et un centre de formation, les trois parties prenantes ayant signé un contrat d'apprentissage.
in scheme: FINANCES PUBLIQUES
in scheme: Entreprises
in scheme: Travail
in scheme: 212619
notation: REFIP4328

titulaire d'une délégation de service public
type: ConceptReFip
type: Concept
alternative label: délégataire privé
alternative label: délégataire public
broader: délégation de service public
definition: Entrepreneur, fournisseur ou prestataire de services auquel vient d'être notifié la délégation de service public.
in scheme: FINANCES PUBLIQUES
in scheme: Commande publique
in scheme: Gestion Publique
notation: REFIP4329

application SIRHIUS-PART
type: ConceptReFip
type: Concept
alternative label: SIRIUS-PART
broader: applications fiscales (non-descripteur)
definition: Outil décisionnel aidant à la sélection et à la programmation des dossiers IR/ISF en vu du contrôle fiscal des particuliers.
in scheme: FINANCES PUBLIQUES
in scheme: Applications Informatiques
in scheme: Applications fiscales
notation: REFIP433

Auvergne-Rhône-Alpes
type: ConceptReFip
type: Concept
broader: France métropolitaine
definition: Région française dont le chef-lieu est Lyon.
in scheme: FINANCES PUBLIQUES
in scheme: Géographie
in scheme: Europe
narrower: Drôme
narrower: Cantal
narrower: Ardèche
narrower: Rhône
narrower: Isère
narrower: Haute-Savoie
narrower: Savoie
narrower: Ain
narrower: Loire
narrower: refip-REFIP843
narrower: refip-REFIP92
narrower: refip-REFIP924
notation: REFIP4330

application ONTARIO
type: ConceptReFip
type: Concept
alternative label: ONTARIO
alternative label: outil national d'analyse et de restitutions financières des OPH
broader: applications gestion publique (non-descripteur)
definition: Outil permettant la réalisation d'analyse financière rétrospective des OPH.
in scheme: FINANCES PUBLIQUES
in scheme: Applications Informatiques
in scheme: Applications gestion publique
notation: REFIP4331

crédit provisionnel (supprimé)
type: ConceptReFip
type: Concept
broader: ZZ
in scheme: FINANCES PUBLIQUES
notation: REFIP4333

avance de trésorerie
type: ConceptReFip
type: Concept
broader: exécution de la dépense (non-descripteur)
definition: Paiement d'une somme par avance sur la procédure normale de l'engagement , de la liquidation et de l'ordonnancement des dépenses de l'État.
in scheme: FINANCES PUBLIQUES
in scheme: Dépenses publiques
in scheme: Gestion Publique
notation: REFIP4335
related: avance facultative

Pyrénées-Atlantiques
type: ConceptReFip
type: Concept
broader: refip-REFIP7020
definition: Département français
in scheme: FINANCES PUBLIQUES
in scheme: Géographie
in scheme: Europe
notation: REFIP4336

condition de forme
type: ConceptReFip
type: Concept
alternative label: formalisme
broader: droit civil
definition: Condition relative à la rédaction de l'acte juridique.
in scheme: FINANCES PUBLIQUES
in scheme: Droit et Justice
in scheme: Divisions du Droit
in scheme: Droit Privé
narrower: vice de forme
notation: REFIP4337

Bénin
type: ConceptReFip
type: Concept
broader: Afrique
definition: Pays
in scheme: FINANCES PUBLIQUES
in scheme: Géographie
in scheme: Afrique
notation: REFIP4338

formulaire électronique
type: ConceptReFip
type: Concept
broader: imprimé
definition: Formulaire à remplir via Internet.
in scheme: FINANCES PUBLIQUES
in scheme: Documentation
in scheme: Communication Documentation Informatique
notation: REFIP4339
related: dématérialisation

local de stockage
type: ConceptReFip
type: Concept
alternative label: entrepôt
alternative label: garde-meuble
broader: local professionnel
definition: Local destiné à l'entreposage (permanent ou provisoire) de produits, de marchandises ou de biens et qui ne sont pas intégrés topographiquement à un établissement de production.
in scheme: FINANCES PUBLIQUES
in scheme: Cadastre
in scheme: Fiscalité
notation: REFIP434

téléprocédure
type: ConceptReFip
type: Concept
broader: chaîne de traitement
definition: Procédure administrative remplie par l'intermédiaire d'un service en ligne sur Internet.
in scheme: FINANCES PUBLIQUES
in scheme: Informatique
in scheme: Communication Documentation Informatique
notation: REFIP4340
related: télédéclaration

intégration fiscale
type: ConceptReFip
type: Concept
alternative label: unité fiscale
broader: régime d'imposition
definition: Régime fiscal optionnel qui permet d'imposer le résultat d'une filiale, détenue au moins à 95 %, au niveau de la société mère.
in scheme: FINANCES PUBLIQUES
in scheme: Régime d'Imposition
in scheme: Fiscalité
notation: REFIP4341

Corrèze
type: ConceptReFip
type: Concept
broader: refip-REFIP7020
definition: Département français
in scheme: FINANCES PUBLIQUES
in scheme: Géographie
in scheme: Europe
notation: REFIP4342

application SISPEO
type: ConceptReFip
type: Concept
alternative label: SISPEO
broader: applications fiscales (non-descripteur)
definition: Application de gestion et de suivi des délais de paiement accordés aux contribuables en phase amiable.
in scheme: FINANCES PUBLIQUES
in scheme: Applications Informatiques
in scheme: Applications fiscales
notation: REFIP4344

charte
type: ConceptReFip
type: Concept
broader: document
definition: Acte juridique signé par plusieurs acteurs pour définir un objectif et parfois des moyens communs.
in scheme: FINANCES PUBLIQUES
in scheme: Documentation
in scheme: Communication Documentation Informatique
narrower: charte graphique
notation: REFIP4345

République de Singapour
type: ConceptReFip
type: Concept
alternative label: Singapour
broader: Asie
definition: Pays
in scheme: FINANCES PUBLIQUES
in scheme: Géographie
in scheme: Asie
notation: REFIP4348

consolidation des comptes
type: ConceptReFip
type: Concept
alternative label: consolidation comptable
broader: procédures et techniques comptables (non-descripteur)
definition: Opération visant à présenter les comptes d’un ensemble d’entités, liées financièrement et économiquement, formant un groupe, comme si cet ensemble ne constituait qu’une seule entité. Consistant à substituer au montant des titres de participation qui figure à l’actif du bilan de l’entité consolidante, la part des capitaux propres de l’entité ou des entités détenues par l’entité consolidante.
in scheme: FINANCES PUBLIQUES
in scheme: Procédures et Techniques Comptables
in scheme: Comptabilité
narrower: neutralisation des opérations réciproques
notation: REFIP4349

versement
type: ConceptReFip
type: Concept
broader: mots outils (liste additive)
definition: Action de verser de l'argent, de remettre un objet ou des marchandises.
in scheme: FINANCES PUBLIQUES
in scheme: Mots Outils
notation: REFIP435

apurement des restes à recouvrer
type: ConceptReFip
type: Concept
broader: restes à recouvrer
definition: Acquittement d'une dette suite à paiement effectif du redevable ou recouvrement pour ordre (dégrèvement, admission en non valeur ou par apurement après acquisition de la prescription extinctive)
in scheme: FINANCES PUBLIQUES
in scheme: Recouvrement
in scheme: Fiscalité
narrower: admission en non-valeur
notation: REFIP4350

conseil départemental de l'accès au droit
type: ConceptReFip
type: Concept
alternative label: CDAD
broader: groupement d'intérêt public
definition: Groupement d'intérêt Public, le CDAD est institué dans chaque département et a pour mission essentielle de définir une politique d'accès au droit dans le département, de piloter et de coordonner les actions en matière d'aide à l'accès au droit.
in scheme: FINANCES PUBLIQUES
in scheme: Organisation Structurelle de l'Etat
in scheme: Opérateur de l'Etat
in scheme: Administration de L'Etat
notation: REFIP4351

application TELEACTES
type: ConceptReFip
type: Concept
alternative label: TELE@CTES
broader: applications fiscales (non-descripteur)
definition: Application permettant la dématérialisation des échanges entre les notaires et les services de publicité foncière.
in scheme: FINANCES PUBLIQUES
in scheme: Applications Informatiques
in scheme: Applications fiscales
notation: REFIP4352

responsabilité pénale
type: ConceptReFip
type: Concept
broader: droit pénal
definition: Obligation de répondre de ses actes délictueux en subissant une sanction pénale dans les conditions et selon les formes prescrites par la loi.
in scheme: FINANCES PUBLIQUES
in scheme: Droit et Justice
in scheme: Divisions du Droit
in scheme: Droit Public
notation: REFIP4353

bicyclette (supprimé)
type: ConceptReFip
type: Concept
broader: ZZ
in scheme: FINANCES PUBLIQUES
notation: REFIP4354

passation des marchés publics
type: ConceptReFip
type: Concept
broader: marché public
definition: Procédures depuis l'expression du besoin jusqu'à l'exécution du marché en passant par l’information des candidats et l’analyse des offres. La passation suit trois principes : égalité de traitement des candidats, liberté d'accès à la commande publique et transparence des procédures de passation.
in scheme: FINANCES PUBLIQUES
in scheme: Commande publique
in scheme: Gestion Publique
narrower: concours à un marché public
narrower: procédure adaptée
narrower: système d'acquisition dynamique
narrower: appel d'offres
narrower: attribution de marché public
narrower: prix ferme
narrower: avenant de transfert
narrower: mise en concurrence
narrower: garantie à première demande
narrower: bordereau des prix
narrower: procédure de conception réalisation
narrower: certificat de cessibilité
narrower: dialogue compétitif
narrower: lettre de commande
narrower: prix provisoire
narrower: acheteur public
narrower: prix forfaitaire
narrower: prix actualisable
narrower: publicité des marchés publics
narrower: révision de prix
narrower: candidature à un marché public
narrower: procédure formalisée
narrower: seuil de passation des marchés
narrower: prix définitif
narrower: règlement de la consultation
notation: REFIP4355

Institut d'émission des départements d'outre-mer
type: ConceptReFip
type: Concept
alternative label: IEDOM
broader: établissement public à caractère administratif
definition: Etablissement public national chargé d’assurer la continuité territoriale en matière monétaire par délégation de la Banque de France dans les cinq départements d’outre-mer et dans les collectivités de Saint-Pierre-et-Miquelon, Saint-Barthélemy et Saint-Martin.
in scheme: FINANCES PUBLIQUES
in scheme: Organisation Structurelle de l'Etat
in scheme: Opérateur de l'Etat
in scheme: Administration de L'Etat
notation: REFIP4357

véhicule terrestre à moteur
type: ConceptReFip
type: Concept
alternative label: VTM
broader: transport routier
definition: Véhicule terrestre doté d’un moteur et capable de transporter des personnes ou des charges.
in scheme: FINANCES PUBLIQUES
in scheme: Branche d'activité
in scheme: Questions Economiques
in scheme: Transports
narrower: automobile
narrower: véhicule hors d'usage
narrower: taxi
narrower: véhicule administratif
narrower: véhicule personnel
narrower: véhicule d'occasion
narrower: véhicule à deux roues
narrower: refip-REFIP6944
narrower: refip-REFIP6953
notation: REFIP4358

voies navigables de France
type: ConceptReFip
type: Concept
broader: établissement public à caractère administratif
definition: Etablissement public à caractère administratif français chargé de gérer la majeure partie du réseau des voies navigables de France.
in scheme: FINANCES PUBLIQUES
in scheme: Organisation Structurelle de l'Etat
in scheme: Opérateur de l'Etat
in scheme: Administration de L'Etat
notation: REFIP4359

notaire
type: ConceptReFip
type: Concept
broader: charges et offices
definition: Juriste de droit privé et officier public, nommé par l’autorité publique, chargé d’instrumenter les actes juridiques civils, dits actes notariés, de juridiction non-contentieuse pour lesquels la forme authentique est prescrite par la loi ou requise par les parties.
in scheme: FINANCES PUBLIQUES
in scheme: Profession Juridique
in scheme: Droit et Justice
in scheme: Organisation Juridictionnelle
notation: REFIP4360

juge commissaire
type: ConceptReFip
type: Concept
broader: juge judiciaire
definition: Fonction attribuée à un Juge du Tribunal de commerce qui intervient dans les procédures collectives. Il est chargé de veiller au déroulement rapide de la procédure et à la protection des intérêts en présence. Il a compétence pour relever les créanciers qui ont omis de produire ou qui ont produit hors délai, de la forclusion qu'ils ont encourue, il a aussi compétence pour autoriser les licenciements pour motifs économiques.
in scheme: FINANCES PUBLIQUES
in scheme: Profession Juridique
in scheme: Droit et Justice
in scheme: Organisation Juridictionnelle
notation: REFIP4361

voie de recours
type: ConceptReFip
type: Concept
broader: principes généraux (non-descripteur)
definition: Moyens mis à la disposition des plaideurs pour leur permettre d'obtenir un nouvel examen du procès (ou d'une partie de celui-ci) ou de faire valoir les irrégularités observées dans le déroulement de la procédure.
in scheme: FINANCES PUBLIQUES
in scheme: Principes Généraux
in scheme: Droit et Justice
in scheme: Procédure
narrower: pourvoi juridictionnel
narrower: appel en justice
narrower: tierce opposition
narrower: refip-REFIP774
notation: REFIP4363

créance privilégiée
type: ConceptReFip
type: Concept
broader: recouvrement
definition: Créance bénéficiant d'un droit d'être préférée aux autres créances, même hypothécaires, accordé par un texte en raison de sa nature ou de la qualité de son détenteur (Salariés, Trésor public, organismes sociaux).
in scheme: FINANCES PUBLIQUES
in scheme: Recouvrement
in scheme: Fiscalité
notation: REFIP4365

valeur actuelle nette
type: ConceptReFip
type: Concept
alternative label: VAN
alternative label: valeur actualisée
broader: flux de trésorerie
definition: Valeur utilisée pour déterminer si un investissement est rentable ou non. Un investissement rentable est un investissement qui accroît la valeur de l'actif économique, c'est à dire qui crée de la richesse.
in scheme: FINANCES PUBLIQUES
in scheme: Analyse financière
in scheme: Comptabilité
notation: REFIP4366
scope note: Analyse financière

Etats-Unis
type: ConceptReFip
type: Concept
alternative label: USA
broader: Amérique
definition: Pays
in scheme: FINANCES PUBLIQUES
in scheme: Géographie
in scheme: Amérique
notation: REFIP4367

avis de vérification
type: ConceptReFip
type: Concept
broader: documentation fiscale (non-descripteur)
definition: Imprimé obligatoirement envoyé au contribuable dès lors que le contrôle envisagé s'analyse comme une vérification de comptabilité (imprimé n° 3927-SD – Cerfa n°11872) ou un ESFP (imprimé 3929-SD - Cerfa n°11873).
in scheme: FINANCES PUBLIQUES
in scheme: Documentation Fiscale
in scheme: Fiscalité
notation: REFIP4369

non-concurrence
type: ConceptReFip
type: Concept
alternative label: clause de non concurrence
broader: droit commercial
definition: Stipulation par laquelle un contractant se prive de la faculté d'exercer pendant une certaine période et dans une aire géographique déterminée une activité professionnelle susceptible de concurrencer celle de l'autre.
in scheme: FINANCES PUBLIQUES
in scheme: Droit et Justice
in scheme: Divisions du Droit
in scheme: Droit Privé
notation: REFIP4370

marché à procédure adaptée
type: ConceptReFip
type: Concept
alternative label: MAPA
alternative label: marché non formalisé
alternative label: procédure allégée
broader: marché public
definition: Marché dont les modalités sont librement fixées par le pouvoir adjudicateur en fonction de la nature et des caractéristiques du besoin à satisfaire, du nombre ou de la localisation des opérateurs économique susceptibles d’y répondre ainsi que des circonstances de l’achat.
in scheme: FINANCES PUBLIQUES
in scheme: Commande publique
in scheme: Gestion Publique
narrower: marché sans formalité préalable
notation: REFIP4373
related: procédure adaptée
related: lettre de commande

comptabilité publique
type: ConceptReFip
type: Concept
definition: Comptabilité tenue par les administrations et les collectivités publiques pour enregistrer leurs recettes et leurs dépenses.
in scheme: FINANCES PUBLIQUES
in scheme: Comptabilité publique
in scheme: Comptabilité
narrower: comptabilité de caisse
narrower: CHORUS (non-descripteur)
narrower: comptabilité matières
narrower: refip-REFIP773
notation: REFIP4374

subvention d'exploitation
type: ConceptReFip
type: Concept
broader: subvention
definition: Aide financière qui permet à une entreprise de compenser l’insuffisance de certains produits d’exploitation ou de faire face à certaines charges d’exploitation.
in scheme: FINANCES PUBLIQUES
in scheme: Dépenses publiques
in scheme: Gestion Publique
notation: REFIP4375

mandataire judiciaire
type: ConceptReFip
type: Concept
broader: procédure collective
definition: Personne désignée dans toute procédure collective, chargée par décision de justice de représenter les créanciers, de préserver les droits financiers des salariés et de réaliser les actifs des entreprises en liquidation judiciaire au profit des créanciers. Le mandataire accompagne le chef d'entreprise durant toute la période d'observation. Il invite les créanciers à déclarer leur créance et vérifie le montant exact des dettes, fixé ensuite par le juge-commissaire ; il les consulte sur les propositions de règlement émises par l'entreprise ou son administrateur en donnant son avis. Il assure le règlement des sommes dues aux salariés et procède aux licenciements en liquidation judiciaire.
in scheme: FINANCES PUBLIQUES
in scheme: Vie de l'Entreprise
in scheme: Entreprises
in scheme: Vie et Gestion de l'entreprise
narrower: mandataire liquidateur
notation: REFIP4377

devoir d'alerte
type: ConceptReFip
type: Concept
broader: responsabilité des comptables
definition: Obligation de signaler à sa hiérarchie les faits détectés à l'occasion de l'exercice de ses missions qui sont susceptibles de constituer des actes contraires à la loi ou des dérives de gestion. Cette responsabilité incombe à tout agent de la DGFIP.
in scheme: FINANCES PUBLIQUES
in scheme: Responsabilité des comptables
in scheme: Missions Transverses des Finances publiques
notation: REFIP4379

Pôle national d'assistance informatique du secteur public local
type: ConceptReFip
type: Concept
alternative label: PNSR de Metz
alternative label: Pôle de Metz
broader: Pôle national de soutien au réseau
definition: Structure conçue à l'origine pour répondre aux questions métier du réseau sur les applications de gestion des collectivités locales, le PNSR s'est progressivement recentré sur l'application Hélios.
in scheme: FINANCES PUBLIQUES
in scheme: Organisation Structurelle de l'Etat
in scheme: Ministère
in scheme: Administration de L'Etat
notation: REFIP438

amortissement exceptionnel
type: ConceptReFip
type: Concept
alternative label: amortissement accéléré
broader: amortissement comptable
definition: Amortissement consistant à enregistrer pour la ou les premières annuités des montants supérieurs à la dépréciation réelle du bien.
in scheme: FINANCES PUBLIQUES
in scheme: Procédures et Techniques Comptables
in scheme: Comptabilité
notation: REFIP4381

France métropolitaine
type: ConceptReFip
type: Concept
broader: refip-REFIP886
definition: Ensemble des territoires européens de la France. Elle comprend son territoire continental et les îles proches de l'océan Atlantique, de la Manche et de la mer Méditerranée, comme la Corse. La France métropolitaine se différencie ainsi de la France d'outre-mer, c'est-à-dire les parties de la République française précisément situées en dehors de l'Europe.
in scheme: FINANCES PUBLIQUES
in scheme: Géographie
in scheme: Europe
narrower: Corse
narrower: Centre-Val de Loire
narrower: Provence-Alpes-Côte d'Azur
narrower: Ile-de-France
narrower: Auvergne-Rhône-Alpes
narrower: Pays de la Loire
narrower: refip-REFIP7009
narrower: refip-REFIP7010
narrower: refip-REFIP7016
narrower: refip-REFIP7017
narrower: refip-REFIP7020
narrower: refip-REFIP7036
narrower: refip-REFIP957
notation: REFIP4382

déblocage anticipé de la participation
type: ConceptReFip
type: Concept
broader: participation financière
definition: Opération permettant aux salariés de demander le déblocage anticipé de tout ou partie des sommes issues de la participation ou de l’intéressement, affectées à un dispositif d’épargne salariale. Dans certains cas, l'exonération d'impôt sur le revenu n'est pas remise en cause
in scheme: FINANCES PUBLIQUES
in scheme: Gestion de l'Entreprise
in scheme: Entreprises
in scheme: Vie et Gestion de l'entreprise
notation: REFIP4383

avance sur consommation (supprimé)
type: ConceptReFip
type: Concept
broader: ZZ
in scheme: FINANCES PUBLIQUES
notation: REFIP4384

vente forcée
type: ConceptReFip
type: Concept
alternative label: adjudication à la barre
alternative label: vente judiciaire
alternative label: vente sur saisie
broader: vente
definition: Vente intervenant dans le cas où un débiteur n'exécute pas volontairement la décision de justice qui le contraint à payer des sommes liquidées par un jugement devenu exécutoire.
in scheme: FINANCES PUBLIQUES
in scheme: Droit et Justice
in scheme: Divisions du Droit
in scheme: Droit Privé
notation: REFIP4385

commandement valant saisie
type: ConceptReFip
type: Concept
broader: avertissement de payer
definition: Acte de poursuite signifié par voie d'huissier et avertissant le débiteur qu'en cas de non apurement de sa dette, une saisie immobilière en vue d'une vente judiciaire.
in scheme: FINANCES PUBLIQUES
in scheme: Recouvrement
in scheme: Fiscalité
notation: REFIP4387

imposition forfaitaire annuelle sur les pylônes
type: ConceptReFip
type: Concept
alternative label: imposition forfaitaire sur les pylônes
broader: autres taxes, droits ou redevances (non-descripteur)
definition: Imposition portant sur les pylônes supportant des lignes électriques dont la tension est au moins égale à 200 kilovolts. Son montant est révisé chaque année proportionnellement à la variation du produit de la taxe foncière sur les propriétés bâties constatées au niveau national.
in scheme: FINANCES PUBLIQUES
in scheme: Fiscalité
in scheme: Impôt
notation: REFIP4388

régie industrielle des établissements pénitentiaires
type: ConceptReFip
type: Concept
broader: régie
definition: Service géré par le Service de l'Emploi Pénitentiaire, un service à compétence nationale du Ministère de la Justice en charge, dans le cadre de sa mission de réinsertion, de développer des activités de travail et de formation au sein des établissements pénitentiaires.
in scheme: FINANCES PUBLIQUES
in scheme: Secteur public local
in scheme: Gestion Publique
notation: REFIP4389

droit au logement
type: ConceptReFip
type: Concept
alternative label: DAL
alternative label: DALO
alternative label: droit au logement opposable
alternative label: droit à un logement décent
broader: droit administratif
definition: Droit au logement considéré comme découlant du préambule de la Constitution de 1946. De là découle en 2003 la revendication d'un droit à un logement opposable.
in scheme: FINANCES PUBLIQUES
in scheme: Droit et Justice
in scheme: Divisions du Droit
in scheme: Droit Public
notation: REFIP439

travaux publics
type: ConceptReFip
type: Concept
broader: construction
definition: Travaux s'appliquant aux infrastructures publiques. Il s'agit de travaux de construction, d'aménagement ou d'entretien sur un bien immeuble, effectués par une administration publique pour son compte dans un but d'intérêt général, ou en exécution d'une mission de service public.
in scheme: FINANCES PUBLIQUES
in scheme: Branche d'activité
in scheme: Questions Economiques
in scheme: Construction
narrower: travaux d'enfouissement
narrower: travaux de voirie
notation: REFIP4392
related: concession de travaux publics

Ain
type: ConceptReFip
type: Concept
broader: Auvergne-Rhône-Alpes
definition: Département français
in scheme: FINANCES PUBLIQUES
in scheme: Géographie
in scheme: Europe
notation: REFIP4393

caractère confiscatoire
type: ConceptReFip
type: Concept
broader: impôt
definition: Qui présente les caractères d'une confiscation, d'une saisie des biens. On parle d'impôt confiscatoire lorsque le règlement de cet impôt conduit soit à l'expropriation du redevable, soit à l'aliénation (vente) forcée de son patrimoine. Un taux confiscatoire est un taux élevé qui absorbe la totalité des revenus.
in scheme: FINANCES PUBLIQUES
in scheme: Fiscalité
in scheme: Impôt
notation: REFIP4394

plage
type: ConceptReFip
type: Concept
broader: littoral
definition: Partie plate et basse d'un rivage de mer, de cours d'eau.
in scheme: FINANCES PUBLIQUES
in scheme: Environnement
in scheme: Milieu Naturel
in scheme: Questions de Société
notation: REFIP4395

crédit d'impôt pour mobilité des chômeurs ou salariés (supprimé)
type: ConceptReFip
type: Concept
broader: ZZ
in scheme: FINANCES PUBLIQUES
notation: REFIP4396

résidence hôtelière à vocation sociale
type: ConceptReFip
type: Concept
alternative label: RHVS
broader: fourniture de logement
definition: Structure commerciale, destinée à apporter une solution d’hébergement ponctuelle ou permanente, à un prix modéré, aux personnes éprouvant des difficultés financières et sociales pour se loger.
in scheme: FINANCES PUBLIQUES
in scheme: Branche d'activité
in scheme: Questions Economiques
in scheme: Commerce
notation: REFIP4397

Asie
type: ConceptReFip
type: Concept
definition: Continent
in scheme: FINANCES PUBLIQUES
in scheme: Géographie
in scheme: Asie
narrower: Corée du Sud
narrower: Japon
narrower: Bangladesh
narrower: Ouzbékistan
narrower: Géorgie
narrower: Indonésie
narrower: Koweït
narrower: Syrie
narrower: Jordanie
narrower: royaume de Bahreïn
narrower: République de Singapour
narrower: Cambodge
narrower: Thaïlande
narrower: Corée du Nord
narrower: Laos
narrower: Azerbaïdjan
narrower: Turquie
narrower: Russie
narrower: Israël
narrower: Inde
narrower: Chine
narrower: refip-REFIP663
narrower: refip-REFIP721
narrower: refip-REFIP818
narrower: refip-REFIP990
notation: REFIP4398

Aveyron
type: ConceptReFip
type: Concept
broader: refip-REFIP7036
definition: Département français
in scheme: FINANCES PUBLIQUES
in scheme: Géographie
in scheme: Europe
notation: REFIP44

République du Liberia
type: ConceptReFip
type: Concept
alternative label: Liberia
broader: Afrique
definition: Pays
in scheme: FINANCES PUBLIQUES
in scheme: Géographie
in scheme: Afrique
notation: REFIP440

certificat de résidence
type: ConceptReFip
type: Concept
alternative label: attestation de résidence fiscale
alternative label: certificat de résidence fiscale
broader: documentation fiscale (non-descripteur)
definition: Document permettant aux bénéficiaires de revenus de source étrangère fiscalement domiciliés en France d'attester auprès des autorités fiscales de leur pays d'origine de leur résidence fiscale en France et ainsi de bénéficier des avantages prévus par les conventions internationales signées par la France.
in scheme: FINANCES PUBLIQUES
in scheme: Documentation Fiscale
in scheme: Fiscalité
notation: REFIP4401

principe de sincérité
type: ConceptReFip
type: Concept
alternative label: sincérité comptable
alternative label: sincérité des comptes
broader: refip-REFIP819
definition: Principe exigeant que les documents comptables révèlent aux tiers toutes les opérations jugées importantes, toutes les informations susceptibles d'avoir une influence sur leurs évaluations et leurs décisions.
in scheme: FINANCES PUBLIQUES
in scheme: Principe comptable
in scheme: Comptabilité
notation: REFIP4402

Conseil de normalisation des comptes publics
type: ConceptReFip
type: Concept
alternative label: CNOCP
broader: refip-REFIP7061
definition: Organisme consultatif placé auprès du Ministre chargé des comptes publics en charge de la normalisation comptable de toutes les personnes publiques et privées exerçant une activité non marchande et financées majoritairement par des ressources publiques, et notamment des prélèvements obligatoires. Entrent dans le champ de compétence du CNoCP l’Etat et les organismes dépendant de l'Etat, les organismes de sécurité sociale, ainsi que les collectivités territoriales et les établissements publics locaux.
in scheme: FINANCES PUBLIQUES
in scheme: Organisation Structurelle de l'Etat
in scheme: Ministère
in scheme: Administration de L'Etat
notation: REFIP4403

application DDR3
type: ConceptReFip
type: Concept
alternative label: DDR3
broader: applications gestion publique (non-descripteur)
definition: Application permettant de tenir la comptabilité générale des postes non centralisateurs.
in scheme: FINANCES PUBLIQUES
in scheme: Applications Informatiques
in scheme: Applications gestion publique
notation: REFIP4404

local commercial
type: ConceptReFip
type: Concept
alternative label: bâtiment commercial
broader: local professionnel
definition: Local destiné à accueillir une activité commerciale.
in scheme: FINANCES PUBLIQUES
in scheme: Cadastre
in scheme: Fiscalité
notation: REFIP4407

Ecole nationale de la magistrature
type: ConceptReFip
type: Concept
alternative label: ENM
broader: établissement public à caractère administratif
definition: Etablissement public à caractère administratif placé sous la tutelle du ministère de la Justice chargée de l’organisation des concours d’accès ; la formation professionnelle des auditeurs de justice - futurs magistrats français ; la formation continue des magistrats français en fonction ; la contribution à la formation de futurs magistrats d’États étrangers liés à la France par des accords de coopération.
in scheme: FINANCES PUBLIQUES
in scheme: Organisation Structurelle de l'Etat
in scheme: Opérateur de l'Etat
in scheme: Administration de L'Etat
notation: REFIP4409

immatriculation de véhicule
type: ConceptReFip
type: Concept
broader: transport routier
definition: Inscription au fichier national de l'immatriculation.
in scheme: FINANCES PUBLIQUES
in scheme: Branche d'activité
in scheme: Questions Economiques
in scheme: Transports
narrower: Fichier national des immatriculations
narrower: refip-REFIP6853
narrower: refip-REFIP960
notation: REFIP441

marine marchande
type: ConceptReFip
type: Concept
alternative label: flotte de commerce
alternative label: flotte marchande
alternative label: navire de commerce
broader: transport maritime
definition: Marine de commerce désignant tout ce qui fait l'objet d'échanges commerciaux par voies maritimes, et qui est en rapport, avec le transport maritime de marchandises ou de personnes.
in scheme: FINANCES PUBLIQUES
in scheme: Branche d'activité
in scheme: Questions Economiques
in scheme: Transports
notation: REFIP4410

distribution d'actions aux salariés (supprimé)
type: ConceptReFip
type: Concept
broader: ZZ
in scheme: FINANCES PUBLIQUES
notation: REFIP4412
scope note: Supprimé le 31/05/2016

sécurité informatique
type: ConceptReFip
type: Concept
alternative label: sécurité des systèmes d'information
broader: mission de service public
definition: Ensemble des moyens techniques, organisationnels, juridiques et humains nécessaires et mis en place par l'Etat pour conserver, rétablir, et garantir la sécurité du système d'information.
in scheme: FINANCES PUBLIQUES
in scheme: Etat
in scheme: Mission de Service Public
in scheme: Administration de L'Etat
notation: REFIP4413

validation des acquis de l'expérience
type: ConceptReFip
type: Concept
alternative label: VAE
broader: formation en milieu professionnel
definition: Mesure qui permet à toute personne, quels que soient son âge, sa nationalité, son niveau de formation ou son statut, et qui justifie d'un certain nombre de mois d'expérience en rapport direct avec la certification visée, de faire valider les acquis de son expérience pour obtenir une certification professionnelle. Cette certification peut être un diplôme, un titre ou un certificat de qualification professionnelle et doit être enregistrée au Répertoire national des certifications professionnelles.
in scheme: FINANCES PUBLIQUES
in scheme: Entreprises
in scheme: Travail
in scheme: 212619
notation: REFIP4414
related: accès à la fonction publique
related: formation professionnelle

condamnation pénale
type: ConceptReFip
type: Concept
broader: condamnation
definition: Décision prononcée par une juridiction pénale et imposant à un individu une sanction prévue par le Code Pénal à raison des agissements qui lui sont imputés (ex : peine privative de liberté, peine pécuniaire, peine privative de droits, mesures de sûreté etc…).
in scheme: FINANCES PUBLIQUES
in scheme: Principes Généraux
in scheme: Droit et Justice
in scheme: Procédure
notation: REFIP4415

comptabilité auxiliaire
type: ConceptReFip
type: Concept
alternative label: comptabilité auxiliaire de la dépense
broader: comptabilité générale de l'Etat
definition: Subdivision de la comptabilité générale qui recense dans ses comptes l'ensemble des mouvements affectant les droits et obligations de l'Etat : comptabilité auxiliaire de la dépense et comptabilité auxiliaire du recouvrement. On parle aussi de comptabilité auxiliaire lorsqu'elle détaille certains montants ne figurant qu'en masse en comptabilité générale.
in scheme: FINANCES PUBLIQUES
in scheme: Comptabilité générale de l'Etat
in scheme: Comptabilité
narrower: comptabilité développée du recouvrement
notation: REFIP4416

indice de revalorisation
type: ConceptReFip
type: Concept
broader: économie générale (non-descripteur)
definition: Indicateur permettant de revaloriser la valeur d'une grandeur à des périodes différentes (loyer, pension, prix etc,).
in scheme: FINANCES PUBLIQUES
in scheme: Questions Economiques
in scheme: Economie générale
notation: REFIP4417
related: refip-REFIP871

nom de famille
type: ConceptReFip
type: Concept
alternative label: nom patronymique
alternative label: nom usuel
alternative label: patronyme
broader: identité
definition: Partie d'un nom de personne transmise à un enfant par l'un de ses parents, ou les deux, selon les règles et coutumes en vigueur.
in scheme: FINANCES PUBLIQUES
in scheme: Droit et Justice
in scheme: Divisions du Droit
in scheme: Droit Privé
notation: REFIP442

Vaucluse
type: ConceptReFip
type: Concept
broader: Provence-Alpes-Côte d'Azur
definition: Département français
in scheme: FINANCES PUBLIQUES
in scheme: Géographie
in scheme: Europe
notation: REFIP4420

La Poste
type: ConceptReFip
type: Concept
broader: entreprise publique
definition: Le groupe La poste comprend outre l'activité historique du courrier une activité bancaire avec sa filiale La Banque Postale.
in scheme: FINANCES PUBLIQUES
in scheme: Organisation Structurelle de l'Etat
in scheme: Entreprise Publique
in scheme: Administration de L'Etat
narrower: refip-REFIP7227
notation: REFIP4422

fonds de solidarité vieillesse
type: ConceptReFip
type: Concept
alternative label: FNS
alternative label: FSV
alternative label: Fonds national de solidarité
broader: établissement public à caractère administratif
definition: Etablissement public à caractère administratif, le Fonds de solidarité vieillesse a pour mission de financer, au moyen de recettes qui lui sont affectées, divers avantages vieillesse à caractère non contributif relevant de la solidarité nationale servis par les régimes de vieillesse de la sécurité sociale.
in scheme: FINANCES PUBLIQUES
in scheme: Organisation Structurelle de l'Etat
in scheme: Opérateur de l'Etat
in scheme: Administration de L'Etat
notation: REFIP4423

usager
type: ConceptReFip
type: Concept
broader: relations avec le public
definition: Personne utilisant un service public.
in scheme: FINANCES PUBLIQUES
in scheme: Missions Transverses des Finances publiques
in scheme: Qualité de service
notation: REFIP4424

délai baisse brutale de revenu
type: ConceptReFip
type: Concept
alternative label: baisse brutale de revenu
alternative label: délai BBR
broader: délai de paiement
definition: Temps supplémentaire accordé pour le paiement de l'impôt sur le revenu, en cas de baisse significative des revenus.
in scheme: FINANCES PUBLIQUES
in scheme: Recouvrement
in scheme: Fiscalité
notation: REFIP4426
related: difficulté financière

contribution sur les revenus locatifs
type: ConceptReFip
type: Concept
alternative label: CRL
broader: impôt direct
definition: Contribution due par les bailleurs, autres que les personnes physiques, qui donnent en location des locaux achevés depuis 15 ans au moins dans le cadre de leur activité professionnelle.
in scheme: FINANCES PUBLIQUES
in scheme: Fiscalité
in scheme: Impôt
notation: REFIP4427

fonds de solidarité prioritaire
type: ConceptReFip
type: Concept
broader: fonds (non-descripteur)
definition: Outil de financement des actions de coopération du Ministère des Affaires étrangères dans le cadre de la politique d’aide au développement sous forme d’aide-projets.
in scheme: FINANCES PUBLIQUES
in scheme: Dépenses publiques
in scheme: Gestion Publique
notation: REFIP4428
scope note: Remplace fonds d'aide et de coopération

débiteur international
type: ConceptReFip
type: Concept
broader: recouvrement
definition: Débiteur étranger (Etats étrangers, certains organismes internationaux, fonctionnaires internationaux) faisant l'objet d'une action en recouvrement spécifique en application des conventions internationales.
in scheme: FINANCES PUBLIQUES
in scheme: Recouvrement
in scheme: Fiscalité
notation: REFIP443

condamnation pécuniaire
type: ConceptReFip
type: Concept
broader: condamnation
definition: Sanction. Décision prononcée par une autorité ayant pouvoir de juridiction et ordonnant de payer une somme d’argent (amende, intérêts, dommages et intérêts etc,),
in scheme: FINANCES PUBLIQUES
in scheme: Principes Généraux
in scheme: Droit et Justice
in scheme: Procédure
notation: REFIP4430

organisme de placement collectif en valeurs mobilières
type: ConceptReFip
type: Concept
alternative label: OPCVM
broader: instrument financier
definition: Intermédiaire financier qui donne à ses souscripteurs la possibilité d'investir sur des marchés financiers auxquels ils n'auraient que difficilement accès autrement (marchés financiers et monétaires étrangers, actions non cotées,...). L'activité principale des OPCVM consiste à collecter des fonds en émettant des titres financiers auprès de divers agents (particuliers, entreprises, etc.) en vue d'acquérir des actifs financiers.
in scheme: FINANCES PUBLIQUES
in scheme: Instrument financier
in scheme: Organisme de Placement Collectif en Valeurs Mobilières
in scheme: Finance
narrower: Fonds commun de placement
narrower: refip-REFIP6883
notation: REFIP4431

contrat en mains
type: ConceptReFip
type: Concept
broader: contrat
definition: Contrat dans lequel celui qui achète ne paie que le prix de son acquisition, les frais de la vente restant à la charge du vendeur.
in scheme: FINANCES PUBLIQUES
in scheme: Droit et Justice
in scheme: Divisions du Droit
in scheme: Droit Privé
notation: REFIP4433

Cambodge
type: ConceptReFip
type: Concept
broader: Asie
definition: Pays
in scheme: FINANCES PUBLIQUES
in scheme: Géographie
in scheme: Asie
notation: REFIP4434

avantage fiscal
type: ConceptReFip
type: Concept
alternative label: niche fiscale
broader: déduction fiscale
definition: Réduction d'impôt ou crédit d'impôt accordé par l'administration fiscale suite à la réalisation d'un achat ou d'une dépense par le contribuable sous respect des conditions.
in scheme: FINANCES PUBLIQUES
in scheme: Liquidation de l'Impôt
in scheme: Fiscalité
narrower: amortissement Borloo
narrower: amortissement Besson neuf
narrower: amortissement Robien classique
narrower: dispositif d'investissement locatif Scellier
narrower: dispositif d'investissement locatif Duflot
narrower: dispositif d'investissement locatif Pinel
narrower: refip-REFIP675
narrower: refip-REFIP971
notation: REFIP4435

résidence de tourisme
type: ConceptReFip
type: Concept
broader: tourisme
definition: Établissement commercial d'hébergement classé, faisant l'objet d'une exploitation permanente ou saisonnière. Elle est constituée d'un ensemble homogène de chambres ou d'appartements meublés disposés en unités collectives ou pavillonnaires, offerts en location pour une occupation temporaire à une clientèle touristique qui n'y élit pas domicile.
in scheme: FINANCES PUBLIQUES
in scheme: Branche d'activité
in scheme: Questions Economiques
in scheme: Tourisme
notation: REFIP4436
related: hôtel

duplicata
type: ConceptReFip
type: Concept
broader: document
definition: Double, copie de l'original d'une facture, d'un document.
in scheme: FINANCES PUBLIQUES
in scheme: Documentation
in scheme: Communication Documentation Informatique
notation: REFIP4437

commission syndicale de section de commune (supprimé)
type: ConceptReFip
type: Concept
broader: ZZ
in scheme: FINANCES PUBLIQUES
notation: REFIP4438

revenu foncier
type: ConceptReFip
type: Concept
broader: revenu catégoriel
definition: Revenu tiré de la location d'immeuble nu.
in scheme: FINANCES PUBLIQUES
in scheme: Champ d'Application
in scheme: Fiscalité
notation: REFIP4442

travail à domicile
type: ConceptReFip
type: Concept
alternative label: travailleur à domicile
broader: refip-REFIP6950
definition: Travail rémunéré réalisé directement au domicile de l'employé. Notion se recoupant partiellement avec celle de « télétravail ».
in scheme: FINANCES PUBLIQUES
in scheme: Entreprises
in scheme: Travail
in scheme: 212619
notation: REFIP4443

durée
type: ConceptReFip
type: Concept
broader: mots outils (liste additive)
definition: Espace de temps pendant lequel une chose dure.
in scheme: FINANCES PUBLIQUES
in scheme: Mots Outils
notation: REFIP4444

Ministère de la Défense (obsolète)
type: ConceptReFip
type: Concept
is replaced by: refip-REFIP7076
broader: ZZ
in scheme: FINANCES PUBLIQUES
notation: REFIP4445

Indre
type: ConceptReFip
type: Concept
broader: Centre-Val de Loire
definition: Département français
in scheme: FINANCES PUBLIQUES
in scheme: Géographie
in scheme: Europe
notation: REFIP4447

plan départemental de contrôle interne
type: ConceptReFip
type: Concept
alternative label: PDCI
broader: plan de contrôle
definition: Déclinaison au niveau départemental du plan national de contrôle interne en tenant compte des enjeux et risques identifiés dans le contexte local.
in scheme: FINANCES PUBLIQUES
in scheme: Missions Transverses des Finances publiques
in scheme: Maîtrise des risques
notation: REFIP4448

participation pour voirie et réseaux (supprimé)
type: ConceptReFip
type: Concept
broader: ZZ
in scheme: FINANCES PUBLIQUES
notation: REFIP4449

paiement fractionné
type: ConceptReFip
type: Concept
broader: paiement de l'impôt
definition: Modalité de paiement des droits d'enregistrement et de la taxe de publicité foncière perçue par l'Etat et les départements, et aux taxes additionnelles à ces droits, selon des modalités prévues par décret.
in scheme: FINANCES PUBLIQUES
in scheme: Recouvrement
in scheme: Fiscalité
notation: REFIP445

taxe sur les installations nucléaires de base (supprimé)
type: ConceptReFip
type: Concept
broader: ZZ
in scheme: FINANCES PUBLIQUES
notation: REFIP4450

crédit d'impôt au profit des débitants de tabac
type: ConceptReFip
type: Concept
broader: refip-REFIP849
definition: Dispositif institué au profit des entreprises exerçant une activité de débitant de tabac et ayant engagé des dépenses en vue de la rénovation de vitrines ou de l'acquisition de terminaux informatiques, sous respects des conditions
in scheme: FINANCES PUBLIQUES
in scheme: Liquidation de l'Impôt
in scheme: Fiscalité
notation: REFIP4451

imposition tardive
type: ConceptReFip
type: Concept
broader: impôt
definition: Imposition afférente à une année donnée et mise en recouvrement après le 31 décembre de ladite année.
in scheme: FINANCES PUBLIQUES
in scheme: Fiscalité
in scheme: Impôt
notation: REFIP4453

Grèce
type: ConceptReFip
type: Concept
broader: Europe
definition: Pays
in scheme: FINANCES PUBLIQUES
in scheme: Géographie
in scheme: Europe
notation: REFIP4454

investissement locatif
type: ConceptReFip
type: Concept
broader: optimisation fiscale
definition: Acquisition d'un bien immobilier pour le louer afin de se construire un patrimoine et de percevoir des revenus complémentaires.
in scheme: FINANCES PUBLIQUES
in scheme: Fiscalité - Autres notions
in scheme: Fiscalité
notation: REFIP4457
related: dispositif d'investissement locatif Scellier
related: dispositif d'investissement locatif Duflot
related: dispositif d'investissement locatif Pinel

déclaration d'insaisissabilité
type: ConceptReFip
type: Concept
broader: recouvrement
definition: Mesure prévue par le code de commerce permettant à une personne physique immatriculée à un registre de publicité légale à caractère professionnel ou exerçant une activité professionnelle agricole ou indépendante de déclarer insaisissables ses droits sur l'immeuble où est fixée sa résidence principale ainsi que sur tout bien foncier bâti ou non bâti qu'elle n'a pas affecté à son usage professionnel.
in scheme: FINANCES PUBLIQUES
in scheme: Recouvrement
in scheme: Fiscalité
notation: REFIP4459

prise illégale d'intérêt
type: ConceptReFip
type: Concept
alternative label: délit d'ingérence
broader: corruption
definition: Fait pour une personne dépositaire de l'autorité publique ou investie d'un mandat électif public ou chargée d'une mission de service public, de prendre ou de conserver un intérêt quelconque dans une activité sur laquelle elle dispose du fait de sa fonction d'un pouvoir de décision, ou qu'elle a la charge de payer ou de gérer.
in scheme: FINANCES PUBLIQUES
in scheme: Droit et Justice
in scheme: Infractions et Sanctions
in scheme: Infraction
notation: REFIP446

prescription biennale
type: ConceptReFip
type: Concept
broader: prescription
definition: Extinction de l'exercice d'un droit dans le délai de deux ans en matière de droit des assurances.
in scheme: FINANCES PUBLIQUES
in scheme: Droit et Justice
in scheme: Droit Général
notation: REFIP4460

Conseil d'Etat
type: ConceptReFip
type: Concept
broader: juridiction administrative
definition: Juridiction administrative suprême qui, lorsqu'elle statue au contentieux, est juge d'appel ou de cassation à l'égard des jugements des tribunaux administratifs. Le Conseil d’État est le conseiller du Gouvernement. Il est chargé de donner son avis sur la légalité et l’opportunité des projets de lois et des projets de certains décrets.
in scheme: FINANCES PUBLIQUES
in scheme: Droit et Justice
in scheme: Juridiction
in scheme: Organisation Juridictionnelle
notation: REFIP4461

habilitation
type: ConceptReFip
type: Concept
broader: application informatique
definition: Droit d’accès, attribué à un intervenant, au système d’information et/ou aux transactions autorisées (”profil”).
in scheme: FINANCES PUBLIQUES
in scheme: Informatique
in scheme: Communication Documentation Informatique
narrower: délégation d'habilitation
narrower: profil utilisateur
notation: REFIP4462

acquisition amiable
type: ConceptReFip
type: Concept
broader: affectation de biens
definition: Acquisition à caractère immobilier qui s'effectue d'un commun accord entre les deux parties selon les règles du droit civil.
in scheme: FINANCES PUBLIQUES
in scheme: Domaine
in scheme: Gestion Publique
notation: REFIP4463

opposition à exécution
type: ConceptReFip
type: Concept
alternative label: opposition à titre de perception exécutoire
alternative label: opposition à un titre exécutoire
broader: opposition
in scheme: FINANCES PUBLIQUES
in scheme: Recouvrement
in scheme: Fiscalité
notation: REFIP4464

portage salarial
type: ConceptReFip
type: Concept
broader: gestion de l'entreprise (non-descripteur)
definition: Relation contractuelle tripartite dans laquelle un salarié porté ayant un contrat de travail avec une entreprise de portage salarial effectue une prestation pour le compte d'entreprises clientes.
in scheme: FINANCES PUBLIQUES
in scheme: Gestion de l'Entreprise
in scheme: Entreprises
in scheme: Vie et Gestion de l'entreprise
notation: REFIP4465

droit indivis
type: ConceptReFip
type: Concept
broader: indivision
definition: Droit détenu par les propriétaires d'un bien indivis, leur octroyant une valeur égale de la valeur dudit bien, car il est impossible de le diviser matériellement.
in scheme: FINANCES PUBLIQUES
in scheme: Droit et Justice
in scheme: Divisions du Droit
in scheme: Droit Privé
notation: REFIP4466

subvention
type: ConceptReFip
type: Concept
broader: aide publique
definition: Aide financière réelle, qui n'est ni un prêt ni une avance de trésorerie, accordée par l'Etat, une collectivité territoriale ou un organisme privé pour financer ou favoriser le développement d'une activité d'intérêt général ou, à titre de secours, pour subvenir à un cas pressant.
in scheme: FINANCES PUBLIQUES
in scheme: Dépenses publiques
in scheme: Gestion Publique
narrower: subvention d'équipement
narrower: subvention pour charges de service public
narrower: subvention d'équilibre
narrower: subvention d'exploitation
notation: REFIP4467
related: ressources propres

catastrophe naturelle
type: ConceptReFip
type: Concept
alternative label: avalanche
alternative label: cyclone
alternative label: glissement de terrain
alternative label: inondation
alternative label: ouragan
alternative label: raz de marée
alternative label: risque naturel majeur
alternative label: séisme
alternative label: tempête
alternative label: tornade
alternative label: tremblement de terre
alternative label: tsunami
alternative label: éruption volcanique
broader: dégradation de l'environnement
definition: Evènements climatiques, sismiques ou astronomiques majeurs.
in scheme: FINANCES PUBLIQUES
in scheme: Environnement
in scheme: Dégradation de l'Environnement
in scheme: Questions de Société
narrower: canicule
notation: REFIP4468
related: intempéries
related: calamité agricole
related: refip-REFIP6861
related: refip-REFIP714

commune
type: ConceptReFip
type: Concept
broader: collectivité territoriale
definition: Plus petite subdivision administrative française, les communes sont au nombre d'environ 36 000.
in scheme: FINANCES PUBLIQUES
in scheme: Organisation Territoriale
in scheme: Structures Territoriales
in scheme: Administration de L'Etat
narrower: conseil municipal
narrower: section de commune
narrower: refip-REFIP76
notation: REFIP4469

République de Guinée
type: ConceptReFip
type: Concept
alternative label: Guinée
alternative label: Guinée Conakry
broader: Afrique
definition: Pays
in scheme: FINANCES PUBLIQUES
in scheme: Géographie
in scheme: Afrique
notation: REFIP447

période comptable
type: ConceptReFip
type: Concept
alternative label: période de clôture
alternative label: période spéciale
broader: fin de gestion
definition: Période au terme de laquelle les écritures sont arrêtées comptablement, la période comptable de base est la journée. Le caractère définitif des enregistrements au cours d’une période comptable est assuré par une procédure d’arrêté (ou clôture), qui interdit toute modification ou suppression des enregistrements.
in scheme: FINANCES PUBLIQUES
in scheme: Procédures et Techniques Comptables
in scheme: Comptabilité
notation: REFIP4470

Nouvelle-Calédonie
type: ConceptReFip
type: Concept
broader: collectivités et territoires d'outre mer (non-descripteur)
definition: Collectivité d'outre-mer
in scheme: FINANCES PUBLIQUES
in scheme: Géographie
in scheme: Europe
notation: REFIP4471

service civique
type: ConceptReFip
type: Concept
alternative label: contrat de volontariat associatif
broader: mission de service public
definition: Engagement volontaire au service de l'intérêt général, ouvert à tous les jeunes de 16 à 25 ans, sans conditions de diplôme. Le Service Civique peut être effectué auprès d’associations, de collectivités territoriales ou d’établissements publics, sur une période de 6 à 12 mois en France ou à l'étranger, pour une mission d'au moins 24h par semaine.
in scheme: FINANCES PUBLIQUES
in scheme: Etat
in scheme: Administration de L'Etat
notation: REFIP4472

commission départementale de financement de l'économie
type: ConceptReFip
type: Concept
alternative label: CDFE
broader: structure locale (non-descripteur)
definition: Commission départementale créée afin de mieux suivre l'activité économique au sein de chaque département. Elle a pour missions d'informer les acteurs économiques des mesures prises au niveau national et de leurs objectifs ; d'effectuer un diagnostic de la situation locale et en particulier du rétablissement d’un fonctionnement normal du marché du crédit aux entreprises ; de décliner au plan local et suivre de manière précise et régulière les engagements pris par les banques au niveau national.
in scheme: FINANCES PUBLIQUES
in scheme: Organisation Territoriale
in scheme: Structures Territoriales
in scheme: Administration de L'Etat
notation: REFIP4473

commission pour la transparence et la qualité des opérations immobilières de l'Etat
type: ConceptReFip
type: Concept
broader: refip-REFIP7061
definition: Instance compétente pour contrôler les opérations immobilières de l'Etat les plus importantes en matière de cessions, prises à bail et acquisitions. Elle doit être obligatoirement consultée avant toute cession de gré à gré d'un immeuble appartenant à l'Etat dont la valeur vénale estimée est supérieure à deux millions d'euros. A ce titre, elle se prononce sur la possibilité de procéder à la cession envisagée et sur la qualité des procédures employées. La commission peut également être saisie de toute question relative à la régularité des projets d'opérations immobilières de l'Etat portant sur des cessions, acquisitions ou conclusions de baux.
in scheme: FINANCES PUBLIQUES
in scheme: Organisation Structurelle de l'Etat
in scheme: Ministère
in scheme: Administration de L'Etat
notation: REFIP4475

convoyeur de fonds
type: ConceptReFip
type: Concept
broader: transport de fonds
definition: Personne qui assure le transport d'argent liquide, de bijoux, de métaux précieux ou de documents permettant d'effectuer un paiement. Elle est chargée de les protéger contre les risques de vol.
in scheme: FINANCES PUBLIQUES
in scheme: Branche d'activité
in scheme: Questions Economiques
in scheme: Transports
notation: REFIP4476

coupe de bois
type: ConceptReFip
type: Concept
alternative label: abattage d'arbres
broader: exploitation forestière
definition: Aménagement suivant lequel on coupe chaque année une portion de bois déterminée pour améliorer les peuplements ou la récolte de produits arrivés à maturité.
in scheme: FINANCES PUBLIQUES
in scheme: Branche d'activité
in scheme: Questions Economiques
in scheme: Agriculture
notation: REFIP4478

Vienne
type: ConceptReFip
type: Concept
broader: refip-REFIP7020
definition: Département français
in scheme: FINANCES PUBLIQUES
in scheme: Géographie
in scheme: Europe
notation: REFIP4479

application EDEN-RH
type: ConceptReFip
type: Concept
alternative label: EDEN-RH
broader: applications missions transverses (non-descripteur)
definition: Application d'évaluation et de notation des agents de la DGFIP.
in scheme: FINANCES PUBLIQUES
in scheme: Applications missions transverses
in scheme: Applications Informatiques
notation: REFIP448
scope note: Remplace les applications EVALNOT et EDEN à compter du 01/01/2013

participation financière
type: ConceptReFip
type: Concept
broader: gestion de l'entreprise (non-descripteur)
definition: Mécanisme financier permettant d'attribuer aux salariés d'une entreprise une fraction de ses profits sous réserve d'un accord signé entre la direction de l'entreprise et les instances représentatives du personnel.
in scheme: FINANCES PUBLIQUES
in scheme: Gestion de l'Entreprise
in scheme: Entreprises
in scheme: Vie et Gestion de l'entreprise
narrower: bon de souscription de part de créateur d'entreprise
narrower: déblocage anticipé de la participation
narrower: distribution de réserves
narrower: épargne salariale
notation: REFIP4480

délégation de signature
type: ConceptReFip
type: Concept
broader: droit administratif
definition: Habilitation donnée par une autorité administrative, dans les limites légales, à un agent nominativement désigné d'exercer, concurremment avec elle, une ou plusieurs de ses compétences en signant au nom du délégant les décisions correspondantes, le délégant n'est pas dessaisi de ses compétences,
in scheme: FINANCES PUBLIQUES
in scheme: Droit et Justice
in scheme: Divisions du Droit
in scheme: Droit Public
notation: REFIP4481

évaluation cadastrale
type: ConceptReFip
type: Concept
alternative label: évaluation foncière
broader: cadastre
definition: Mode de calcul de la base d'imposition des impôts directs locaux constituée par la valeur locative cadastrale.
in scheme: FINANCES PUBLIQUES
in scheme: Cadastre
in scheme: Fiscalité
narrower: révision des valeurs locatives
notation: REFIP4483

vice de forme
type: ConceptReFip
type: Concept
broader: condition de forme
definition: Irrégularité résultant de l'inobservation d'une formalité requise dans la conclusion ou la rédaction d'un acte (contrat, acte de procédure, etc.) en général sanctionnée par la nullité de l'acte.
in scheme: FINANCES PUBLIQUES
in scheme: Droit et Justice
in scheme: Divisions du Droit
in scheme: Droit Privé
notation: REFIP4485

déchets industriels et commerciaux
type: ConceptReFip
type: Concept
broader: déchets
definition: Déchets provenant des industries et des commerces. Ils sont assimilables aux ordures ménagères et doivent pouvoir être transportés et traités sans contraintes techniques particulières, contrairement aux déchets industriels spéciaux.
in scheme: FINANCES PUBLIQUES
in scheme: Environnement
in scheme: Dégradation de l'Environnement
in scheme: Questions de Société
notation: REFIP4486

coopération intercommunale
type: ConceptReFip
type: Concept
alternative label: intercommunalité
broader: secteur public local
definition: Structure administrative française regroupant plusieurs collectivités pour exercer des compétences en commun. La coopération intercommunale peut prendre la forme de plusieurs types d'établissements intercommunaux (EPCI) : syndicats de communes, syndicats mixtes, communautés urbaines, communautés de communes, communautés d'agglomération, syndicats d'agglomération nouvelle. Elles sont distinguées par leur degré d'intégration, reflété par leur régime fiscal : avec ou sans fiscalité propre.
in scheme: FINANCES PUBLIQUES
in scheme: Secteur public local
in scheme: Gestion Publique
narrower: charte intercommunale de développement et d'aménagement
narrower: groupement de coopération sanitaire
narrower: schéma départemental de coopération intercommunale
narrower: groupement de communes
narrower: société publique locale d'aménagement
narrower: coopération transfrontalière
narrower: groupement de coopération sociale et médico-sociale
narrower: coopération décentralisée
narrower: scission de communes
narrower: allocation compensatrice
narrower: refip-REFIP89
notation: REFIP4487
related: fusion d'établissements publics de coopération intercommunale

déclaration d'échanges de biens
type: ConceptReFip
type: Concept
alternative label: DEB
broader: documentation fiscale (non-descripteur)
definition: Document douanier communautaire destiné à informer la Douane française des échanges de biens intracommunautaires, permettant ainsi de veiller au respect des règles de la TVA et de lutter contre les trafics frauduleux.
in scheme: FINANCES PUBLIQUES
in scheme: Documentation Fiscale
in scheme: Fiscalité
notation: REFIP4489

taxe additionnelle à la cotisation sur la valeur ajoutée des entreprises
type: ConceptReFip
type: Concept
alternative label: taxe additionnelle CVAE
broader: impôt direct local
definition: Taxe perçue au profit des établissements du réseau des chambres de commerce et d'industrie de région.
in scheme: FINANCES PUBLIQUES
in scheme: Fiscalité
in scheme: Impôt
notation: REFIP449

vente à tempérament
type: ConceptReFip
type: Concept
broader: vente
definition: Variété de vente à crédit dans laquelle le paiement du prix est fractionné en plusieurs versements échelonnés sur une certaine durée. Cette vente est assimilée à une opération de crédit.
in scheme: FINANCES PUBLIQUES
in scheme: Droit et Justice
in scheme: Divisions du Droit
in scheme: Droit Privé
notation: REFIP4490

application RCE
type: ConceptReFip
type: Concept
alternative label: RCE
broader: applications fiscales (non-descripteur)
definition: Application permettant l'encaissement de masse de titres interbancaires de paiement (TIP) et des chèques pour le paiement des impôts, amendes, secteur local, produits divers, produits DGDDI.
in scheme: FINANCES PUBLIQUES
in scheme: Applications Informatiques
in scheme: Applications fiscales
notation: REFIP4494

langage parlé complété
type: ConceptReFip
type: Concept
alternative label: LPC
broader: information
definition: Code rendant visible un message verbal aux personnes souffrant d'une défaillance auditive.
in scheme: FINANCES PUBLIQUES
in scheme: Communication
in scheme: Communication Documentation Informatique
notation: REFIP4495

créance prioritaire (supprimé)
type: ConceptReFip
type: Concept
broader: ZZ
in scheme: FINANCES PUBLIQUES
notation: REFIP4496

obligation d'obéissance hiérarchique
type: ConceptReFip
type: Concept
alternative label: obligation d'obéissance
alternative label: obéissance hiérarchique
alternative label: refus d'obéissance
broader: refip-REFIP6565
definition: Obligation pour chaque agent de se conformer aux instructions de son supérieur hiérarchique. Cette obligation a toutefois quelques limites notamment si l'ordre donné est illégal ou en cas de d'exercice du droit de retrait.
in scheme: FINANCES PUBLIQUES
in scheme: Gestion des ressources humaines
in scheme: Fonction Publique et Gestion des Ressources Humaines
notation: REFIP4497

crédit d'impôt sur produits financiers (supprimé)
type: ConceptReFip
type: Concept
broader: ZZ
in scheme: FINANCES PUBLIQUES
notation: REFIP4498

agent commercial
type: ConceptReFip
type: Concept
alternative label: agent d'affaire
alternative label: intermédiaire de commerce
broader: commerce
definition: Intermédiaire agissant pour le compte d'un fournisseur auprès de clients, l'agent commercial exerce une profession indépendante . C'est un mandataire chargé, de façon permanente et indépendante, de négocier et éventuellement de conclure des contrats de vente, d'achat, de location ou de prestations de services, au nom et pour le compte d'autres entreprises.
in scheme: FINANCES PUBLIQUES
in scheme: Branche d'activité
in scheme: Questions Economiques
in scheme: Commerce
narrower: démarchage
notation: REFIP4499

dépenses engagées
type: ConceptReFip
type: Concept
broader: refip-REFIP996
definition: Dépenses présentant le caractère d'une dette certaine dans son principe et dans son montant ce qui implique que la créance correspondante soit considérée comme acquise par l'autre contractant.
in scheme: FINANCES PUBLIQUES
in scheme: Dépenses publiques
in scheme: Gestion Publique
notation: REFIP450

groupement d'entreprises
type: ConceptReFip
type: Concept
broader: candidature à un marché public
definition: Groupement d'entreprises constitué pour répondre à un marché public.
in scheme: FINANCES PUBLIQUES
in scheme: Commande publique
in scheme: Gestion Publique
narrower: groupement conjoint
narrower: groupement solidaire
notation: REFIP4500

tiers déclarant
type: ConceptReFip
type: Concept
broader: fiscalité
definition: Organismes (Caisses, Établissements bancaires…) ou entreprises déclarant à l'administration fiscale des sommes versées à des tiers.
in scheme: FINANCES PUBLIQUES
in scheme: Fiscalité - Autres notions
in scheme: Fiscalité
notation: REFIP4501

non-résident
type: ConceptReFip
type: Concept
alternative label: contribuable domicilié à l'étranger
broader: territorialité de l'impôt
definition: Contribuable de nationalité française ou étrangère, domicilié fiscalement hors de France et disposant de revenus de source française, quelle que soit sa profession, ainsi que les fonctionnaires et agents de l'État en service hors de France.
in scheme: FINANCES PUBLIQUES
in scheme: Champ d'Application
in scheme: Fiscalité
narrower: non-résident Schumacker
notation: REFIP4502

recours pour excès de pouvoir
type: ConceptReFip
type: Concept
alternative label: excès de pouvoir
alternative label: recours en annulation
broader: refip-REFIP885
definition: Demande d'un fonctionnaire ou d'un agent non titulaire (le demandeur ou requérant) d'annulation d'une décision administrative. Dans le cadre d'un recours pour excès de pouvoir, le juge administratif contrôle la légalité de la décision et l'annule ou la valide.
in scheme: FINANCES PUBLIQUES
in scheme: Procédure Administrative
in scheme: Droit et Justice
in scheme: Procédure
notation: REFIP4503

commission consultative des marchés publics
type: ConceptReFip
type: Concept
alternative label: CCM
alternative label: CCMP
alternative label: Commission centrale des marches
broader: marché public
definition: Instance qui a pour mission d'assister les acheteurs publics pour l'élaboration ou la passation des marchés publics et des accords-cadres.
in scheme: FINANCES PUBLIQUES
in scheme: Commande publique
in scheme: Gestion Publique
notation: REFIP4504
scope note: supprimée par le Décret n° 2013-420 du 23 mai 2013

désignation
type: ConceptReFip
type: Concept
broader: mots outils (liste additive)
definition: Fait de choisir, d'élire quelqu'un.
in scheme: FINANCES PUBLIQUES
in scheme: Mots Outils
notation: REFIP4505

assistance technique
type: ConceptReFip
type: Concept
alternative label: assistance informatique
broader: informatique
definition: Support technique apportant un complément de savoir-faire destiné à résoudre un problème aux utilisateurs d'un logiciel ou d'un matériel.
in scheme: FINANCES PUBLIQUES
in scheme: Informatique
in scheme: Communication Documentation Informatique
narrower: aide en ligne
notation: REFIP4506

vétérinaire
type: ConceptReFip
type: Concept
broader: activité libérale
definition: Praticien libéral, spécialiste de la médecine et de la chirurgie des animaux.
in scheme: FINANCES PUBLIQUES
in scheme: Branche d'activité
in scheme: Questions Economiques
in scheme: Services et professions libérales
notation: REFIP4507

nomenclature budgétaire de l'Etat
type: ConceptReFip
type: Concept
broader: exécution du budget
definition: Liste permettant, dans le cadre de la LOLF, l’identification des engagements et des dépenses en fonction de leur destination et de leur nature.
in scheme: FINANCES PUBLIQUES
in scheme: Exécution du budget
in scheme: Budget
narrower: domaine fonctionnel
notation: REFIP4508

centre hospitalier régional
type: ConceptReFip
type: Concept
alternative label: CHR
alternative label: hôpital régional
broader: établissement public de santé
definition: Centre hospitalier ayant une vocation régionale liée à leur haute spécialisation et assurant en outre les soins courants à la population proche.
in scheme: FINANCES PUBLIQUES
in scheme: Organisation Territoriale
in scheme: Structures Territoriales
in scheme: Administration de L'Etat
narrower: Assistance publique-hôpitaux de Marseille
narrower: centre hospitalier universitaire
narrower: refip-REFIP665
notation: REFIP4509

échange automatique d'information
type: ConceptReFip
type: Concept
broader: fiscalité internationale
definition: Norme définie par l'OCDE selon laquelle les pays signent des accords pour échanger automatiquement (et non plus sur demande) les informations des comptes bancaires détenus par des personnes physiques ou morales résidant dans tout état signataire.
in scheme: FINANCES PUBLIQUES
in scheme: Champ d'Application
in scheme: Fiscalité
notation: REFIP451
scope note: Fiscalité internationale

bétail
type: ConceptReFip
type: Concept
alternative label: bovin
alternative label: élevage bovin
broader: élevage
definition: Ensemble des animaux d'un élevage, à l'exception de la volaille.
in scheme: FINANCES PUBLIQUES
in scheme: Branche d'activité
in scheme: Questions Economiques
in scheme: Agriculture
notation: REFIP4510

centre de traitement automatisé de l'information (supprimé)
type: ConceptReFip
type: Concept
broader: ZZ
in scheme: FINANCES PUBLIQUES
notation: REFIP4511

valeur nette comptable
type: ConceptReFip
type: Concept
alternative label: VNC
alternative label: valeur comptable nette
broader: actif
definition: Valeur brute d'un actif diminuée des amortissements et provisions pour dépréciations.
in scheme: FINANCES PUBLIQUES
in scheme: Documents comptables
in scheme: Comptabilité
notation: REFIP4512

distribution de réserves
type: ConceptReFip
type: Concept
broader: participation financière
definition: Prélèvements effectués sur les bénéfices réalisés par une société avant qu'ils ne soient distribués aux associés, dans un but de prévoyance.
in scheme: FINANCES PUBLIQUES
in scheme: Gestion de l'Entreprise
in scheme: Entreprises
in scheme: Vie et Gestion de l'entreprise
notation: REFIP4513

comité technique d'établissement
type: ConceptReFip
type: Concept
broader: établissement public de santé
definition: Instance représentative du personnel dotée de compétences consultatives sur les sujets ayant une incidence sur le fonctionnement et sur l’organisation de l’établissement public de santé.
in scheme: FINANCES PUBLIQUES
in scheme: Organisation Territoriale
in scheme: Structures Territoriales
in scheme: Administration de L'Etat
notation: REFIP4514

qualité comptable
type: ConceptReFip
type: Concept
alternative label: qualité des comptes
broader: refip-REFIP819
definition: Obligation impliquant que les comptes des opérateurs et organismes relevant de l’État, qui sont repris dans sa comptabilité, soient eux-mêmes réguliers, sincères et fidèles.
in scheme: FINANCES PUBLIQUES
in scheme: Principe comptable
in scheme: Comptabilité
notation: REFIP4515

droit d'apport (supprimé)
type: ConceptReFip
type: Concept
broader: ZZ
in scheme: FINANCES PUBLIQUES
notation: REFIP4516

société civile professionnelle
type: ConceptReFip
type: Concept
broader: société civile
definition: Société créée par au moins deux associés, exerçant une même profession : avocats, notaires, commissaires-priseurs, commissaires aux comptes, avoués, huissiers de justice...qui ont décidé d'exercer en commun. Une telle société ne peut être constituée qu'entre membres de professions libérales réglementées.
in scheme: FINANCES PUBLIQUES
in scheme: Société
in scheme: Entreprises
in scheme: Forme juridique
notation: REFIP4518

application ALTAIR
type: ConceptReFip
type: Concept
alternative label: ALTAIR
broader: applications gestion publique (non-descripteur)
definition: Applicatif permettant la tenue des comptes de dépôts de fonds au Trésor.
in scheme: FINANCES PUBLIQUES
in scheme: Applications Informatiques
in scheme: Applications gestion publique
notation: REFIP452

affrètement
type: ConceptReFip
type: Concept
broader: transport de marchandises
definition: Contrat par lequel un armateur appelé fréteur s'engage à mettre un bâtiment à la disposition d'un affréteur moyennant le paiement d'une somme appelée fret.
in scheme: FINANCES PUBLIQUES
in scheme: Branche d'activité
in scheme: Questions Economiques
in scheme: Transports
notation: REFIP4520

société de capitaux
type: ConceptReFip
type: Concept
alternative label: société par actions
broader: société commerciale
definition: Société commerciale, dont la responsabilité des actionnaires est limitée à leur mise de fonds, sauf exception. Les titres de propriété représentant ces capitaux sont appelées actions et sont librement négociables et transmissibles. La société a pour objectif de réaliser des bénéfices et de les répartir, le cas échéant, entre les actionnaires sous forme de dividendes.
in scheme: FINANCES PUBLIQUES
in scheme: Société
in scheme: Entreprises
in scheme: Forme juridique
narrower: société de capital risque
narrower: société d'investissement immobilier cotée
narrower: société en commandité par action
narrower: société par actions simplifiée
narrower: société anonyme
narrower: refip-REFIP813
notation: REFIP4521

principe de spécialité budgétaire
type: ConceptReFip
type: Concept
alternative label: principe de spécialité du budget de l'Etat
alternative label: spécialité budgétaire
alternative label: spécialité du budget de l'Etat
broader: principe budgétaire
definition: Principe imposant d’indiquer précisément le montant et la nature des opérations prévues par la loi de finances, ce qui implique une nomenclature budgétaire appropriée. Les crédits sont ainsi ouverts de manière détaillée, spécialisés par programmes depuis la mise en œuvre de la LOLF, et sont tous rattachés à une destination spécifique, qui ne doit pas être dénaturée en exécution par le Gouvernement. Le principe de spécialité vise à assurer une information suffisante pour permettre l’exercice d’un contrôle efficace sur l’exécution du budget de l’État.
in scheme: FINANCES PUBLIQUES
in scheme: Élaboration du budget
in scheme: Budget
notation: REFIP4522

timbres.impots.gouv
type: ConceptReFip
type: Concept
broader: applications fiscales (non-descripteur)
definition: Site internet de vente de timbres fiscaux électroniques permettant de s'acquitter des droits de certaines formalités administratives.
in scheme: FINANCES PUBLIQUES
in scheme: Applications Informatiques
in scheme: Applications fiscales
notation: REFIP4523

publicité des marchés publics
type: ConceptReFip
type: Concept
broader: passation des marchés publics
definition: Règle que doit respecter l'acheteur public, dans le cadre de marché public, afin de garantir une concurrence satisfaisante, dans les conditions fixées par la réglementation , selon l'objet du marché et la valeur estimée du besoin de l'organisme concerné.
in scheme: FINANCES PUBLIQUES
in scheme: Commande publique
in scheme: Gestion Publique
notation: REFIP4524

extranet
type: ConceptReFip
type: Concept
broader: internet
definition: Réseau de télécommunication constitué d'un intranet étendu, accessible à l'extérieur de l'entreprise, permettant la communication avec certains organismes extérieurs, comme des clients ou des fournisseurs.
in scheme: FINANCES PUBLIQUES
in scheme: Communication
in scheme: Communication Documentation Informatique
notation: REFIP4525

Cour des comptes européenne
type: ConceptReFip
type: Concept
broader: juridiction financière
definition: Chargée du contrôle de la légalité et de la régularité ainsi que de la bonne gestion financière des recettes et dépenses des institutions de l'Union européenne.
in scheme: FINANCES PUBLIQUES
in scheme: Droit et Justice
in scheme: Juridiction
in scheme: Organisation Juridictionnelle
notation: REFIP4526

application ADELIE
type: ConceptReFip
type: Concept
alternative label: ADELIE
broader: applications fiscales (non-descripteur)
definition: Application à destination des agents de la DGFIP et des usagers professionnels, permettant un accès aux données fiscales des entreprises.
in scheme: FINANCES PUBLIQUES
in scheme: Applications Informatiques
in scheme: Applications fiscales
notation: REFIP4527

taxe sur les ventes et les locations de vidéogrammes
type: ConceptReFip
type: Concept
broader: refip-REFIP934
definition: Taxe due par les redevables qui vendent ou louent des vidéogrammes à toute personne qui elle-même n'a pas pour activité la vente ou la location de vidéogrammes. Est assimilée à une activité de vente ou de location de vidéogrammes la mise à disposition du public d'un service offrant l'accès à titre onéreux à des oeuvres cinématographiques ou audiovisuelles, sur demande individuelle formulée par un procédé de communication électronique.
in scheme: FINANCES PUBLIQUES
in scheme: Fiscalité
in scheme: Impôt
notation: REFIP4528

taxe locale d'équipement
type: ConceptReFip
type: Concept
alternative label: TLE
broader: taxes et redevance de nature immobilière (non-descripteur)
definition: Imposition forfaitaire et générale grevant les opérations de construction, affectée au financement des dépenses générales d’urbanisation de la commune. Elle est perçue au profit de la commune ou de certains groupements de communes compétents pour la réalisation d’équipements d’infrastructure.
in scheme: FINANCES PUBLIQUES
in scheme: Fiscalité
in scheme: Impôt
notation: REFIP4529
scope note: Remplacée par la taxe d'aménagement à compter du 01/03/2012

dossier de marché public
type: ConceptReFip
type: Concept
alternative label: dossier de candidature à un marché public
alternative label: dossier de consultation des entreprises
broader: candidature à un marché public
definition: Ensemble de documents comprenant la lettre de candidature DC1, la déclaration du candidat DC2 le cas échéant, la déclaration de sous-traitance DC4.
in scheme: FINANCES PUBLIQUES
in scheme: Commande publique
in scheme: Gestion Publique
notation: REFIP453

Commission des marchés publics de l'Etat (supprimé)
type: ConceptReFip
type: Concept
broader: ZZ
in scheme: FINANCES PUBLIQUES
notation: REFIP4530

Ministère de la Culture et de la Communication (obsolète)
type: ConceptReFip
type: Concept
is replaced by: refip-REFIP7064
broader: ZZ
in scheme: FINANCES PUBLIQUES
notation: REFIP4531

vacance de maison
type: ConceptReFip
type: Concept
alternative label: vacance d'immeuble
broader: inexploitation d'immeuble
definition: Fait pour une maison ou un immeuble d'être inoccupé et constituant sous certaines conditions un motif de dégrèvement en matière de taxe foncière.
in scheme: FINANCES PUBLIQUES
in scheme: Cadastre
in scheme: Fiscalité
notation: REFIP4534

état de développement des soldes
type: ConceptReFip
type: Concept
broader: documents comptables
definition: Document comptable détaillant par écriture comptable, le solde d’un compte.
in scheme: FINANCES PUBLIQUES
in scheme: Documents comptables
in scheme: Comptabilité
notation: REFIP4537

régime dérogatoire
type: ConceptReFip
type: Concept
broader: régime d'imposition
definition: Régime fiscal particulier dérogeant au régime général.
in scheme: FINANCES PUBLIQUES
in scheme: Régime d'Imposition
in scheme: Fiscalité
narrower: régime fiscal privilégié
notation: REFIP4538

Office national de l'eau et des milieux aquatiques (obsolète)
type: ConceptReFip
type: Concept
is replaced by: refip-REFIP7079
broader: ZZ
in scheme: FINANCES PUBLIQUES
notation: REFIP4539

juridiction administrative
type: ConceptReFip
type: Concept
broader: juridiction
definition: Ensemble des tribunaux de l'ordre administratif, normalement soumises au contrôle du Conseil d'État.
in scheme: FINANCES PUBLIQUES
in scheme: Droit et Justice
in scheme: Juridiction
in scheme: Organisation Juridictionnelle
narrower: Conseil d'Etat
narrower: Cour administrative d'appel
narrower: tribunal administratif
notation: REFIP454

Sarthe
type: ConceptReFip
type: Concept
broader: Pays de la Loire
definition: Département français
in scheme: FINANCES PUBLIQUES
in scheme: Géographie
in scheme: Europe
notation: REFIP4541

opposition à saisie
type: ConceptReFip
type: Concept
broader: opposition à poursuites
definition: Les contribuables peuvent faire opposition aux saisies que l'administration fiscale a engagées à leur encontre dans les conditions de l'opposition à poursuites.
in scheme: FINANCES PUBLIQUES
in scheme: Recouvrement
in scheme: Fiscalité
notation: REFIP4542

exception d'illégalité
type: ConceptReFip
type: Concept
broader: procédure administrative
definition: Moyen de défense procédural par lequel une partie allègue en cours d'instance l'illégalité de l'acte administratif qui lui est opposé.
in scheme: FINANCES PUBLIQUES
in scheme: Procédure Administrative
in scheme: Droit et Justice
in scheme: Procédure
notation: REFIP4543

Direction générale de l'armement
type: ConceptReFip
type: Concept
alternative label: DGA
broader: refip-REFIP7076
definition: Direction du ministère de la Défense, maître d'ouvrage des programmes d'armement, la DGA est responsable de la conception, de l'acquisition et de l'évaluation des équipements des forces armées. Elle a pour mission d'anticiper les menaces et les risques dans le cadre européen, et de promouvoir les exportations d'armement.
in scheme: FINANCES PUBLIQUES
in scheme: Organisation Structurelle de l'Etat
in scheme: Ministère
in scheme: Administration de L'Etat
notation: REFIP4544

application ANGELIS
type: ConceptReFip
type: Concept
alternative label: ANGELIS
broader: applications gestion publique (non-descripteur)
definition: Application de gestion et de liquidation de toutes les successions vacantes gérées par le Domaine.
in scheme: FINANCES PUBLIQUES
in scheme: Applications Informatiques
in scheme: Applications gestion publique
notation: REFIP4545
scope note: Remplace l'application SAGIS en 2015

Loire-Atlantique
type: ConceptReFip
type: Concept
broader: Pays de la Loire
definition: Département français
in scheme: FINANCES PUBLIQUES
in scheme: Géographie
in scheme: Europe
notation: REFIP4546

amende civile
type: ConceptReFip
type: Concept
broader: amende
definition: Sanction pécuniaire prévue par une loi civile et prononcée par une juridiction civile en cas de violation de certaines règles juridiques limitativement énumérées.
in scheme: FINANCES PUBLIQUES
in scheme: Droit et Justice
in scheme: Sanction
in scheme: Infractions et Sanctions
notation: REFIP4547

fraude sur internet
type: ConceptReFip
type: Concept
broader: fraude
definition: Acte illégal consistant à tromper, escroquer par le biais de site internet (fraude carte bancaires, annonces frauduleuses, phishing etc,).
in scheme: FINANCES PUBLIQUES
in scheme: Droit et Justice
in scheme: Infractions et Sanctions
in scheme: Infraction
narrower: refip-REFIP904
notation: REFIP4548

occurrence fiscale
type: ConceptReFip
type: Concept
broader: fiscalité
definition: Référence d'une obligation fiscale dans les référentiels DGFIP.
in scheme: FINANCES PUBLIQUES
in scheme: Fiscalité - Autres notions
in scheme: Fiscalité
notation: REFIP4549

index travaux publics
type: ConceptReFip
type: Concept
broader: révision de prix
definition: Indices de coût de différentes activités du secteur de la construction.
in scheme: FINANCES PUBLIQUES
in scheme: Commande publique
in scheme: Gestion Publique
notation: REFIP455

Malte
type: ConceptReFip
type: Concept
alternative label: République de Malte
alternative label: île de Malte
broader: Europe
definition: Pays
in scheme: FINANCES PUBLIQUES
in scheme: Géographie
in scheme: Europe
notation: REFIP4551

responsabilité des comptables
type: ConceptReFip
type: Concept
definition: Responsabilité spécifique aux comptables publics s'ajoutant à la responsabilité attachée à leur qualité d'agent public. Les comptables publics sont personnellement et pécuniairement responsables du recouvrement des recettes, du paiement des dépenses, de la garde et de la conservation des fonds et valeurs, du maniement des fonds et des mouvements de comptes de disponibilités, de la conservation des pièces justificatives des opérations et documents de comptabilité ainsi que de la tenue de la comptabilité du poste comptable qu'ils dirigent. Les comptables publics sont personnellement et pécuniairement responsables des contrôles qu'ils sont tenus d'assurer. La responsabilité personnelle et pécuniaire se trouve engagée dès lors qu'un déficit ou un manquant en monnaie ou en valeurs a été constaté, qu'une recette n'a pas été recouvrée, qu'une dépense a été irrégulièrement payée ou que, par le fait du comptable public, l'organisme public a dû procéder à l'indemnisation d'un autre organisme public ou d'un tiers ou a dû rétribuer un commis d'office pour produire les comptes.
in scheme: FINANCES PUBLIQUES
in scheme: Responsabilité des comptables
in scheme: Missions Transverses des Finances publiques
narrower: cautionnement du comptable
narrower: apurement des comptes
narrower: diligence
narrower: certificat de libération définitive
narrower: gestion conjointe de postes comptables
narrower: remise de service
narrower: gestion de fait
narrower: adjonction de service
narrower: devoir d'alerte
narrower: dépôt de fonds
narrower: assurance personnelle
narrower: refip-REFIP7041
narrower: refip-REFIP7095
narrower: refip-REFIP7191
notation: REFIP4552

société de personnes
type: ConceptReFip
type: Concept
broader: société commerciale
definition: Société constituée intuitu personae c'est-à-dire en considération de la personne des associés, dans laquelle la part de chaque associé, appelé part d'intérêt, est en principe personnelle à l'associé et n'est pas cessible entre vifs ou ne l'est que dans certaines conditions.
in scheme: FINANCES PUBLIQUES
in scheme: Société
in scheme: Entreprises
in scheme: Forme juridique
narrower: société en nom collectif
narrower: société en commandité simple
notation: REFIP4553

territoire de Belfort
type: ConceptReFip
type: Concept
broader: refip-REFIP7017
definition: Département français
in scheme: FINANCES PUBLIQUES
in scheme: Géographie
in scheme: Europe
notation: REFIP4554

bureautique
type: ConceptReFip
type: Concept
broader: refip-REFIP757
definition: Ensemble des techniques et des moyens tendant à automatiser les activités de bureau et principalement le traitement et la communication de la parole, de l'écrit et de l'image.
in scheme: FINANCES PUBLIQUES
in scheme: Informatique
in scheme: Communication Documentation Informatique
notation: REFIP4556

mission de service public
type: ConceptReFip
type: Concept
broader: Etat
definition: Qualification octroyée par le juge pour des activités présentant un caractère d'intérêt général, assumées même par des organismes privés ou des particuliers.
in scheme: FINANCES PUBLIQUES
in scheme: Etat
in scheme: Mission de Service Public
in scheme: Administration de L'Etat
narrower: service public
narrower: activité de conseil
narrower: sécurité économique
narrower: sécurité informatique
narrower: service civique
narrower: médiation du crédit
narrower: sûreté immobilière
notation: REFIP4557

don
type: ConceptReFip
type: Concept
broader: frais déductibles
definition: Versement à des organismes d'aide aux personnes en difficulté ou à des organismes d'intérêt général établis en France, Fiscalement déductibles à l'impôt sur le revenu.
in scheme: FINANCES PUBLIQUES
in scheme: Liquidation de l'Impôt
in scheme: Fiscalité
notation: REFIP4558

état des prévisions de recettes et de dépenses
type: ConceptReFip
type: Concept
broader: documents comptables
definition: Document qui, pour un exercice comptable donné, estime les recettes et les dépenses prévisibles de certains établissements publics.
in scheme: FINANCES PUBLIQUES
in scheme: Documents comptables
in scheme: Comptabilité
notation: REFIP4559

crédit de paiement
type: ConceptReFip
type: Concept
broader: exécution du budget
definition: Limite supérieure des dépenses pouvant être ordonnancées ou payées pendant l’année pour la couverture des engagements contractés dans le cadre des autorisations d’engagement
in scheme: FINANCES PUBLIQUES
in scheme: Exécution du budget
in scheme: Budget
narrower: délégation de crédit de paiement
narrower: ordonnance de délégation
notation: REFIP456
related: refip-REFIP6623

Bouches-du-Rhône
type: ConceptReFip
type: Concept
broader: Provence-Alpes-Côte d'Azur
definition: Département français
in scheme: FINANCES PUBLIQUES
in scheme: Géographie
in scheme: Europe
narrower: Marseille
notation: REFIP4560

amortissement par composant
type: ConceptReFip
type: Concept
alternative label: méthode par composant
broader: amortissement comptable
definition: Type d'amortissement pratiqué lorsque les composants d'une immobilisation ont une durée réelle d'utilisation différente de celle de l'immobilisation corporelle à laquelle ils se rapportent.
in scheme: FINANCES PUBLIQUES
in scheme: Procédures et Techniques Comptables
in scheme: Comptabilité
notation: REFIP4561

fonds de commerce
type: ConceptReFip
type: Concept
alternative label: Fonds artisanal
broader: droit commercial
definition: Ensemble d'éléments mobiliers corporels et incorporels, constitué en vue d'attirer une clientèle. Le fonds de commerce est un bien composite, dans le sens où il est constitué de plusieurs autres biens.
in scheme: FINANCES PUBLIQUES
in scheme: Droit et Justice
in scheme: Divisions du Droit
in scheme: Droit Privé
narrower: refip-REFIP764
notation: REFIP4563

report en arrière de déficits
type: ConceptReFip
type: Concept
alternative label: carry back
broader: déduction fiscale
definition: Option proposée aux entreprises soumises à l'impôt sur les sociétés pour le report en arrière en arrière du déficit constaté à la clôture d'un exercice, dans la limite de 1 000 000 €, sur le bénéfice de l'exercice précédent. Cette imputation fait naître une créance sur le Trésor correspondant à l'excédent d'impôt sur les sociétés antérieurement versé.
in scheme: FINANCES PUBLIQUES
in scheme: Liquidation de l'Impôt
in scheme: Fiscalité
notation: REFIP4565

bâtiment rural
type: ConceptReFip
type: Concept
alternative label: immeuble rural
broader: refip-REFIP919
definition: Construction affectée de façon permanente et exclusive à un usage agricole ainsi que le sol et les dépendances indispensables et immédiates de cette construction.
in scheme: FINANCES PUBLIQUES
in scheme: Branche d'activité
in scheme: Questions Economiques
in scheme: Construction
notation: REFIP4567

groupement solidaire
type: ConceptReFip
type: Concept
broader: groupement d'entreprises
definition: Groupement d'entreprises où chaque opérateur économique est engagé financièrement pour la totalité du marché public.
in scheme: FINANCES PUBLIQUES
in scheme: Commande publique
in scheme: Gestion Publique
notation: REFIP4568

aide aux entreprises en difficulté
type: ConceptReFip
type: Concept
broader: aide aux entreprises
definition: Soutien public perçu par une entreprise qui a du mal à faire face à ses échéances financières ou dont les perspectives de développement sont incertaines.
in scheme: FINANCES PUBLIQUES
in scheme: Dépenses publiques
in scheme: Gestion Publique
notation: REFIP4569

règlement partiel définitif
type: ConceptReFip
type: Concept
broader: exécution d'un marché public
definition: Le règlement partiel définitif est le paiement, non susceptible d’être remis en cause, correspondant à la réalisation complète des prestations prévues par un ou plusieurs lots, tranches ou bons de commande d’un marché.
in scheme: FINANCES PUBLIQUES
in scheme: Commande publique
in scheme: Gestion Publique
notation: REFIP457

décompte
type: ConceptReFip
type: Concept
broader: mots outils (liste additive)
definition: Opération de décomposition d'une somme en ses divers éléments constitutifs, ou le fait de déduire quelque chose d'un compte en vue d'obtenir un solde.
in scheme: FINANCES PUBLIQUES
in scheme: Mots Outils
notation: REFIP4570

prescription d'assiette
type: ConceptReFip
type: Concept
broader: émission de titre de recette
definition: Délai qui court à l'encontre de la collectivité créancière pour émettre le titre de recettes.
in scheme: FINANCES PUBLIQUES
in scheme: Budget de l’État
in scheme: Budget
notation: REFIP4571
scope note: Délai imparti aux ordonnateurs pour émettre des titres de recette

Assistance publique-hôpitaux de Marseille
type: ConceptReFip
type: Concept
broader: centre hospitalier régional
definition: Etablissement public de santé qui exerce le rôle de centre hospitalier régional pour Marseille.
in scheme: FINANCES PUBLIQUES
in scheme: Organisation Territoriale
in scheme: Structures Territoriales
in scheme: Administration de L'Etat
notation: REFIP4572

amende
type: ConceptReFip
type: Concept
broader: sanction financière
definition: Sanction pécuniaire édictée par la loi consistant dans le paiement d'une somme d'argent à l’État.
in scheme: FINANCES PUBLIQUES
in scheme: Droit et Justice
in scheme: Sanction
in scheme: Infractions et Sanctions
narrower: amende forfaitaire
narrower: amende pénale
narrower: amende civile
narrower: amende administrative
notation: REFIP4573

société civile de moyens
type: ConceptReFip
type: Concept
broader: société civile
definition: Structure juridique réservée aux professions libérales (avocats, médecins, infirmiers…) et dont l'objet est la fourniture de moyens (personnel, matériel) à ses membres pour faciliter l'exercice de leur profession et réduire leurs coûts.
in scheme: FINANCES PUBLIQUES
in scheme: Société
in scheme: Entreprises
in scheme: Forme juridique
notation: REFIP4574

travail de nuit
type: ConceptReFip
type: Concept
broader: refip-REFIP6950
definition: Travail réalisé en principe entre 21 heures et 6 heures du matin, donc à cheval sur 2 journées civiles. Le recours à ce type de travail est exceptionnel et soumis à un régime juridique spécifique qui doit notamment prévoir des contreparties sous forme de repos compensateur, et le cas échéant sous forme pécuniaire.
in scheme: FINANCES PUBLIQUES
in scheme: Entreprises
in scheme: Travail
in scheme: 212619
notation: REFIP4575

droit de timbre
type: ConceptReFip
type: Concept
broader: droits d'enregistrement
definition: Impôt applicable à certains actes ou écrits. Il constitue également un mode de paiement du coût de certaines formalités et de certains documents fournis par les administrations publiques. Le paiement du droit de timbre s'effectue principalement par des vignettes, des estampilles ou autres moyens.
in scheme: FINANCES PUBLIQUES
in scheme: Fiscalité
in scheme: Impôt
narrower: taxe annuelle sur la détention de véhicules les plus polluants
notation: REFIP4576

association de la loi de 1901
type: ConceptReFip
type: Concept
alternative label: association à but non lucratif
broader: organisme sans but lucratif
definition: Association à but non lucratif qui relève de la loi du 1er juillet 1901 précisant que l'association est la convention par laquelle au moins deux personnes mettent en commun leurs compétences dans un but autre que celui de partager des profits.
in scheme: FINANCES PUBLIQUES
in scheme: Entreprises
in scheme: Forme juridique
in scheme: Association
narrower: association sportive
narrower: refip-REFIP688
notation: REFIP4577

fonds de pension
type: ConceptReFip
type: Concept
broader: épargne salariale
definition: Fonds d'investissement spécifique à la retraite par capitalisation.
in scheme: FINANCES PUBLIQUES
in scheme: Gestion de l'Entreprise
in scheme: Entreprises
in scheme: Vie et Gestion de l'entreprise
narrower: plan d'épargne pour la retraite collectif
narrower: plan d'épargne entreprise
notation: REFIP4578

règlement européen
type: ConceptReFip
type: Concept
broader: législation
definition: Acte juridique de portée générale. Il est obligatoire dans toutes ses dispositions : les États membres sont tenus de las appliquer telles qu’elles sont définies par le règlement, sans nécessiter de transposition . Le règlement est donc directement applicable dans l’ordre juridique des États membres. Il s’impose à tous les sujets de droit : particuliers, États, institutions.
in scheme: FINANCES PUBLIQUES
in scheme: Droit et Justice
in scheme: Sources du Droit
in scheme: Sources du Droit Objectif
notation: REFIP458

comité technique de service central de réseau
type: ConceptReFip
type: Concept
alternative label: comité technique de réseau
broader: organisme consultatif et représentatif (non-descripteur)
definition: Instance de représentation et de dialogue chargée de donner un avis sur les questions collectives concernant les services centraux d'un réseau tel que la DGFIP.
in scheme: FINANCES PUBLIQUES
in scheme: Organisation Structurelle de l'Etat
in scheme: Organisme Consultatif et Représentatif
in scheme: Administration de L'Etat
notation: REFIP4580

dotation globale de financement (supprimé)
type: ConceptReFip
type: Concept
broader: ZZ
in scheme: FINANCES PUBLIQUES
notation: REFIP4581

Cour de cassation
type: ConceptReFip
type: Concept
alternative label: cour de cassation chambre civile
alternative label: cour de cassation chambre commerciale
alternative label: cour de cassation chambre criminelle
alternative label: cour de cassation chambre sociale
broader: juridiction judiciaire
definition: Juridiction placée au sommet de la hiérarchie pour les juridictions civiles et pénales de l'ordre judiciaire. Sa fonction est de vérifier la conformité des décisions des tribunaux et des cours aux règles de droit.
in scheme: FINANCES PUBLIQUES
in scheme: Droit et Justice
in scheme: Juridiction
in scheme: Organisation Juridictionnelle
notation: REFIP4582

Caisse nationale d'épargne (supprimé)
type: ConceptReFip
type: Concept
broader: ZZ
in scheme: FINANCES PUBLIQUES
notation: REFIP4584

hypothèque judiciaire
type: ConceptReFip
type: Concept
alternative label: hypothèque judiciaire conservatoire
broader: hypothèque
definition: Hypothèque résultant des jugements, soit contradictoires, soit par défaut, définitifs ou provisoires, en faveur de celui qui les a obtenus
in scheme: FINANCES PUBLIQUES
in scheme: Recouvrement
in scheme: Fiscalité
notation: REFIP4585

activité occulte
type: ConceptReFip
type: Concept
broader: fraude fiscale
definition: Activité exercée par un contribuable qui n’a pas accompli ses obligations déclaratives dans les délais légaux et, soit, n’a pas fait connaître son activité à un centre de formalité des entreprises ou au greffe du tribunal de commerce, soit s'est livré à une activité illicite.
in scheme: FINANCES PUBLIQUES
in scheme: Droit de Contrôle de l'Administration
in scheme: Fiscalité
notation: REFIP4588

adjoint au maire
type: ConceptReFip
type: Concept
broader: élu local
definition: Représentant du maire qui est élu par le conseil municipal. Il existe plusieurs adjoints dans une commune pour aider le maire dans ses différentes tâches. Leur nombre est fixé par le conseil municipal mais ne doit pas dépasser un certain pourcentage de l’effectif du conseil.
in scheme: FINANCES PUBLIQUES
in scheme: Organisation Territoriale
in scheme: Administration de L'Etat
in scheme: 212106
narrower: adjoint spécial
notation: REFIP4589

pénalité de recouvrement
type: ConceptReFip
type: Concept
broader: recouvrement
in scheme: FINANCES PUBLIQUES
in scheme: Recouvrement
in scheme: Fiscalité
narrower: pénalité libératoire
notation: REFIP459

acompte
type: ConceptReFip
type: Concept
broader: facturation
definition: Paiement partiel effectué en règlement de la fraction exécutée d'une fourniture convenue de biens ou de services.
in scheme: FINANCES PUBLIQUES
in scheme: Procédures et Techniques Comptables
in scheme: Comptabilité
notation: REFIP4590

application CGL
type: ConceptReFip
type: Concept
alternative label: CGL
broader: applications gestion publique (non-descripteur)
definition: Application permettant la tenue de la comptabilité générale dans les postes centralisateurs.
in scheme: FINANCES PUBLIQUES
in scheme: Applications Informatiques
in scheme: Applications gestion publique
notation: REFIP4591

preuve par tout moyen
type: ConceptReFip
type: Concept
broader: droit civil
definition: Preuve pouvant être administrée par tous moyens (écrit, témoignages etc.).
in scheme: FINANCES PUBLIQUES
in scheme: Droit et Justice
in scheme: Divisions du Droit
in scheme: Droit Privé
narrower: présomption
narrower: déclaration sur l'honneur
notation: REFIP4592

activité non professionnelle
type: ConceptReFip
type: Concept
broader: fiscalité des professionnels
definition: Activité procurant des revenus industriels et commerciaux sans participation personnelle, continue et directe de l'un des membres du foyer fiscal à l'accomplissement des actes nécessaires à l'activité; concerne aussi les locations meublées non professionnelles (locations meublées où aucun membre du foyer fiscal n'est inscrit au registre du commerce et des sociétés en qualité de loueur professionnel et ne dépassant pas certains plafonds).
in scheme: FINANCES PUBLIQUES
in scheme: Champ d'Application
in scheme: Fiscalité
notation: REFIP4593

crédit d'office
type: ConceptReFip
type: Concept
broader: procédures et techniques comptables (non-descripteur)
definition: Processus comptable permettant d'être payé (ou crédité) de manière automatique.
in scheme: FINANCES PUBLIQUES
in scheme: Procédures et Techniques Comptables
in scheme: Comptabilité
notation: REFIP4595

gérant de fait
type: ConceptReFip
type: Concept
broader: gérance
definition: Personne, associée ou non, rémunérée ou non, qui dirige la société sans fonction officielle, à la place du gérant régulièrement nommé et qui, par conséquence, réalise certaines des opérations qui lui incombe. Une gérance de fait sera reconnue par jugement et portera certaines conséquences. Si la société ne peut honorer ses dettes (notamment sociales et fiscales), la responsabilité du gérant peut être mise en cause. Dans ce cas, le gérant de fait peut être reconnu solidairement responsable des dettes de la société.
in scheme: FINANCES PUBLIQUES
in scheme: Gestion de l'Entreprise
in scheme: Entreprises
in scheme: Vie et Gestion de l'entreprise
notation: REFIP4598

titre de travail simplifié
type: ConceptReFip
type: Concept
alternative label: TTS
broader: refip-REFIP6950
definition: Moyen de paiement simple qui permet d’effectuer en une seule fois, plusieurs formalités administratives : il vaut déclaration à l'URSSAF, au Régime d’Assurance Chômage, à la Médecine du travail, aux Services Fiscaux ; il tient lieu de contrat de travail ; il dispense l’employeur de la remise d’un bulletin de salaire ; lorsque l’employeur n’est pas un particulier il doit satisfaire à la déclaration préalable à l’embauche (DPAE) au moyen du volet prévu à cet effet. Il se présente sous forme d’un chéquier comportant différents formulaires.
in scheme: FINANCES PUBLIQUES
in scheme: Entreprises
in scheme: Travail
in scheme: 212619
notation: REFIP4599
scope note: Réservé à l'outre-mer

inspecteur divisionnaire des finances publiques hors classe
type: ConceptReFip
type: Concept
alternative label: inspecteur départemental des impôts de 1ère classe
alternative label: trésorier principal du Trésor public de 1ère catégorie
broader: grade de la Direction générale des Finances publiques (non-descripteur)
definition: Grade de catégorie A de la DGFIP accessible aux inspecteurs principaux (IP) ainsi qu'aux inspecteurs divisionnaires de classe normale (IDIV CN). Les inspecteurs divisionnaires hors classe (IDIV HC) sont choisis parmi les inspecteurs divisionnaires de classe normale (IDIV CN) ayant atteint au moins le 3e échelon et comptant 4 ans de services effectifs dans leur grade.Les IDIV peuvent se voir confier au sein d’une direction régionale, départementale ou locale des finances publiques ou d’une direction spécialisée ou auprès d’un responsable d’un service à compétence nationale relevant de la DGFiP, la responsabilité d’un service de contrôle fiscal ou des fonctions d’encadrement au sein de ces services, ou la responsabilité d’un poste comptable ou les fonctions d’adjoint au responsable d’un tel poste. Ils peuvent également assurer des missions d’expertise ou des missions particulières au sein de ces structures ou en administration centrale.
in scheme: FINANCES PUBLIQUES
in scheme: Personnels et fonctions
in scheme: Fonction publique
in scheme: Fonction Publique et Gestion des Ressources Humaines
notation: REFIP46

acte de commerce
type: ConceptReFip
type: Concept
broader: droit commercial
definition: Acte juridique ou fait juridique soumis aux règles du droit commercial, en raison de sa nature, de sa forme, ou en raison de la qualité de commerçant de son auteur.
in scheme: FINANCES PUBLIQUES
in scheme: Droit et Justice
in scheme: Divisions du Droit
in scheme: Droit Privé
notation: REFIP460

impots.gouv
type: ConceptReFip
type: Concept
alternative label: portail fiscal sur internet
broader: applications fiscales (non-descripteur)
definition: Site internet officiel de la DGFIP regroupant les informations et services utiles à la déclaration et aux paiements de l'impôt pour les particuliers, professionnels et collectivités territoriales.
in scheme: FINANCES PUBLIQUES
in scheme: Applications Informatiques
in scheme: Applications fiscales
notation: REFIP4600

application FIP
type: ConceptReFip
type: Concept
alternative label: FIP
broader: applications fiscales (non-descripteur)
definition: Référentiel de la fiscalité des particuliers gérant notamment les états-civils et les adresses des foyers fiscaux.
in scheme: FINANCES PUBLIQUES
in scheme: Applications Informatiques
in scheme: Applications fiscales
notation: REFIP4601

contrat nouvelles embauches (supprimé)
type: ConceptReFip
type: Concept
broader: ZZ
in scheme: FINANCES PUBLIQUES
notation: REFIP4602

remise de dettes
type: ConceptReFip
type: Concept
broader: droit des obligations et contrats (non-descripteur)
definition: Acte, en droit des obligations, par lequel le créancier libère volontairement le débiteur de tout ou partie de sa dette, alors même qu'il n'a pas obtenu ce qui lui était dû.
in scheme: FINANCES PUBLIQUES
in scheme: Droit et Justice
in scheme: Divisions du Droit
in scheme: Droit Privé
notation: REFIP4603

analyse financière rétrospective
type: ConceptReFip
type: Concept
broader: refip-REFIP788
definition: Technique de gestion permettant à une entité d'effectuer une analyse de l'équilibre financier du budget principal ou consolidée, et d'évaluer ainsi les marges de manœuvre financières pour l'avenir.
in scheme: FINANCES PUBLIQUES
in scheme: Analyse financière
in scheme: Comptabilité
notation: REFIP4604

établissement culturel français à l'étranger
type: ConceptReFip
type: Concept
alternative label: établissement de diffusion culturelle à l'étranger
broader: refip-REFIP7066
definition: Réseau culturel français à l'étranger composé d'instituts, de centres culturels français ainsi que d'alliances françaises ayant pour objectif de faire rayonner la culture française à l'extérieur de la France.
in scheme: FINANCES PUBLIQUES
in scheme: Organisation Structurelle de l'Etat
in scheme: Ministère
in scheme: Administration de L'Etat
notation: REFIP4605

lettre recommandée
type: ConceptReFip
type: Concept
alternative label: recommandé
broader: courrier
definition: Forme d'envoi permettant d'obtenir la preuve du lieu de dépôt et de la date d'envoi d'une lettre. Lorsqu'elle est accompagnée d'un accusé de réception, elle permet de prouver la réception du courrier par le destinataire.
in scheme: FINANCES PUBLIQUES
in scheme: Communication
in scheme: Communication Documentation Informatique
notation: REFIP4606

enquête d'utilité publique
type: ConceptReFip
type: Concept
broader: déclaration d'utilité publique
definition: Procédure mise en place lorsqu'un projet de travaux publics de grande ampleur est lancé, et qui permet au public d'exprimer en toute liberté son opinion sur le bien-fondé de ces travaux ou sur leurs modalités.
in scheme: FINANCES PUBLIQUES
in scheme: Domaine
in scheme: Gestion Publique
notation: REFIP4607

service livrancier
type: ConceptReFip
type: Concept
alternative label: livrancier
alternative label: organisme livrancier
alternative label: remettant
alternative label: service remettant
broader: domaine (non-descripteur)
definition: Services de l'État ou de ses opérateurs remettant, à titre obligatoire ou facultatif, les biens dont ils n'ont plus l'usage au Domaine.
in scheme: FINANCES PUBLIQUES
in scheme: Domaine
in scheme: Gestion Publique
notation: REFIP461

Ministère de l'Economie de l'Industrie et du Numérique (obsolète)
type: ConceptReFip
type: Concept
is replaced by: Ministère de l'Economie et des Finances
broader: ZZ
in scheme: FINANCES PUBLIQUES
notation: REFIP4611

département d'outre-mer
type: ConceptReFip
type: Concept
alternative label: DOM
broader: collectivité territoriale
definition: Collectivité territoriale intégrée à la République française au même titre que les départements ou régions de la France métropolitaine. Chacun de ces départements constitue une région mono-départementale, dite « région d'outre-mer » depuis la révision constitutionnelle de 2003. Les cinq Dom sont : la Guadeloupe, la Martinique, la Guyane, La Réunion et Mayotte.
in scheme: FINANCES PUBLIQUES
in scheme: Organisation Territoriale
in scheme: Structures Territoriales
in scheme: Administration de L'Etat
notation: REFIP4613

vérification des créances (supprimé)
type: ConceptReFip
type: Concept
broader: ZZ
in scheme: FINANCES PUBLIQUES
notation: REFIP4616

application EDI TVA
type: ConceptReFip
type: Concept
alternative label: EDI TVA
broader: applications fiscales (non-descripteur)
definition: Application permettant la transmission électronique des déclarations à partir des fichiers comptables, par l'intermédiaire de l' expert-comptable ou d'un prestataire spécialisé : le partenaire EDI (Echange des Données Informatisé).
in scheme: FINANCES PUBLIQUES
in scheme: Applications Informatiques
in scheme: Applications fiscales
notation: REFIP4617

demande de paiement
type: ConceptReFip
type: Concept
broader: paiement de la dépense (non-descripteur)
definition: Facture ou demande équivalente conforme aux obligations légales et contractuelles du créancier. Lorsque le service est fait et la facture reçue, c’est la date de réception de la facture qui fixe le point de départ du délai de paiement.
in scheme: FINANCES PUBLIQUES
in scheme: Dépenses publiques
in scheme: Gestion Publique
notation: REFIP462

clause compromissoire
type: ConceptReFip
type: Concept
broader: droit des obligations et contrats (non-descripteur)
definition: Clause contractuelle qui anticipe des différends pouvant survenir au cours de l'exécution d'un contrat et qui vise à privilégier le recours à un mode de résolution des conflits faisant appel à un tiers neutre, impartial et indépendant, à un règlement arbitral des différends.
in scheme: FINANCES PUBLIQUES
in scheme: Droit et Justice
in scheme: Divisions du Droit
in scheme: Droit Privé
notation: REFIP4620

inspecteur principal des finances publiques
type: ConceptReFip
type: Concept
alternative label: inspecteur principal des impôts
alternative label: inspecteur principal du Trésor public
broader: grade de la Direction générale des Finances publiques (non-descripteur)
definition: Grade de catégorie A de la DGFIP, les inspecteurs principaux (IP) sont nommés par le ministre chargé du Budget. Ils sont recrutés parmi les inspecteurs (I) ainsi que parmi les inspecteurs divisionnaires de classe normale (IDIV CN). Les IP peuvent se voir confier, au sein d’une direction régionale, départementale ou locale des finances publiques ou d’une direction spécialisée relevant de la direction générale des finances publiques ou auprès d’un responsable d’un service à compétence nationale relevant de la DGFiP la responsabilité d’un service ou la responsabilité d’un poste comptable . Ils peuvent également assurer des fonctions d’encadrement ou des missions particulières notamment des missions d’audit au sein de ces structures ou en administration centrale.
in scheme: FINANCES PUBLIQUES
in scheme: Personnels et fonctions
in scheme: Fonction publique
in scheme: Fonction Publique et Gestion des Ressources Humaines
notation: REFIP4621

amende administrative
type: ConceptReFip
type: Concept
broader: amende
definition: Sanction prononcée par une autorité administrative qui a le caractère de punition.
in scheme: FINANCES PUBLIQUES
in scheme: Droit et Justice
in scheme: Sanction
in scheme: Infractions et Sanctions
notation: REFIP4622

certificat de recettes
type: ConceptReFip
type: Concept
broader: documents comptables
definition: Document mensuel recensant la part des recettes (contributions sociales) à reverser aux différents organismes sociaux (fonds, caisses).
in scheme: FINANCES PUBLIQUES
in scheme: Documents comptables
in scheme: Comptabilité
notation: REFIP4623

application OSIRIS
type: ConceptReFip
type: Concept
alternative label: OSIRIS
alternative label: outil OSIRIS
broader: applications missions transverses (non-descripteur)
definition: Outil de suivi des contrôles sur les régies du secteur public local.
in scheme: FINANCES PUBLIQUES
in scheme: Applications missions transverses
in scheme: Applications Informatiques
notation: REFIP4624

exploitation agricole à responsabilité limitée
type: ConceptReFip
type: Concept
alternative label: EARL
broader: société civile
definition: Forme de société civile à objet agricole créée par la loi du 11 juillet 1985, dotée de la personnalité morale et créée dans le but de donner à l’exploitation agricole une autonomie patrimoniale et de conserver un éventuel caractère familial.
in scheme: FINANCES PUBLIQUES
in scheme: Société
in scheme: Entreprises
in scheme: Forme juridique
notation: REFIP4625

administrateur de société
type: ConceptReFip
type: Concept
broader: gestion de l'entreprise (non-descripteur)
definition: Personne ayant la charge des affaires d'une société anonyme pour laquelle il a été nommé. Lors de la création de l'entreprise,il est mentionné dans les statuts mais peut par la suite être mandaté par l'assemblée générale ordinaire. L’administrateur de société anonyme effectue un mandat dont la durée est fixée dans les statuts même s’il ne peut dépasser les 6 ans pour les administrateurs nommés après la constitution de la société.
in scheme: FINANCES PUBLIQUES
in scheme: Gestion de l'Entreprise
in scheme: Entreprises
in scheme: Vie et Gestion de l'entreprise
narrower: administrateur provisoire
narrower: refip-REFIP942
notation: REFIP4626

Yvelines
type: ConceptReFip
type: Concept
broader: Ile-de-France
definition: Département français
in scheme: FINANCES PUBLIQUES
in scheme: Géographie
in scheme: Europe
notation: REFIP4627

carte judiciaire
type: ConceptReFip
type: Concept
broader: organisation juridictionnelle (non-descripteur)
definition: Répartition des tribunaux en France.
in scheme: FINANCES PUBLIQUES
in scheme: Droit et Justice
in scheme: Organisation Juridictionnelle
notation: REFIP4628

mensualisation
type: ConceptReFip
type: Concept
alternative label: prélèvement mensuel
broader: paiement de l'impôt
definition: Modalité de paiement qui consiste pour le contribuable à faire acte de domiciliation dans un établissement payeur et à autoriser le comptable public à prélever de façon automatique, mensuellement le dixième du montant de l'impôt de l'année précédente.
in scheme: FINANCES PUBLIQUES
in scheme: Recouvrement
in scheme: Fiscalité
notation: REFIP4629

reprographie
type: ConceptReFip
type: Concept
alternative label: imprimerie
alternative label: photocopie
alternative label: travaux d'impression
alternative label: travaux d'imprimerie
alternative label: travaux de reproduction
alternative label: travaux de reprographie
broader: documentation
definition: Ensemble des techniques de reproduction des documents écrits.
in scheme: FINANCES PUBLIQUES
in scheme: Documentation
in scheme: Communication Documentation Informatique
notation: REFIP463

association foncière urbaine
type: ConceptReFip
type: Concept
alternative label: AFU
alternative label: association foncière urbaine autorisée
alternative label: association foncière urbaine constituée d'office
alternative label: association foncière urbaine libre
broader: association
definition: Collectivité de propriétaires réunis pour exécuter et entretenir, à frais communs, les travaux qu'elle énumère. Elle peut avoir l'un des objets suivants : le remembrement de parcelles et les travaux et aménagements nécessaires; le regroupement de parcelles en vue de la mise à disposition ou la vente à un tiers; la construction et l'entretien d'équipements d'usage collectif (voirie, chauffage, espaces verts ...); la conservation, la restauration et la mise en valeur d'immeubles en secteur sauvegardé ou périmètre de restauration immobilière.
in scheme: FINANCES PUBLIQUES
in scheme: Entreprises
in scheme: Forme juridique
in scheme: Association
notation: REFIP4630

application CENTRALISATION DES IMAGES CHEQUES
type: ConceptReFip
type: Concept
alternative label: application CIC
broader: applications gestion publique (non-descripteur)
definition: Interface avec la Banque de France pour la procédure d’Echange d’Images-Chèques.
in scheme: FINANCES PUBLIQUES
in scheme: Applications Informatiques
in scheme: Applications gestion publique
notation: REFIP4631

comptabilité des engagements
type: ConceptReFip
type: Concept
broader: exécution du budget
definition: Comptabilité tenue par les ordonnateurs qui permet de suivre l’exécution du budget et l’évolution de la disponibilité des crédits.
in scheme: FINANCES PUBLIQUES
in scheme: Exécution du budget
in scheme: Budget
narrower: engagement de l'Etat
notation: REFIP4632

facturation
type: ConceptReFip
type: Concept
broader: procédures et techniques comptables (non-descripteur)
definition: Action d'établir une facture, document de nature commerciale et comptable établi par une structure juridique pour constater les conditions des achats et ventes de produits, de marchandises ou de services rendus.
in scheme: FINANCES PUBLIQUES
in scheme: Procédures et Techniques Comptables
in scheme: Comptabilité
narrower: prix de vente
narrower: devis
narrower: avance
narrower: rabais
narrower: prix de revient
narrower: avoir sur facture
narrower: acompte
narrower: facturation interne
narrower: prix unitaire
narrower: débours
narrower: refip-REFIP777
narrower: refip-REFIP850
notation: REFIP4635

évaluation d'office
type: ConceptReFip
type: Concept
broader: imposition d'office
definition: Procédure d'imposition d’office concernant le défaut de production ou la souscription tardive des déclarations spéciales déposées au titre des revenus catégoriels qui servent à la détermination de l'impôt sur le revenu.
in scheme: FINANCES PUBLIQUES
in scheme: Droit de Reprise de l'Administration
in scheme: Fiscalité
notation: REFIP4636

Uruguay
type: ConceptReFip
type: Concept
broader: Amérique
definition: Pays
in scheme: FINANCES PUBLIQUES
in scheme: Géographie
in scheme: Amérique
notation: REFIP4637

facture irrégulière
type: ConceptReFip
type: Concept
broader: facture
definition: Facture ne présentant pas les éléments obligatoires notamment la date d’émission, la numérotation de la facture, la date de la vente ou de la prestation de service, l'identité de l'acheteur, l'identité du vendeur ou prestataire, le numéro individuel d'identification à la TVA, la désignation du produit ou de la prestation, le décompte détaillé de chaque prestation et produit fourni, le prix catalogue, la majoration éventuelle de prix, le taux de TVA légalement applicable, le montant de la TVA correspondant, la réduction de prix, la somme totale à payer hors taxe et toutes taxes comprises. Certaines mentions seront à ajouter si la facture est adressée à un professionnel. Certaines mentions particulières peuvent également s'y trouver, notamment si le vendeur bénéficie de la franchise en base de TVA par exemple.
in scheme: FINANCES PUBLIQUES
in scheme: Documents comptables
in scheme: Comptabilité
notation: REFIP4638

revenu fiscal de référence
type: ConceptReFip
type: Concept
broader: liquidation de l'impôt
definition: Quotité déterminée lors du calcul de l'impôt sur le revenu d'un contribuable. Il est calculé par l'administration à partir du montant net de des revenus et plus-values retenus pour le calcul de l'impôt sur le revenu de l'année précédente.Ce montant est augmenté de certains revenus exonérés ou soumis à un prélèvement obligatoire, de certains abattements et charges déductibles du revenu. Le revenu fiscal de référence sert de critère pour l'accès à certains dispositifs : sociaux (par exemple, la bourse des collèges) ; fiscaux (par exemple, des exonérations en matière d'impôts locaux).
in scheme: FINANCES PUBLIQUES
in scheme: Liquidation de l'Impôt
in scheme: Fiscalité
notation: REFIP464

société d'autoroutes
type: ConceptReFip
type: Concept
alternative label: société concessionnaire d'autoroutes
broader: société concessionnaire
definition: Société concessionnaire à qui l'Etat a confié le soin de construire, d'entretenir et d'exploiter certaines autoroutes, moyennant la perception d'un péage auprès des usagers.
in scheme: FINANCES PUBLIQUES
in scheme: Société
in scheme: Entreprises
in scheme: Forme juridique
notation: REFIP4640
related: péage

fournisseur
type: ConceptReFip
type: Concept
broader: commerce
definition: Personne physique ou morale, qui soit fabrique ou transforme des produits contrôlés, soit exerce des activités d’importation ou de vente de ces produits.
in scheme: FINANCES PUBLIQUES
in scheme: Branche d'activité
in scheme: Questions Economiques
in scheme: Commerce
notation: REFIP4641

accord d'échange d'information fiscale
type: ConceptReFip
type: Concept
alternative label: accord d'échange d'information
broader: fiscalité internationale
definition: Engagement pris par un Etat de participer au développement de la coopération internationale en matière fiscale par l'échange de renseignements afin de lutter contre les pratiques fiscales dommageables.
in scheme: FINANCES PUBLIQUES
in scheme: Champ d'Application
in scheme: Fiscalité
notation: REFIP4642

restructuration
type: ConceptReFip
type: Concept
alternative label: réorganisation
broader: mots outils (liste additive)
definition: Opération par laquelle un ensemble organisé voit sa structure organisationnelle remaniée en vue d’atteindre une nouvelle configuration.
in scheme: FINANCES PUBLIQUES
in scheme: Mots Outils
notation: REFIP4643

Mexique
type: ConceptReFip
type: Concept
broader: Amérique
definition: Pays
in scheme: FINANCES PUBLIQUES
in scheme: Géographie
in scheme: Amérique
notation: REFIP4644

écrêtement
type: ConceptReFip
type: Concept
broader: mots outils (liste additive)
definition: action de supprimer ou d enlever ce qui est supérieur à une valeur ou limite pré définie.
in scheme: FINANCES PUBLIQUES
in scheme: Mots Outils
notation: REFIP4645

département comptable ministériel
type: ConceptReFip
type: Concept
alternative label: DCM
broader: service de contrôle budgétaire et comptable ministériel
definition: Service chargé au sein de chaque ministère du contrôle comptable.
in scheme: FINANCES PUBLIQUES
in scheme: Organisation Structurelle de l'Etat
in scheme: Ministère
in scheme: Administration de L'Etat
notation: REFIP4647

application REP-EPS
type: ConceptReFip
type: Concept
alternative label: REP-EPS
broader: applications gestion publique (non-descripteur)
definition: Outil permettant la réalisation d'analyse financière infra annuelle détaillée pour le compte des EPS.
in scheme: FINANCES PUBLIQUES
in scheme: Applications Informatiques
in scheme: Applications gestion publique
notation: REFIP4649

acquit libératoire
type: ConceptReFip
type: Concept
alternative label: pouvoir libératoire
broader: contrôle hiérarchisé de la dépense
definition: Paiement effectué au véritable créancier ou à son représentant qualifié pour libérer le débiteur.
in scheme: FINANCES PUBLIQUES
in scheme: Dépenses publiques
in scheme: Gestion Publique
notation: REFIP465

Office national des forêts
type: ConceptReFip
type: Concept
alternative label: ONF
broader: établissement public à caractère industriel et commercial
definition: Établissement public à caractère industriel et commercial qui mène son action dans le cadre d'un contrat pluriannuel d'objectifs et de performance avec l'Etat et la Fédération nationale des communes forestières. Il assure la gestion durable des forêts publiques françaises en France métropolitaine et dans les DOM.
in scheme: FINANCES PUBLIQUES
in scheme: Organisation Structurelle de l'Etat
in scheme: Opérateur de l'Etat
in scheme: Administration de L'Etat
notation: REFIP4651

reprise d'entreprise
type: ConceptReFip
type: Concept
alternative label: rachat d'entreprise
broader: transfert d'entreprise
definition: Evènement qui se produit quand une unité légale reprend totalement ou partiellement, l'activité d'un ou plusieurs établissements économiques d'une autre unité légale.
in scheme: FINANCES PUBLIQUES
in scheme: Vie de l'Entreprise
in scheme: Entreprises
in scheme: Vie et Gestion de l'entreprise
narrower: plan de reprise
notation: REFIP4653

débit de tabac
type: ConceptReFip
type: Concept
alternative label: buraliste
alternative label: bureau de tabac
broader: commerce de détail
definition: Établissement commercial spécialisé dans la vente au détail de différents types de tabacs prêts à la consommation.
in scheme: FINANCES PUBLIQUES
in scheme: Branche d'activité
in scheme: Questions Economiques
in scheme: Commerce
notation: REFIP4654

Maine-et-Loire
type: ConceptReFip
type: Concept
broader: Pays de la Loire
definition: Département français
in scheme: FINANCES PUBLIQUES
in scheme: Géographie
in scheme: Europe
notation: REFIP4655

centre de formation d'apprentis
type: ConceptReFip
type: Concept
alternative label: CFA
broader: refip-REFIP7075
definition: Etablissement de formation assurant un enseignement en alternance à des apprentis âgés de 16 à 25 ans et leur dispensant une formation générale et technique qui complète la formation reçue dans les entreprises.
in scheme: FINANCES PUBLIQUES
in scheme: Organisation Structurelle de l'Etat
in scheme: Ministère
in scheme: Administration de L'Etat
notation: REFIP466

assemblée générale
type: ConceptReFip
type: Concept
alternative label: AG
broader: gestion de l'entreprise (non-descripteur)
definition: Rassemblement de l'ensemble des membres d'une organisation (ou des représentants de ces membres) avec les dirigeants ou les membres du conseil d'administration . Généralement annuelle, l'assemblée générale permet aux dirigeants d'informer leurs membres et à ceux-ci de voter sur des décisions relatives au fonctionnement de l'organisation. Les assemblées générales d'une entreprise sont l'occasion pour les actionnaires d'exercer leur pouvoir de décision.
in scheme: FINANCES PUBLIQUES
in scheme: Gestion de l'Entreprise
in scheme: Entreprises
in scheme: Vie et Gestion de l'entreprise
narrower: assemblée d'actionnaires
notation: REFIP4660

application PSAR
type: ConceptReFip
type: Concept
alternative label: PSAR
broader: applications gestion publique (non-descripteur)
definition: Application permettant la centralisation par les ESI des moyens de paiement dématérialisés à remettre à la Banque de France, et à l'IEDOM (hors paye, pensions et mensualisation de l'impôt).
in scheme: FINANCES PUBLIQUES
in scheme: Applications Informatiques
in scheme: Applications gestion publique
notation: REFIP4661

état de poursuites extérieures
type: ConceptReFip
type: Concept
alternative label: EPE
alternative label: état de poursuites par voie de saisie extérieure
broader: documentation fiscale (non-descripteur)
definition: Imprimé P761 utilisé en matière de procédure de saisie extérieure, transmis à un huissier de justice ou un huissier des finances publiques.
in scheme: FINANCES PUBLIQUES
in scheme: Documentation Fiscale
in scheme: Fiscalité
notation: REFIP4662

Ministère de la Justice
type: ConceptReFip
type: Concept
broader: ministère
definition: Administration chargée de l’action et de la gestion des juridictions et de la conduite de la politique d’action publique. Il est dirigé par le garde des Sceaux, ministre de la Justice. Il prépare des textes de lois et des règlements dans certains domaines, comme le droit de la famille, la nationalité française, la Justice civile et la Justice pénale. Il s'occupe de la gestion des moyens de la Justice (personnel, équipements, constructions, informatique..) et prend en charge des populations qui lui sont confiées par l'autorité judiciaire : les mineurs délinquants ou en danger et les personnes placées sous main de justice. Enfin, il définit et met en oeuvre des politiques publiques en matière de Justice (aide aux victimes d'infraction, politique pénale, lutte contre la criminalité organisée, accès au droit et à la Justice).
in scheme: FINANCES PUBLIQUES
in scheme: Organisation Structurelle de l'Etat
in scheme: Ministère
in scheme: Administration de L'Etat
narrower: établissement pénitentiaire
narrower: administration pénitentiaire
narrower: protection judiciaire de la jeunesse
narrower: chambre nationale des huissiers de justice
narrower: refip-REFIP735
notation: REFIP4663
scope note: Depuis le 02/04/2014

personnel navigant
type: ConceptReFip
type: Concept
broader: compagnie de navigation aérienne
definition: Personnel d'équipage d'un avion s'occupant de la sécurité des passagers embarqués et assurant le service commercial à bord des avions.
in scheme: FINANCES PUBLIQUES
in scheme: Branche d'activité
in scheme: Questions Economiques
in scheme: Transports
notation: REFIP4664

système d'information géographique
type: ConceptReFip
type: Concept
broader: cadastre
definition: Système d'ensemble de bases de données repérées dans l'espace pour produire des plans et des actes.
in scheme: FINANCES PUBLIQUES
in scheme: Cadastre
in scheme: Fiscalité
narrower: système national de référence de coordonnées géographiques planimétriques et altimétriques
notation: REFIP4666

crise économique
type: ConceptReFip
type: Concept
broader: conjoncture économique
definition: Dégradation brutale de la situation économique et des perspectives économiques. Son étendue sectorielle, temporelle et géographique peut aller d'un seul secteur d'une seule région pour une brève période à l'ensemble de l'économie mondiale pendant plusieurs années : on parle alors de ralentissement économique ou, plus grave, de récession économique.
in scheme: FINANCES PUBLIQUES
in scheme: Questions Economiques
in scheme: Economie générale
narrower: plan de relance
notation: REFIP4667

double imposition
type: ConceptReFip
type: Concept
broader: territorialité de l'impôt
definition: Fait pour un revenu de supporter deux fois l'impôt.
in scheme: FINANCES PUBLIQUES
in scheme: Champ d'Application
in scheme: Fiscalité
notation: REFIP4668

politique immobilière de l'Etat
type: ConceptReFip
type: Concept
alternative label: gestion immobilière de l'Etat
broader: gestion publique
definition: Gestion du parc immobilier dont l’État est propriétaire, bureaux, bâtiments techniques, logements. Ces biens sont mis à disposition des administrations occupantes, ministères et opérateurs de l’État, comme les universités, afin de leur permettre de conduire les différentes politiques publiques. Cette politique distingue l’État propriétaire, incarné par la direction de l’immobilier de l’État, des ministères occupants. Il s’agit de mieux connaître ce parc et ses caractéristiques techniques, de l’entretenir, et de s’adapter aux évolutions nécessaires, en cédant des biens et en construisant de nouveaux bâtiments.
in scheme: FINANCES PUBLIQUES
in scheme: Politique immobilière de l'Etat
in scheme: Gestion Publique
narrower: tableau général des propriétés de l'Etat
narrower: formulaire de mise à jour de l'inventaire comptable
narrower: schéma directeur immobilier régional
narrower: programmation immobilière
narrower: refip-REFIP869
notation: REFIP467

Code de procédure pénale
type: ConceptReFip
type: Concept
broader: documentation juridique (non-descripteur)
definition: Ensemble des textes juridiques organisant les étapes de la procédure pénale. Il fixe les règles concernant les enquêtes pénales (préliminaires ou de flagrance), l'instruction judiciaire, la poursuite des infractions, l'audience pénale devant le tribunal de police, le tribunal correctionnel, la cour d'assises, les voies de recours, l'application des peines.
in scheme: FINANCES PUBLIQUES
in scheme: Droit et Justice
in scheme: Documentation Juridique
in scheme: Sources du Droit
notation: REFIP4670

maître d'ouvrage
type: ConceptReFip
type: Concept
alternative label: maître de l'ouvrage
broader: refip-REFIP699
definition: Personne morale pour laquelle l'ouvrage est construit. Responsable principal de l'ouvrage, il remplit dans ce rôle une fonction d'intérêt général dont il ne peut se démettre.
in scheme: FINANCES PUBLIQUES
in scheme: Commande publique
in scheme: Gestion Publique
notation: REFIP4671

imputation provisoire
type: ConceptReFip
type: Concept
alternative label: compte d'imputation provisoire
alternative label: imputation provisoire des dépenses
alternative label: imputation provisoire des recettes
broader: règle d'imputation
definition: Affectation d'une somme à un compte, en débit ou en crédit, même si la destination finale n'est pas encore identifiée.
in scheme: FINANCES PUBLIQUES
in scheme: Procédures et Techniques Comptables
in scheme: Comptabilité
notation: REFIP4672

rattachement de crédit
type: ConceptReFip
type: Concept
broader: exécution du budget
definition: Procédure permettant de rattacher les crédits sur les programmes des ministères concernés par un arrêté du comptable centralisateur des comptes de l’État qui distingue la part des crédits rattachés sur les dépenses de personnel des autres crédits. Suite à ce rattachement, les crédits sont alors disponibles après signature de l’arrêté et intégration dans CHORUS.
in scheme: FINANCES PUBLIQUES
in scheme: Exécution du budget
in scheme: Budget
notation: REFIP4673

congé pour accident
type: ConceptReFip
type: Concept
alternative label: congé pour accident de service
broader: congés (non-descripteur)
definition: Congé accordé lorsque l'incapacité temporaire de travail est consécutive à un accident reconnu imputable au service, à un accident de trajet ou à une maladie professionnelle.
in scheme: FINANCES PUBLIQUES
in scheme: Gestion des ressources humaines
in scheme: Temps de travail
in scheme: Fonction Publique et Gestion des Ressources Humaines
notation: REFIP4674

magistrature
type: ConceptReFip
type: Concept
broader: profession juridique (non-descripteur)
definition: Corps des magistrats exerçant leurs fonctions dans le cadre de l'autorité judiciaire.
in scheme: FINANCES PUBLIQUES
in scheme: Profession Juridique
in scheme: Droit et Justice
in scheme: Organisation Juridictionnelle
narrower: magistrat
narrower: auditeur de justice
notation: REFIP4675

correction d'erreur
type: ConceptReFip
type: Concept
broader: mots outils (liste additive)
definition: Modification apportée dans le but de rectifier une donnée erronée.
in scheme: FINANCES PUBLIQUES
in scheme: Mots Outils
notation: REFIP4676

Alsace (obsolète)
type: ConceptReFip
type: Concept
is replaced by: refip-REFIP7009
broader: ZZ
in scheme: FINANCES PUBLIQUES
notation: REFIP4677

saisie-vente
type: ConceptReFip
type: Concept
alternative label: saisie-exécution
broader: saisie
definition: Procédure d'exécution qui permet de saisir les biens meubles corporels du débiteur, qu'ils soient détenus par lui ou par un tiers, afin de les faire vendre et de se faire payer sur le prix.
in scheme: FINANCES PUBLIQUES
in scheme: Recouvrement
in scheme: Fiscalité
notation: REFIP4678

télédéclarant
type: ConceptReFip
type: Concept
broader: fiscalité
definition: Personne utilisant les services en ligne pour remplir ses obligations déclaratives.
in scheme: FINANCES PUBLIQUES
in scheme: Fiscalité - Autres notions
in scheme: Fiscalité
notation: REFIP4679

certificat de non imposition (supprimé)
type: ConceptReFip
type: Concept
broader: ZZ
in scheme: FINANCES PUBLIQUES
notation: REFIP468

amende forfaitaire majorée
type: ConceptReFip
type: Concept
broader: amende forfaitaire
definition: Majoration de l'amende forfaitaire à défaut de paiement ou de contestation dans les 45 jours.
in scheme: FINANCES PUBLIQUES
in scheme: Droit et Justice
in scheme: Sanction
in scheme: Infractions et Sanctions
notation: REFIP4680

marché sans formalité préalable
type: ConceptReFip
type: Concept
broader: marché à procédure adaptée
definition: Marché d’un montant inférieur aux seuils fixés dans le code des marchés publics.
in scheme: FINANCES PUBLIQUES
in scheme: Commande publique
in scheme: Gestion Publique
notation: REFIP4681

vie privée
type: ConceptReFip
type: Concept
broader: liberté fondamentale
definition: Sphère des activités de la personne qui relèvent de l'intimité et qui doivent rester à l'abri du regard d'autrui (vie sentimentale, mœurs, état de santé, pratique religieuse etc,). La loi proclame le droit au respect de la vie privée.
in scheme: FINANCES PUBLIQUES
in scheme: Droit et Justice
in scheme: Divisions du Droit
in scheme: Droit Public
notation: REFIP4682

violation de domicile
type: ConceptReFip
type: Concept
broader: délit
definition: Introduction ou le maintien dans le domicile d'autrui à l'aide de manœuvres, menaces, voies de fait ou contrainte.
in scheme: FINANCES PUBLIQUES
in scheme: Droit et Justice
in scheme: Infractions et Sanctions
in scheme: Infraction
notation: REFIP4683

Fonds national de garantie individuelle des ressources
type: ConceptReFip
type: Concept
alternative label: FNGIR
broader: fonds (non-descripteur)
definition: Fonds permettant de compenser pour chaque commune et les établissements publics de coopération intercommunale (EPCI) à fiscalité propre, les conséquences financières de la réforme de la fiscalité locale.
in scheme: FINANCES PUBLIQUES
in scheme: Dépenses publiques
in scheme: Gestion Publique
notation: REFIP4685

délit
type: ConceptReFip
type: Concept
broader: refip-REFIP660
definition: Infraction à la loi pénale dont l’auteur est puni de peines correctionnelles.
in scheme: FINANCES PUBLIQUES
in scheme: Droit et Justice
in scheme: Infractions et Sanctions
in scheme: Infraction
narrower: délit d'entrave
narrower: fraude
narrower: détournement de fonds
narrower: escroquerie
narrower: trafic de stupéfiants
narrower: travail illégal
narrower: délit de favoritisme
narrower: corruption
narrower: violation de domicile
narrower: discrimination
narrower: diffamation
narrower: extorsion
narrower: refip-REFIP657
narrower: refip-REFIP729
notation: REFIP4686

dépenses à régulariser
type: ConceptReFip
type: Concept
broader: refip-REFIP996
definition: Opérations qui ne peuvent être imputées de façon certaine ou définitive à un compte déterminé au moment où elles doivent être enregistrées ou qui exigent une information complémentaire ou des formalités particulières.
in scheme: FINANCES PUBLIQUES
in scheme: Dépenses publiques
in scheme: Gestion Publique
notation: REFIP4687

déconcentration
type: ConceptReFip
type: Concept
broader: réforme de l'Etat
definition: Processus d’aménagement de l’État unitaire qui consiste à implanter dans des circonscriptions locales administratives des autorités administratives représentant l’État. Ces autorités sont dépourvues de toute autonomie et de la personnalité morale. Les autorités déconcentrées sont notamment les préfets (départements, régions), les recteurs (académies), les maires (communes).
in scheme: FINANCES PUBLIQUES
in scheme: Etat
in scheme: Réforme de l'Etat
in scheme: Administration de L'Etat
notation: REFIP4688

juge d'instance
type: ConceptReFip
type: Concept
broader: juge judiciaire
definition: Magistrat du tribunal de grande instance chargé de l’instance. Il statue à juge unique et rend des jugements en dernier ressort ou à charge d’appel selon le montant de l’objet de la demande et/ou la nature du litige. Il est également juge des tutelles des personnes majeures. Il préside le tribunal paritaire des baux ruraux. Il peut également présider le tribunal de police pour juger les contraventions de cinquième classe. Le juge d'instance exerce les fonctions de juge départiteur en matière prud'homale, c’est-à-dire qu’il peut être appelé pour départager les parties, en cas de désaccord entre les conseillers prud’homaux sur la décision à prendre.
in scheme: FINANCES PUBLIQUES
in scheme: Profession Juridique
in scheme: Droit et Justice
in scheme: Organisation Juridictionnelle
notation: REFIP4689

référé fiscal
type: ConceptReFip
type: Concept
broader: contentieux fiscal
definition: Procédure d'urgence permettant au contribuable de porter devant le juge du référé fiscal (qui est un membre du tribunal administratif ou du tribunal de grande instance) une contestation relative à la constitution des garanties ou aux saisies conservatoires prises par le comptable de la DGFIP à la suite d'une demande de sursis de paiement.
in scheme: FINANCES PUBLIQUES
in scheme: Contentieux Fiscal
in scheme: Fiscalité
narrower: référé suspension
notation: REFIP469

privilège des salaires
type: ConceptReFip
type: Concept
alternative label: privilège du salarié
alternative label: superprivilège
broader: privilège
definition: Type particulier de privilège qui s'applique aux salaires et aux indemnités correspondant aux soixante derniers jours de travail et qui, en cas de redressement ou de liquidation judiciaire, sont payés avant toute autre créance privilégiée.
in scheme: FINANCES PUBLIQUES
in scheme: Droit et Justice
in scheme: Divisions du Droit
in scheme: Droit Privé
notation: REFIP4690

responsabilité d'une collectivité
type: ConceptReFip
type: Concept
broader: secteur public local
definition: Responsabilité civile ou pénale des collectivités locales qui peut être engagée dans l'exercice de leurs activités.
in scheme: FINANCES PUBLIQUES
in scheme: Secteur public local
in scheme: Gestion Publique
notation: REFIP4691

port autonome
type: ConceptReFip
type: Concept
broader: entreprise publique
definition: Etablissement public de l'État exerçant conjointement des missions de service public administratif et des missions de service public à caractère industriel et commercial. Il est géré comme un établissement public à caractère industriel et commercial (EPIC). Placé sous la tutelle du ministère chargé des transports, il bénéficie, comme tout établissement public, d'une large autonomie de gestion. Le port autonome gère les installations portuaires situées dans les limites de sa circonscription (fluviale ou maritime).
in scheme: FINANCES PUBLIQUES
in scheme: Organisation Structurelle de l'Etat
in scheme: Entreprise Publique
in scheme: Administration de L'Etat
notation: REFIP4694

consulat
type: ConceptReFip
type: Concept
broader: refip-REFIP7066
definition: Service diplomatique implanté à l'étranger, chargé de la protection et du suivi administratif des ressortissants du pays dont il dépend dans le pays dans lequel il est implanté.
in scheme: FINANCES PUBLIQUES
in scheme: Organisation Structurelle de l'Etat
in scheme: Ministère
in scheme: Administration de L'Etat
notation: REFIP4695
related: consul

médiation du crédit
type: ConceptReFip
type: Concept
alternative label: médiateur du crédit
alternative label: médiateur départemental du crédit
alternative label: médiateur national du crédit
broader: mission de service public
definition: Mission du ministère de l’Économie et des finances qui sert d'intermédiaire entre les banques et les entreprises en difficulté. Elle est accessible aux entreprises qui rencontrent des difficultés de financement bancaire, d'assurance crédit ou de fait leurs fonds propres, dès lors que leurs établissements financiers refusent un financement lié à une activité professionnelle.
in scheme: FINANCES PUBLIQUES
in scheme: Etat
in scheme: Mission de Service Public
in scheme: Administration de L'Etat
notation: REFIP4697
related: difficulté financière

mise à jour
type: ConceptReFip
type: Concept
broader: mots outils (liste additive)
definition: Action ou processus qui consiste en une révision, une mise à niveau afin de prendre en considération un changement ou une évolution.
in scheme: FINANCES PUBLIQUES
in scheme: Mots Outils
notation: REFIP4698

profil utilisateur
type: ConceptReFip
type: Concept
broader: habilitation
definition: Ensemble de données qui influencent le comportement d'un dispositif informatique en fonction de l'utilisateur. Un profil peut être relatif à une personne seule, ou à un groupe de personnes ayant des points communs.
in scheme: FINANCES PUBLIQUES
in scheme: Informatique
in scheme: Communication Documentation Informatique
notation: REFIP47

Direction nationale d'intervention domaniale
type: ConceptReFip
type: Concept
alternative label: DNID
broader: service à compétence nationale
definition: Service à compétence nationale rattaché au chef du Service France Domaine de la DGFiP. Elle assure des missions sur l’ensemble du territoire national (ventes mobilières, évaluations immobilières de biens exceptionnels, …) et des missions sur la région Ile-de-France (évaluations ; expropriations dans le cadre du service domanial foncier pour l’Ile-de-France, gestion des patrimoines privés).
in scheme: FINANCES PUBLIQUES
in scheme: Organisation Structurelle de l'Etat
in scheme: Ministère
in scheme: Administration de L'Etat
narrower: commissariat aux ventes
notation: REFIP4701
related: service France Domaine

licenciement
type: ConceptReFip
type: Concept
broader: rupture de contrat
definition: Procédure engagée à l'encontre d'un salarié afin de mettre ainsi fin unilatéralement au contrat de travail. Cette rupture du contrat de travail est encadrée par la loi et contrôlée par les tribunaux. On peut distinguer plusieurs catégories de licenciements en fonction du motif de rupture invoqué par l'employeur, comme par exemple le licenciement pour motif économique, le licenciement pour faute, le licenciement sans faute et le licenciement pour motif personnel.
in scheme: FINANCES PUBLIQUES
in scheme: Entreprises
in scheme: Travail
in scheme: 212619
narrower: préavis de licenciement
narrower: refip-REFIP911
notation: REFIP4702
related: chômage

provision pour risques
type: ConceptReFip
type: Concept
broader: provision
definition: Ensemble de provisions regroupant celles afférentes aux risques liés aux ventes, celles constituées pour faire face aux pertes sur des opérations en cours à la clôture de l'exercice ou sur des produits en stock en instance de commercialisation, aux pertes de change, au risque afférent à un engagement de caution et enfin de propre assureur.
in scheme: FINANCES PUBLIQUES
in scheme: Documents comptables
in scheme: Comptabilité
notation: REFIP4703

Direction générale des finances publiques
type: ConceptReFip
type: Concept
alternative label: DGCP
alternative label: DGFIP
alternative label: DGI
alternative label: Direction de la comptabilité publique
alternative label: Direction générale de la comptabilité publique
alternative label: Direction générale des impôts
broader: refip-REFIP7061
definition: Direction placée sous l'autorité du Ministère de l'Action et des Comptes publics, les grandes missions de la direction générale des finances publiques (DGFiP) concernant la fiscalité et la gestion publique sont les suivantes : établir les impôts, contrôler les déclarations fiscales, recenser le patrimoine foncier et conserver les actes relatifs aux immeubles, recouvrer les recettes publiques, contrôler et exécuter les dépenses publiques, produire l’information budgétaire et comptable, offrir des prestations d’expertise et de conseil financier, gérer la clientèle des dépôts de fonds au Trésor et piloter la stratégie immobilière de l’État. Elle exerce également une mission d'animation et de coordination en matière de pensions de l'Etat. La DGFiP comprend en son sein la direction de la législation fiscale qui conçoit et élabore les dispositions législatives et réglementaires à caractère fiscal ainsi que les instructions générales nécessaires à leur application. Elle a également pour mission d'assurer la conduite des relations fiscales internationales (négociation et interprétation des conventions fiscales, procédures amiables, fiscalité des prix de transfert, négociations fiscales européennes, travaux des organisations internationales).
in scheme: FINANCES PUBLIQUES
in scheme: Organisation Structurelle de l'Etat
in scheme: Ministère
in scheme: Administration de L'Etat
narrower: services déconcentrés des finances publiques
narrower: service à compétence nationale
narrower: administration centrale des finances publiques
narrower: Agence comptable
narrower: refip-REFIP895
notation: REFIP4704

Océanie
type: ConceptReFip
type: Concept
definition: Continent
in scheme: FINANCES PUBLIQUES
in scheme: Géographie
in scheme: Océanie
narrower: Australie
narrower: République de Vanuatu
narrower: refip-REFIP78
notation: REFIP4706

taxe d'abattage
type: ConceptReFip
type: Concept
alternative label: abattage d'animaux
alternative label: opération d'abattage
broader: refip-REFIP934
definition: Taxe due par par les personnes qui exploitent un établissement d’abattage. Supprimée par le 4° du II de l'article 47 de la loi n° 2013-1278 du 29 décembre 2013 de finances pour 2014.
in scheme: FINANCES PUBLIQUES
in scheme: Fiscalité
in scheme: Impôt
notation: REFIP4707

changement d'activité
type: ConceptReFip
type: Concept
broader: vie de l'entreprise (non-descripteur)
definition: Modification de l'activité d'une entreprise. Un changement d'activité réelle d'une société entraîne en principe cessation d'entreprise.
in scheme: FINANCES PUBLIQUES
in scheme: Vie de l'Entreprise
in scheme: Entreprises
in scheme: Vie et Gestion de l'entreprise
notation: REFIP4708

application DEVICAD
type: ConceptReFip
type: Concept
alternative label: DEVICAD
broader: applications fiscales (non-descripteur)
definition: Outil qui permet d'établir les devis relatifs à la délivrance des fichiers fonciers du cadastre.
in scheme: FINANCES PUBLIQUES
in scheme: Applications Informatiques
in scheme: Applications fiscales
notation: REFIP471

opposabilité
type: ConceptReFip
type: Concept
alternative label: inopposabilité
broader: droit général (non-descripteur)
definition: Caractère d'un droit que son titulaire peut faire valoir contre un tiers.
in scheme: FINANCES PUBLIQUES
in scheme: Droit et Justice
in scheme: Droit Général
notation: REFIP4711

mutualisation des moyens
type: ConceptReFip
type: Concept
broader: réforme de l'Etat
definition: Mise en commun des moyens, équipements matériels ou personnels, au sein d'une même structure.
in scheme: FINANCES PUBLIQUES
in scheme: Etat
in scheme: Réforme de l'Etat
in scheme: Administration de L'Etat
notation: REFIP4713

révision de prix
type: ConceptReFip
type: Concept
alternative label: clause de révision de prix
broader: passation des marchés publics
definition: Méthode comptable destinée à compenser les conséquences de la variation des prix des matières premières dans les marchés publics,
in scheme: FINANCES PUBLIQUES
in scheme: Commande publique
in scheme: Gestion Publique
narrower: prix révisable
narrower: index travaux publics
notation: REFIP4714

prix ajustable (supprimé)
type: ConceptReFip
type: Concept
broader: ZZ
in scheme: FINANCES PUBLIQUES
notation: REFIP4718

rattachement au foyer fiscal
type: ConceptReFip
type: Concept
broader: refip-REFIP952
definition: Modalité de prise en compte pour l'impôt sur le revenu des charges de famille que représentent les enfants majeurs ou ayant un foyer distinct jusqu'à l'âge de 21 ans ou de 25 ans s'ils sont étudiants. L'option pour le rattachement entraîne le renoncement à une imposition séparée.
in scheme: FINANCES PUBLIQUES
in scheme: Liquidation de l'Impôt
in scheme: Fiscalité
notation: REFIP4719

application SIRHIUS-PRO
type: ConceptReFip
type: Concept
alternative label: SIRIUS-PRO
broader: applications fiscales (non-descripteur)
definition: Outil d'aide à la programmation du contrôle fiscal des professionnels.
in scheme: FINANCES PUBLIQUES
in scheme: Applications Informatiques
in scheme: Applications fiscales
notation: REFIP472

légataire universel
type: ConceptReFip
type: Concept
broader: legs
definition: Personne qui recueille, au décès du testateur, l'ensemble des biens, droits et actions du testateur après délivrance des autres legs (les droits des héritiers réservataires) et l'exécution des charges. Si le testateur ne lègue qu'une partie ou une fraction de son patrimoine, le bénéficiaire du legs est dit "légataire à titre universel".
in scheme: FINANCES PUBLIQUES
in scheme: Droit et Justice
in scheme: Divisions du Droit
in scheme: Droit Privé
notation: REFIP4720

aéroport
type: ConceptReFip
type: Concept
broader: aérodrome
definition: Lieu aménagé pour le départ, l'arrivée, les escales des lignes aériennes, et comprenant notamment l'aérogare, le service d'aide à la navigation, les pistes, les hangars.
in scheme: FINANCES PUBLIQUES
in scheme: Branche d'activité
in scheme: Questions Economiques
in scheme: Transports
notation: REFIP4721

fonds (non-descripteur)
type: ConceptReFip
type: Concept
broader: aide publique
definition: Terme ne servant pas à l'indexation.
in scheme: FINANCES PUBLIQUES
in scheme: Dépenses publiques
in scheme: Gestion Publique
narrower: Fonds national de péréquation des ressources intercommunales et communales
narrower: fonds de correction des déséquilibres régionaux
narrower: Fonds national de développement et de modernisation de l'apprentissage
narrower: Fonds national de développement agricole
narrower: fonds européen agricole de garantie
narrower: Fonds d'aide au relogement d'urgence
narrower: fonds de concours
narrower: fonds départemental de la taxe professionnelle
narrower: fonds de mobilisation départementale pour l'insertion
narrower: Fonds de compensation pour la taxe sur la valeur ajoutée
narrower: fonds de compensation de la fiscalité transférée
narrower: fonds de solidarité prioritaire
narrower: Fonds national de garantie individuelle des ressources
narrower: Fonds national de péréquation des droits de mutation à titre onéreux
narrower: Fonds national d'aide au logement
narrower: fonds européens structurels et d'investissement
narrower: refip-REFIP714
notation: REFIP4722

Manche
type: ConceptReFip
type: Concept
broader: refip-REFIP7016
definition: Département français
in scheme: FINANCES PUBLIQUES
in scheme: Géographie
in scheme: Europe
notation: REFIP4723
scope note: Département

traité européen
type: ConceptReFip
type: Concept
alternative label: TFUE
alternative label: TUE
alternative label: traité de Maastricht
alternative label: traité de Rome
alternative label: traité sur l'Union européenne
alternative label: traité sur le fonctionnement de l'Union européenne
broader: législation
definition: Accord contraignant adopté par tous les États membres de l'Union européenne. Il définit les objectifs poursuivis par l'UE, les règles de fonctionnement des institutions européennes, les procédures à suivre pour prendre des décisions et les relations entre l'UE et les États membres.
in scheme: FINANCES PUBLIQUES
in scheme: Droit et Justice
in scheme: Sources du Droit
in scheme: Sources du Droit Objectif
narrower: convention de sauvegarde des droits de l'homme et des libertés fondamentales
notation: REFIP4724
related: refip-REFIP6938

impôt sur les spectacles
type: ConceptReFip
type: Concept
broader: refip-REFIP934
definition: Impôt indirect local perçu par la commune sur notamment les réunions sportives, les cercles de jeux, les appareils de jeux automatiques et les machines à sous.
in scheme: FINANCES PUBLIQUES
in scheme: Fiscalité
in scheme: Impôt
notation: REFIP4725

revendication
type: ConceptReFip
type: Concept
broader: mots outils (liste additive)
definition: Réclamation de ce qui est dû.
in scheme: FINANCES PUBLIQUES
in scheme: Mots Outils
notation: REFIP4726

bleus budgétaires
type: ConceptReFip
type: Concept
broader: annexes budgétaires
definition: Fascicules de couleur bleue présentant les projets de loi de finances et leurs annexes.
in scheme: FINANCES PUBLIQUES
in scheme: Documentation budgétaire
in scheme: Budget
notation: REFIP4728

droit de la propriété industrielle
type: ConceptReFip
type: Concept
broader: propriété intellectuelle
definition: Ensemble des droits qui concernent les brevets d'invention, les marques, les dessins et modèles. Ces trois droits confèrent un monopole d'exploitation. Celui-ci est limité dans le temps - mais indéfiniment renouvelable pour les marques - et nécessite un dépôt et un enregistrement auprès d'une administration ad hoc chargée de la propriété industrielle - par exemple l'INPI (Institut national de la propriété industrielle, l'Office européen des brevets – OEB-).
in scheme: FINANCES PUBLIQUES
in scheme: Droit et Justice
in scheme: Divisions du Droit
in scheme: Droit Privé
narrower: brevet d'invention
narrower: licence
notation: REFIP4729

modèle
type: ConceptReFip
type: Concept
broader: mots outils (liste additive)
definition: Représentation simplifiée d'un processus, référence.
in scheme: FINANCES PUBLIQUES
in scheme: Mots Outils
notation: REFIP473

syndicat de communes
type: ConceptReFip
type: Concept
alternative label: syndicat intercommunal
broader: refip-REFIP821
definition: Etablissement public de coopération intercommunale de forme associative, permettant aux communes de créer et de gérer ensemble des activités ou des services publics, par opposition aux formes fédératives destinées à regrouper des communes autour d’un projet de développement local et à favoriser l’aménagement du territoire. Les syndicats de communes sont régis par les dispositions générales applicables aux EPCI, sous réserve des dispositions qui leur sont propres. Ils sont de deux types : SIVU et SIVOM.
in scheme: FINANCES PUBLIQUES
in scheme: Organisation Territoriale
in scheme: Structures Territoriales
in scheme: Administration de L'Etat
narrower: syndicat intercommunal à vocation multiple
narrower: syndicat intercommunal à vocation unique
notation: REFIP4730

laïcité
type: ConceptReFip
type: Concept
broader: droit constitutionnel
definition: Principe d'organisation et de fonctionnement des services de l’État et de toutes les personnes publiques selon lequel l’État est non confessionnel. Pour des raisons historiques, ce principe ne s'applique pas aux régions Alsace Lorraine.
in scheme: FINANCES PUBLIQUES
in scheme: Droit et Justice
in scheme: Divisions du Droit
in scheme: Droit Public
notation: REFIP4734
related: refip-REFIP6711

nue-propriété
type: ConceptReFip
type: Concept
broader: démembrement de propriété
definition: Prérogatives conservées par un propriétaire sur une chose qui fait l'objet d'un démembrement de propriété. Il donne à son titulaire le droit de disposer juridiquement de la chose, mais ne lui confère ni l'usage, ni la jouissance,
in scheme: FINANCES PUBLIQUES
in scheme: Droit et Justice
in scheme: Divisions du Droit
in scheme: Droit Privé
narrower: nu-propriétaire
notation: REFIP4735

facturation interne
type: ConceptReFip
type: Concept
broader: facturation
definition: Action de facturer les flux entre services de l’État.
in scheme: FINANCES PUBLIQUES
in scheme: Procédures et Techniques Comptables
in scheme: Comptabilité
notation: REFIP4736
related: application CHORUS

délégation d'autorisation de programme globale
type: ConceptReFip
type: Concept
broader: autorisation de programme
definition: Enveloppe globale délivrée par le niveau central au niveau local, ce dernier la répartissant en plusieurs opérations selon les besoins.
in scheme: FINANCES PUBLIQUES
in scheme: Exécution du budget
in scheme: Budget
notation: REFIP474

incendie
type: ConceptReFip
type: Concept
alternative label: lutte anti-incendie
broader: dégradation de l'environnement
definition: Grand feu violent et destructeur pour les activités humaines ou la nature.
in scheme: FINANCES PUBLIQUES
in scheme: Environnement
in scheme: Dégradation de l'Environnement
in scheme: Questions de Société
notation: REFIP4740

mali de fusion
type: ConceptReFip
type: Concept
broader: fusion de sociétés
definition: Ecart négatif entre le prix d'acquisition des titres de la société absorbée par la société absorbante et la valeur nette comptable au moment de l'apport de ces mêmes titres.
in scheme: FINANCES PUBLIQUES
in scheme: Vie de l'Entreprise
in scheme: Entreprises
in scheme: Vie et Gestion de l'entreprise
notation: REFIP4745

Conseil de l'ordre
type: ConceptReFip
type: Concept
broader: activité libérale
definition: Organisme professionnel, administratif et juridictionnel dont les membres sont élus par ceux qui appartiennent à un ordre.
in scheme: FINANCES PUBLIQUES
in scheme: Branche d'activité
in scheme: Questions Economiques
in scheme: Services et professions libérales
narrower: ordre des géomètres-experts
notation: REFIP4746

association française de cautionnement mutuel
type: ConceptReFip
type: Concept
alternative label: AFCM
broader: Ministère de l'Economie et des Finances
definition: Agréée par la loi de Finances publiée au Journal Officiel du 26 décembre 1908, elle a pour objet de garantir au moyen d'un acte collectif de cautionnement les obligations contractées, vis-à-vis du Trésor Public et divers services publics ou d'utilité publique, par les comptables publics et autres fonctionnaires agents ou employés astreints à fournir un cautionnement en garantie de leur gestion. L'adhésion est exclusivement réservée aux comptables publics et assimilés. L'association dispense le comptable du versement sur ses deniers personnels, du cautionnement dont il doit justifier la réalisation lors de sa prise de service.
in scheme: FINANCES PUBLIQUES
in scheme: Organisation Structurelle de l'Etat
in scheme: Ministère
in scheme: Administration de L'Etat
notation: REFIP4747

taxe sur les services fournis par les opérateurs de communication électronique
type: ConceptReFip
type: Concept
alternative label: taxe FAI
alternative label: taxe fournisseur d'accès à internet
broader: refip-REFIP934
definition: Taxe due par tout opérateur de communications électroniques qui fournit un service en France et qui a fait l’objet d’une déclaration préalable auprès de l’Autorité de régulation des communications électroniques et des postes (ARCEP). Les opérateurs concernés sont les personnes qui exploitent un réseau de communications électroniques ouvert au public ou qui lui fournissent un service de communications électroniques.
in scheme: FINANCES PUBLIQUES
in scheme: Fiscalité
in scheme: Impôt
notation: REFIP4748

métal
type: ConceptReFip
type: Concept
broader: matières premières
definition: Matériau constitué d'éléments chimiques ou de leur mélange.
in scheme: FINANCES PUBLIQUES
in scheme: Branche d'activité
in scheme: Questions Economiques
in scheme: Industrie
narrower: métal précieux
notation: REFIP4749

vacation funéraire
type: ConceptReFip
type: Concept
broader: refip-REFIP6677
definition: Somme versée au fonctionnaire chargé de la surveillance de certaines opérations funéraires.
in scheme: FINANCES PUBLIQUES
in scheme: Gestion des ressources humaines
in scheme: Fonction Publique et Gestion des Ressources Humaines
notation: REFIP475

Caisse centrale de réassurance
type: ConceptReFip
type: Concept
broader: entreprise publique
definition: Société anonyme détenue à 100 % par l’État français, sa principale mission est réassureur public proposant aux cédantes opérant en France, dans l’intérêt général, des couvertures contre les catastrophes naturelles et les risques non assurables.
in scheme: FINANCES PUBLIQUES
in scheme: Organisation Structurelle de l'Etat
in scheme: Entreprise Publique
in scheme: Administration de L'Etat
narrower: refip-REFIP820
notation: REFIP4750

application WIN ADS
type: ConceptReFip
type: Concept
alternative label: WIN ADS
broader: applications fiscales (non-descripteur)
definition: Application permettant de gérer la taxe d'urbanisme (liquidation, dégrèvement..). Remplacée par le logiciel ADS 2007.
in scheme: FINANCES PUBLIQUES
in scheme: Applications Informatiques
in scheme: Applications fiscales
notation: REFIP4751

titulaire d'un marché public
type: ConceptReFip
type: Concept
broader: attribution de marché public
definition: Opérateur économique qui conclut le marché avec le représentant du pouvoir adjudicateur. En cas de groupement des opérateurs économiques, le « titulaire » désigne le groupement, représenté par son mandataire.
in scheme: FINANCES PUBLIQUES
in scheme: Commande publique
in scheme: Gestion Publique
notation: REFIP4752

appel d'offres ouvert
type: ConceptReFip
type: Concept
broader: appel d'offres
definition: Procédure de l'appel d'offres lorsque tout opérateur économique intéressé peut soumissionner.
in scheme: FINANCES PUBLIQUES
in scheme: Commande publique
in scheme: Gestion Publique
notation: REFIP4753

analyse de l'exécution
type: ConceptReFip
type: Concept
broader: exécution du budget
definition: Processus ayant pour objet la consolidation et l'interprétation de l'exécution du budget ainsi et de la performance des unités opérationnelles, des budgets opérationnels de programme et des programmes.
in scheme: FINANCES PUBLIQUES
in scheme: Exécution du budget
in scheme: Budget
notation: REFIP4756

Thaïlande
type: ConceptReFip
type: Concept
broader: Asie
definition: Pays
in scheme: FINANCES PUBLIQUES
in scheme: Géographie
in scheme: Asie
notation: REFIP4757

syndicat des transports d'Ile-de-France (supprimé)
type: ConceptReFip
type: Concept
broader: ZZ
in scheme: FINANCES PUBLIQUES
notation: REFIP4758

Hautes-Alpes
type: ConceptReFip
type: Concept
broader: Provence-Alpes-Côte d'Azur
definition: Département français
in scheme: FINANCES PUBLIQUES
in scheme: Géographie
in scheme: Europe
notation: REFIP4759

crédit d'impôt pour dépenses de création de jeux vidéo
type: ConceptReFip
type: Concept
broader: refip-REFIP849
definition: Dispositif institué en faveur des entreprises de création de jeux vidéo soumises à l’impôt sur les sociétés et qui respectent la législation sociale en vigueur.
in scheme: FINANCES PUBLIQUES
in scheme: Liquidation de l'Impôt
in scheme: Fiscalité
notation: REFIP476

révision générale des politiques publiques
type: ConceptReFip
type: Concept
alternative label: RGPP
broader: réforme de l'Etat
definition: Analyse des missions et actions de l'État et des collectivités, suivie de la mise en œuvre de scénarios de réformes structurelles, avec comme objectifs la réforme de l'État, la baisse des dépenses publiques et l'amélioration des politiques publiques. Lancée en 2007.
in scheme: FINANCES PUBLIQUES
in scheme: Etat
in scheme: Réforme de l'Etat
in scheme: Administration de L'Etat
notation: REFIP4760

maison des jeunes et de la culture
type: ConceptReFip
type: Concept
alternative label: MJC
broader: refip-REFIP7065
definition: Structure associative ayant pour objectif la responsabilisation et l'autonomie des citoyens, rattachée au Ministère de la Jeunesse et des Sports. Les MJC ont la capacité à réunir et à mettre en mouvement des citoyens et à développer des initiatives nouvelles et innovantes. Elles veulent lier jeunesse et culture dans une perspective d’éducation populaire.
in scheme: FINANCES PUBLIQUES
in scheme: Organisation Structurelle de l'Etat
in scheme: Ministère
in scheme: Administration de L'Etat
notation: REFIP4761

application PATRIM
type: ConceptReFip
type: Concept
alternative label: PATRIM
broader: applications fiscales (non-descripteur)
definition: Application offrant une fonctionnalité de recherche des termes de comparaison en matière de mutations immobilières.
in scheme: FINANCES PUBLIQUES
in scheme: Applications Informatiques
in scheme: Applications fiscales
notation: REFIP4762

Bulletin officiel de la comptabilité publique
type: ConceptReFip
type: Concept
alternative label: BOCP
broader: bulletin officiel
definition: Recueil officiel des textes de la compatibilité publique se composant des instructions et des notes de service.
in scheme: FINANCES PUBLIQUES
in scheme: Documentation
in scheme: Communication Documentation Informatique
notation: REFIP4764
scope note: Remplacé par le Bulletin Officiel des Finances Publiques - Gestion comptable publique depuis janvier 2013

énergie renouvelable
type: ConceptReFip
type: Concept
broader: énergie
definition: Toutes les énergies que la nature constitue ou reconstitue plus rapidement que l'Homme ne les utilise. Elles peuvent ainsi être considérées comme inépuisables à l'échelle du temps humain.
in scheme: FINANCES PUBLIQUES
in scheme: Branche d'activité
in scheme: Questions Economiques
in scheme: Industrie
narrower: énergie solaire photovoltaïque
narrower: énergie éolienne
narrower: refip-REFIP654
notation: REFIP4766

Antilles
type: ConceptReFip
type: Concept
alternative label: Antilles françaises
broader: Caraïbes
definition: Territoire
in scheme: FINANCES PUBLIQUES
in scheme: Géographie
in scheme: Amérique
notation: REFIP4767
related: Guadeloupe
related: Martinique
related: refip-REFIP886

réseau interrégional de maîtrise des risques (supprimé)
type: ConceptReFip
type: Concept
broader: ZZ
in scheme: FINANCES PUBLIQUES
notation: REFIP4768

règlement intérieur
type: ConceptReFip
type: Concept
broader: refip-REFIP6950
definition: Document qui précise un certain nombre d'obligations, notamment en matière d'hygiène, de sécurité ou de sanctions, que le salarié et l'employeur doivent respecter à l'intérieur de l'entreprise. Il est obligatoire à partir d'un certain nombre de salariés.
in scheme: FINANCES PUBLIQUES
in scheme: Entreprises
in scheme: Travail
in scheme: 212619
notation: REFIP4769

centre de gestion agréé
type: ConceptReFip
type: Concept
alternative label: CGA
alternative label: Centre agréé
broader: refip-REFIP7154
definition: Organisme associatif Loi 1901 qui apporte une assistance en matière de gestion et de fiscalité à leurs adhérents. Son rôle est d'assister et de surveiller la gestion de l'entreprise adhérente. Il a ainsi pour mission de lui fournir tous services en matière de gestion notamment dans les domaines de l'assistance technique et de la formation. Il doit également fournir une analyse des informations économiques, comptables et financières en matière de prévention des difficultés économiques et financières de l'adhérent.
in scheme: FINANCES PUBLIQUES
in scheme: Entreprises
in scheme: Forme juridique
in scheme: Association
notation: REFIP4770
related: comptable agrée

application IR-CDA
type: ConceptReFip
type: Concept
alternative label: IR-CDA
broader: applications fiscales (non-descripteur)
definition: Matrices de rôles supplémentaires pour l'impôt sur le revenu et la CSG.
in scheme: FINANCES PUBLIQUES
in scheme: Applications Informatiques
in scheme: Applications fiscales
notation: REFIP4773

timbre fiscal mobile (obsolète)
type: ConceptReFip
type: Concept
is replaced by: refip-REFIP6897
broader: ZZ
in scheme: FINANCES PUBLIQUES
notation: REFIP4774

défiscalisation
type: ConceptReFip
type: Concept
broader: fiscalité
definition: Essentiel des dispositions légales prises pour échapper, en tout ou partie, à l'impôt.
in scheme: FINANCES PUBLIQUES
in scheme: Fiscalité - Autres notions
in scheme: Fiscalité
narrower: optimisation fiscale
notation: REFIP4775

local
type: ConceptReFip
type: Concept
broader: cadastre
definition: Lieu fermé destiné à une activité précise, identifié par son numéro invariant, par son indicatif cadastral complété des numéros de bâtiment, d'escalier, de niveau et de porte.
in scheme: FINANCES PUBLIQUES
in scheme: Cadastre
in scheme: Fiscalité
narrower: local à usage d'habitation
narrower: local professionnel
narrower: local nu
narrower: refip-REFIP7027
notation: REFIP4776

travaux d'entretien
type: ConceptReFip
type: Concept
alternative label: travaux de réparation
broader: construction
definition: Travaux ayant pour objet de maintenir ou de remettre un immeuble en bon état et d'en permettre un usage normal sans en modifier la consistance, l'agencement ou l'équipement initial.
in scheme: FINANCES PUBLIQUES
in scheme: Branche d'activité
in scheme: Questions Economiques
in scheme: Construction
notation: REFIP4777

réclamation contentieuse
type: ConceptReFip
type: Concept
broader: réclamation fiscale
definition: Demande par laquelle le contribuable vise à faire corriger l'assiette ou le calcul d'une imposition ou à obtenir le bénéfice d'un droit résultant d'une disposition législative ou réglementaire.
in scheme: FINANCES PUBLIQUES
in scheme: Contentieux Fiscal
in scheme: Fiscalité
narrower: réclamation collective
narrower: réclamation suspensive de paiement
notation: REFIP4778

Ariège
type: ConceptReFip
type: Concept
broader: refip-REFIP7036
definition: Département français
in scheme: FINANCES PUBLIQUES
in scheme: Géographie
in scheme: Europe
notation: REFIP4779

achèvement des travaux
type: ConceptReFip
type: Concept
alternative label: achèvement de l'ouvrage
alternative label: déclaration d'achèvement
alternative label: fin de chantier
alternative label: fin des travaux
broader: exécution d'un marché public
definition: Constatation que les travaux sont en état d'être reçus
in scheme: FINANCES PUBLIQUES
in scheme: Commande publique
in scheme: Gestion Publique
notation: REFIP478

crédit d'impôt en faveur des jeunes
type: ConceptReFip
type: Concept
broader: refip-REFIP849
definition: L’ordonnance n° 2005-895 du 2 août 2005 a institué un crédit d’impôt sur le revenu en faveur des jeunes de moins de vingt-six ans qui justifient avoir exercé pendant au moins six mois consécutifs une activité salariée, débutée entre le 01/07/2005 et le 31/12/2007 dans un métier qui connaît des difficultés de recrutement et se rattache à l’une des familles professionnelles limitativement énumérées.
in scheme: FINANCES PUBLIQUES
in scheme: Liquidation de l'Impôt
in scheme: Fiscalité
notation: REFIP4780

support magnétique (supprimé)
type: ConceptReFip
type: Concept
broader: ZZ
in scheme: FINANCES PUBLIQUES
notation: REFIP4781

optimisation fiscale
type: ConceptReFip
type: Concept
broader: défiscalisation
definition: Fait pour un contribuable (particulier ou entreprise) d'explorer toutes les possibilités qui lui sont offertes par la loi, afin d'éliminer, sinon de réduire, l'imposition en réalisant les investissements adéquats.
in scheme: FINANCES PUBLIQUES
in scheme: Fiscalité - Autres notions
in scheme: Fiscalité
narrower: investissement locatif
notation: REFIP4782

recettes au comptant
type: ConceptReFip
type: Concept
broader: comptabilité de caisse
definition: Recette sans enregistrement d'un titre préalable à l'encaissement.
in scheme: FINANCES PUBLIQUES
in scheme: Comptabilité publique
in scheme: Comptabilité
notation: REFIP4784

cédérom
type: ConceptReFip
type: Concept
alternative label: CD-ROM
broader: support de communication
definition: Disque compact à lecture laser, possédant une grande capacité de mémoire, et utilisé pour stocker des textes, des images et des sons.
in scheme: FINANCES PUBLIQUES
in scheme: Communication
in scheme: Communication Documentation Informatique
notation: REFIP4785

mise en demeure de payer
type: ConceptReFip
type: Concept
broader: poursuites
definition: Acte de poursuite adressé, par le comptable public compétent, au contribuable qui n'a pas payé les sommes mentionnées sur l'avis d'imposition à la date limite de paiement ou de celle mentionnées sur l'avis de mise en recouvrement et en l'absence d'une réclamation assortie d'une demande de sursis de paiement formulée selon les conditions définies à l'article L. 277 du LPF.
in scheme: FINANCES PUBLIQUES
in scheme: Recouvrement
in scheme: Fiscalité
notation: REFIP4786

période d'observation
type: ConceptReFip
type: Concept
broader: procédure collective
definition: Phase de 6 mois, renouvelable une fois par jugement du Tribunal , et le cas échéant une seconde fois (à la demande du Procureur de la République) qui commence au jugement qui prononce la sauvegarde ou le redressement judiciaire Cette période d’observation répond a plusieurs objectifs : faire un bilan détaillé de l’état de l’entreprise (trésorerie, comptabilité, exploitation...); rechercher et mettre en place si elles existent les mesures de restructuration nécessaires; connaître très exactement le montant des dettes qu’il faudra rembourser une fois que la restructuration sera avancée, et que la période d’observation prendra fin.
in scheme: FINANCES PUBLIQUES
in scheme: Vie de l'Entreprise
in scheme: Entreprises
in scheme: Vie et Gestion de l'entreprise
notation: REFIP4787

aide aux particuliers (non-descripteur)
type: ConceptReFip
type: Concept
broader: aide publique
definition: Terme ne servant pas à l'indexation
in scheme: FINANCES PUBLIQUES
in scheme: Dépenses publiques
in scheme: Gestion Publique
narrower: bonus pour l'acquisition d'un véhicule propre
narrower: aide à la pierre
narrower: avance remboursable ne portant pas intérêt
notation: REFIP4788
note: Etiquette de nœud

contrat d'accès à l'emploi (supprimé)
type: ConceptReFip
type: Concept
broader: ZZ
in scheme: FINANCES PUBLIQUES
notation: REFIP4789

application TELETVA
type: ConceptReFip
type: Concept
alternative label: TELETVA
broader: applications fiscales (non-descripteur)
definition: Application permettant à un partenaire EDI de transmettre, sous forme dématérialisée, ses déclarations de TVA et taxes parafiscales, les paiements correspondants ainsi que les demandes de remboursement de crédit de TVA.
in scheme: FINANCES PUBLIQUES
in scheme: Applications Informatiques
in scheme: Applications fiscales
notation: REFIP4790

Ministère de l'Intérieur
type: ConceptReFip
type: Concept
alternative label: Ministère de l'Intérieur de l'Outre-mer des Collectivités territoriales et de l'Immigration
alternative label: Ministère de l'Intérieur de l'Outre-mer et des Collectivités territoriales
broader: ministère
definition: Administration chargée de préparer et de mettre en œuvre la politique du Gouvernement en matière de sécurité intérieure, de libertés publiques, d'administration territoriale de l'Etat, de décentralisation, d'immigration, d'asile et de sécurité routière. Sans préjudice des attributions du ministre de la justice, le ministre de l'intérieur prépare et met en œuvre, dans la limite de ses attributions, la politique du Gouvernement en matière d'accès à la nationalité française. Conjointement avec le ministre de la cohésion des territoires, il prépare et met en œuvre la politique du Gouvernement à l'égard des collectivités territoriales. Sans préjudice des attributions du ministre de l'Europe et des affaires étrangères, il est chargé de l'organisation des scrutins. Il est, en outre, chargé de coordonner les actions de lutte contre les trafics de stupéfiants. Il prépare la politique gouvernementale en matière de prévention de la délinquance et de la radicalisation et veille à sa mise en œuvre.
in scheme: FINANCES PUBLIQUES
in scheme: Organisation Structurelle de l'Etat
in scheme: Ministère
in scheme: Administration de L'Etat
narrower: police nationale
narrower: préfecture de police
narrower: gendarmerie nationale
narrower: Direction générale des collectivités locales
notation: REFIP4791
related: brigade nationale d'enquêtes économiques
scope note: Depuis le 02/04/2014

injonction
type: ConceptReFip
type: Concept
broader: principes généraux (non-descripteur)
definition: Ordre, prescription, commandement émanant d'une autorité.
in scheme: FINANCES PUBLIQUES
in scheme: Principes Généraux
in scheme: Droit et Justice
in scheme: Procédure
narrower: injonction de payer
notation: REFIP4792

publicité de l'impôt
type: ConceptReFip
type: Concept
broader: fiscalité
definition: Mesure permettant aux contribuables de prendre connaissance auprès de la direction départementale des finances publiques dont ils relèvent, sous certaines conditions,de certains renseignements sur les revenus, l’impôt sur le revenu ou l'impôt sur les sociétés d’autres contribuables.
in scheme: FINANCES PUBLIQUES
in scheme: Fiscalité - Autres notions
in scheme: Fiscalité
notation: REFIP4793

taxe professionnelle
type: ConceptReFip
type: Concept
broader: impôt direct local
definition: Impôt local, qui était dû par les entreprises et les personnes physiques ou morales qui exerçaient une activité professionnelle non salariée. Impôt supprimé par la Loi de finances pour 2010 n° 2009-1673 du 30/12/2009 et remplacé par la Contribution économique territoriale avec des modes de calculs différents.
in scheme: FINANCES PUBLIQUES
in scheme: Fiscalité
in scheme: Impôt
narrower: taxe professionnelle unique
narrower: cotisation minimale de taxe professionnelle
notation: REFIP4794
scope note: Remplacée par la contribution économique territoriale avec des modes de calculs différents par la loi 2009-1673

contrôle budgétaire
type: ConceptReFip
type: Concept
broader: contrôle interne
definition: Évaluation de la soutenabilité des programmations financières, l’identification et la prévention des risques budgétaires ainsi que l’analyse des facteurs explicatifs de la dépense.
in scheme: FINANCES PUBLIQUES
in scheme: Missions Transverses des Finances publiques
in scheme: Maîtrise des risques
notation: REFIP4795

avis de règlement
type: ConceptReFip
type: Concept
broader: documents comptables
definition: Avis émis par le comptable centralisateur pour effectuer le transfert de la recette ou de la dépense au comptable destinataire.
in scheme: FINANCES PUBLIQUES
in scheme: Documents comptables
in scheme: Comptabilité
notation: REFIP4796

carnet de tickets de jeux
type: ConceptReFip
type: Concept
broader: carnet à souches
definition: Carnet permettant d'effectuer la retenue au profit de la cagnotte des jeux de cercle.
in scheme: FINANCES PUBLIQUES
in scheme: Documentation
in scheme: Communication Documentation Informatique
notation: REFIP4799

EUROFISC
type: ConceptReFip
type: Concept
broader: contrôle multilatéral international
definition: Structure commune aux pays de l'UE permettant un échange rapide d'informations sur les contribuables dans le but de s'attaquer aux fraudes utilisant la technique des carrousels de TVA.
in scheme: FINANCES PUBLIQUES
in scheme: Droit de Contrôle de l'Administration
in scheme: Fiscalité
notation: REFIP48

Institut national de l'information géographique et forestière
type: ConceptReFip
type: Concept
alternative label: IFN
alternative label: IGN
alternative label: Institut géographique national
alternative label: Inventaire forestier national
broader: établissement public à caractère administratif
definition: Etablissement public à caractère administratif issu de la fusion de l’Institut géographique national (IGN) et de l’Inventaire forestier national (IFN), l'IGN est l'opérateur public de référence pour l'information géographique et forestière en France. L'institut a pour vocation de décrire, d’un point de vue géométrique et physique, la surface du territoire national et l’occupation de son sol, d’élaborer et de mettre à jour l’inventaire permanent des ressources forestières nationales. Il produit toutes les représentations appropriées des données ainsi rassemblées, les diffuse et les archive.
in scheme: FINANCES PUBLIQUES
in scheme: Organisation Structurelle de l'Etat
in scheme: Opérateur de l'Etat
in scheme: Administration de L'Etat
notation: REFIP480

jour chômé
type: ConceptReFip
type: Concept
broader: refip-REFIP6950
definition: Jour pendant lequel le travail est suspendu.
in scheme: FINANCES PUBLIQUES
in scheme: Entreprises
in scheme: Travail
in scheme: 212619
notation: REFIP4800

droit exclusif (supprimé)
type: ConceptReFip
type: Concept
broader: ZZ
in scheme: FINANCES PUBLIQUES
notation: REFIP4801

pouvoirs publics
type: ConceptReFip
type: Concept
broader: organisation structurelle de l'Etat (non-descripteur)
definition: Ensemble du gouvernement et des services chargés de l'administration d'un Etat ou d'une collectivité territoriale. Peut aussi désigner plus spécifiquement telle ou telle administration ou encore les autorités qui dirigent l’administration générale de l’État et font appliquer les lois sur le territoire national.
in scheme: FINANCES PUBLIQUES
in scheme: Organisation Structurelle de l'Etat
in scheme: Pouvoirs Publics
in scheme: Administration de L'Etat
narrower: Président de la République
narrower: gouvernement
narrower: Parlement
notation: REFIP4802

déclaration de la taxe sur la valeur ajoutée
type: ConceptReFip
type: Concept
alternative label: déclaration de TVA
broader: refip-REFIP804
definition: Formulaire CA3 (mensuel ou trimestriel) ou CA12 (annuel) devant être souscrit par tout redevable réalisant des opérations (ventes et les prestations de service) soumises à la taxe sur la valeur ajoutée (TVA) qu'il perçoit et doit reverser au service des impôts des entreprises.
in scheme: FINANCES PUBLIQUES
in scheme: Documentation Fiscale
in scheme: Fiscalité
notation: REFIP4803

échange de données informatisé
type: ConceptReFip
type: Concept
alternative label: EDI
broader: informatique
definition: Transfert, entre plusieurs systèmes d’information, de données structurées directement émises et traitées par des applications informatiques selon des procédures normalisées.
in scheme: FINANCES PUBLIQUES
in scheme: Informatique
in scheme: Communication Documentation Informatique
narrower: refip-REFIP724
notation: REFIP4807
related: traitement de l'information

contrat de service
type: ConceptReFip
type: Concept
broader: refip-REFIP996
definition: Document définissant les engagements réciproques entre les trois acteurs (services prescripteurs, les CSP, les SFACT) et précisant l'organisation du circuit de la dépense publique en mode facturier.
in scheme: FINANCES PUBLIQUES
in scheme: Dépenses publiques
in scheme: Gestion Publique
notation: REFIP4809

taxe pour frais de chambres de commerce et d'industrie
type: ConceptReFip
type: Concept
broader: taxes assimilées aux impôts directs locaux (non descripteur)
definition: Taxe pourvoyant à une partie des dépenses des chambres de commerce et d'industrie de région. Elle est constituée de deux contributions, une taxe additionnelle à la cotisation foncière des entreprises et une taxe additionnelle à la cotisation sur la valeur ajoutée des entreprises.
in scheme: FINANCES PUBLIQUES
in scheme: Fiscalité
in scheme: Impôt
notation: REFIP481

créance douteuse
type: ConceptReFip
type: Concept
broader: créance
definition: Créance de toute nature, même assortie de garanties, qui présente un risque certain ou probable de non-recouvrement partiel ou total par l’entreprise détentrice.
in scheme: FINANCES PUBLIQUES
in scheme: Documents comptables
in scheme: Comptabilité
notation: REFIP4812

Conseil supérieur de la fonction publique hospitalière
type: ConceptReFip
type: Concept
broader: organisme consultatif et représentatif (non-descripteur)
definition: Instance à la fois consultative et de recours. Il a été créé pour favoriser une concertation régulière et un dialogue constant entre les pouvoirs publics, les élus locaux et les représentants des personnels de la fonction publique hospitalière.
in scheme: FINANCES PUBLIQUES
in scheme: Organisation Structurelle de l'Etat
in scheme: Organisme Consultatif et Représentatif
in scheme: Administration de L'Etat
notation: REFIP4813

discrimination
type: ConceptReFip
type: Concept
alternative label: discrimination à l'embauche
alternative label: lutte anti-discrimination
alternative label: lutte contre les discriminations
broader: délit
definition: Distinction, isolement, ségrégation d'une personne ou d'un groupe de personnes, sur le fondement de son appartenance, vraie ou supposée à une ethnie ou une race, une religion, de ses convictions, son âge, son handicap, son orientation sexuelle ou son sexe. Elle consiste à restreindre leurs droits en leur appliquant un traitement défavorable.
in scheme: FINANCES PUBLIQUES
in scheme: Droit et Justice
in scheme: Infractions et Sanctions
in scheme: Infraction
notation: REFIP4814

télécopie
type: ConceptReFip
type: Concept
alternative label: fax
broader: telétransmission
definition: Procédé de télécommunication, associant la téléphonie et la numérisation d'image, qui permet de transmettre un document sous la forme d'un autre document semblable à l'original. Désigne également le document transmis.
in scheme: FINANCES PUBLIQUES
in scheme: Communication
in scheme: Communication Documentation Informatique
notation: REFIP4815

indemnité temporaire
type: ConceptReFip
type: Concept
broader: indemnité
definition: Rémunération accessoire versée pendant une durée limitée, dans des cas limitativement prévus.
in scheme: FINANCES PUBLIQUES
in scheme: Gestion des ressources humaines
in scheme: Fonction Publique et Gestion des Ressources Humaines
notation: REFIP4816

Midi-Pyrénées (obsolète)
type: ConceptReFip
type: Concept
is replaced by: refip-REFIP7036
broader: ZZ
in scheme: FINANCES PUBLIQUES
notation: REFIP4817

application CIRCL
type: ConceptReFip
type: Concept
alternative label: CIRCL
broader: applications gestion publique (non-descripteur)
definition: Logiciel de tenue de la comptabilité des valeurs inactives dans les postes comptables non centralisateurs, de gestion des valeurs déposées par les hébergés, et de tenue des régies des collectivités Locales.
in scheme: FINANCES PUBLIQUES
in scheme: Applications Informatiques
in scheme: Applications gestion publique
notation: REFIP4819

contrat de prestations intégrées
type: ConceptReFip
type: Concept
alternative label: contrat in-house
alternative label: quasi-régie
broader: commande publique
definition: Contrat in-house (encore appelé contrat de quasi-régie, ou contrat de prestations intégrées) , exclu du champ d'application du code des marchés publics, et qui concerne les contrats de fournitures, de travaux ou de services conclus entre deux personnes morales distinctes mais dont l’une peut être regardée comme le prolongement administratif de l’autre.
in scheme: FINANCES PUBLIQUES
in scheme: Commande publique
in scheme: Gestion Publique
notation: REFIP482

décret de répartition
type: ConceptReFip
type: Concept
broader: exécution du budget
definition: Décret fixant, dès la promulgation de la loi de finances, la répartition entre les ministres, qui sont ordonnateurs principaux, par programme ou par dotation, des crédits ouverts en distinguant les dépenses de personnel (titre 2) des autres dépenses.
in scheme: FINANCES PUBLIQUES
in scheme: Exécution du budget
in scheme: Budget
notation: REFIP4820

telétransmission
type: ConceptReFip
type: Concept
broader: télécommunication
definition: Action de transmettre à distance un signal, une information.
in scheme: FINANCES PUBLIQUES
in scheme: Communication
in scheme: Communication Documentation Informatique
narrower: télécopie
notation: REFIP4821

droits de succession
type: ConceptReFip
type: Concept
alternative label: droit de mutation par décès
broader: droit de mutation à titre gratuit
definition: Droits de mutation par décès venant frapper toutes les transmissions qui s'effectuent à l'occasion du décès, c'est-à-dire celles qui résultant de successions, de dispositions contenues dans un testament, de donations à cause de mort, dont la réalisation est subordonnée au décès du donateur.
in scheme: FINANCES PUBLIQUES
in scheme: Fiscalité
in scheme: Impôt
notation: REFIP4822

taxe sur la valeur ajoutée immobilière
type: ConceptReFip
type: Concept
alternative label: TVA immobilière
broader: taxe sur la valeur ajoutée
definition: Taxe sur la valeur ajoutée grevant les opérations d'achat et/ou vente de biens immobiliers.
in scheme: FINANCES PUBLIQUES
in scheme: Fiscalité
in scheme: Impôt
notation: REFIP4823

Saint-Vincent-et-les-Grenadines
type: ConceptReFip
type: Concept
broader: Caraïbes
definition: Pays
in scheme: FINANCES PUBLIQUES
in scheme: Géographie
in scheme: Amérique
notation: REFIP4824

remboursement
type: ConceptReFip
type: Concept
broader: mots outils (liste additive)
definition: Fait de rendre (à une personne ou à un organisme) une somme qui a été avancée ou déboursée .
in scheme: FINANCES PUBLIQUES
in scheme: Mots Outils
notation: REFIP4826

mobilier national
type: ConceptReFip
type: Concept
broader: refip-REFIP7064
definition: Service à compétence nationale rattaché à la Délégation aux Arts plastiques du Ministère français de la culture qui a pour mission de meubler les bâtiments officiels de la république française, auxquels il prête certains des objets de sa collection. Également chargé de la conservation et de l'entretien de ces objets, au sein de ses ateliers d'art.
in scheme: FINANCES PUBLIQUES
in scheme: Organisation Structurelle de l'Etat
in scheme: Ministère
in scheme: Administration de L'Etat
notation: REFIP4827

clause de réserve de propriété
type: ConceptReFip
type: Concept
broader: droit des obligations et contrats (non-descripteur)
definition: Clause par laquelle un vendeur se réserve la propriété de la chose vendue jusqu'au paiement intégral du prix par l'acquéreur.
in scheme: FINANCES PUBLIQUES
in scheme: Droit et Justice
in scheme: Divisions du Droit
in scheme: Droit Privé
notation: REFIP4829

émission de titre de recette
type: ConceptReFip
type: Concept
broader: refip-REFIP880
definition: Titre de recette émis par l'ordonnateur afin de respecter le principe des droits constatés. Tous les droits acquis au cours d’un exercice doivent impérativement faire l’objet, au titre de cet exercice, d’un titre de recettes, qu’ils aient donné lieu à encaissement ou non.
in scheme: FINANCES PUBLIQUES
in scheme: Budget de l’État
in scheme: Budget
narrower: prescription d'assiette
notation: REFIP483

Direction générale des entreprises
type: ConceptReFip
type: Concept
alternative label: DGE Direction générale des entreprises
broader: Ministère de l'Economie et des Finances
definition: Direction placée sous l’autorité du ministre de l’Economie et des Finances, la DGE élabore et met en œuvre les politiques publiques relatives à l’industrie, à l’économie numérique, au tourisme, au commerce, à l’artisanat et aux services. A travers les directions régionales des entreprises, de la concurrence, de la consommation, du travail et de l’emploi (Direccte), elle favorise la création, le développement, l’innovation et la compétitivité des entreprises de toutes tailles, en France et à l’international. La DGE entretient des relations étroites avec les entreprises elles-mêmes et leurs représentants.
in scheme: FINANCES PUBLIQUES
in scheme: Organisation Structurelle de l'Etat
in scheme: Ministère
in scheme: Administration de L'Etat
narrower: Agence du numérique
notation: REFIP4831

gage du Trésor (supprimé)
type: ConceptReFip
type: Concept
broader: ZZ
in scheme: FINANCES PUBLIQUES
notation: REFIP4833

crédit d'impôt en faveur de la première accession à la propriété
type: ConceptReFip
type: Concept
broader: refip-REFIP849
definition: La loi de finances pour 2011 a instauré un nouveau prêt ne portant pas intérêt, octroyé aux personnes physiques par les établissements de crédit et destiné à financer la première accession à la propriété. Les établissements de crédit bénéficient en contrepartie d’un crédit d’impôt s’appliquant aux offres de prêt ne portant pas intérêts. La loi de finances pour 2012 en a modifié le dispositif, afin notamment, de permettre son cumul, sous certains conditions, avec le crédit d’impôt au titre du développement durable.
in scheme: FINANCES PUBLIQUES
in scheme: Liquidation de l'Impôt
in scheme: Fiscalité
notation: REFIP4835

contrôle partenarial (supprimé)
type: ConceptReFip
type: Concept
broader: ZZ
in scheme: FINANCES PUBLIQUES
notation: REFIP4837

comité technique paritaire
type: ConceptReFip
type: Concept
alternative label: CTP
broader: organisme consultatif et représentatif (non-descripteur)
definition: Instance de concertation chargée d’examiner les questions relatives à l’organisation et au fonctionnement des services. Suite à une réforme les comités techniques paritaires sont progressivement remplacés par des comités techniques (CT).
in scheme: FINANCES PUBLIQUES
in scheme: Organisation Structurelle de l'Etat
in scheme: Organisme Consultatif et Représentatif
in scheme: Administration de L'Etat
notation: REFIP4839
related: refip-REFIP6578

client
type: ConceptReFip
type: Concept
alternative label: clientèle
broader: commerce
definition: Personne ou entité qui prend la décision d'acheter un bien ou service, de façon occasionnelle ou habituelle.
in scheme: FINANCES PUBLIQUES
in scheme: Branche d'activité
in scheme: Questions Economiques
in scheme: Commerce
notation: REFIP4840

Agence de l'environnement et de la maîtrise de l'énergie
type: ConceptReFip
type: Concept
alternative label: ADEME
broader: établissement public à caractère industriel et commercial
definition: Etablissement public à caractère industriel et commercial, l'ADEME participe à la mise en œuvre des politiques publiques dans les domaines de l’environnement, de l’énergie et du développement durable. Elle met ses capacités d’expertise et de conseil à disposition des entreprises, des collectivités locales, des pouvoirs publics et du grand public, afin de leur permettre de progresser dans leur démarche environnementale. L’ADEME est un établissement public sous la tutelle conjointe du ministère de la Transition écologique et solidaire et du ministère de l’Enseignement supérieur, de la Recherche et de l’Innovation.
in scheme: FINANCES PUBLIQUES
in scheme: Organisation Structurelle de l'Etat
in scheme: Opérateur de l'Etat
in scheme: Administration de L'Etat
notation: REFIP4841

plainte
type: ConceptReFip
type: Concept
broader: procédure pénale
definition: Acte par lequel toute personne qui s'estime victime d'une infraction en informe le procureur de la république ou les services de police.
in scheme: FINANCES PUBLIQUES
in scheme: Procédure Pénale
in scheme: Droit et Justice
in scheme: Procédure
notation: REFIP4844

Agence comptable
type: ConceptReFip
type: Concept
broader: Direction générale des finances publiques
definition: Structure placée au sein des établissements publics et chargée de recouvrer les recettes et de procéder au paiement des dépenses.
in scheme: FINANCES PUBLIQUES
in scheme: Organisation Structurelle de l'Etat
in scheme: Ministère
in scheme: Administration de L'Etat
notation: REFIP4847

association pour la gestion des restaurants administratifs financiers
type: ConceptReFip
type: Concept
alternative label: AGRAF
broader: secrétariat général des ministères économiques et financiers
definition: Association «Loi 1901» ayant pour mission de gérer les établissements de restauration fréquentés par les agents des Ministères économique et financier à Paris et en région parisienne.
in scheme: FINANCES PUBLIQUES
in scheme: Organisation Structurelle de l'Etat
in scheme: Ministère
in scheme: Administration de L'Etat
notation: REFIP4848

directive européenne
type: ConceptReFip
type: Concept
broader: directive
definition: Acte normatif liant les États membres destinataires quant au résultat à atteindre, tout en leur laissant le choix des moyens et de la forme pour en transposer le contenu en droit interne.
in scheme: FINANCES PUBLIQUES
in scheme: Droit et Justice
in scheme: Sources du Droit
in scheme: Sources du Droit Objectif
notation: REFIP4849

plan d'épargne entreprise
type: ConceptReFip
type: Concept
alternative label: PEE
broader: fonds de pension
definition: Système permettant aux salariés de se constituer une épargne sous la forme d'un portefeuille de valeurs mobilières, avec l'aide de leur entreprise. Bloquées pendant 5 ans minimum, les sommes détenues proviennent des versements volontaires des salariés et de l'abondement de l'entreprise. Le PEE peut également être alimenté par l'intéressement et la participation.
in scheme: FINANCES PUBLIQUES
in scheme: Gestion de l'Entreprise
in scheme: Entreprises
in scheme: Vie et Gestion de l'entreprise
notation: REFIP4850

apurement des débets
type: ConceptReFip
type: Concept
broader: refip-REFIP7041
definition: Acquittement des sommes mises à la charge du comptable public, après constatation d'un débet, soit par prise en charge sur le budget de l'Etat ou de l'organisme public suite à une décision constatant la force majeure ou une décision de remise gracieuse, soit par versement du montant par le comptable.
in scheme: FINANCES PUBLIQUES
in scheme: Responsabilité des comptables
in scheme: Missions Transverses des Finances publiques
notation: REFIP4852

application TSBCS
type: ConceptReFip
type: Concept
alternative label: TSBCS
broader: applications fiscales (non-descripteur)
definition: Applicatif de suivi et de contrôle des déclarations pour la taxe sur les bureaux, les locaux commerciaux et de stockage.
in scheme: FINANCES PUBLIQUES
in scheme: Applications Informatiques
in scheme: Applications fiscales
notation: REFIP4854

soutenabilité budgétaire
type: ConceptReFip
type: Concept
broader: principe budgétaire
definition: Théorie consistant en l’adéquation des projets de dépenses d’un responsable administratif aux capacités d’engagement et droits de paiement qui lui sont notifiés ou qui sont susceptibles de lui être délégués dans le futur.
in scheme: FINANCES PUBLIQUES
in scheme: Élaboration du budget
in scheme: Budget
notation: REFIP4855

transport aérien
type: ConceptReFip
type: Concept
broader: refip-REFIP766
definition: Activité de transport des passagers ou des marchandises par voie aérienne.
in scheme: FINANCES PUBLIQUES
in scheme: Branche d'activité
in scheme: Questions Economiques
in scheme: Transports
narrower: aviation civile
narrower: aérodrome
narrower: avion
notation: REFIP4856

fusion de postes comptables
type: ConceptReFip
type: Concept
broader: réforme de l'Etat
definition: Unification en un seul poste comptable de plusieurs jusqu’alors distincts.
in scheme: FINANCES PUBLIQUES
in scheme: Etat
in scheme: Réforme de l'Etat
in scheme: Administration de L'Etat
notation: REFIP4857

candidature à un marché public
type: ConceptReFip
type: Concept
alternative label: candidat à un marché public
broader: passation des marchés publics
definition: Opérateur économique qui demande à participer ou est invité à participer à une procédure de passation d’un marché public.
in scheme: FINANCES PUBLIQUES
in scheme: Commande publique
in scheme: Gestion Publique
narrower: variante à un marché public
narrower: acte d'engagement
narrower: état annuel des certificats reçus
narrower: opérateur économique
narrower: certificat de qualité
narrower: groupement d'entreprises
narrower: dossier de marché public
narrower: attestation de régularité fiscale et sociale
notation: REFIP486

Fonds national de péréquation des droits de mutation à titre onéreux
type: ConceptReFip
type: Concept
broader: fonds (non-descripteur)
definition: Fonds perçus par les départements, alimenté par 2 prélèvements : un premier prélèvement sur « stock » lié au niveau des DMTO du département relativement à la moyenne de l’ensemble des départements ; un second prélèvement sur « flux » prenant en compte la dynamique de progression des recettes de DMTO d’un département. Sont bénéficiaires des ressources du fonds tous les départements dont le potentiel financier par habitant est inférieur à la moyenne de l’ensemble des départements.
in scheme: FINANCES PUBLIQUES
in scheme: Dépenses publiques
in scheme: Gestion Publique
notation: REFIP4862

comptabilité M 4
type: ConceptReFip
type: Concept
broader: comptabilité publique locale
definition: Instruction comptable M 4 applicable aux services publics industriels et commerciaux (SPIC).
in scheme: FINANCES PUBLIQUES
in scheme: Secteur public local
in scheme: Gestion Publique
notation: REFIP4863

journée complémentaire
type: ConceptReFip
type: Concept
alternative label: période complémentaire
broader: fin de gestion
definition: Période limitée à un mois, la journée complémentaire permet aux services comptables de terminer leurs écritures de l'année.
in scheme: FINANCES PUBLIQUES
in scheme: Procédures et Techniques Comptables
in scheme: Comptabilité
notation: REFIP4864

domaine privé
type: ConceptReFip
type: Concept
broader: propriété des personnes publiques
definition: Ensemble des biens de personnes publiques qui ne relèvent pas du domaine public.
in scheme: FINANCES PUBLIQUES
in scheme: Domaine
in scheme: Gestion Publique
narrower: succession
notation: REFIP4867

sous-traitant
type: ConceptReFip
type: Concept
alternative label: externalisation
alternative label: sous-traitance
broader: exécution d'un marché public
definition: Personne physique ou morale à qui un entrepreneur confie sous sa responsabilité tout ou partie de l'exécution du marché public conclu avec le maître de l'ouvrage.
in scheme: FINANCES PUBLIQUES
in scheme: Commande publique
in scheme: Gestion Publique
notation: REFIP4868

relevé de propriété
type: ConceptReFip
type: Concept
alternative label: extrait de matrice
broader: extrait cadastral
definition: Extrait de matrice cadastrale obtenu sur demande, et sous certaines conditions, pouvant être de trois types : relevé de propriété destiné au propriétaire, relevé de propriété destiné aux tiers et le relevé de propriété limité à un bien.
in scheme: FINANCES PUBLIQUES
in scheme: Cadastre
in scheme: Fiscalité
notation: REFIP4869

potentiel fiscal
type: ConceptReFip
type: Concept
broader: finances locales (non-descripteur)
definition: Indicateur de richesse fiscale. Le potentiel fiscal d'une commune est égal à la somme que produiraient les quatre taxes directes de cette collectivité si l’on appliquait aux bases communales de ces quatre taxes le taux moyen national d’imposition à chacune de ces taxes.
in scheme: FINANCES PUBLIQUES
in scheme: Secteur public local
in scheme: Gestion Publique
notation: REFIP487

médiateur des ministères économiques et financiers
type: ConceptReFip
type: Concept
broader: Ministère de l'Economie et des Finances
definition: Personne indépendante ayant pour mission de recevoir les réclamations individuelles des personnes physiques (contribuables, consommateurs, commerçants, chefs d'entreprise...) ou morales (sociétés, associations...) et de favoriser la solution des litiges. Le médiateur est au service des particuliers, des entreprises et des associations pour tout litige persistant en matière d'impôts et de réclamations douanières et financières.
in scheme: FINANCES PUBLIQUES
in scheme: Organisation Structurelle de l'Etat
in scheme: Ministère
in scheme: Administration de L'Etat
notation: REFIP4871
related: refip-REFIP7061

audit
type: ConceptReFip
type: Concept
definition: Activité de contrôle et de conseil permettant de s’assurer que le fonctionnement d’une organisation est conforme aux prescriptions et réglementations.
in scheme: FINANCES PUBLIQUES
in scheme: Audit
in scheme: Missions Transverses des Finances publiques
narrower: audit extérieur
narrower: audit externe
narrower: audit interne
narrower: audit diagnostic de régularité
notation: REFIP4872
related: traçabilité

crédit d'impôt en faveur des métiers d'art
type: ConceptReFip
type: Concept
broader: refip-REFIP849
definition: Dispositif institué au profit des entreprises dont les charges de personnel, afférentes aux salariés qui exercent un des métiers d'art énumérés dans la liste des métiers de l'artisanat d'art, représentent au moins 30 % de la masse salariale totale ; les entreprises industrielles des secteurs de l'horlogerie, de la bijouterie, de la joaillerie, de l'orfèvrerie, de la lunetterie, des arts de la table, du jouet, de la facture instrumentale et de l'ameublement ; les entreprises portant le label " Entreprise du patrimoine vivant ".
in scheme: FINANCES PUBLIQUES
in scheme: Liquidation de l'Impôt
in scheme: Fiscalité
notation: REFIP4873

report de crédits
type: ConceptReFip
type: Concept
broader: budget de l'Etat
definition: Technique permettant à un service d'utiliser, l'année suivante, le reliquat des crédits inutilisés au cours de l'année d'autorisation.
in scheme: FINANCES PUBLIQUES
in scheme: Budget de l’État
in scheme: Budget
notation: REFIP4874

travailleur frontalier
type: ConceptReFip
type: Concept
alternative label: travailleur transfrontalier
broader: travailleur salarié
definition: Personne qui habite dans la zone frontalière d'un pays et qui travaille quotidiennement dans la zone frontalière d'un autre pays
in scheme: FINANCES PUBLIQUES
in scheme: Entreprises
in scheme: Travail
in scheme: 212619
notation: REFIP4877

Direction régionale des entreprises de la concurrence de la consommation du travail et de l'emploi
type: ConceptReFip
type: Concept
alternative label: DIRECCTE
broader: refip-REFIP775
definition: Direction régionale, placée auprès du Préfet de région, pour favoriser le développement des entreprises et de l’emploi, améliorer la qualité du travail et des relations sociales, assurer la loyauté des marchés et la sécurité des consommateurs. Les principales missions en matière de développement économique, des DIRECCTE sont l'accompagnement des entreprises à chaque étape de leur évolution, l'anticipation et l’accompagnement des mutations économiques.
in scheme: FINANCES PUBLIQUES
in scheme: Organisation Structurelle de l'Etat
in scheme: Ministère
in scheme: Administration de L'Etat
notation: REFIP4878

Corée du Nord
type: ConceptReFip
type: Concept
alternative label: République populaire démocratique de Corée
broader: Asie
definition: Pays
in scheme: FINANCES PUBLIQUES
in scheme: Géographie
in scheme: Asie
notation: REFIP4879

contrôle allégé en partenariat
type: ConceptReFip
type: Concept
broader: contrôle hiérarchisé de la dépense
definition: Mode de contrôle de la dépense publique réalisé par l’ordonnateur et le comptable public pour s’assurer de la maîtrise des risques relatifs à la régularité de l’émission des ordres de paiements.
in scheme: FINANCES PUBLIQUES
in scheme: Dépenses publiques
in scheme: Gestion Publique
notation: REFIP488

héritier
type: ConceptReFip
type: Concept
broader: droit successoral
definition: Celui qui succède au défunt par l'effet soit de la loi, soit du testament.
in scheme: FINANCES PUBLIQUES
in scheme: Droit et Justice
in scheme: Divisions du Droit
in scheme: Droit Privé
notation: REFIP4880

juge administratif
type: ConceptReFip
type: Concept
broader: magistrat
definition: Magistrat qui peut annuler une décision administrative contestée et il peut la modifier, Il peut condamner une administration à payer une somme d’argent à titre de dommages et intérêts. Il prononce des mesures d’urgence.
in scheme: FINANCES PUBLIQUES
in scheme: Profession Juridique
in scheme: Droit et Justice
in scheme: Organisation Juridictionnelle
notation: REFIP4883

représentation parcellaire cadastrale unique
type: ConceptReFip
type: Concept
alternative label: RPCU
broader: système national de référence de coordonnées géographiques planimétriques et altimétriques
definition: Représentation des limites des parcelles cadastrales et des bâtis, ayant vocation à se substituer aux deux représentations parcellaires actuelles, le plan cadastral géré par la DGFiP et la base de données parcellaires gérée par l'institut national de l'information géographique et forestière, afin d'offrir une vision modernisée et améliorée du plan cadastral et conforme aux attentes des utilisateurs.
in scheme: FINANCES PUBLIQUES
in scheme: Cadastre
in scheme: Fiscalité
narrower: parcelle
notation: REFIP4884

hypothèque
type: ConceptReFip
type: Concept
broader: sûreté réelle
definition: Droit réel accessoire grevant un immeuble et constitué au profit d'un créancier en garantie de la dette. Elle n'entraîne pas dessaisissement du propriétaire.
in scheme: FINANCES PUBLIQUES
in scheme: Recouvrement
in scheme: Fiscalité
narrower: hypothèque légale du Trésor
narrower: radiation d'hypothèque
narrower: inscription d'hypothèque
narrower: purge des hypothèques
narrower: hypothèque judiciaire
narrower: hypothèque conventionnelle
notation: REFIP4886

Amérique
type: ConceptReFip
type: Concept
definition: Continent
in scheme: FINANCES PUBLIQUES
in scheme: Géographie
in scheme: Amérique
narrower: République du Costa Rica
narrower: Guatemala
narrower: Haïti
narrower: République du Panama
narrower: Chili
narrower: Argentine
narrower: Brésil
narrower: le Belize
narrower: Paraguay
narrower: Etats-Unis
narrower: Uruguay
narrower: Mexique
narrower: Canada
narrower: Caraïbes
narrower: refip-REFIP666
narrower: refip-REFIP948
notation: REFIP4887

ordonnancement
type: ConceptReFip
type: Concept
broader: refip-REFIP996
definition: Acte administratif adressé par l’ordonnateur au comptable donnant, conformément aux résultats de la liquidation, l’ordre de payer la dette de l’organisme public. Dans le secteur local et pour les ordonnateurs secondaires de l’État, cette phase s’appelle le mandatement.
in scheme: FINANCES PUBLIQUES
in scheme: Dépenses publiques
in scheme: Gestion Publique
narrower: refip-REFIP659
notation: REFIP4888

droits compensateurs (supprimé)
type: ConceptReFip
type: Concept
broader: ZZ
in scheme: FINANCES PUBLIQUES
notation: REFIP4889

Direction générale du Trésor
type: ConceptReFip
type: Concept
broader: Ministère de l'Economie et des Finances
definition: La direction générale est au service du ministre de l'Economie et des Finances pour proposer et conduire les actions des politiques économique et financière de la France et les défendre en Europe et dans le monde. A ce titre, elle élabore des prévisions économiques et conseille les ministres sur les politiques économiques et les politiques publiques dans les domaines financier, social et sectoriel. Elle veille à la régulation du financement de l’économie et des institutions intervenant en matière d’assurance, de banque et d’investissement sur les marchés financiers. Elle participe aux négociations financières et commerciales bilatérales et multilatérales et supervise l’aide au développement. Elle assure le soutien à l’export et à l’investissement à l’étranger des entreprises. Elle gère la trésorerie et la dette de l’État à travers l’Agence France Trésor (AFT) et fournit une expertise en matière de partenariats public-privé à travers la Mission d'appui aux partenariats public-privé (MAPPP).
in scheme: FINANCES PUBLIQUES
in scheme: Organisation Structurelle de l'Etat
in scheme: Ministère
in scheme: Administration de L'Etat
narrower: Agence France Trésor
narrower: Comité interministériel de restructuration industrielle
notation: REFIP489

traçabilité
type: ConceptReFip
type: Concept
broader: pilotage
definition: Formalisation de la réalisation des opérations et des opérationnels les ayant réalisées. La traçabilité repose sur un système de preuves. Cette formalisation doit être disponible, accessible, pertinente (adaptée à son objet et à son utilisation), vérifiable (existence des sources d'information). La traçabilité conditionne la qualité de la piste d'audit.
in scheme: FINANCES PUBLIQUES
in scheme: Missions Transverses des Finances publiques
in scheme: Pilotage
notation: REFIP4890
related: audit

aide publique
type: ConceptReFip
type: Concept
alternative label: aide financière
broader: dépenses publiques
definition: Aide financière sans contrepartie allouée en général par les pouvoirs publics en faveur d'une entreprise ou d'un organisme accomplissant ou non une mission d'intérêt général.
in scheme: FINANCES PUBLIQUES
in scheme: Dépenses publiques
in scheme: Gestion Publique
narrower: dotation
narrower: aide aux entreprises
narrower: indemnités (non-descripteur)
narrower: subvention
narrower: fonds (non-descripteur)
narrower: aide aux particuliers (non-descripteur)
narrower: prime (non-descripteur)
narrower: refip-REFIP941
notation: REFIP4891

règlement amiable
type: ConceptReFip
type: Concept
broader: procédure civile
definition: Règlement d'un litige en dehors d'une procédure engagée devant les tribunaux, par simple accord entre les parties et éventuellement sur la base des propositions d'un médiateur. Conciliation directe ou faisant intervenir un tiers (arbitrage, expertise, médiation etc.).
in scheme: FINANCES PUBLIQUES
in scheme: Procédure Civile
in scheme: Droit et Justice
in scheme: Procédure
narrower: arbitrage
narrower: conciliation
notation: REFIP4892

procédure de contrôle fiscal
type: ConceptReFip
type: Concept
broader: droit de reprise de l'administration
definition: Règles de procédure que doit observer l'administration pour apporter des rectifications aux bases d'imposition et réclamer les compléments de droits qui lui paraissent exigibles ou procéder aux dégrèvements auxquels le contribuable peut prétendre.
in scheme: FINANCES PUBLIQUES
in scheme: Droit de Reprise de l'Administration
in scheme: Fiscalité
narrower: procédure contradictoire
narrower: rappel de taxe sur la valeur ajoutée
narrower: imposition d'office
notation: REFIP4894

Fonds de garantie
type: ConceptReFip
type: Concept
alternative label: FGAO
alternative label: FGTI
alternative label: Fonds de garantie des assurances obligatoires de dommages
alternative label: Fonds de garantie des victimes des actes de terrorisme et d'autres infractions
broader: organisme privé assurant service public (non-descripteur)
definition: Fonds ayant pour mission l’indemnisation des victimes au titre de la solidarité nationale et exerçant des actions de recours contre les responsables de dommages.
in scheme: FINANCES PUBLIQUES
in scheme: Organisation Structurelle de l'Etat
in scheme: Organisme Privé Assurant Service Public
in scheme: Administration de L'Etat
notation: REFIP4895

recettes de l'Etat étrangères à l'impôt et au domaine
type: ConceptReFip
type: Concept
broader: recettes de l'Etat
definition: Produits divers de l’État comprenant toutes les créances de l’État étrangères à l'impôt, au domaines et aux amendes. il s'agit essentiellement des fonds de concours, reversement de fonds, compte d'affection spéciale, compte de commerce.
in scheme: FINANCES PUBLIQUES
in scheme: Budget de l’État
in scheme: Budget
narrower: reversement de fonds sur dépenses des ministères
notation: REFIP4896
related: recouvrement des produits divers

investissement public
type: ConceptReFip
type: Concept
alternative label: investissement de l'Etat
broader: dépenses publiques
definition: Dépenses publiques en vue d'améliorer ou d'accroître la capacité de production.
in scheme: FINANCES PUBLIQUES
in scheme: Dépenses publiques
in scheme: Gestion Publique
notation: REFIP4897

charges de famille
type: ConceptReFip
type: Concept
broader: quotient familial
definition: Ensemble des frais supportés par le contribuable pour les personnes à charge de son foyer fiscal. La prise en compte de ces charges permet de réduire le montant de l’Impôt sur le revenu et s’effectue principalement par le système du quotient familial.
in scheme: FINANCES PUBLIQUES
in scheme: Liquidation de l'Impôt
in scheme: Fiscalité
notation: REFIP4899

avance forfaitaire
type: ConceptReFip
type: Concept
broader: exécution d'un marché public
definition: Versement effectué aux titulaires avant le début d’exécution des marchés publics. Elle constitue, par là même, une dérogation au principe du service fait.
in scheme: FINANCES PUBLIQUES
in scheme: Commande publique
in scheme: Gestion Publique
notation: REFIP49
note: Notion abandonnée depuis le nouveau code des marchés publics 2006

fonds européen de développement économique et régional
type: ConceptReFip
type: Concept
alternative label: FEDER
broader: fonds européens structurels et d'investissement
definition: Fonds structurel européens visant à renforcer la cohésion économique et sociale au sein de l’Union européenne en corrigeant les déséquilibres régionaux.
in scheme: FINANCES PUBLIQUES
in scheme: Dépenses publiques
in scheme: Gestion Publique
notation: REFIP4900
related: développement régional

taxe intérieure de consommation sur les houilles les lignites et les cokes
type: ConceptReFip
type: Concept
broader: autres taxes, droits ou redevances (non-descripteur)
definition: Taxe s'appliquant aux houilles, lignites et cokes utilisés comme combustible. La taxe est due par le fournisseur de charbon sur les livraisons qu'il effectue auprès de consommateurs finals en France, ou par le consommateur final lorsque celui-ci a lui-même importé ou produit le charbon qu'il utilise.
in scheme: FINANCES PUBLIQUES
in scheme: Fiscalité
in scheme: Impôt
notation: REFIP4901

comptabilité M 52
type: ConceptReFip
type: Concept
broader: comptabilité publique locale
definition: Instruction budgétaire et comptable M 52 applicable aux départements.
in scheme: FINANCES PUBLIQUES
in scheme: Secteur public local
in scheme: Gestion Publique
notation: REFIP4905

gestion des immeubles
type: ConceptReFip
type: Concept
broader: programmation immobilière
definition: Administration du parc immobilier de l’État.
in scheme: FINANCES PUBLIQUES
in scheme: Politique immobilière de l'Etat
in scheme: Gestion Publique
narrower: plafonnement des loyers
narrower: entretien des immeubles
notation: REFIP4907

lettre de motivation
type: ConceptReFip
type: Concept
alternative label: lettre de motivation des majorations
alternative label: lettre de motivation des pénalités
broader: documentation fiscale (non-descripteur)
definition: Document adressé au contribuable faisant l'objet d'une sanction fiscale en vertu de l'obligation de motiver toute pénalité ou amende. L'imprimé diffère selon le type de sanction.
in scheme: FINANCES PUBLIQUES
in scheme: Documentation Fiscale
in scheme: Fiscalité
notation: REFIP4908
related: motivation

Agence nationale pour la rénovation urbaine
type: ConceptReFip
type: Concept
alternative label: ANRU
broader: établissement public à caractère industriel et commercial
definition: Etablissement industriel et commercial, l’ANRU est chargée de la mise en oeuvre du Nouveau Programme national de renouvellement urbain, elle est l’interlocuteur unique des collectivités locales et des organismes d’HLM qui souhaitent mettre en oeuvre des projets de rénovation urbaine dans les zones urbaines sensibles. L’Agence apporte son soutien financier aux collectivités locales, aux établissements publics et aux organismes privés ou publics qui conduisent des opérations de rénovation urbaine.
in scheme: FINANCES PUBLIQUES
in scheme: Organisation Structurelle de l'Etat
in scheme: Opérateur de l'Etat
in scheme: Administration de L'Etat
notation: REFIP4909

commission spécialisée de contrôle des marchés de l'Etat (supprimé)
type: ConceptReFip
type: Concept
broader: ZZ
in scheme: FINANCES PUBLIQUES
notation: REFIP4910

permis de chasse
type: ConceptReFip
type: Concept
alternative label: chasse
alternative label: permis de chasser
broader: document administratif
definition: Document obligatoire pour pratiquer la chasse, s'obtient à la suite d'un examen comprenant une épreuve théorique et une épreuve pratique.
in scheme: FINANCES PUBLIQUES
in scheme: Documentation
in scheme: Communication Documentation Informatique
notation: REFIP4911

déduction extra-comptable
type: ConceptReFip
type: Concept
broader: déduction fiscale
definition: Corrections extra-comptables négatives réalisés sur le résultat comptables des entreprises afin de tenir compte des règles fiscales spécifiques.
in scheme: FINANCES PUBLIQUES
in scheme: Liquidation de l'Impôt
in scheme: Fiscalité
notation: REFIP4912

obligation de résultat
type: ConceptReFip
type: Concept
broader: droit civil
definition: Obligation en vertu de laquelle le débiteur est tenu d'un résultat précis.
in scheme: FINANCES PUBLIQUES
in scheme: Droit et Justice
in scheme: Divisions du Droit
in scheme: Droit Privé
notation: REFIP4913

application MEREDITH
type: ConceptReFip
type: Concept
alternative label: MEREDITH
alternative label: outil MEREDITH
broader: applications fiscales (non-descripteur)
definition: Outil multicritères d'aide à la mise à jour TH exploitant un fichier des données IR-TH.
in scheme: FINANCES PUBLIQUES
in scheme: Applications Informatiques
in scheme: Applications fiscales
notation: REFIP4917

frais de fonctionnement
type: ConceptReFip
type: Concept
broader: dépenses de fonctionnement
definition: Ensemble des dépenses liées au fonctionnement courant de la collectivité, qui regroupent principalement les frais de rémunération des personnels, les dépenses d'entretien et de fourniture, les frais de fonctionnement divers correspondant aux compétences de la collectivité, les intérêts de la dette.
in scheme: FINANCES PUBLIQUES
in scheme: Dépenses publiques
in scheme: Gestion Publique
narrower: achat courant
narrower: frais de gestion
notation: REFIP4918

fournisseur d'accès à internet
type: ConceptReFip
type: Concept
alternative label: FAI
broader: internet
definition: Entreprise qui procure, moyennant un abonnement, des accès internet avec ou sans service en ligne.
in scheme: FINANCES PUBLIQUES
in scheme: Communication
in scheme: Communication Documentation Informatique
notation: REFIP4919

application TTC
type: ConceptReFip
type: Concept
broader: applications fiscales (non-descripteur)
definition: Applicatif de consultation de l'ensemble des informations relatives à un assujetti français ou étranger et de leurs opérations intracommunautaires.
in scheme: FINANCES PUBLIQUES
in scheme: Applications Informatiques
in scheme: Applications fiscales
notation: REFIP492

statuts
type: ConceptReFip
type: Concept
alternative label: statut-type
broader: droit des sociétés
definition: Ensemble des dispositions constitutives d'une société et par extension le document qui les consigne.
in scheme: FINANCES PUBLIQUES
in scheme: Droit et Justice
in scheme: Divisions du Droit
in scheme: Droit Privé
notation: REFIP4920

dotation globale de fonctionnement
type: ConceptReFip
type: Concept
broader: dotation
definition: Prélèvement opéré sur le budget de l'État et distribué aux collectivités locales. Son montant est établi selon un mode de prélèvement et de répartition fixé chaque année par la loi de finances. Cette dotation est constituée d'une dotation forfaitaire et d'une dotation de péréquation.
in scheme: FINANCES PUBLIQUES
in scheme: Dépenses publiques
in scheme: Gestion Publique
notation: REFIP4921

protection judiciaire de la jeunesse
type: ConceptReFip
type: Concept
alternative label: Direction de la protection judiciaire de la jeunesse
alternative label: PJJ
broader: Ministère de la Justice
definition: Direction de la protection judiciaire de la jeunesse chargée, dans le cadre de la compétence du ministère de la justice, de l'ensemble des questions intéressant la justice des mineurs et de la concertation entre les institutions intervenant à ce titre.
in scheme: FINANCES PUBLIQUES
in scheme: Organisation Structurelle de l'Etat
in scheme: Ministère
in scheme: Administration de L'Etat
notation: REFIP4923

gérance
type: ConceptReFip
type: Concept
alternative label: cogérance
broader: gestion de l'entreprise (non-descripteur)
definition: Exercice de la fonction de gérant de cette société. En matière de gérance de fonds de commerce, on distingue, selon le mode d'exploitation de l'entreprise, la gérance salariée où le gérant salarié est lié au propriétaire du fonds par un contrat de travail, et la gérance libre (synonyme location-gérance) où le gérant est un commerçant.
in scheme: FINANCES PUBLIQUES
in scheme: Gestion de l'Entreprise
in scheme: Entreprises
in scheme: Vie et Gestion de l'entreprise
narrower: gérant de fonds de commerce
narrower: gérant de fait
narrower: gérant de société
notation: REFIP4924

durée d'amortissement
type: ConceptReFip
type: Concept
broader: amortissement comptable
definition: Durée pendant laquelle un bien est amorti. Elle est variable selon le type de biens corporels ou incorporels.
in scheme: FINANCES PUBLIQUES
in scheme: Procédures et Techniques Comptables
in scheme: Comptabilité
notation: REFIP4925

conseiller municipal
type: ConceptReFip
type: Concept
broader: élu local
definition: Membre élu au suffrage universel direct lors des élections municipales et qui représente les habitants.
in scheme: FINANCES PUBLIQUES
in scheme: Organisation Territoriale
in scheme: Administration de L'Etat
in scheme: 212106
notation: REFIP4926

chiffre d'affaires
type: ConceptReFip
type: Concept
broader: compte de résultat
definition: Total des ventes de biens et/ou de services d'une entreprise sur un exercice comptable.
in scheme: FINANCES PUBLIQUES
in scheme: Documents comptables
in scheme: Comptabilité
notation: REFIP4927

dépassement
type: ConceptReFip
type: Concept
broader: mots outils (liste additive)
definition: Action d'outrepasser les limites fixées.
in scheme: FINANCES PUBLIQUES
in scheme: Mots Outils
notation: REFIP4928

Fonds national d'aménagement foncier et d'urbanisme (supprimé)
type: ConceptReFip
type: Concept
broader: ZZ
in scheme: FINANCES PUBLIQUES
notation: REFIP4929

service de contrôle budgétaire et comptable ministériel
type: ConceptReFip
type: Concept
alternative label: SCBCM
broader: Ministère de l'Economie et des Finances
definition: Service d’administration centrale, placé auprès des ministères pour exercer des fonctions budgétaires et comptables liées à l’exécution des programmes du ministère de rattachement. Chaque SCBCM est comptable assignataire des dépenses et des recettes centrales du ministère auprès duquel il est placé.
in scheme: FINANCES PUBLIQUES
in scheme: Organisation Structurelle de l'Etat
in scheme: Ministère
in scheme: Administration de L'Etat
narrower: département du contrôle budgétaire
narrower: département comptable ministériel
notation: REFIP493
related: refip-REFIP7061

délai de reprise
type: ConceptReFip
type: Concept
broader: droit de reprise de l'administration
definition: Délai pendant lequel l'administration dispose du pouvoir de rectifier les omissions, insuffisances ou erreurs commises dans l'établissement de l'impôt.
in scheme: FINANCES PUBLIQUES
in scheme: Droit de Reprise de l'Administration
in scheme: Fiscalité
notation: REFIP4931

contre-lettre
type: ConceptReFip
type: Concept
broader: convention simulée
definition: Document secret signé par les parties à une entente, et venant modifier ou annuler cette entente en tout ou en partie, afin de cacher certains faits aux tiers, et ainsi de créer une simulation ou de déguiser un acte.
in scheme: FINANCES PUBLIQUES
in scheme: Droit et Justice
in scheme: Divisions du Droit
in scheme: Droit Privé
notation: REFIP4932

Fonds national d'aide au logement
type: ConceptReFip
type: Concept
alternative label: FNAL
broader: fonds (non-descripteur)
definition: Fonds qui centralise les dépenses et les recettes de l'allocation au logement. Il est alimenté par une contribution de l’État et une cotisation sociale patronale française qu contribue aux caisses de la Sécurité sociale et de la Caisse d'allocations familiales.
in scheme: FINANCES PUBLIQUES
in scheme: Dépenses publiques
in scheme: Gestion Publique
notation: REFIP4933

taxe sur les spectacles (supprimé)
type: ConceptReFip
type: Concept
broader: ZZ
in scheme: FINANCES PUBLIQUES
notation: REFIP4934

programmation budgétaire initiale
type: ConceptReFip
type: Concept
broader: refip-REFIP978
definition: Préparation du buget consistant à fixer les plafonds de dépenses sur une base triennale semi-glissante.
in scheme: FINANCES PUBLIQUES
in scheme: Élaboration du budget
in scheme: Budget
notation: REFIP4935

péage
type: ConceptReFip
type: Concept
broader: transport routier
definition: Droit dont l'automobiliste doit s'acquitter sur les réseaux d'autoroutes de liaisons interurbaines mais aussi pour accéder à des ouvrages d'art importants ( ponts, tunnels...).
in scheme: FINANCES PUBLIQUES
in scheme: Branche d'activité
in scheme: Questions Economiques
in scheme: Transports
notation: REFIP4939
related: société d'autoroutes
scope note: Transport routier

contreseing
type: ConceptReFip
type: Concept
broader: droit constitutionnel
definition: Signature destinée à authentifier la signature principale ou marquer un engagement solidaire.
in scheme: FINANCES PUBLIQUES
in scheme: Droit et Justice
in scheme: Divisions du Droit
in scheme: Droit Public
notation: REFIP4941

Pôle Emploi
type: ConceptReFip
type: Concept
alternative label: ANPE
alternative label: Agence nationale pour l'Emploi
broader: établissement public à caractère administratif
definition: Institution nationale publique, dotée de la personnalité morale et de l'autonomie financière, établissement public à caractère administratif. Le pôle emploi a pour missions principales, le versement des allocations des demandeurs d’emploi indemnisés, l’accompagnement de chaque demandeur d’emploi dans sa recherche d’emploi jusqu’au placement, la prospection du marché du travail en allant au-devant des entreprises et l'accompagnement des demandeurs d’emploi souhaitant reprendre ou créer une entreprise.
in scheme: FINANCES PUBLIQUES
in scheme: Organisation Structurelle de l'Etat
in scheme: Opérateur de l'Etat
in scheme: Administration de L'Etat
notation: REFIP4942
related: Union nationale interprofessionnelle pour l'emploi dans l'industrie et le commerce

facture électronique
type: ConceptReFip
type: Concept
alternative label: facture dématérialisée
broader: facture
definition: Facture devant être non seulement émise, mais aussi reçue sous format électronique (courrier électronique ou transmission d'un lien sécurisé sur un portail internet), ce qui implique que les systèmes de l'émetteur (fournisseur) et du récepteur (client) soient compatibles et que la preuve de sa réception puisse être apportée. Le contenu d'une facture dématérialisée doit correspondre à celui d'une facture-papier comportant strictement les mêmes mentions obligatoires.
in scheme: FINANCES PUBLIQUES
in scheme: Documents comptables
in scheme: Comptabilité
notation: REFIP4944

prime de vacances (supprimé)
type: ConceptReFip
type: Concept
broader: ZZ
in scheme: FINANCES PUBLIQUES
notation: REFIP4947

bénéfice industriel et commercial
type: ConceptReFip
type: Concept
alternative label: BIC
broader: revenu catégoriel
definition: Bénéfice réalisé par une personne physique et provenant de l'exercice d'une activité commerciale, industrielle ou artisanale.
in scheme: FINANCES PUBLIQUES
in scheme: Champ d'Application
in scheme: Fiscalité
notation: REFIP4948

droit de propriété
type: ConceptReFip
type: Concept
alternative label: droit réel
broader: droit civil
definition: Droit d'user, de jouir et de disposer d'une chose. C’est le droit réel principal le plus absolu.
in scheme: FINANCES PUBLIQUES
in scheme: Droit et Justice
in scheme: Divisions du Droit
in scheme: Droit Privé
narrower: transfert de propriété
narrower: démembrement de propriété
narrower: droit d'usage et d'habitation
narrower: indivision
narrower: servitude
narrower: théorie de l'accession
narrower: droit de pêche
narrower: droit de pacage
narrower: droit de chasse
notation: REFIP495

aménagement du lieu de travail
type: ConceptReFip
type: Concept
broader: lieu de travail
definition: Obligation faite à l'employeur d'aménager le lieu et le poste de travail dans certaines situations.
in scheme: FINANCES PUBLIQUES
in scheme: Contrat de Travail
in scheme: Entreprises
in scheme: Travail
narrower: matériel
narrower: équipement de sécurité
narrower: mobilier
notation: REFIP4950
related: conditions de travail

Agence nationale pour les chèques vacances
type: ConceptReFip
type: Concept
alternative label: ANCV
broader: établissement public à caractère industriel et commercial
definition: Etablissement public à caractère industriel et commercial, l’ANCV assure une mission d’intérêt général : « développer l’accès aux vacances et aux loisirs pour tous, et notamment les personnes les plus fragiles ». Elle élabore et développe une offre globale de produits et programmes spécifiques à vocation sociale, elle commercialise le Chèque-Vacances auprès d’employeurs, de comités d’entreprises, les CAF et les Collectivités.
in scheme: FINANCES PUBLIQUES
in scheme: Organisation Structurelle de l'Etat
in scheme: Opérateur de l'Etat
in scheme: Administration de L'Etat
notation: REFIP4951

Afrique du Sud
type: ConceptReFip
type: Concept
broader: Afrique
definition: Pays
in scheme: FINANCES PUBLIQUES
in scheme: Géographie
in scheme: Afrique
notation: REFIP4954

application AGIR
type: ConceptReFip
type: Concept
broader: applications missions transverses (non-descripteur)
definition: Application de gestion interne des risques qui porte sur l'ensemble de la démarche de contrôle interne de la DGFiP.
in scheme: FINANCES PUBLIQUES
in scheme: Applications missions transverses
in scheme: Applications Informatiques
notation: REFIP4955

provision pour charges
type: ConceptReFip
type: Concept
broader: provision
definition: Passifs non financiers dont l’échéance ou le montant ne sont pas fixés de manière précise.
in scheme: FINANCES PUBLIQUES
in scheme: Documents comptables
in scheme: Comptabilité
notation: REFIP4956

accord international
type: ConceptReFip
type: Concept
broader: législation
definition: Engagement international soumis, en France à l'approbation du gouvernement.
in scheme: FINANCES PUBLIQUES
in scheme: Droit et Justice
in scheme: Sources du Droit
in scheme: Sources du Droit Objectif
notation: REFIP4957

recevabilité
type: ConceptReFip
type: Concept
broader: principes généraux (non-descripteur)
definition: Caractère d'un recours ou d'une proposition qui remplit les conditions préalables exigées pour que l'organe saisi puisse passer à l'examen du fond en vue de discuter, amender, adopter ou rejeter.
in scheme: FINANCES PUBLIQUES
in scheme: Principes Généraux
in scheme: Droit et Justice
in scheme: Procédure
narrower: irrecevabilité
notation: REFIP4958

décision de justice
type: ConceptReFip
type: Concept
broader: principes généraux (non-descripteur)
definition: Terme général utilisé en procédure, pour désigner les actes émanant d'une juridiction collégiale ou d'un magistrat unique.
in scheme: FINANCES PUBLIQUES
in scheme: Principes Généraux
in scheme: Droit et Justice
in scheme: Procédure
narrower: non-lieu à statuer
narrower: sursis à statuer
narrower: sursis à exécution
narrower: condamnation
narrower: jugement
notation: REFIP4959

plan de sauvegarde
type: ConceptReFip
type: Concept
broader: procédure de sauvegarde
definition: Programme arrêté par le tribunal lors de la procédure de sauvegarde de l'entreprise, s'il existe des éléments sérieux pouvant assurer la survie de l'entreprise. Le plan met fin à la période d'observation. Celui-ci fixe les perspectives de redressement en fonction de l'activité, de l'état du marché et des moyens de financement dont elle dispose. Le tribunal peut prévoir la cession d'une ou plusieurs activités de l'entreprise. Dans ce cas, afin de faciliter l'émission d'offre de reprise, les droits de préemption (notamment de la Safer et des communes) ne peuvent s'exercer. La durée du plan de sauvegarde ne peut excéder 10 ans (15 ans pour un agriculteur). Si l'adoption d'un plan de sauvegarde est manifestement impossible et que la clôture de la procédure conduirait de manière certaine à la cessation des paiements, le tribunal peut convertir la procédure de sauvegarde en redressement ou en liquidation judiciaire.
in scheme: FINANCES PUBLIQUES
in scheme: Vie de l'Entreprise
in scheme: Entreprises
in scheme: Vie et Gestion de l'entreprise
notation: REFIP496

participation des employeurs à l'effort de construction
type: ConceptReFip
type: Concept
alternative label: PEEC
alternative label: déclaration 2 8
broader: taxes et participations assises sur les salaires (non-descripteur)
definition: Participation chaque année, au financement de le construction de logements ou d'opérations assimilées par les employeurs occupant au minimum vingt salariés, par le versement d'une quote-part des rémunérations qu'ils ont versées au cours de l'année civile précédente, sous certaines conditions.
in scheme: FINANCES PUBLIQUES
in scheme: Fiscalité
in scheme: Impôt
notation: REFIP4960

Laos
type: ConceptReFip
type: Concept
broader: Asie
definition: Pays
in scheme: FINANCES PUBLIQUES
in scheme: Géographie
in scheme: Asie
notation: REFIP4961

loyer budgétaire
type: ConceptReFip
type: Concept
alternative label: codhc
alternative label: coût d'occupation domanial hors charges
broader: recettes non fiscales de l'Etat
definition: Somme versée par les administrations pour l'occupation de locaux appartenant à l’État. A compter de 2019, les loyers budgétaires ne seront plus facturés aux services de l’État occupant des immeubles domaniaux, à l'exception des biens mis à disposition du ministère des Armées.
in scheme: FINANCES PUBLIQUES
in scheme: Budget de l’État
in scheme: Budget
notation: REFIP4962

déclaration sur l'honneur
type: ConceptReFip
type: Concept
alternative label: attestation sur l'honneur
broader: preuve par tout moyen
definition: Formulation orale ou écrite par laquelle une personne s'engage solennellement sur l'authenticité et la véracité des informations qu'elle fournit ainsi que sur le respect des règles.
in scheme: FINANCES PUBLIQUES
in scheme: Droit et Justice
in scheme: Divisions du Droit
in scheme: Droit Privé
notation: REFIP4964

chambre de commerce et d'industrie
type: ConceptReFip
type: Concept
alternative label: CCI
broader: chambre consulaire
definition: Organisme « consulaire » ayant le statut d'établissement public économique chargé de représenter les intérêts des entreprises commerciales, industrielles et de services d'une zone géographique et de leur apporter certains services. Les chambres de commerce et d'industrie sont présentes sur l’ensemble du territoire français au niveau départemental, régional et national et en Outre-mer.
in scheme: FINANCES PUBLIQUES
in scheme: Organisation Structurelle de l'Etat
in scheme: Opérateur de l'Etat
in scheme: Administration de L'Etat
notation: REFIP4965

loi organique
type: ConceptReFip
type: Concept
broader: loi
definition: Catégorie de lois, prévues par la Constitution, dont l'objet est de préciser les conditions d'application de la Constitution.
in scheme: FINANCES PUBLIQUES
in scheme: Droit et Justice
in scheme: Sources du Droit
in scheme: Sources du Droit Objectif
notation: REFIP4966

conflit de privilège (supprimé)
type: ConceptReFip
type: Concept
broader: ZZ
in scheme: FINANCES PUBLIQUES
notation: REFIP4968

Azerbaïdjan
type: ConceptReFip
type: Concept
broader: Asie
definition: Pays
in scheme: FINANCES PUBLIQUES
in scheme: Géographie
in scheme: Asie
notation: REFIP4969

cantonnement des poursuites (supprimé)
type: ConceptReFip
type: Concept
broader: ZZ
in scheme: FINANCES PUBLIQUES
notation: REFIP497

application NAUSICAA
type: ConceptReFip
type: Concept
alternative label: NAUSICAA
alternative label: bibliothèque documentaire unifiée
broader: applications missions transverses (non-descripteur)
definition: Application de gestion et de publication de la documentation produite en interne à la DGFiP, non opposable aux usagers.
in scheme: FINANCES PUBLIQUES
in scheme: Applications missions transverses
in scheme: Applications Informatiques
notation: REFIP4970

quittance
type: ConceptReFip
type: Concept
alternative label: reçu
alternative label: récépissé
broader: document
definition: Écrit par lequel un créancier déclare qu'il a perçu de son débiteur une somme d'argent en paiement de tout ou partie de la dette dont il était redevable. Elle consacre la libération du débiteur à due concurrence des sommes qu'il a versées au créancier.
in scheme: FINANCES PUBLIQUES
in scheme: Documentation
in scheme: Communication Documentation Informatique
notation: REFIP4971

jeton de présence
type: ConceptReFip
type: Concept
broader: conseil d'administration
definition: Rémunération octroyée, en contrepartie de leur activité, aux administrateurs d’une entreprise. Leur montant et leur répartition sont définis par l’assemblée générale et le Conseil d'administration.
in scheme: FINANCES PUBLIQUES
in scheme: Gestion de l'Entreprise
in scheme: Entreprises
in scheme: Vie et Gestion de l'entreprise
notation: REFIP4974

application FIDELIO
type: ConceptReFip
type: Concept
alternative label: FIDELIO
broader: applications gestion publique (non-descripteur)
definition: Référentiel des collectivités locales.
in scheme: FINANCES PUBLIQUES
in scheme: Applications Informatiques
in scheme: Applications gestion publique
notation: REFIP4975

procédure formalisée
type: ConceptReFip
type: Concept
broader: passation des marchés publics
definition: Dispositif de passation des marchés publics qu'il est obligatoire de mettre en œuvre lorsque certains seuils sont atteints.
in scheme: FINANCES PUBLIQUES
in scheme: Commande publique
in scheme: Gestion Publique
notation: REFIP4977
related: seuil de passation des marchés

collège
type: ConceptReFip
type: Concept
broader: établissement public local d'enseignement
definition: Etablissement public local d'enseignement, de niveau secondaire qui, à l'issue de l'école élémentaire, accueille tous les enfants scolarisés. Il définit et met en œuvre un projet d'établissement, qui lui permet de prendre des initiatives et d'être autonome. La gestion de leurs bâtiments relève des départements en application des lois de décentralisation.
in scheme: FINANCES PUBLIQUES
in scheme: Organisation Territoriale
in scheme: Structures Territoriales
in scheme: Administration de L'Etat
notation: REFIP4978

compte de gestion
type: ConceptReFip
type: Concept
alternative label: CDG
broader: documents comptables
definition: Ensemble des documents chiffrés et des pièces justificatives des recettes et des dépenses, remis annuellement par les comptables principaux au juge des comptes pour jugement. Il retrace l’ensemble des opérations budgétaires et de trésorerie exercées au cours de l’exercice comptable.
in scheme: FINANCES PUBLIQUES
in scheme: Documents comptables
in scheme: Comptabilité
notation: REFIP4979

cumul de mandats
type: ConceptReFip
type: Concept
broader: droit constitutionnel
definition: Possibilité d'exercer parallèlement plusieurs mandants électifs.
in scheme: FINANCES PUBLIQUES
in scheme: Droit et Justice
in scheme: Divisions du Droit
in scheme: Droit Public
notation: REFIP498

droit de chancellerie
type: ConceptReFip
type: Concept
alternative label: taxe de chancellerie
broader: autres taxes, droits ou redevances (non-descripteur)
definition: Droit perçu dans les chancelleries diplomatiques et consulaires à l'occasion de la délivrance des différents visas, il correspond au paiement du visa d'entrée sur le territoire français.
in scheme: FINANCES PUBLIQUES
in scheme: Fiscalité
in scheme: Impôt
notation: REFIP4980

dépenses somptuaires
type: ConceptReFip
type: Concept
alternative label: charges somptuaires
broader: charge non déductible
definition: Charges relatives aux résidences d'agrément, aux yachts et bateaux de plaisance, à la chasse.
in scheme: FINANCES PUBLIQUES
in scheme: Liquidation de l'Impôt
in scheme: Fiscalité
notation: REFIP4981

convention de recherche
type: ConceptReFip
type: Concept
broader: marché de prestations intellectuelles
definition: Contrat de prestation intellectuelle utilisé la plupart du temps dans le monde de la recherche et de l'expertise.
in scheme: FINANCES PUBLIQUES
in scheme: Commande publique
in scheme: Gestion Publique
notation: REFIP4982

interruption de prescription
type: ConceptReFip
type: Concept
alternative label: interruption de la prescription
broader: prescription de l'action en recouvrement
definition: Action qui annule le délai déjà écoulé et fait courir à compter de l'acte interruptif un nouveau délai de même nature et de même durée.
in scheme: FINANCES PUBLIQUES
in scheme: Recouvrement
in scheme: Fiscalité
notation: REFIP4983

mesure d'accompagnement judiciaire
type: ConceptReFip
type: Concept
broader: principes généraux (non-descripteur)
definition: Mesure judiciaire par laquelle un mandataire judiciaire à la protection des majeurs perçoit et gère tout ou partie des prestations sociales d'une personne majeure en vue de rétablir son autonomie dans la gestion de ses ressources.
in scheme: FINANCES PUBLIQUES
in scheme: Principes Généraux
in scheme: Droit et Justice
in scheme: Procédure
notation: REFIP4984
related: protection juridique

document d'arpentage numérique
type: ConceptReFip
type: Concept
alternative label: DA numérique
broader: document d'arpentage
definition: Document différant du document d'arpentage traditionnel par sa partie graphique dématérialisée en respect d'un format d'échange figurant en annexe.
in scheme: FINANCES PUBLIQUES
in scheme: Cadastre
in scheme: Fiscalité
notation: REFIP4985

contrôle fiscal sur demande
type: ConceptReFip
type: Concept
broader: contrôle fiscal externe
definition: Procédure de contrôle sur demande du contribuable, applicable depuis le 1er janvier 2005. Elle s’inscrit dans le cadre des mesures d’amélioration des relations entre l’administration fiscale et les contribuables. Ce dispositif permet aux PME qui veulent s’assurer qu’elles appliquent correctement les règles fiscales, de demander à l’administration un contrôle de leurs opérations sur un point particulier.
in scheme: FINANCES PUBLIQUES
in scheme: Droit de Contrôle de l'Administration
in scheme: Fiscalité
notation: REFIP4986

contribution additionnelle à l'imposition forfaitaire sur les entreprises de réseaux
type: ConceptReFip
type: Concept
alternative label: contribution additionnelle à l'IFER
broader: contribution
definition: Taxe additionnelle qui s'applique à certaines stations radioélectriques, égale à un pourcentage déterminé chaque année par décret du montant de l'IFER dû.
in scheme: FINANCES PUBLIQUES
in scheme: Fiscalité
in scheme: Impôt
notation: REFIP4989

réponse de l'administration
type: ConceptReFip
type: Concept
alternative label: absence de réponse de l'administration
alternative label: défaut de réponse de l'administration
alternative label: non-réponse de l'administration
broader: relations avec le public
definition: Réponse écrite formulée par l'administration dans un délai général de 2 mois, sauf exceptions, lorsqu'un usager adresse une démande écrite.
in scheme: FINANCES PUBLIQUES
in scheme: Missions Transverses des Finances publiques
in scheme: Qualité de service
narrower: délai de réponse de l'administration
notation: REFIP4990

application MADRHAS
type: ConceptReFip
type: Concept
alternative label: MADRHAS
broader: applications missions transverses (non-descripteur)
definition: Application de gestion des habilitations et des délégations des agents de la DGFiP en remplacement d'APTERA et BAHIA.
in scheme: FINANCES PUBLIQUES
in scheme: Applications missions transverses
in scheme: Applications Informatiques
notation: REFIP4991
scope note: Nouvel outil de gestion des habilitations en remplacement de BAHIA et APTERA

ventilation comptable
type: ConceptReFip
type: Concept
alternative label: ventilation comptable mensuelle
alternative label: ventilation mensuelle
broader: comptabilité analytique
definition: Opération visant à ventiler ses charges et ses produits, après les avoir enregistrés en comptabilité, sur plusieurs exercices, sur plusieurs produits fabriqués ou prestations exécutées, sur plusieurs centres d'analyse ou sections. Chaque produit encaissé ou chaque frais supporté est affecté à plusieurs postes.
in scheme: FINANCES PUBLIQUES
in scheme: Comptabilité
in scheme: Comptabilité analytique
notation: REFIP4992

restitution de versements indus
type: ConceptReFip
type: Concept
broader: demande en restitution
definition: Acte par lequel l'administration restitue des impositions indûment payées par le contribuable.
in scheme: FINANCES PUBLIQUES
in scheme: Contentieux Fiscal
in scheme: Fiscalité
narrower: restitution des droits d'enregistrement
narrower: restitution des impositions directes
notation: REFIP4993

comptabilité M 91
type: ConceptReFip
type: Concept
broader: comptabilité publique locale
definition: Plan comptable M 91 applicable aux Établissements publics nationaux à caractère administratif.
in scheme: FINANCES PUBLIQUES
in scheme: Secteur public local
in scheme: Gestion Publique
notation: REFIP4995

frais d'huissier
type: ConceptReFip
type: Concept
broader: frais de poursuites
definition: Émoluments réglementés dus aux huissiers de justice pour l'exécution des actes de procédure ou de poursuites que leur confient les comptables publics chargés du recouvrement.
in scheme: FINANCES PUBLIQUES
in scheme: Recouvrement
in scheme: Fiscalité
notation: REFIP4996

Pôle national de soutien au réseau fonctions publiques territoriale et hospitalière
type: ConceptReFip
type: Concept
alternative label: PNSR FPH et FPT
alternative label: PNSR de Rennes
alternative label: Pôle de Rennes
broader: Pôle national de soutien au réseau
definition: Structure ayant pour mission d'offrir aux directions locales un soutien juridique et technique en répondant aux questions complexes relatives aux fonctions publiques territoriale et hospitalière. Il apporte son concours au PNSR dédié aux établissements publics nationaux pour des questions complexes concernant la fonction publique d'Etat.
in scheme: FINANCES PUBLIQUES
in scheme: Organisation Structurelle de l'Etat
in scheme: Ministère
in scheme: Administration de L'Etat
notation: REFIP4997

application PAI
type: ConceptReFip
type: Concept
alternative label: PAI
broader: applications fiscales (non-descripteur)
definition: Application de prise de règlement des amendes télépayables mise à disposition des agents des finances publiques.
in scheme: FINANCES PUBLIQUES
in scheme: Applications Informatiques
in scheme: Applications fiscales
notation: REFIP4998

barème
type: ConceptReFip
type: Concept
broader: mots outils (liste additive)
definition: Grille ou table qui permet, par simple lecture de déterminer des taux, des tarifs, des prix, des indemnités, des montants, des valeurs, des responsabilités.
in scheme: FINANCES PUBLIQUES
in scheme: Mots Outils
notation: REFIP500

électricité
type: ConceptReFip
type: Concept
broader: énergie
definition: Énergie électrique.
in scheme: FINANCES PUBLIQUES
in scheme: Branche d'activité
in scheme: Questions Economiques
in scheme: Industrie
narrower: pylône
narrower: ligne électrique
narrower: centrale électrique
notation: REFIP5000

office de tourisme
type: ConceptReFip
type: Concept
alternative label: office du tourisme
alternative label: syndicat d'initiative
broader: établissement public communal
definition: Structure administrative locale qui peut prendre la forme d'une Association de loi 1901 ou d'une Société d’Economie Mixte Locale si la gestion est déléguée. C'est un organisme local de tourisme reconnu pour assumer par délégation de la Municipalité ou de l’intercommunalité, les missions d’accueil et d’information des touristes, de promotion touristique de la commune, de coordination des interventions des divers partenaires du développement touristique local.
in scheme: FINANCES PUBLIQUES
in scheme: Organisation Territoriale
in scheme: Structures Territoriales
in scheme: Administration de L'Etat
notation: REFIP5001

brigade de contrôle et de recherche
type: ConceptReFip
type: Concept
alternative label: BCR
broader: direction départementale des finances publiques
definition: Service d'une direction départementale ou régionale des finances publiques chargé de rechercher les renseignements en vue de la programmation de vérifications, de procéder à des contrôles matériels et à des opérations de recoupements, de collecter et de mettre en cohérence les renseignements provenant des services de la direction générale des finances publiques et d'apporter leur appui aux vérificateurs. Elle dispose du droit d'enquête et prépare le droit de visite et de saisie avec les services de la Direction nationale d'enquêtes fiscales.
in scheme: FINANCES PUBLIQUES
in scheme: Organisation Structurelle de l'Etat
in scheme: Ministère
in scheme: Administration de L'Etat
notation: REFIP5002

délai de règlement conventionnel
type: ConceptReFip
type: Concept
broader: délai de paiement
definition: Délai de règlement inférieur au délai réglementaire formalisé par une convention entre l'ordonnateur et le comptable afin d'optimiser la chaîne de la dépense dans une démarche partenariale prenant en compte les contraintes de chaque acteur.
in scheme: FINANCES PUBLIQUES
in scheme: Recouvrement
in scheme: Fiscalité
notation: REFIP5004

application PDFEDIT
type: ConceptReFip
type: Concept
alternative label: PDFEDIT
broader: applications fiscales (non-descripteur)
definition: Application permettant la restitution de manière dématérialisée en format PDF, d'informations issues des applications REC, RAR, MEDOC.
in scheme: FINANCES PUBLIQUES
in scheme: Applications Informatiques
in scheme: Applications fiscales
notation: REFIP5005

application CALCULETTE CORRECTIVE (supprimé)
type: ConceptReFip
type: Concept
broader: ZZ
in scheme: FINANCES PUBLIQUES
notation: REFIP5007

terrorisme
type: ConceptReFip
type: Concept
alternative label: attaque terroriste
alternative label: attentat
broader: crime
definition: Acte intentionnel constitutif d'une infraction qui est en relation une entreprise individuelle ou collective ayant pour but de troubler gravement l'ordre public par l'intimidation ou la terreur.
in scheme: FINANCES PUBLIQUES
in scheme: Droit et Justice
in scheme: Infractions et Sanctions
in scheme: Infraction
notation: REFIP5008

cahier des clauses techniques générales
type: ConceptReFip
type: Concept
alternative label: CCTG
broader: cahier des charges
definition: Document divisé en fascicules qui fixe les dispositions techniques applicables à toutes les prestations d’une même nature dans le cadre d'un marché public.
in scheme: FINANCES PUBLIQUES
in scheme: Commande publique
in scheme: Gestion Publique
notation: REFIP5009

mise en régie
type: ConceptReFip
type: Concept
broader: exécution d'un marché public
definition: Procédure permettant à l’administration, lorsqu’une entreprise titulaire d’un contrat public est défaillante dans l’exécution des prestations, de procéder à son remplacement par une autre entreprise ou d’effectuer la prestation directement par ses services.
in scheme: FINANCES PUBLIQUES
in scheme: Commande publique
in scheme: Gestion Publique
notation: REFIP501

dépôt légal (supprimé)
type: ConceptReFip
type: Concept
broader: ZZ
in scheme: FINANCES PUBLIQUES
notation: REFIP5010

location-gérance
type: ConceptReFip
type: Concept
broader: droit des obligations et contrats (non-descripteur)
definition: Contrat par lequel le propriétaire d'un fonds de commerce confie, en vertu d'un contrat de location, l'exploitation de son fonds à un gérant qui exploite ce fonds en son nom, pour son compte et à ses risques et périls, et qui paie au propriétaire un loyer ou redevance.
in scheme: FINANCES PUBLIQUES
in scheme: Droit et Justice
in scheme: Divisions du Droit
in scheme: Droit Privé
notation: REFIP5011
related: gérant de fonds de commerce

Turquie
type: ConceptReFip
type: Concept
alternative label: République de Turquie
broader: Asie
definition: Pays
in scheme: FINANCES PUBLIQUES
in scheme: Géographie
in scheme: Asie
notation: REFIP5012

compensation entre plus-value et moins-value (supprimé)
type: ConceptReFip
type: Concept
broader: ZZ
in scheme: FINANCES PUBLIQUES
notation: REFIP5013

Centre des monuments nationaux
type: ConceptReFip
type: Concept
broader: établissement public à caractère administratif
definition: Etablissement public à caractère administratif placé sous tutelle du ministère de la Culture et de la Communication. Il gère, anime et ouvre à la visite près de 100 monuments nationaux, propriétés de l'État.
in scheme: FINANCES PUBLIQUES
in scheme: Organisation Structurelle de l'Etat
in scheme: Opérateur de l'Etat
in scheme: Administration de L'Etat
notation: REFIP5016

gérant de tutelle
type: ConceptReFip
type: Concept
broader: tutelle
definition: Personne désignée par le juge des tutelles pour assurer la gérance de la tutelle, qui a pour mission de percevoir les revenus de l'incapable et de les affecter aux besoins de ce dernier.
in scheme: FINANCES PUBLIQUES
in scheme: Droit et Justice
in scheme: Divisions du Droit
in scheme: Droit Privé
notation: REFIP5017

dotation d'installation aux jeunes agriculteurs
type: ConceptReFip
type: Concept
alternative label: DJA
alternative label: aide à l'installation des jeunes agriculteurs
broader: dotation
definition: Dotation destinée aux jeunes agriculteurs qui s’installent, dont le montant varie selon la zone d’installation, la nature du projet ainsi que des priorités des régions.
in scheme: FINANCES PUBLIQUES
in scheme: Dépenses publiques
in scheme: Gestion Publique
notation: REFIP5019

opticien
type: ConceptReFip
type: Concept
alternative label: entreprise d'optique
alternative label: opticien mutualiste
broader: commerce de détail
definition: Personne qui vend et/ou qui fabrique des instruments d'optique, en particulier des verres correcteurs pour la vue.
in scheme: FINANCES PUBLIQUES
in scheme: Branche d'activité
in scheme: Questions Economiques
in scheme: Commerce
notation: REFIP5020
related: refip-REFIP6642

nomenclature
type: ConceptReFip
type: Concept
broader: classement
definition: Instance de classification (code, tableau, liste, règles d'attribution d'identité...) faisant autorité et servant de référence à une discipline donnée.
in scheme: FINANCES PUBLIQUES
in scheme: Documentation
in scheme: Communication Documentation Informatique
narrower: sigle
notation: REFIP5021

contrôle fiscal
type: ConceptReFip
type: Concept
alternative label: droit de contrôle de l'administration
broader: droit de contrôle de l'administration (non-descripteur)
definition: Droit dont dispose l’administration pour s’assurer du respect des obligations fiscales, contrepartie du système déclaratif.
in scheme: FINANCES PUBLIQUES
in scheme: Droit de Contrôle de l'Administration
in scheme: Fiscalité
narrower: contrôle fiscal externe
narrower: relance amiable
narrower: contrôle formel
narrower: contrôle fiscal international
narrower: contrôle sur pièces
narrower: réponse aux observations du contribuable
notation: REFIP5023

Basse-Normandie (obsolète)
type: ConceptReFip
type: Concept
is replaced by: refip-REFIP7016
broader: ZZ
in scheme: FINANCES PUBLIQUES
notation: REFIP5024

usufruit
type: ConceptReFip
type: Concept
broader: démembrement de propriété
definition: Droit réel qui confère le pouvoir d'user et de jouir d'une chose appartenant à autrui (à charge d'en conserver la substance) et qui, essentiellement temporaire, s'éteint au plus tard au décès du titulaire.
in scheme: FINANCES PUBLIQUES
in scheme: Droit et Justice
in scheme: Divisions du Droit
in scheme: Droit Privé
narrower: usufruitier
narrower: bien grevé d'un usufruit
notation: REFIP5026

société coopérative agricole
type: ConceptReFip
type: Concept
alternative label: SCA
alternative label: coopérative agricole
broader: refip-REFIP707
definition: Société ayant la personnalité morale et la pleine capacité et ayant pour objet l’utilisation en commun par des agriculteurs de tous moyens propres à faciliter ou à développer leur activité économique, à améliorer ou à accroître les résultats de cette activité. Une société coopérative agricole est créée par des agriculteurs afin d'assurer en commun l'utilisation d'outils de production, de conditionnement, de stockage, la commercialisation ou la transformation des produits de leurs exploitations; leur approvisionnement en engrais et autres intrants.
in scheme: FINANCES PUBLIQUES
in scheme: Société
in scheme: Entreprises
in scheme: Forme juridique
notation: REFIP5027

construction sur sol d'autrui
type: ConceptReFip
type: Concept
alternative label: construction sur terrain d'autrui
broader: théorie de l'accession
definition: Modes d'acquisition de la propriété en matière d'accession immobilière; fait de construire sur le sol d'autrui.
in scheme: FINANCES PUBLIQUES
in scheme: Droit et Justice
in scheme: Divisions du Droit
in scheme: Droit Privé
notation: REFIP5029

revenu disponible
type: ConceptReFip
type: Concept
broader: revenu imposable
definition: Revenus dont le contribuable a eu la disposition au cours de l'année d'imposition, quel que soit l'usage qu'il en a fait et même s'il choisit de ne pas les percevoir effectivement ou d'en différer l'encaissement.
in scheme: FINANCES PUBLIQUES
in scheme: Champ d'Application
in scheme: Fiscalité
notation: REFIP503

proposition de rectification
type: ConceptReFip
type: Concept
broader: documentation fiscale (non-descripteur)
definition: La procédure de rectification contradictoire est engagée par une proposition, adressée au contribuable, des rectifications que l'administration envisage d'apporter à ses déclarations. Cette proposition de rectification est matérialisée sur le formulaire 2120.
in scheme: FINANCES PUBLIQUES
in scheme: Documentation Fiscale
in scheme: Fiscalité
notation: REFIP5031

Code de procédure civile
type: ConceptReFip
type: Concept
broader: documentation juridique (non-descripteur)
definition: Ensemble des règles de procédure civile française, c'est-à-dire la manière dont le procès a lieu, depuis l'assignation ou la requête, les conditions de recevabilité, en passant par les incidents d'audience, les délais, jusqu'aux voies de recours ordinaires (appel) ou extraordinaires (cassation).
in scheme: FINANCES PUBLIQUES
in scheme: Droit et Justice
in scheme: Documentation Juridique
in scheme: Sources du Droit
notation: REFIP5032

juge des comptes
type: ConceptReFip
type: Concept
broader: magistrat
definition: Juge les comptes des organismes publics dotés d’un comptable public.
in scheme: FINANCES PUBLIQUES
in scheme: Profession Juridique
in scheme: Droit et Justice
in scheme: Organisation Juridictionnelle
notation: REFIP5033

médecine préventive
type: ConceptReFip
type: Concept
broader: santé (non-descripteur)
definition: Branche de la médecine consistant à donner des conseils d'hygiène au sens large ainsi qu'au dépistage de maladie.
in scheme: FINANCES PUBLIQUES
in scheme: Santé et Protection Sociale
in scheme: Santé
in scheme: Questions de Société
notation: REFIP5035
related: refip-REFIP6828

bien grevé d'un usufruit
type: ConceptReFip
type: Concept
broader: usufruit
definition: Bien dont la propriété est démembrée : d'un côté le titulaire de l'usufruit qui a l'usage et la jouissance du bien, à charge pour lui d'en conserver la substance; et, de l'autre côté, le nu-propriétaire qui a le pouvoir de disposer du bien : vente, donation, destruction.
in scheme: FINANCES PUBLIQUES
in scheme: Droit et Justice
in scheme: Divisions du Droit
in scheme: Droit Privé
notation: REFIP5036

dotation de compensation de la réforme de la taxe professionnelle
type: ConceptReFip
type: Concept
alternative label: DCRTP
alternative label: dotation de compensation de la taxe professionnelle
broader: dotation de compensation
definition: Dotation de compensation perçue par chaque EPCI et indexée chaque année comme la part correspondant à la compensation de la suppression de la « part salaires » de la taxe professionnelle au sein de la dotation forfaitaire des communes
in scheme: FINANCES PUBLIQUES
in scheme: Dépenses publiques
in scheme: Gestion Publique
notation: REFIP5037

crédit d'impôt relatif aux intérêts d'emprunts pour acquisition de l'habitation principale
type: ConceptReFip
type: Concept
broader: refip-REFIP849
definition: Crédit d'impôt accordé sous conditions sur les intérêts versés pour le financement de l'acquisition ou de la construction d'une résidence principale entre le 6 mai 2007 et le 30 septembre 2011. Le crédit d'impôt est supprimé pour les opérations réalisées à partir du 1er octobre 2011. Cet avantage fiscal est remplacé par le nouveau prêt à taux zéro « PTZ + ».
in scheme: FINANCES PUBLIQUES
in scheme: Liquidation de l'Impôt
in scheme: Fiscalité
notation: REFIP5038
scope note: Remplacé par le prêt à taux zéro (PTZ) à compter du 01/01/2011

prix unitaire
type: ConceptReFip
type: Concept
broader: facturation
definition: Prix appliqué aux quantités réellement livrées ou exécutées.
in scheme: FINANCES PUBLIQUES
in scheme: Procédures et Techniques Comptables
in scheme: Comptabilité
notation: REFIP5039

indemnité de résiliation
type: ConceptReFip
type: Concept
broader: résiliation
definition: Indemnité forfaitaire susceptible d’être allouée au titulaire d’un marché faisant l’objet d’une résiliation du fait de l’acheteur public.
in scheme: FINANCES PUBLIQUES
in scheme: Droit et Justice
in scheme: Divisions du Droit
in scheme: Droit Privé
notation: REFIP504

droits sociaux
type: ConceptReFip
type: Concept
broader: droit des sociétés
definition: Titres reçus en contrepartie de l'apport fait par les associés en droit des sociétés. Les droits sociaux englobent les parts sociales et les actions.
in scheme: FINANCES PUBLIQUES
in scheme: Droit et Justice
in scheme: Divisions du Droit
in scheme: Droit Privé
narrower: part sociale
narrower: cession de droits sociaux
notation: REFIP5040
scope note: Actions et parts sociales

succession
type: ConceptReFip
type: Concept
broader: domaine privé
definition: Transmission par voie légale du patrimoine laissé par une personne décédée à une ou plusieurs personnes (les héritiers). Ce patrimoine inclut aussi bien les actifs que les passifs, dettes ou taxes dues par le défunt.
in scheme: FINANCES PUBLIQUES
in scheme: Domaine
in scheme: Gestion Publique
narrower: succession en déshérence
narrower: succession vacante
narrower: refip-REFIP933
notation: REFIP5041

délai de garantie
type: ConceptReFip
type: Concept
broader: exécution d'un marché public
definition: Temps pendant lequel le pouvoir adjudicateur peut formuler des réserves sur des malfaçons qui n’étaient pas apparentes ou dont les conséquences n’étaient pas identifiables au moment de la réception.
in scheme: FINANCES PUBLIQUES
in scheme: Commande publique
in scheme: Gestion Publique
notation: REFIP5042

hôtel
type: ConceptReFip
type: Concept
alternative label: résidence hôtelière
broader: refip-REFIP901
definition: Établissement où l'on peut louer des chambres meublées, à un tarif journalier.
in scheme: FINANCES PUBLIQUES
in scheme: Branche d'activité
in scheme: Questions Economiques
in scheme: Commerce
notation: REFIP5043
related: résidence de tourisme

droit au bail
type: ConceptReFip
type: Concept
alternative label: droit au renouvellement
alternative label: propriété commerciale
broader: droit commercial
definition: Droit pour le commerçant locataire du local dans lequel il exploite son fonds de commerce d’obtenir du bailleur le renouvellement de son bail lorsque celui-ci arrive à expiration, ou en cas de refus injustifié, d’obtenir à certaines conditions une indemnité d’éviction représentant le préjudice causé par la privation des locaux.
in scheme: FINANCES PUBLIQUES
in scheme: Droit et Justice
in scheme: Divisions du Droit
in scheme: Droit Privé
notation: REFIP5044
related: indemnité d'éviction

assemblage cadastral particulier (supprimé)
type: ConceptReFip
type: Concept
broader: ZZ
in scheme: FINANCES PUBLIQUES
notation: REFIP5045

réforme fiscale
type: ConceptReFip
type: Concept
alternative label: réforme de la fiscalité
broader: réforme de l'Etat
definition: Changement profond apporté à la politique fiscale visant à en améliorer son fonctionnement.
in scheme: FINANCES PUBLIQUES
in scheme: Etat
in scheme: Réforme de l'Etat
in scheme: Administration de L'Etat
notation: REFIP5046

juge des référés
type: ConceptReFip
type: Concept
broader: magistrat
definition: Juge administratif de l’urgence. Il ne juge pas du principal mais permet d’obtenir des mesures provisoires et rapides, destinées à sauvegarder les droits et libertés des administrés. Il se prononce par ordonnances.
in scheme: FINANCES PUBLIQUES
in scheme: Profession Juridique
in scheme: Droit et Justice
in scheme: Organisation Juridictionnelle
notation: REFIP5048

créance litigieuse
type: ConceptReFip
type: Concept
broader: créance
definition: Créance qui est contestée sur son montant ou son principe.
in scheme: FINANCES PUBLIQUES
in scheme: Documents comptables
in scheme: Comptabilité
notation: REFIP5050

commission départementale d'aide sociale (supprimé)
type: ConceptReFip
type: Concept
broader: ZZ
in scheme: FINANCES PUBLIQUES
notation: REFIP5051

cotisation foncière des entreprises
type: ConceptReFip
type: Concept
broader: contribution économique territoriale
definition: Cotisation destinée à assurer le financement des communes et de leurs EPCI. Elle constitue, avec la cotisation sur la valeur ajoutée des entreprises (CVAE), l'une des deux composantes de la contribution économique territoriale (CET). Elle est assise sur les biens soumis à la taxe foncière.
in scheme: FINANCES PUBLIQUES
in scheme: Fiscalité
in scheme: Impôt
notation: REFIP5054

accord d'entreprise
type: ConceptReFip
type: Concept
alternative label: accord collectif
broader: convention collective
definition: Texte négocié et signé entre la direction de l’entreprise et les représentants des salariés.
in scheme: FINANCES PUBLIQUES
in scheme: Entreprises
in scheme: Travail
in scheme: 212619
notation: REFIP5055

balance d'entrée
type: ConceptReFip
type: Concept
broader: balance comptable
definition: État du début d'exercice.
in scheme: FINANCES PUBLIQUES
in scheme: Documents comptables
in scheme: Comptabilité
notation: REFIP5056

informatique
type: ConceptReFip
type: Concept
definition: Discipline qui concerne le traitement rationnel, par machines automatiques, de l'information considérée comme le support des connaissances humaines et des communications dans les domaines techniques, économiques et sociaux.
in scheme: FINANCES PUBLIQUES
in scheme: Informatique
in scheme: Communication Documentation Informatique
narrower: maintenance informatique
narrower: fichier informatique
narrower: virus informatique
narrower: base de données
narrower: intégration informatique
narrower: machine multi-applicative
narrower: table de correspondance
narrower: invariant
narrower: paramétrage
narrower: interface
narrower: gestion de contexte
narrower: sauvegarde informatique
narrower: restitution de l'information
narrower: application informatique
narrower: assistance technique
narrower: échange de données informatisé
narrower: gestion de projet
narrower: chaîne de traitement
narrower: refip-REFIP757
narrower: refip-REFIP778
narrower: refip-REFIP98
notation: REFIP5057
related: internet
related: dématérialisation

prisée de meuble
type: ConceptReFip
type: Concept
broader: droit civil
definition: Estimation de la valeur d'objets mobiliers compris dans une liquidation, un partage, une donation ou une vente aux enchères.
in scheme: FINANCES PUBLIQUES
in scheme: Droit et Justice
in scheme: Divisions du Droit
in scheme: Droit Privé
notation: REFIP5058

plan comptable de l'Etat
type: ConceptReFip
type: Concept
alternative label: plan de comptes de l'Etat
broader: documents comptables
definition: Recueil regroupant les normes comptables applicables à l’État.
in scheme: FINANCES PUBLIQUES
in scheme: Documents comptables
in scheme: Comptabilité
narrower: compte courant du Trésor à la Banque de France
narrower: compte courant postal du Trésor
notation: REFIP5059

association agréée
type: ConceptReFip
type: Concept
broader: refip-REFIP688
definition: Forme d’association qui bénéficie d’un agrément délivré par certains ministères. Une association agréée peut ainsi se voir attribuer des prérogatives juridiques supplémentaires et bénéficier de subventions.
in scheme: FINANCES PUBLIQUES
in scheme: Entreprises
in scheme: Forme juridique
in scheme: Association
notation: REFIP5060

réglementation
type: ConceptReFip
type: Concept
broader: droit général (non-descripteur)
definition: Ensemble des règles qui gouvernent une matière.
in scheme: FINANCES PUBLIQUES
in scheme: Droit et Justice
in scheme: Droit Général
notation: REFIP5061

document administratif
type: ConceptReFip
type: Concept
broader: documentation administrative
definition: Document élaboré ou détenu par une administration ou par un organisme privé chargé de la gestion d'un service public, dans le cadre de ses missions de service public.
in scheme: FINANCES PUBLIQUES
in scheme: Documentation
in scheme: Communication Documentation Informatique
narrower: autorisation préalable
narrower: Journal officiel
narrower: permis de conduire
narrower: recueil des actes administratifs
narrower: passeport
narrower: extrait d'acte
narrower: bulletin municipal
narrower: permis de chasse
narrower: délai de délivrance
narrower: carte nationale d'identité
narrower: Journal d'annonces légales
narrower: bulletin officiel
narrower: refip-REFIP7197
narrower: refip-REFIP796
narrower: refip-REFIP807
notation: REFIP5062

secteur public local
type: ConceptReFip
type: Concept
alternative label: SPL
broader: gestion publique
definition: Ensemble des collectivités territoriales, des établissements publics (établissements publics de coopération intercommunale, offices publics de l'habitat..) et des autres organismes du secteur public local (établissements publics de santé, groupements d'intérêt public..). Les comptables de la DGFIP qui ont en charge les services des trésoreries de proximité et hospitalières, paieries départementales et régionales, ont pour mission essentielle la tenue des comptes des collectivités locales et établissements publics locaux, ils recouvrent et encaissent les recettes et produits locaux et payent les dépenses.
in scheme: FINANCES PUBLIQUES
in scheme: Secteur public local
in scheme: Gestion Publique
narrower: registre des délibérations
narrower: coopération intercommunale
narrower: responsabilité d'une collectivité
narrower: contrat et mode de gestion (non-descripteur)
narrower: finances locales (non-descripteur)
narrower: comptabilité publique locale
notation: REFIP5063

décret
type: ConceptReFip
type: Concept
broader: législation
definition: Acte exécutoire émis par le pouvoir exécutif. Sa portée peut être générale, lorsqu'il formule une règle de droit, ou individuelle lorsqu'il ne concerne qu'une seule personne.
in scheme: FINANCES PUBLIQUES
in scheme: Droit et Justice
in scheme: Sources du Droit
in scheme: Sources du Droit Objectif
notation: REFIP5065

Essonne
type: ConceptReFip
type: Concept
broader: Ile-de-France
definition: Département français
in scheme: FINANCES PUBLIQUES
in scheme: Géographie
in scheme: Europe
notation: REFIP5066

agriculture biologique
type: ConceptReFip
type: Concept
broader: agriculture
definition: Méthode de culture qui n’utilise pas de pesticides ou d’engrais chimiques, et qui les remplace par d’autres méthodes incluant des produits issus des plantes ou des animaux.
in scheme: FINANCES PUBLIQUES
in scheme: Branche d'activité
in scheme: Questions Economiques
in scheme: Agriculture
notation: REFIP5067

application MARGOT
type: ConceptReFip
type: Concept
alternative label: MARGOT
broader: applications fiscales (non-descripteur)
definition: Application à disposition du correspondant RIVOLI TOPAD permettant la dématérialisation de la documentation papier.
in scheme: FINANCES PUBLIQUES
in scheme: Applications Informatiques
in scheme: Applications fiscales
notation: REFIP5068

caution personnelle
type: ConceptReFip
type: Concept
broader: caution
definition: Personne qui s'engage envers le créancier, sur l'ensemble de son patrimoine, à garantir l'exécution de l'obligation si le débiteur principal n'y satisfait pas.
in scheme: FINANCES PUBLIQUES
in scheme: Recouvrement
in scheme: Fiscalité
notation: REFIP5069

licence
type: ConceptReFip
type: Concept
alternative label: licence d'exploitation
broader: droit de la propriété industrielle
definition: Contrat par lequel le titulaire des droits d'auteur sur un programme informatique, un brevet, une marque... définit avec son cocontractant les conditions d'utilisation.
in scheme: FINANCES PUBLIQUES
in scheme: Droit et Justice
in scheme: Divisions du Droit
in scheme: Droit Privé
notation: REFIP507

comité de pilotage
type: ConceptReFip
type: Concept
alternative label: COPIL
broader: organisme consultatif et représentatif (non-descripteur)
definition: Groupe de personnes chargées de veiller au bon fonctionnement d'un projet au sein d'une entité. Le Comité de pilotage, souvent baptisé Copil, regroupe des décideurs capables de rendre les arbitrages nécessaires à la conduite du projet (allocations de ressources ou de budget, révision du périmètre du projet, révision des délais etc.).
in scheme: FINANCES PUBLIQUES
in scheme: Organisation Structurelle de l'Etat
in scheme: Organisme Consultatif et Représentatif
in scheme: Administration de L'Etat
notation: REFIP5071

demande en restitution
type: ConceptReFip
type: Concept
broader: contentieux fiscal
definition: Demande d'un contribuable tendant au remboursement de versements indus
in scheme: FINANCES PUBLIQUES
in scheme: Contentieux Fiscal
in scheme: Fiscalité
narrower: restitution de versements indus
notation: REFIP5073

taxe d'expatriation
type: ConceptReFip
type: Concept
alternative label: exit tax
broader: impôt direct
definition: Impôt compensatoire auquel peuvent être soumises les plus-values latentes constatées sur le patrimoine mobilier d'un contribuable qui transfère son domicile fiscal d'un État à un autre.
in scheme: FINANCES PUBLIQUES
in scheme: Fiscalité
in scheme: Impôt
notation: REFIP5075

procès-verbal
type: ConceptReFip
type: Concept
broader: principes généraux (non-descripteur)
definition: Acte écrit rédigé par un magistrat, un officier ou agent de police judiciaire, un officier public, qui rend compte de ce qu'il a fait, entendu ou constaté dans l'exercice de ses fonctions.
in scheme: FINANCES PUBLIQUES
in scheme: Principes Généraux
in scheme: Droit et Justice
in scheme: Procédure
notation: REFIP5076

redevance d'assainissement
type: ConceptReFip
type: Concept
broader: taxes assimilées aux impôts directs locaux (non descripteur)
definition: Redevance payée par tous les utilisateurs dès que leur immeuble ou leur maison est raccordé au réseau d'assainissement. Le montant de la redevance est fixé par les communes ou les EPCI.
in scheme: FINANCES PUBLIQUES
in scheme: Fiscalité
in scheme: Impôt
notation: REFIP5077
related: refip-REFIP6811

mise en cause
type: ConceptReFip
type: Concept
broader: principes généraux (non-descripteur)
definition: Fait pour l'une des parties à un procès, d'y appeler un tiers afin d'obtenir contre ce dernier une condamnation ou de lui rendre le jugement commun.
in scheme: FINANCES PUBLIQUES
in scheme: Principes Généraux
in scheme: Droit et Justice
in scheme: Procédure
notation: REFIP5078

seuil de passation des marchés
type: ConceptReFip
type: Concept
alternative label: seuil de procédure des marchés publics
broader: passation des marchés publics
definition: Valeur du marché public au delà de laquelle une procédure formalisée doit être engagée.
in scheme: FINANCES PUBLIQUES
in scheme: Commande publique
in scheme: Gestion Publique
notation: REFIP5079
related: procédure adaptée
related: procédure formalisée

service public hospitalier
type: ConceptReFip
type: Concept
broader: service public
definition: Service public exerçant une mission d’intérêt général se composant de missions confiées à des établissements de santé, il vise à « garantir à chaque citoyen dans des conditions d’égalité, quels que soient son niveau de revenu et son lieu d’habitation, l’accès à l’ensemble des biens et des services jugés fondamentaux ».
in scheme: FINANCES PUBLIQUES
in scheme: Etat
in scheme: Mission de Service Public
in scheme: Administration de L'Etat
notation: REFIP508

ordre des géomètres-experts
type: ConceptReFip
type: Concept
broader: Conseil de l'ordre
definition: Ordre professionnel, instance de management stratégique de la profession des géomètres-experts chargée de les représenter et d'impulser une stratégie de développement de cette profession.
in scheme: FINANCES PUBLIQUES
in scheme: Branche d'activité
in scheme: Questions Economiques
in scheme: Services et professions libérales
notation: REFIP5080

tribunal d'instance
type: ConceptReFip
type: Concept
broader: juridiction civile
definition: Juridiction de premier degré de l'ordre judiciaire, à juge unique, compétente pour toutes les affaires personnelles ou mobilières d'une valeur de 4 000 à 10 000€ (sous réserve de la compétence de la juridiction de proximité).
in scheme: FINANCES PUBLIQUES
in scheme: Droit et Justice
in scheme: Juridiction
in scheme: Organisation Juridictionnelle
notation: REFIP5082

amortissement Robien classique
type: ConceptReFip
type: Concept
broader: avantage fiscal
definition: Dispositif de défiscalisation reposant sur un mécanisme d'amortissement des logements neufs ou assimilés ou anciens réhabilités donnés en location, lorsque l'investissement a été réalisé avant le 1er septembre 2006.
in scheme: FINANCES PUBLIQUES
in scheme: Liquidation de l'Impôt
in scheme: Fiscalité
notation: REFIP5083

Doubs
type: ConceptReFip
type: Concept
broader: refip-REFIP7017
definition: Département français
in scheme: FINANCES PUBLIQUES
in scheme: Géographie
in scheme: Europe
notation: REFIP5085

topographie
type: ConceptReFip
type: Concept
broader: système national de référence de coordonnées géographiques planimétriques et altimétriques
definition: Technique qui a pour objet de représenter sur un plan ou une carte le relief d'une surface donnée.
in scheme: FINANCES PUBLIQUES
in scheme: Cadastre
in scheme: Fiscalité
narrower: vectorisation
narrower: photogrammétrie
narrower: stéréopréparation
narrower: levé terrestre
notation: REFIP5087

immunité
type: ConceptReFip
type: Concept
alternative label: immunité d'exécution
alternative label: immunité de juridiction
alternative label: immunité diplomatique
alternative label: immunité familiale
broader: droit pénal
definition: Cause d'impunité qui, tenant à la situation particulière de l'auteur de l'infraction au moment où il commet celle-ci, s'oppose définitivement à toute poursuite, alors que la situation créant ce privilège a pris fin.
in scheme: FINANCES PUBLIQUES
in scheme: Droit et Justice
in scheme: Divisions du Droit
in scheme: Droit Public
notation: REFIP5088

caractère exécutoire
type: ConceptReFip
type: Concept
broader: droit général (non-descripteur)
definition: Caractère de ce qui peut être mis à exécution, au besoin avec le concours de la force publique.
in scheme: FINANCES PUBLIQUES
in scheme: Droit et Justice
in scheme: Droit Général
narrower: titre exécutoire
notation: REFIP5090

commerce de demi-gros
type: ConceptReFip
type: Concept
alternative label: vente en demi-gros
broader: commerce
definition: Activité consistant à acheter de grosses quantités de marchandises pour les revendre au commerce de détail, et même directement parfois aux consommateurs.
in scheme: FINANCES PUBLIQUES
in scheme: Branche d'activité
in scheme: Questions Economiques
in scheme: Commerce
notation: REFIP5091

barème de taxation
type: ConceptReFip
type: Concept
broader: évaluation forfaitaire
definition: Taux d'imposition qui s'applique à la base imposable en vue de déterminer la montant de la dette fiscale du contribuable, fixé chaque année par la loi de finances.
in scheme: FINANCES PUBLIQUES
in scheme: Liquidation de l'Impôt
in scheme: Fiscalité
narrower: taux d'imposition
narrower: refip-REFIP7113
narrower: refip-REFIP7177
narrower: refip-REFIP7178
notation: REFIP5092

restitution des droits d'enregistrement
type: ConceptReFip
type: Concept
broader: restitution de versements indus
definition: Remboursement au contribuable dans des cas limitativement prévus par la loi de droits d'enregistrement.
in scheme: FINANCES PUBLIQUES
in scheme: Contentieux Fiscal
in scheme: Fiscalité
notation: REFIP5093

compétence exclusive
type: ConceptReFip
type: Concept
broader: principes généraux (non-descripteur)
definition: Il y a compétence exclusive lorsque la connaissance d’un certain contentieux est absolument réservée à une juridiction déterminée, qu’il s’agisse de compétence d’attribution ou de compétence territoriale.
in scheme: FINANCES PUBLIQUES
in scheme: Principes Généraux
in scheme: Droit et Justice
in scheme: Procédure
notation: REFIP5094

Bulletin officiel des finances publiques
type: ConceptReFip
type: Concept
alternative label: BOFIP
broader: bulletin officiel
definition: Publication de la DGFiP se composant de trois bulletins : le bulletin officiel Impôts (BOFIP-Impôts), le bulletin officiel des finances publiques - Gestion comptable publique (BOFIP-GCP), et le bulletin officiel des finances publiques – Ressources humaines et organisation (BOFiP-RHO).
in scheme: FINANCES PUBLIQUES
in scheme: Documentation
in scheme: Communication Documentation Informatique
notation: REFIP5095
related: doctrine administrative

prorogation
type: ConceptReFip
type: Concept
broader: droit général (non-descripteur)
definition: Maintien d'une situation donnée après la date à laquelle elle devait initialement cesser ou disparaître.
in scheme: FINANCES PUBLIQUES
in scheme: Droit et Justice
in scheme: Droit Général
notation: REFIP5096

quote-part
type: ConceptReFip
type: Concept
alternative label: montant proportionnel
alternative label: pourcentage
alternative label: proportion
alternative label: quotité
broader: mots outils (liste additive)
definition: Part que chacun doit payer ou recevoir dans la répartition d'une somme totale.
in scheme: FINANCES PUBLIQUES
in scheme: Mots Outils
notation: REFIP5097

compte unique du Trésor (supprimé)
type: ConceptReFip
type: Concept
broader: ZZ
in scheme: FINANCES PUBLIQUES
notation: REFIP5099

opération commerciale des domaines
type: ConceptReFip
type: Concept
alternative label: opération commerciale du domaine
broader: recettes non fiscales de l'Etat
definition: Compte de commerce retraçant les « ventes du Domaine » c'est-à-dire les ventes mobilières et patrimoines privés ainsi que les opérations réalisées en application de décisions de justice. Il retrace également le suivi de la « Zone des 50 pas géométriques » et gère aussi le suivi « Gestion des cités administratives ».
in scheme: FINANCES PUBLIQUES
in scheme: Budget de l’État
in scheme: Budget
notation: REFIP51
related: compte de commerce

recouvrement des produits divers
type: ConceptReFip
type: Concept
broader: produits divers
in scheme: FINANCES PUBLIQUES
in scheme: Recouvrement
in scheme: Fiscalité
notation: REFIP510
related: astreinte d'urbanisme
related: recettes de l'Etat étrangères à l'impôt et au domaine

directive
type: ConceptReFip
type: Concept
broader: législation
definition: Acte à portée générale par lequel l'Administration procède à une auto-limitation de son pouvoir discrétionnaire, en arrêtant à l'avance les principes qui fonderont son action dans certaines matières, sans la déposséder de son pouvoir d'appréciation.
in scheme: FINANCES PUBLIQUES
in scheme: Droit et Justice
in scheme: Sources du Droit
in scheme: Sources du Droit Objectif
narrower: directive européenne
notation: REFIP5101

société en commandité simple
type: ConceptReFip
type: Concept
broader: société de personnes
definition: Société de personnes formée par deux groupes d'associés : les "commandités" qui en ont la gestion et qui sont tenus à l'égard des tiers comme les associés des sociétés en nom collectif, et les "commanditaires" qui ne peuvent s'immiscer dans la gestion de la société même en vertu d'un mandat et qui ne sont tenus chacun qu'à concurrence de la valeur de leurs apports.
in scheme: FINANCES PUBLIQUES
in scheme: Société
in scheme: Entreprises
in scheme: Forme juridique
notation: REFIP5102

charbon
type: ConceptReFip
type: Concept
broader: combustible
definition: Minerai, combustible.
in scheme: FINANCES PUBLIQUES
in scheme: Branche d'activité
in scheme: Questions Economiques
in scheme: Industrie
notation: REFIP5103
related: refip-REFIP75

amortissement dégressif
type: ConceptReFip
type: Concept
broader: amortissement comptable
definition: Type d'amortissement comptable consistant en une déduction fiscale d'annuités décroissantes.
in scheme: FINANCES PUBLIQUES
in scheme: Procédures et Techniques Comptables
in scheme: Comptabilité
notation: REFIP5104

Cour administrative d'appel
type: ConceptReFip
type: Concept
broader: juridiction administrative
definition: Juridiction d'appel française de l'ordre administrative. Elle est saisie des recours contre les jugements des tribunaux administratifs de leur ressort, ainsi que des appels formés contre les jugements des commissions du contentieux de l'indemnisation des rapatriés.
in scheme: FINANCES PUBLIQUES
in scheme: Droit et Justice
in scheme: Juridiction
in scheme: Organisation Juridictionnelle
notation: REFIP5105

délai de délivrance
type: ConceptReFip
type: Concept
broader: document administratif
definition: Délai dont dispose l'administration pour répondre à une demande de document et qui varie selon la nature des documents demandés.
in scheme: FINANCES PUBLIQUES
in scheme: Documentation
in scheme: Communication Documentation Informatique
notation: REFIP5106

interdiction
type: ConceptReFip
type: Concept
broader: mots outils (liste additive)
definition: Action d'interdire, de défendre quelque chose en vertu d'une autorité.
in scheme: FINANCES PUBLIQUES
in scheme: Mots Outils
notation: REFIP5107

droit international
type: ConceptReFip
type: Concept
broader: refip-REFIP7002
definition: Droit recouvrant deux types de règles : le droit international public pour les relations entre les États ou autres sujets de droit international et le droit international privé pour les relations entre des personnes privées dans un cadre international.
in scheme: FINANCES PUBLIQUES
in scheme: Droit et Justice
in scheme: Divisions du Droit
in scheme: Droit International
narrower: accord de siège
notation: REFIP5108

Office national des anciens combattants et victimes de guerre
type: ConceptReFip
type: Concept
alternative label: ONACVG
broader: refip-REFIP7076
definition: Etablissement public administratif, sous tutelle du ministère de la défense et géré en étroite relation avec les associations d’anciens combattants et de victimes de guerre. Ses principales missions sont l'exercice de la reconnaissance de la Nation envers les personnes affectées par la guerre grâce à l'attribution de titres et de cartes ; l’action sociale nécessaire en faveur de ses ressortissants ; la politique de mémoire du ministère de la défense ; la reconversion professionnelle ; l’hébergement des personnes âgées dépendantes ; la gestion des divers dispositifs en faveur des populations rapatriée et harkie.
in scheme: FINANCES PUBLIQUES
in scheme: Organisation Structurelle de l'Etat
in scheme: Ministère
in scheme: Administration de L'Etat
notation: REFIP5109
related: ancien combattant et victime de guerre

tribunal de la fonction publique de l'Union européenne
type: ConceptReFip
type: Concept
broader: Cour de justice de l'Union européenne
definition: Chambre juridictionnelle adjointe au Tribunal de première instance de l'Union européenne, elle a pour mission de traiter du contentieux pouvant opposer les institutions communautaires et leurs agents.
in scheme: FINANCES PUBLIQUES
in scheme: Droit et Justice
in scheme: Juridiction
in scheme: Organisation Juridictionnelle
notation: REFIP5112

prime de retour à l'emploi
type: ConceptReFip
type: Concept
broader: prime (non-descripteur)
definition: Prime attribuée, sous certaines conditions, aux bénéficiaires de l'allocation de solidarité spécifique (ASS), du revenu minimum d'insertion (RMI) ou de l'allocation de parent isolé (API) lorsque ceux-ci débutent ou reprennent une activité professionnelle.
in scheme: FINANCES PUBLIQUES
in scheme: Dépenses publiques
in scheme: Gestion Publique
notation: REFIP5114

exclusion temporaire de fonction
type: ConceptReFip
type: Concept
alternative label: exclusion temporaire
broader: refip-REFIP6820
definition: Sanction disciplinaire du 2eme ou 3ème groupe applicable au fonctionnaire, l'exclusion temporaire de fonctions pour une durée de trois mois à deux ans est privative des droits à rémunération, avancement et retraite.
in scheme: FINANCES PUBLIQUES
in scheme: Gestion des ressources humaines
in scheme: Fonction Publique et Gestion des Ressources Humaines
notation: REFIP5116

scission de communes
type: ConceptReFip
type: Concept
alternative label: défusion
broader: coopération intercommunale
definition: Erection en commune distincte d'une ou plusieurs parties de la commune.
in scheme: FINANCES PUBLIQUES
in scheme: Secteur public local
in scheme: Gestion Publique
notation: REFIP5117

date limite
type: ConceptReFip
type: Concept
alternative label: date d'échéance
alternative label: date de fin
broader: mots outils (liste additive)
definition: Date à laquelle un engagement doit être satisfait.
in scheme: FINANCES PUBLIQUES
in scheme: Mots Outils
notation: REFIP5119

Suisse
type: ConceptReFip
type: Concept
broader: Europe
definition: Pays
in scheme: FINANCES PUBLIQUES
in scheme: Géographie
in scheme: Europe
notation: REFIP512

inaliénabilité
type: ConceptReFip
type: Concept
broader: aliénation de biens
definition: Caractère de ce qui est inaliénable, résultant soit d'une disposition expresse de la loi, soit d'une clause insérée dans un acte juridique qui ne peut être cédé, tant à titre gratuit qu'onéreux, ni grevé de droits réels.
in scheme: FINANCES PUBLIQUES
in scheme: Droit et Justice
in scheme: Divisions du Droit
in scheme: Droit Privé
notation: REFIP5120

dossier sécurisé
type: ConceptReFip
type: Concept
alternative label: dossier sensible
broader: documentation fiscale (non-descripteur)
definition: Dossier fiscal de personnalité dont l'accès est strictement limité du fait de la sensibilité des données.
in scheme: FINANCES PUBLIQUES
in scheme: Documentation Fiscale
in scheme: Fiscalité
notation: REFIP5121

gestion de projet
type: ConceptReFip
type: Concept
alternative label: conduite de projet
broader: informatique
definition: Démarche consistant à organiser le déroulement d'un projet informatique.
in scheme: FINANCES PUBLIQUES
in scheme: Informatique
in scheme: Communication Documentation Informatique
notation: REFIP5122

droit du travail
type: ConceptReFip
type: Concept
broader: droit social
definition: Branche du droit privé, il recouvre l’ensemble des règles juridiques ayant pour objet, dans les secteur privé, les relations du travail entre employeurs et salariés, et régissant les rapports d’emploi (contrat de travail, licenciement etc.) et les rapports professionnels qui présentent une dimension collective (grève etc.),
in scheme: FINANCES PUBLIQUES
in scheme: Droit et Justice
in scheme: Divisions du Droit
in scheme: Droit Privé
narrower: droit de retrait
narrower: droit de grève
narrower: avantage acquis
narrower: droit syndical
narrower: affichage légal
notation: REFIP5123

comptabilité M 832
type: ConceptReFip
type: Concept
broader: comptabilité publique locale
definition: Instruction budgétaire et comptable M 832 applicable aux centres de gestion de la fonction publique territoriale.
in scheme: FINANCES PUBLIQUES
in scheme: Secteur public local
in scheme: Gestion Publique
notation: REFIP5126

majeur protégé
type: ConceptReFip
type: Concept
alternative label: incapable majeur
broader: protection juridique
definition: Majeur victime d'une altération de ses facultés mentales ou corporelles empêchant l'expression de sa volonté. Pour cette raison il est soumis à l'un des régimes de protection prévus par la loi : sauvegarde de justice, curatelle, tutelle.
in scheme: FINANCES PUBLIQUES
in scheme: Droit et Justice
in scheme: Divisions du Droit
in scheme: Droit Privé
notation: REFIP513

débiteur public
type: ConceptReFip
type: Concept
broader: recouvrement
definition: Personne morale de droit public redevable d'une obligation et faisant l'objet de règles spécifiques en matière de recouvrement.
in scheme: FINANCES PUBLIQUES
in scheme: Recouvrement
in scheme: Fiscalité
notation: REFIP5130

liasse fiscale
type: ConceptReFip
type: Concept
broader: refip-REFIP804
definition: Ensemble de documents comptables et fiscaux remis chaque année à l'administration fiscale lors de l'établissement des comptes de fin d'exercice. Elle se compose de la déclaration de résultat qui varie en fonction du régime d'imposition et des tableaux annexes justifiant cette déclaration de résultat (bilan, compte de résultat, détermination du résultat fiscal et éléments hors bilan).
in scheme: FINANCES PUBLIQUES
in scheme: Documentation Fiscale
in scheme: Fiscalité
narrower: déclaration des résultats
narrower: déclaration des frais généraux
notation: REFIP5131

application ARPEJE
type: ConceptReFip
type: Concept
alternative label: ARPEJE
broader: applications fiscales (non-descripteur)
definition: Application permettant le suivi global des poursuites confiées aux huissiers de justice.
in scheme: FINANCES PUBLIQUES
in scheme: Applications Informatiques
in scheme: Applications fiscales
notation: REFIP5133

société nationale des chemins de fer français
type: ConceptReFip
type: Concept
alternative label: SNCF
broader: établissement public à caractère industriel et commercial
definition: Entreprise ferroviaire publique française.
in scheme: FINANCES PUBLIQUES
in scheme: Organisation Structurelle de l'Etat
in scheme: Opérateur de l'Etat
in scheme: Administration de L'Etat
narrower: SNCF réseau
notation: REFIP5135

contribution sociale sur l'impôt sur les sociétés
type: ConceptReFip
type: Concept
alternative label: contribution sociale sur l'IS
broader: impôt direct
definition: Contribution due par les redevables de l'impôt sur les sociétés ayant réalisé un certain chiffre d'affaires.
in scheme: FINANCES PUBLIQUES
in scheme: Fiscalité
in scheme: Impôt
notation: REFIP5137

modernisation
type: ConceptReFip
type: Concept
broader: mots outils (liste additive)
definition: Fait d'organiser quelque chose d'une manière conforme aux besoins d'aujourd'hui.
in scheme: FINANCES PUBLIQUES
in scheme: Mots Outils
notation: REFIP5138

déclaration des comptes à l'étranger
type: ConceptReFip
type: Concept
broader: documentation fiscale (non-descripteur)
definition: Formulaire n° 3916 (Cerfa n° 11946*09) pour les particuliers, les associations et les sociétés n'ayant pas la forme commerciale qui sont tenus de déclarer, en même temps que leur déclaration de revenus ou de résultats, les références des comptes ouverts, utilisés ou clos à l'étranger au cours de l'année de déclaration.
in scheme: FINANCES PUBLIQUES
in scheme: Documentation Fiscale
in scheme: Fiscalité
notation: REFIP5139

Pôle national de soutien au réseau comptabilité fiscalité intercommunalité
type: ConceptReFip
type: Concept
alternative label: PNSR comptabilité fiscalité intercommunalité
alternative label: PNSR de Bordeaux
alternative label: Pôle de Bordeaux
broader: Pôle national de soutien au réseau
definition: Structure ayant pour mission d’apporter aux directions régionales et départementales des Finances publiques ainsi qu’aux Recettes des Finances territoriales, un soutien juridique et technique, en répondant à leurs questions, sous réserve qu’elles ne nécessitent pas une expertise de l'administration centrale.
in scheme: FINANCES PUBLIQUES
in scheme: Organisation Structurelle de l'Etat
in scheme: Ministère
in scheme: Administration de L'Etat
notation: REFIP514

testament
type: ConceptReFip
type: Concept
broader: droit successoral
definition: Document écrit dans lequel une personne indique les personnes auxquelles elle souhaite transmettre ses biens après son décès.
in scheme: FINANCES PUBLIQUES
in scheme: Droit et Justice
in scheme: Divisions du Droit
in scheme: Droit Privé
narrower: legs
notation: REFIP5140

application VENTILRECETTE
type: ConceptReFip
type: Concept
alternative label: VENTILRECETTE
broader: applications missions transverses (non-descripteur)
definition: Application permettant de sécuriser et faciliter la comptabilisation des dégrèvements dans le cadre de l'exécution des dépenses sans ordonnancement. Remplacée par l'application VENTIL DSO en 2016.
in scheme: FINANCES PUBLIQUES
in scheme: Applications missions transverses
in scheme: Applications Informatiques
notation: REFIP5143

ingénierie financière
type: ConceptReFip
type: Concept
alternative label: aide à l'ingénierie financière
broader: aide aux entreprises
definition: Ensemble de techniques financières ayant pour but de mettre en œuvre des montages financiers parfaitement adaptés aux besoins et aux objectifs spécifiques des agents économiques et au coût minimum.
in scheme: FINANCES PUBLIQUES
in scheme: Dépenses publiques
in scheme: Gestion Publique
narrower: aide à la recherche au développement et à l'innovation
notation: REFIP5144

donation en pleine propriété
type: ConceptReFip
type: Concept
broader: donation
definition: Type de donation dans laquelle le donateur transfère la pleine propriété du bien au donataire.
in scheme: FINANCES PUBLIQUES
in scheme: Champ d'Application
in scheme: Fiscalité
notation: REFIP5145

présomption de revenu
type: ConceptReFip
type: Concept
broader: droit de contrôle de l'administration (non-descripteur)
definition: Dispositif permettant la taxation de personnes s'étant livrées à des activités illicites ou détenant des avoirs à l'étranger sur des comptes non déclarés.
in scheme: FINANCES PUBLIQUES
in scheme: Droit de Contrôle de l'Administration
in scheme: Fiscalité
notation: REFIP5146

commission communale des impôts directs
type: ConceptReFip
type: Concept
broader: structure locale (non-descripteur)
definition: Commission comprenant sept membres (le maire ou l’adjoint délégué, président et six commissaires) instituée dans chaque commune. Elle intervient principalement en matière de fiscalité directe locale et dresse, avec le représentant de l’administration, la liste des locaux de référence et des locaux types retenus pour déterminer la valeur locative des biens imposables aux impôts directs locaux ; elle établit les tarifs d’évaluation des locaux de référence pour les locaux d'habitation ; elle participe à l’évaluation des propriétés bâties, son rôle est consultatif et enfin, elle participe à l’élaboration des tarifs d’évaluation des propriétés non bâties et formule des avis sur des réclamations portant sur une question de fait relative à la taxe d'habitation et à la taxe d’enlèvement des ordures ménagères.
in scheme: FINANCES PUBLIQUES
in scheme: Organisation Territoriale
in scheme: Structures Territoriales
in scheme: Administration de L'Etat
notation: REFIP5147

transfert de bénéfices
type: ConceptReFip
type: Concept
alternative label: transfert indirect de bénéfices
broader: droit de contrôle de l'administration (non-descripteur)
definition: Concept légal codifié à l'article 57 du CGI. Il ne s'applique qu'à des transactions conclues entre entreprises dépendantes dont l'une au moins est située à l'étranger. Pour l'établissement de l'impôt sur les revenus dû par les entreprises qui sont sous la dépendance ou qui possèdent le contrôle d'entreprises situées hors de France, les bénéfices indirectement transférés à ces dernières doivent être incorporés aux résultats comptabilisés.
in scheme: FINANCES PUBLIQUES
in scheme: Droit de Contrôle de l'Administration
in scheme: Fiscalité
notation: REFIP5148

Comité médical supérieur
type: ConceptReFip
type: Concept
broader: refip-REFIP7063
definition: Instance consultative placée auprès du ministre chargé de la santé. Elle peut être consultée, à la demande du fonctionnaire ou de l'administration, en cas de contestation de l'avis rendu en 1er ressort par le comité médical.
in scheme: FINANCES PUBLIQUES
in scheme: Organisation Structurelle de l'Etat
in scheme: Ministère
in scheme: Administration de L'Etat
notation: REFIP5149

réserves du comptable
type: ConceptReFip
type: Concept
alternative label: réserves du comptable sur la gestion de son prédécesseur
broader: remise de service
definition: Formulation écrite, précise et motivée, par le comptable public entrant, contestant certaines opérations du comptable sortant, dans l'objectif d’éviter une mise en jeu sa responsabilité personnelle et pécuniaire pour des opérations pour lesquelles toute régularisation était compromise lors de sa prise de fonction. Elles sont transmises au prédécesseur et aux autorités chargées de mettre en jeu la responsabilité des comptables. Les réserves concernant des opérations en cours visent principalement l’aspect recouvrement de l’activité des comptables publics et peuvent donc porter sur les restes à recouvrer, sur les différences en comptabilité et sur les opérations figurant en compte d’imputation provisoire. Le délai pendant lequel un comptable peut faire des réserves est fixé à six mois à compter de son installation. Ce délai peut être prorogé sur sa demande, le délai total ne pouvant pas être supérieur à un an suivant l’installation.
in scheme: FINANCES PUBLIQUES
in scheme: Responsabilité des comptables
in scheme: Missions Transverses des Finances publiques
notation: REFIP5150

décharge de responsabilité (obsolète)
type: ConceptReFip
type: Concept
is replaced by: refip-REFIP7021
broader: ZZ
in scheme: FINANCES PUBLIQUES
notation: REFIP5151

Direction impôts service
type: ConceptReFip
type: Concept
alternative label: impôts service
broader: service à compétence nationale
definition: Service à compétence nationale de la DGFIP chargé de la délivrance de renseignements fiscaux généraux pour tous impôts (règles d'imposition, contrôle, paiement), pour tous les usagers (particuliers, professionnels).
in scheme: FINANCES PUBLIQUES
in scheme: Organisation Structurelle de l'Etat
in scheme: Ministère
in scheme: Administration de L'Etat
notation: REFIP5152
related: centre impôts service

déclaration sans suite (supprimé)
type: ConceptReFip
type: Concept
broader: ZZ
in scheme: FINANCES PUBLIQUES
notation: REFIP5154

privilège spécial immobilier
type: ConceptReFip
type: Concept
broader: privilège
definition: Privilège portant sur certains immeubles déterminés permettant notamment de garantir au profit de l'État et des communes le recouvrement des créances résultant de mesures de lutte contre l'habitat insalubre et dangereux. Les créances garanties se rapportent à des mesures urgentes ou à des travaux exécutés d'office par les collectivités publiques, du fait de la carence des propriétaires.
in scheme: FINANCES PUBLIQUES
in scheme: Droit et Justice
in scheme: Divisions du Droit
in scheme: Droit Privé
notation: REFIP5157

engagement des dépenses
type: ConceptReFip
type: Concept
broader: engagement de l'Etat
definition: Acte par lequel un organisme public crée ou constate à son encontre une obligation de laquelle résultera une charge (convention, marché, commande…).
in scheme: FINANCES PUBLIQUES
in scheme: Exécution du budget
in scheme: Budget
notation: REFIP5158

chambre régionale des comptes
type: ConceptReFip
type: Concept
alternative label: CRC
broader: Cour des comptes
definition: Juridiction administrative financière française chargée de vérifier les comptes des collectivités locales et de juger des éventuels conflits relatifs à ces comptes. Elle est dotée d’une triple compétence en matière de contrôle : le jugement des comptes des comptables publics, le contrôle budgétaire, ainsi que le contrôle de la gestion.
in scheme: FINANCES PUBLIQUES
in scheme: Droit et Justice
in scheme: Juridiction
in scheme: Organisation Juridictionnelle
notation: REFIP5159

enquête administrative
type: ConceptReFip
type: Concept
broader: droit administratif
definition: Ensemble de recherches ordonnées par une autorité administrative.
in scheme: FINANCES PUBLIQUES
in scheme: Droit et Justice
in scheme: Divisions du Droit
in scheme: Droit Public
notation: REFIP516

Code de la santé publique
type: ConceptReFip
type: Concept
broader: documentation juridique (non-descripteur)
definition: Ensemble des dispositions régissant le droit de la santé publique. Organise les relations et la coopération entre les divers acteurs : établissements de santé, professionnels de la santé et du domaine médico-social, autorités sanitaires, organismes d’assurance maladie... et les personnes.
in scheme: FINANCES PUBLIQUES
in scheme: Droit et Justice
in scheme: Documentation Juridique
in scheme: Sources du Droit
notation: REFIP5161

budget économique (supprimé)
type: ConceptReFip
type: Concept
broader: ZZ
in scheme: FINANCES PUBLIQUES
notation: REFIP5162

occupation temporaire
type: ConceptReFip
type: Concept
alternative label: AOT
alternative label: autorisation d'occupation temporaire
alternative label: convention d'occupation temporaire
broader: occupation de locaux
definition: Tiers occupant le domaine public après autorisation de l'autorité administrative en charge de la gestion de ce domaine.
in scheme: FINANCES PUBLIQUES
in scheme: Domaine
in scheme: Gestion Publique
notation: REFIP5163

garantie biennale
type: ConceptReFip
type: Concept
broader: garanties
definition: Garantie couvrant les éléments d‘équipement "non incorporés" (ceux qui peuvent être enlevés ou remplacés sans détériorer le gros œuvre), par opposition aux éléments de construction couverts par la garantie décennale. Sa durée est de 2 ans, à compter de la date de réception des travaux.
in scheme: FINANCES PUBLIQUES
in scheme: Droit et Justice
in scheme: Divisions du Droit
in scheme: Droit Privé
notation: REFIP5164

état de situation
type: ConceptReFip
type: Concept
broader: documents comptables
definition: Document qui regroupe les informations requises pour décrire une situation à un moment donné.
in scheme: FINANCES PUBLIQUES
in scheme: Documents comptables
in scheme: Comptabilité
notation: REFIP5165

contrat d'apprentissage
type: ConceptReFip
type: Concept
broader: contrat de travail
definition: Contrat de travail à durée déterminée, destiné à faciliter l'insertion professionnelle des personnes sans emploi rencontrant des difficultés sociales et professionnelles particulières d'accès à l'emploi.
in scheme: FINANCES PUBLIQUES
in scheme: Contrat de Travail
in scheme: Entreprises
in scheme: Travail
notation: REFIP5166

temps partiel de droit
type: ConceptReFip
type: Concept
broader: refip-REFIP6895
definition: Possibilité octroyée aux agents de droit de travailler sur une durée inférieure à la durée légale dans les cas limitatifs suivants : naissance ou adoption, don de soins à un parent, handicap, création ou reprise d’une entreprise.
in scheme: FINANCES PUBLIQUES
in scheme: Gestion des ressources humaines
in scheme: Temps de travail
in scheme: Fonction Publique et Gestion des Ressources Humaines
notation: REFIP5168

Pôle national gestion des patrimoines privés
type: ConceptReFip
type: Concept
alternative label: PNSR de Saint-Maurice
alternative label: Pôle de Saint-Maurice
broader: Pôle national de soutien au réseau
definition: Structure ayant pour mission d'apporter aux pôles de gestion des patrimoines privés (GPP) et aux services compétents dans les départements d'Outre-Mer un soutien juridique et technique. Il propose une assistance aux pôles GPP, sous la forme notamment de réponses aux questions posées par les pôles et par la mise en ligne des questions ayant une portée générale ; une veille juridique permettant le suivi des évolutions législatives et réglementaires, doctrinales et jurisprudentielles ; l'organisation de journées thématiques favorisant l'échange et la mutualisation des bonnes pratiques entre les pôles GPP.
in scheme: FINANCES PUBLIQUES
in scheme: Organisation Structurelle de l'Etat
in scheme: Ministère
in scheme: Administration de L'Etat
notation: REFIP517

appel d'offres infructueux
type: ConceptReFip
type: Concept
alternative label: déclaration d'infructuosité
broader: appel d'offres
definition: Procédure qui ne débouche sur aucune offre acceptable pour l'Administration.
in scheme: FINANCES PUBLIQUES
in scheme: Commande publique
in scheme: Gestion Publique
notation: REFIP5170

mission d'ingénierie et d'architecture
type: ConceptReFip
type: Concept
broader: commande publique
definition: Acteur économique privé exerçant auprès d'une collectivité des prestations d'ingénierie et d'architecture dans le cadre de la commande publique.
in scheme: FINANCES PUBLIQUES
in scheme: Commande publique
in scheme: Gestion Publique
notation: REFIP5172

recours hiérarchique
type: ConceptReFip
type: Concept
broader: recours administratif
definition: Recours administratif porté devant le supérieur de l'autorité dont émane la mesure critiquée, ce premier disposant ainsi d'une compétence pour l'annuler ou la modifier.
in scheme: FINANCES PUBLIQUES
in scheme: Procédure Administrative
in scheme: Droit et Justice
in scheme: Procédure
notation: REFIP5173

contrat aide
type: ConceptReFip
type: Concept
broader: contrat de travail
definition: Contrat de travail dérogatoire au droit commun, pour lequel l'employeur bénéficie d'aides, qui peuvent prendre la forme de subventions à l'embauche, d'exonérations de certaines cotisations sociales, d'aides à la formation.
in scheme: FINANCES PUBLIQUES
in scheme: Contrat de Travail
in scheme: Entreprises
in scheme: Travail
narrower: contrat unique d'insertion
notation: REFIP5175
related: insertion professionnelle

pacte d'actionnaires
type: ConceptReFip
type: Concept
broader: droit des obligations et contrats (non-descripteur)
definition: Contrat de droit privé, qui a souvent un caractère confidentiel, entre tout ou partie des associés d'une société par actions.
in scheme: FINANCES PUBLIQUES
in scheme: Droit et Justice
in scheme: Divisions du Droit
in scheme: Droit Privé
notation: REFIP5177

gaz naturel pour les véhicules
type: ConceptReFip
type: Concept
alternative label: GNV
alternative label: gaz naturel véhicules
broader: gaz
definition: Carburant automobile constitué d'environ 97 % de méthane.
in scheme: FINANCES PUBLIQUES
in scheme: Branche d'activité
in scheme: Questions Economiques
in scheme: Industrie
notation: REFIP5178

recouvrement des produits hospitaliers
type: ConceptReFip
type: Concept
broader: recouvrement des produits locaux
in scheme: FINANCES PUBLIQUES
in scheme: Recouvrement
in scheme: Fiscalité
notation: REFIP5179

mention
type: ConceptReFip
type: Concept
broader: mots outils (liste additive)
definition: Indication ou annotation portée sur un document ou formulaire à titre obligatoire ou facultatif.
in scheme: FINANCES PUBLIQUES
in scheme: Mots Outils
notation: REFIP518

cacao
type: ConceptReFip
type: Concept
broader: denrée alimentaire
definition: Aliment obtenu après broyage de l'amande des fèves de cacao plates fermentées produites par le cacaoyer.
in scheme: FINANCES PUBLIQUES
in scheme: Branche d'activité
in scheme: Questions Economiques
in scheme: Industrie
notation: REFIP5180

tierce opposition
type: ConceptReFip
type: Concept
broader: voie de recours
definition: Voie de recours extraordinaire, de rétractation ou de réformation, ouverte aux personnes qui n'ont été ni parties ni représentées dans une instance et leur permettant d'attaquer une décision qui leur fait grief et de faire déclarer qu'elle leur est inopposable.
in scheme: FINANCES PUBLIQUES
in scheme: Principes Généraux
in scheme: Droit et Justice
in scheme: Procédure
notation: REFIP5181

opposition à contrainte (supprimé)
type: ConceptReFip
type: Concept
broader: ZZ
in scheme: FINANCES PUBLIQUES
notation: REFIP5182

flux financier
type: ConceptReFip
type: Concept
alternative label: flux monétaire
broader: état financier
definition: Ensemble des mouvements ayant un impact immédiat ou différé sur la trésorerie de l'entreprise.
in scheme: FINANCES PUBLIQUES
in scheme: Documents comptables
in scheme: Comptabilité
notation: REFIP5183

Canada
type: ConceptReFip
type: Concept
broader: Amérique
definition: Pays
in scheme: FINANCES PUBLIQUES
in scheme: Géographie
in scheme: Amérique
notation: REFIP5185

opposition
type: ConceptReFip
type: Concept
broader: recouvrement
definition: Manifestation de volonté de la part du redevable qui entend arrêter l'exécution d'un processus juridique ou judiciaire à son encontre.
in scheme: FINANCES PUBLIQUES
in scheme: Recouvrement
in scheme: Fiscalité
narrower: opposition administrative
narrower: opposition à partage
narrower: opposition à exécution
notation: REFIP5186

paierie régionale
type: ConceptReFip
type: Concept
broader: direction régionale des finances publiques
definition: Structure chargée de l'encaissement des recettes et du paiement des dépenses du département. Les payeurs sont aussi responsable de la fiabilisation des comptes locaux, du contrôle hiérarchisé de la dépense. Il y en a une par région.
in scheme: FINANCES PUBLIQUES
in scheme: Organisation Structurelle de l'Etat
in scheme: Ministère
in scheme: Administration de L'Etat
notation: REFIP5187

Pays de la Loire
type: ConceptReFip
type: Concept
broader: France métropolitaine
definition: Région française
in scheme: FINANCES PUBLIQUES
in scheme: Géographie
in scheme: Europe
narrower: Vendée
narrower: Sarthe
narrower: Loire-Atlantique
narrower: Maine-et-Loire
narrower: refip-REFIP947
notation: REFIP5188

corps diplomatique
type: ConceptReFip
type: Concept
broader: fonction publique de l'Etat
definition: Ensemble des représentants des puissances étrangères auprès du gouvernement.
in scheme: FINANCES PUBLIQUES
in scheme: Personnels et fonctions
in scheme: Fonction Publique et Gestion des Ressources Humaines
notation: REFIP5189

commission rogatoire
type: ConceptReFip
type: Concept
broader: principes généraux (non-descripteur)
definition: Acte d'instruction qui consiste en une délégation de pouvoir accordé par le juge d'instruction à un autre juge ou une autorité de police judiciaire d'instruire, de rechercher des preuves dans une affaire déterminée.
in scheme: FINANCES PUBLIQUES
in scheme: Principes Généraux
in scheme: Droit et Justice
in scheme: Procédure
notation: REFIP519

taxe sur les conventions d'assurance
type: ConceptReFip
type: Concept
broader: autres taxes, droits ou redevances (non-descripteur)
definition: Taxe annuelle et obligatoire, assise en principe sur toute convention d'assurance conclue avec une société ou compagnie d'assurances, perçue sur le montant des sommes stipulées au profit de l'assureur.
in scheme: FINANCES PUBLIQUES
in scheme: Fiscalité
in scheme: Impôt
notation: REFIP5190

dossier à fort enjeu
type: ConceptReFip
type: Concept
alternative label: DFE
broader: contrôle sur pièces
definition: Dossiers de contribuables personnes physiques disposant de revenus et/ou d'un patrimoine importants, dont le contrôle sur pièces est systématiquement réalisé tous les 3 ans, selon une approche corrélée des revenus et du patrimoine.
in scheme: FINANCES PUBLIQUES
in scheme: Droit de Contrôle de l'Administration
in scheme: Fiscalité
notation: REFIP5191

régie municipale
type: ConceptReFip
type: Concept
alternative label: régie communale
broader: régie
definition: Mode de gestion d'un service public municipal exploité en régie directe ou intéressée par la commune. Régie administrée sous l'autorité du maire et du conseil municipal par un conseil d'exploitation et un directeur.
in scheme: FINANCES PUBLIQUES
in scheme: Secteur public local
in scheme: Gestion Publique
notation: REFIP5192

Loire
type: ConceptReFip
type: Concept
broader: Auvergne-Rhône-Alpes
definition: Département français
in scheme: FINANCES PUBLIQUES
in scheme: Géographie
in scheme: Europe
notation: REFIP5195

cahier des clauses techniques particulières
type: ConceptReFip
type: Concept
alternative label: CCTP
broader: cahier des charges
definition: Document donnant une description précise des prescriptions techniques, propres à l'exécution du marché public ou de l'opération en cause.
in scheme: FINANCES PUBLIQUES
in scheme: Commande publique
in scheme: Gestion Publique
notation: REFIP5196

déclaration de conformité
type: ConceptReFip
type: Concept
broader: document
definition: Document attestant d'une certification, d'un respect des exigences imposées.
in scheme: FINANCES PUBLIQUES
in scheme: Documentation
in scheme: Communication Documentation Informatique
notation: REFIP5198

situation mensuelle de l'Etat
type: ConceptReFip
type: Concept
alternative label: SME
alternative label: situation mensuelle budgétaire
alternative label: situation mensuelle budgétaire de l'Etat
alternative label: situation mensuelle du budget de l'Etat
broader: refip-REFIP982
definition: Document présentant chaque fin de mois les opérations comptabilisées dans les comptes de l’État de manière cumulée depuis le début de l'année.
in scheme: FINANCES PUBLIQUES
in scheme: Documentation budgétaire
in scheme: Budget
notation: REFIP5199

application SIRHIUS
type: ConceptReFip
type: Concept
alternative label: SIRHIUS
broader: applications missions transverses (non-descripteur)
definition: Application de gestion des ressources humaines commune aux Directions des Ministères financiers.
in scheme: FINANCES PUBLIQUES
in scheme: Applications missions transverses
in scheme: Applications Informatiques
notation: REFIP52
scope note: Ressources Humaines

crédit d'impôt pour dépenses de formation aux dispositifs d'épargne salariale et d'actionnariat salarié (supprimé)
type: ConceptReFip
type: Concept
broader: ZZ
in scheme: FINANCES PUBLIQUES
notation: REFIP5200

gendarmerie nationale
type: ConceptReFip
type: Concept
broader: Ministère de l'Intérieur
definition: Force armée instituée pour veiller à l'exécution des lois, La police judiciaire constitue l'une de ses missions essentielles. La gendarmerie nationale est destinée à assurer la sécurité publique et l'ordre public, particulièrement dans les zones rurales et périurbaines, ainsi que sur les voies de communication. Elle contribue à la mission de renseignement et d'information des autorités publiques, à la lutte contre le terrorisme, ainsi qu'à la protection des populations. Elle participe à la défense de la patrie et des intérêts supérieurs de la nation, notamment au contrôle et à la sécurité des armements nucléaires. L'ensemble de ses missions, civiles et militaires, s'exécute sur toute l'étendue du territoire national, hors de celui-ci en application des engagements internationaux de la France, ainsi qu'aux armées.
in scheme: FINANCES PUBLIQUES
in scheme: Organisation Structurelle de l'Etat
in scheme: Ministère
in scheme: Administration de L'Etat
notation: REFIP5202
related: forces armées

application MAJIC
type: ConceptReFip
type: Concept
alternative label: MAJIC
broader: applications fiscales (non-descripteur)
definition: Application permettant la mise à jour et la consultation des informations cadastrales.
in scheme: FINANCES PUBLIQUES
in scheme: Applications Informatiques
in scheme: Applications fiscales
notation: REFIP5203

doublon informatique
type: ConceptReFip
type: Concept
broader: qualité des données
definition: Donnée informatique enregistrée plusieurs fois.
in scheme: FINANCES PUBLIQUES
in scheme: Informatique
in scheme: Communication Documentation Informatique
notation: REFIP5204

abrogation d'un acte administratif
type: ConceptReFip
type: Concept
alternative label: abrogation d'une décision administrative
broader: acte administratif
definition: Acte par lequel l'autorité administrative met fin pour l'avenir à l'application d'un acte administratif.
in scheme: FINANCES PUBLIQUES
in scheme: Droit et Justice
in scheme: Divisions du Droit
in scheme: Droit Public
notation: REFIP5205

contrat de maintenance
type: ConceptReFip
type: Concept
broader: commerce
definition: Convention de service après-vente assurant durablement aux utilisateurs de matériel de haute technicité soit un service périodique de vérification, de réglage et d'entretien, soit un service rapide de dépannage et de réparation.
in scheme: FINANCES PUBLIQUES
in scheme: Branche d'activité
in scheme: Questions Economiques
in scheme: Commerce
notation: REFIP5207

attestation de régularité fiscale et sociale
type: ConceptReFip
type: Concept
broader: candidature à un marché public
definition: Document permettant aux entreprises, notamment celles qui sont retenues pour l'attribution d'un marché public, de justifier au 31 décembre de la régularité de leur situation fiscale et de prouver qu'elles sont à jour du paiement des taxes et contributions dues au Trésor public (paiement de la TVA et de l'impôt sur le revenu ou sur les sociétés).
in scheme: FINANCES PUBLIQUES
in scheme: Commande publique
in scheme: Gestion Publique
notation: REFIP5209

taux d'imposition
type: ConceptReFip
type: Concept
alternative label: taux de l'impôt
broader: barème de taxation
definition: Rapport de la somme totale d'impôt payée par un agent économique au regard de ses revenus ou de son capital.
in scheme: FINANCES PUBLIQUES
in scheme: Liquidation de l'Impôt
in scheme: Fiscalité
narrower: taux réduit
notation: REFIP521

statut juridique
type: ConceptReFip
type: Concept
broader: refip-REFIP758
definition: Ensemble des dispositions législatives, réglementaires et contractuelles qui fixent les droits et obligations applicables à une situation juridique déterminée.
in scheme: FINANCES PUBLIQUES
in scheme: Droit et Justice
in scheme: Droit Général
notation: REFIP5210

Cour de discipline budgétaire et financière
type: ConceptReFip
type: Concept
broader: juridiction financière
definition: Juridiction financière française créée en 1948. À l'inverse de la Cour des comptes, qui juge les comptes, et non les comptables, cette juridiction financière est dotée d'une compétence répressive qui se rapproche des juridictions pénales. Elle est compétente pour juger des actes de certains gestionnaires publics, peut avoir à connaître de leurs actes d'engagement, de liquidation et d'ordonnancement des dépenses.
in scheme: FINANCES PUBLIQUES
in scheme: Droit et Justice
in scheme: Juridiction
in scheme: Organisation Juridictionnelle
notation: REFIP5211

gaz de pétrole liquéfie
type: ConceptReFip
type: Concept
alternative label: GPL
broader: gaz
definition: Mélange d'hydrocarbures légers, stocké à l'état liquide et issu du raffinage du pétrole pour 40 % et du traitement du gaz naturel pour 60 % .
in scheme: FINANCES PUBLIQUES
in scheme: Branche d'activité
in scheme: Questions Economiques
in scheme: Industrie
notation: REFIP5212

application RED-PHARE (supprimé)
type: ConceptReFip
type: Concept
broader: ZZ
in scheme: FINANCES PUBLIQUES
notation: REFIP5213

contribution exceptionnelle sur la fortune
type: ConceptReFip
type: Concept
broader: impôt direct
definition: Imposition spécifique venant s'ajouter à l'impôt de solidarité sur la fortune dû au titre de l'année 2012 et due par les personnes titulaires au 1er janvier 2012 d'un patrimoine net taxable à l'ISF égal ou supérieur à 1 300 000€. Elle est assise sur la valeur nette imposable de leur patrimoine retenue pour le calcul de leur ISF de 2012
in scheme: FINANCES PUBLIQUES
in scheme: Fiscalité
in scheme: Impôt
notation: REFIP5215
scope note: Ne s'applique plus depuis le 01/01/2013.

Meurthe-et-Moselle
type: ConceptReFip
type: Concept
broader: refip-REFIP7009
definition: Département français
in scheme: FINANCES PUBLIQUES
in scheme: Géographie
in scheme: Europe
notation: REFIP5216

Institut national de prévention et d'éducation pour la santé
type: ConceptReFip
type: Concept
alternative label: INPES
broader: établissement public à caractère administratif
definition: Etablissement public administratif, l'Institut est un acteur de santé publique plus particulièrement chargé de mettre en oeuvre les politiques de prévention et d’éducation pour la santé dans le cadre plus général des orientations de la politique de santé publique fixées par le gouvernement.
in scheme: FINANCES PUBLIQUES
in scheme: Organisation Structurelle de l'Etat
in scheme: Opérateur de l'Etat
in scheme: Administration de L'Etat
notation: REFIP5217

réquisition
type: ConceptReFip
type: Concept
alternative label: droit de réquisition
broader: procédure administrative
definition: Procédé permettant à l'administration moyennant indemnisation de contraindre les particuliers à lui accorder leurs services.
in scheme: FINANCES PUBLIQUES
in scheme: Procédure Administrative
in scheme: Droit et Justice
in scheme: Procédure
notation: REFIP5218

levé terrestre
type: ConceptReFip
type: Concept
alternative label: lever terrestre
broader: topographie
definition: Méthode de mensuration consistant à "lever" le terrain depuis des stations au sol, afin de recueillir sur le terrain les données originales indispensables à l'établissement d'une carte ou d'un plan.
in scheme: FINANCES PUBLIQUES
in scheme: Cadastre
in scheme: Fiscalité
notation: REFIP5219
scope note: Permet la mesure de distance

droit civil
type: ConceptReFip
type: Concept
broader: droit privé
definition: Ensemble des règles de droit normalement applicables dans les rapports des personnes privées entre elles.
in scheme: FINANCES PUBLIQUES
in scheme: Droit et Justice
in scheme: Divisions du Droit
in scheme: Droit Privé
narrower: jouissance gratuite d'un bien
narrower: condition de fond
narrower: indivisibilité
narrower: capacité juridique
narrower: ayant cause
narrower: subrogation
narrower: aliénation de biens
narrower: obligation alimentaire
narrower: ayant droit
narrower: droit à l'information
narrower: preuve testimoniale
narrower: preuve par écrit
narrower: séparation de fait
narrower: séparation de corps
narrower: représentant légal
narrower: dol
narrower: viager
narrower: publicité d'acte juridique
narrower: patrimoine
narrower: condition suspensive
narrower: condition résolutoire
narrower: droit à l'image
narrower: honorariat
narrower: prestation compensatoire
narrower: gré à gré
narrower: personne physique de droit privé
narrower: responsabilité civile
narrower: condition de forme
narrower: preuve par tout moyen
narrower: obligation de résultat
narrower: droit de propriété
narrower: prisée de meuble
narrower: droit de rétention
narrower: régime matrimonial
narrower: filiation
narrower: enrichissement sans cause
narrower: immeuble
narrower: meuble
narrower: refip-REFIP738
narrower: refip-REFIP780
narrower: refip-REFIP859
narrower: refip-REFIP939
notation: REFIP5220

île de Jersey
type: ConceptReFip
type: Concept
alternative label: Jersey
broader: Grande-Bretagne
definition: Territoire de Grande-Bretagne
in scheme: FINANCES PUBLIQUES
in scheme: Géographie
in scheme: Europe
notation: REFIP5221

application SYNCOFI
type: ConceptReFip
type: Concept
alternative label: SYNCOFI
alternative label: synthèse du compte fiscal des particuliers
broader: applications fiscales (non-descripteur)
definition: Application permettant d'accéder à la synthèse du compte fiscal d'une personne (résumé des occurences fiscales, services de gestion).
in scheme: FINANCES PUBLIQUES
in scheme: Applications Informatiques
in scheme: Applications fiscales
notation: REFIP5223
scope note: Remplace l'application SPI à compter du 15/01/2009

balance comptable définitive
type: ConceptReFip
type: Concept
alternative label: balance définitive
broader: balance comptable
definition: État contenant uniquement les comptes de bilan (classes 1 à 5), les comptes de gestion (classes 6 et 7) étant soldés lors des écritures de regroupement.
in scheme: FINANCES PUBLIQUES
in scheme: Documents comptables
in scheme: Comptabilité
notation: REFIP5225

Commissariat général à l'investissement
type: ConceptReFip
type: Concept
broader: structure rattachée au Premier Ministre (non-descripteur)
definition: Administration placée sous l'autorité du Premier ministre chargée de veiller à la cohérence de la politique d'investissement de l'État. Pour ce faire le commissariat prépare les décisions du Gouvernement relatives aux contrats passés entre l'État et les organismes chargés de la gestion des fonds, il coordonne la préparation des cahiers des charges accompagnant les appels à projets, il supervise l'instruction des projets d'investissement et formule des avis et des propositions, Enfin, il veille à l'évaluation des investissements. Le commissariat est chargé de la mise en œuvre du programme d'investissements d'avenir.
in scheme: FINANCES PUBLIQUES
in scheme: Organisation Structurelle de l'Etat
in scheme: Ministère
in scheme: Administration de L'Etat
notation: REFIP5226

document d'arpentage
type: ConceptReFip
type: Concept
alternative label: DMPC
alternative label: document modificatif du parcellaire cadastral
broader: plan cadastral
definition: Document servant à assurer, d'une part, l'identification des nouvelles parcelles issues d'une division et d'autre part, la mise à jour du plan cadastral. Il consiste en une reproduction du plan cadastral, sur lequel les limites nouvelles sont reportées.
in scheme: FINANCES PUBLIQUES
in scheme: Cadastre
in scheme: Fiscalité
narrower: document d'arpentage numérique
notation: REFIP5228

fiscalité des particuliers
type: ConceptReFip
type: Concept
alternative label: fiscalité personnelle
broader: champ d'application
definition: Dispositions générales de l'impôt sur le revenu ainsi que les autres revenus catégoriels ne relevant pas de la fiscalité des entreprises ou de la fiscalité immobilière.
in scheme: FINANCES PUBLIQUES
in scheme: Champ d'Application
in scheme: Fiscalité
narrower: lieu d'imposition
narrower: foyer fiscal
notation: REFIP5229

pourvoi en cassation
type: ConceptReFip
type: Concept
broader: pourvoi juridictionnel
definition: Recours extraordinaire contre une décision en dernier ressort porté devant la Cour de cassation ou le Conseil d'Etat
in scheme: FINANCES PUBLIQUES
in scheme: Principes Généraux
in scheme: Droit et Justice
in scheme: Procédure
notation: REFIP523

fermage
type: ConceptReFip
type: Concept
alternative label: bail à ferme
broader: bail rural
definition: Bail ayant pour objet un fonds rural. Le preneur est qualifié fermier et le loyer fermage. Par extension, on appelle aussi fermage ledit bail.
in scheme: FINANCES PUBLIQUES
in scheme: Droit et Justice
in scheme: Divisions du Droit
in scheme: Droit Privé
notation: REFIP5230

nantissement
type: ConceptReFip
type: Concept
broader: sûreté réelle
definition: Sûreté réelle mobilière inscrite par un créancier sur un bien meuble incorporel (parts sociales, fonds de commerce par exemple) appartenant à un débiteur afin de garantir sa dette.
in scheme: FINANCES PUBLIQUES
in scheme: Recouvrement
in scheme: Fiscalité
narrower: nantissement du fonds de commerce
narrower: inscription d'un nantissement
notation: REFIP5231

prix définitif
type: ConceptReFip
type: Concept
broader: passation des marchés publics
definition: Marché dont le prix définitif signifie que le prix ou les modalités de sa détermination sont fixés initialement dans les documents contractuels du marché.
in scheme: FINANCES PUBLIQUES
in scheme: Commande publique
in scheme: Gestion Publique
notation: REFIP5232

crédit d'impôt en faveur des entreprises créées dans des zones d'investissement privilégié (supprimé)
type: ConceptReFip
type: Concept
broader: ZZ
in scheme: FINANCES PUBLIQUES
notation: REFIP5233

travaux de construction
type: ConceptReFip
type: Concept
broader: construction
definition: Ensemble des prestations exécutées par les entreprises en vue de la fourniture, de l’installation et de la mise en service de la construction.
in scheme: FINANCES PUBLIQUES
in scheme: Branche d'activité
in scheme: Questions Economiques
in scheme: Construction
narrower: gros oeuvre
notation: REFIP5234

partage
type: ConceptReFip
type: Concept
alternative label: partage de biens indivis
broader: indivision
definition: Opération qui met fin à une indivision.
in scheme: FINANCES PUBLIQUES
in scheme: Droit et Justice
in scheme: Divisions du Droit
in scheme: Droit Privé
narrower: licitation partage
notation: REFIP5235
related: refip-REFIP7148

préfet de région
type: ConceptReFip
type: Concept
alternative label: commissaire de la République de région
broader: région
definition: Préfet du département dans lequel se situe le chef-lieu de la région, remplissant à cet égard, dans ce département, la totalité des prérogatives d’un préfet de département. Il est le garant de la cohérence de l’action de l’État dans la région ; il a autorité sur les préfets de département, sauf en matière de droit des étrangers, de police administrative et de contrôle de légalité sur les collectivités territoriales ; il dirige les services déconcentrés régionaux de l’État. Il est responsable de l’exécution des politiques de l’État dans la région. Il contrôle la légalité et le respect des règles budgétaires des actes de la région et de ses établissements publics. Enfin, il préside le comité de l’administration régionale (CAR) qui réunit les préfets de département et les chefs de services déconcentrés régionaux de l’État.
in scheme: FINANCES PUBLIQUES
in scheme: Organisation Territoriale
in scheme: Structures Territoriales
in scheme: Administration de L'Etat
notation: REFIP5236

agrégat
type: ConceptReFip
type: Concept
alternative label: agrégat comptable
alternative label: agrégat financier
broader: agrégation des comptes
definition: Grandeur synthétique mesurant le résultat d'une activité économique ou de multiples données monétaires et financières.
in scheme: FINANCES PUBLIQUES
in scheme: Procédures et Techniques Comptables
in scheme: Comptabilité
notation: REFIP5237

affichage légal
type: ConceptReFip
type: Concept
broader: droit du travail
definition: Ensemble de textes de loi que l'employeur est légalement tenu d'afficher sur le lieu de travail.
in scheme: FINANCES PUBLIQUES
in scheme: Droit et Justice
in scheme: Divisions du Droit
in scheme: Droit Privé
notation: REFIP5238
related: lieu de travail

application LUCIA (supprimé)
type: ConceptReFip
type: Concept
broader: ZZ
in scheme: FINANCES PUBLIQUES
notation: REFIP524

conducteur d'opération
type: ConceptReFip
type: Concept
alternative label: mission de conduite d'opération
alternative label: mission du conducteur d'opération
broader: marché public
definition: Personne apportant au maître de l'ouvrage une assistance générale à caractère administratif, financier et technique.
in scheme: FINANCES PUBLIQUES
in scheme: Commande publique
in scheme: Gestion Publique
notation: REFIP5241

infrastructure routière
type: ConceptReFip
type: Concept
alternative label: autoroute
alternative label: chemin rural
alternative label: route
alternative label: route départementale
alternative label: route nationale
alternative label: réseau routier
alternative label: voirie
alternative label: voirie privée
broader: domaine public routier
definition: Ensemble des installations fixes qu'il est nécessaire d'aménager pour permettre la circulation des véhicules et plus généralement le fonctionnement des systèmes de transport routier.
in scheme: FINANCES PUBLIQUES
in scheme: Domaine
in scheme: Gestion Publique
notation: REFIP5242
related: transport routier

travaux de voirie
type: ConceptReFip
type: Concept
alternative label: rénovation de voirie
alternative label: travaux de terrassement
broader: travaux publics
definition: Travaux sur la voie publique comprenant notamment le terrassement, la réfection ou renforcement de la voirie existante et la construction d'une voirie.
in scheme: FINANCES PUBLIQUES
in scheme: Branche d'activité
in scheme: Questions Economiques
in scheme: Construction
notation: REFIP5243

jugement d'ouverture
type: ConceptReFip
type: Concept
broader: jugement
definition: Jugement rendu par le président du tribunal de commerce officialisant l'ouverture d'une procédure collective. Utilisé en droit des entreprises pour celles qui sont en difficulté.
in scheme: FINANCES PUBLIQUES
in scheme: Principes Généraux
in scheme: Droit et Justice
in scheme: Procédure
notation: REFIP5244

application IRMA
type: ConceptReFip
type: Concept
alternative label: IRMA
broader: applications gestion publique (non-descripteur)
definition: Applicatif de saisie de virements et d’intégration de fichiers, supprimé en 2014.
in scheme: FINANCES PUBLIQUES
in scheme: Applications Informatiques
in scheme: Applications gestion publique
notation: REFIP5245

mission d'expertise économique et financière
type: ConceptReFip
type: Concept
alternative label: MEEF
broader: direction régionale des finances publiques
definition: Service chargé de l’expertise et de l’action économiques et financières réalisant à l'échelon régional et interrégional, des expertises juridiques, économiques et financières sur des dossiers d’investissements publics à forts enjeux.
in scheme: FINANCES PUBLIQUES
in scheme: Organisation Structurelle de l'Etat
in scheme: Ministère
in scheme: Administration de L'Etat
notation: REFIP5247
related: expertise et action économiques et financières
related: division expertise et actions économiques et financières

fiche de solvabilité
type: ConceptReFip
type: Concept
broader: documentation fiscale (non-descripteur)
definition: Imprimé n° 3952-SD (Annexe n° 3952 bis- SD) utilisé en matière de contrôle fiscal externe qui rassemble les informations permettant aux services de recouvrement de mesurer la capacité d'une personne physique ou morale à payer ses dettes, donc à apprécier sa solvabilité et les éventuelles mesures conservatoires à prendre.
in scheme: FINANCES PUBLIQUES
in scheme: Documentation Fiscale
in scheme: Fiscalité
notation: REFIP5248

nuisance
type: ConceptReFip
type: Concept
alternative label: nuisance sonore
broader: pollution
definition: Tout facteur qui constitue un préjudice, une gêne pour la santé, le bien-être, l'environnement
in scheme: FINANCES PUBLIQUES
in scheme: Environnement
in scheme: Dégradation de l'Environnement
in scheme: Questions de Société
notation: REFIP5249

transfert intracommunautaire
type: ConceptReFip
type: Concept
broader: fiscalité internationale
definition: Expédition ou transport par un assujetti ou pour son compte, d'un bien meuble corporel pour les besoins de son entreprise à destination d'une succursale, ou d'un autre établissement de l'assujetti, situés dans un autre État membre.
in scheme: FINANCES PUBLIQUES
in scheme: Champ d'Application
in scheme: Fiscalité
notation: REFIP525

société civile de construction
type: ConceptReFip
type: Concept
alternative label: société civile de construction vente
broader: société civile
definition: Société ayant pour objet objet l'achat d'un terrain à bâtir afin de procéder à la construction d'un immeuble et immédiatement à sa vente en totalité ou par lots. La SCI n'est pas imposée mais chaque associé est imposé sur ce qu’il perçoit des bénéfices nets, sur sa déclaration de revenus annuelle.
in scheme: FINANCES PUBLIQUES
in scheme: Société
in scheme: Entreprises
in scheme: Forme juridique
notation: REFIP5250

établissement d'enseignement privé sous contrat
type: ConceptReFip
type: Concept
alternative label: établissement d'enseignement privé sous contrat simple
broader: établissement d'enseignement
definition: Etablissement d’enseignement privé sous contrat avec l'Etat (contrat simple pour les écoles primaires ou spécialisées, ou contrat d’association pour les écoles primaires, les collèges et les lycées) qui dispense les enseignements conformément aux règles et aux programmes de l’enseignement public. L’État rémunère les enseignants, qui ont réussi des concours analogues à ceux de l’enseignement public, et les collectivités publiques financent le fonctionnement de l’établissement dans les mêmes proportions qu’ils financent les écoles et les établissements publics.
in scheme: FINANCES PUBLIQUES
in scheme: Organisation Territoriale
in scheme: Structures Territoriales
in scheme: Administration de L'Etat
notation: REFIP5251

bien professionnel
type: ConceptReFip
type: Concept
broader: fiscalité des professionnels
definition: Biens expressément exclus de l'assiette de l'ISF et pouvant être regroupés en 3 catégories : biens dépendant d'une exploitation individuelle, parts ou actions de société, et certains biens ruraux.
in scheme: FINANCES PUBLIQUES
in scheme: Champ d'Application
in scheme: Fiscalité
notation: REFIP5253

chaîne de traitement
type: ConceptReFip
type: Concept
broader: informatique
definition: Ensemble de paramétrages et de programmes informatiques permettant l'automatisation de certains processus de présentation, de vérification ou de validation.
in scheme: FINANCES PUBLIQUES
in scheme: Informatique
in scheme: Communication Documentation Informatique
narrower: bascule informatique
narrower: workflow
narrower: téléprocédure
narrower: migration informatique
notation: REFIP5254

attestation
type: ConceptReFip
type: Concept
broader: mots outils (liste additive)
definition: Déclaration verbale ou plus souvent écrite témoignant d'une situation ou d'un fait.
in scheme: FINANCES PUBLIQUES
in scheme: Mots Outils
notation: REFIP5255

établissement public social et médicosocial
type: ConceptReFip
type: Concept
alternative label: EPSMS
alternative label: établissement médicosocial
broader: structures territoriales (non-descripteur)
definition: Etablissement public pouvant être communal, intercommunal, départemental, interdépartemental ou national, administré par un conseil d'administration et dirigé par un directeur nommé par l'autorité compétente de l’État après avis du président du conseil d'administration.Pouvant prendre la forme d'institution destinée aux enfants handicapés ou inadaptés ; d'établissement et service d'aide par le travail ; d'établissement d’aide aux personnes âgées ; d'établissement pour adultes atteints d'un handicap ; d'établissement venant en aide aux personnes sans domicile fixe ; de centre de traitement des addictions ; de maison d'enfance à caractère social.
in scheme: FINANCES PUBLIQUES
in scheme: Organisation Territoriale
in scheme: Structures Territoriales
in scheme: Administration de L'Etat
narrower: établissement ou service d'aide par le travail
notation: REFIP5256

sanction fiscale
type: ConceptReFip
type: Concept
alternative label: pénalité fiscale
broader: droit de reprise de l'administration
definition: Se caractérisent pour les infractions liées à l'assiette ou au recouvrement de l'impôt d'une part par l'application d'un intérêt de retard unique, dû indépendamment de toutes sanctions et qui a pour objet de compenser le préjudice subi par le Trésor public du fait de l'encaissement tardif de sa créance et d'autre part par l'application de majorations dont le taux varie en fonction de la gravité de l'infraction ou de la non-régularisation de l'infraction dans les délais prévus par la loi. Par ailleurs, pour les autres infractions, par un dispositif de sanctions spécifiques dont l'importance est adaptée à la gravité réelle de l'infraction relevée.
in scheme: FINANCES PUBLIQUES
in scheme: Droit de Reprise de l'Administration
in scheme: Fiscalité
narrower: pénalité d'assiette
narrower: majoration fiscale
narrower: amende fiscale
notation: REFIP5257

ordonnance de contrainte
type: ConceptReFip
type: Concept
broader: contrainte administrative
definition: Ordonnance rendue par le juge afin de contraindre le tiers saisi à s'exécuter en cas de saisie des rémunérations.
in scheme: FINANCES PUBLIQUES
in scheme: Procédure Civile
in scheme: Droit et Justice
in scheme: Procédure
notation: REFIP5258

prescription acquisitive
type: ConceptReFip
type: Concept
broader: prescription
definition: Moyen d'acquérir par une possession prolongée la propriété d'un immeuble ou d'un droit réel immobilier comme un usufruit ou une servitude.
in scheme: FINANCES PUBLIQUES
in scheme: Droit et Justice
in scheme: Droit Général
notation: REFIP5259

taxe annuelle sur les locaux à usage de bureaux les locaux commerciaux et les locaux de stockage
type: ConceptReFip
type: Concept
alternative label: taxe annuelle sur les locaux à usage de bureaux
alternative label: taxe sur les bureaux
broader: taxes et redevance de nature immobilière (non-descripteur)
definition: Taxe annuelle portant sur les locaux à usage de bureaux et assimilés, les locaux commerciaux, les locaux de stockage et les surfaces de stationnement annexées à ces catégories de locaux, situés dans les limites territoriales de la région d'Île-de-France. Sont soumises à la taxe les personnes privées ou publiques qui sont propriétaires de biens imposables ou titulaires d'un droit réel portant sur de tels biens.
in scheme: FINANCES PUBLIQUES
in scheme: Fiscalité
in scheme: Impôt
notation: REFIP526

application OREGHON
type: ConceptReFip
type: Concept
alternative label: OREGHON
alternative label: outil de reporting global des hôpitaux sur le net
alternative label: outil de reporting hospitalier infra annuel
broader: applications gestion publique (non-descripteur)
definition: Outil de reporting financier infra annuel des établissements publics de santé.
in scheme: FINANCES PUBLIQUES
in scheme: Applications Informatiques
in scheme: Applications gestion publique
notation: REFIP5261

service assistance utilisateur
type: ConceptReFip
type: Concept
alternative label: SAU
broader: services informatiques
definition: Services de la DGFIP assistant les utilisateurs dans l'utilisation des applications informatiques nécessaires à l'exécution de leurs missions et métiers. Les SAU sont le point unique pour toute demande d'assistance.
in scheme: FINANCES PUBLIQUES
in scheme: Organisation Structurelle de l'Etat
in scheme: Ministère
in scheme: Administration de L'Etat
notation: REFIP5262

moins-value
type: ConceptReFip
type: Concept
alternative label: dépréciation
alternative label: moins-value d'actif
broader: actif
definition: Constatation comptable ou fiscale d'une perte sur la valeur d'un actif (titres, bien immobilier...). La moins-value représente donc la différence négative entre le prix d'achat d'un actif et sa valeur actuelle ou son prix de cession.
in scheme: FINANCES PUBLIQUES
in scheme: Documents comptables
in scheme: Comptabilité
narrower: moins-value à long terme
narrower: moins-value à court terme
notation: REFIP5264

Agence nationale de la recherche
type: ConceptReFip
type: Concept
alternative label: ANR
broader: établissement public à caractère administratif
definition: Etablissement public à caractère administratif, l'Agence Nationale de la Recherche a pour mission la mise en œuvre du financement de la recherche sur projets publics ou privés en France. Elle est aussi le principal opérateur des Investissements d'Avenir dans le domaine de l'enseignement supérieur et de la recherche.
in scheme: FINANCES PUBLIQUES
in scheme: Organisation Structurelle de l'Etat
in scheme: Opérateur de l'Etat
in scheme: Administration de L'Etat
notation: REFIP5266

Yonne
type: ConceptReFip
type: Concept
broader: refip-REFIP7017
definition: Département français
in scheme: FINANCES PUBLIQUES
in scheme: Géographie
in scheme: Europe
notation: REFIP5269

évaluation domaniale
type: ConceptReFip
type: Concept
broader: domaine (non-descripteur)
definition: Détermination par les services du Domaine de la valeur vénale d'un bien ou d'un droit réel immobilier en l'état.
in scheme: FINANCES PUBLIQUES
in scheme: Domaine
in scheme: Gestion Publique
notation: REFIP527

Wallis et Futuna
type: ConceptReFip
type: Concept
broader: collectivités et territoires d'outre mer (non-descripteur)
definition: Collectivité d'outre-mer
in scheme: FINANCES PUBLIQUES
in scheme: Géographie
in scheme: Europe
notation: REFIP5270

trésorerie générale pour l'étranger
type: ConceptReFip
type: Concept
alternative label: TGE
broader: refip-REFIP895
definition: Entité de la Direction générale des finances publiques qui assurait des missions particulières relatives au recouvrement des recettes publiques, au paiement des dépenses publiques, à la gestion de la trésorerie ainsi qu'à la gestion financière et comptable des services de l'Etat représentés à l'étranger.
in scheme: FINANCES PUBLIQUES
in scheme: Organisation Structurelle de l'Etat
in scheme: Ministère
in scheme: Administration de L'Etat
notation: REFIP5271
scope note: Remplacée par la Direction Spécialisée des Finances Publiques pour l'Etranger depuis 2015

droit de chasse
type: ConceptReFip
type: Concept
alternative label: bail de chasse
alternative label: droit de chasser
broader: droit de propriété
definition: Droit accordé au propriétaire en vertu de son droit de propriété de chasser et d'autoriser autrui à chasser sur ses terres,
in scheme: FINANCES PUBLIQUES
in scheme: Droit et Justice
in scheme: Divisions du Droit
in scheme: Droit Privé
notation: REFIP5272

dégrèvement transitoire
type: ConceptReFip
type: Concept
broader: dégrèvement
definition: Dégrèvement dégressif en matière de cotisation économique territoriale (CET), au titre des années 2010 à 2013, sur réclamation des contribuables ayant subi un accroissement significatif de leurs cotisations en 2010 du fait de la réforme de la taxe professionnelle.
in scheme: FINANCES PUBLIQUES
in scheme: Contentieux Fiscal
in scheme: Fiscalité
notation: REFIP5273

droit de rétention
type: ConceptReFip
type: Concept
broader: droit civil
definition: Droit reconnu à un créancier de ne pas restituer un bien appartenant à son débiteur tant qu’il n’a pas été désintéressé de ce qui lui est dû.
in scheme: FINANCES PUBLIQUES
in scheme: Droit et Justice
in scheme: Divisions du Droit
in scheme: Droit Privé
notation: REFIP5274

vente à terme
type: ConceptReFip
type: Concept
broader: vente
definition: Vente dans laquelle le vendeur s'engage à livrer un immeuble après son achèvement et l'acheteur s'engage à en prendre livraison et en payer le prix à la date de la livraison. Le transfert de propriété s'opère de plein droit lors de la constatation de l'achèvement de l'immeuble et du paiement du prix.
in scheme: FINANCES PUBLIQUES
in scheme: Droit et Justice
in scheme: Divisions du Droit
in scheme: Droit Privé
narrower: vente en l'état futur d'achèvement
notation: REFIP5276

encaissement immédiat
type: ConceptReFip
type: Concept
broader: encaissement
definition: Modalités de perception de certaines amendes sans prise en charge de titre et au moment de la constatation de l'infraction.
in scheme: FINANCES PUBLIQUES
in scheme: Comptabilité publique
in scheme: Comptabilité
notation: REFIP5277

juge judiciaire
type: ConceptReFip
type: Concept
broader: magistrat
definition: Juge qui traite les affaires judiciaires, et règle les litiges entre particuliers ou pour le pénal.
in scheme: FINANCES PUBLIQUES
in scheme: Profession Juridique
in scheme: Droit et Justice
in scheme: Organisation Juridictionnelle
narrower: juge des tutelles
narrower: juge d'instruction
narrower: juge aux affaires familiales
narrower: juge commissaire
narrower: juge d'instance
narrower: refip-REFIP770
notation: REFIP5278

Martinique
type: ConceptReFip
type: Concept
broader: collectivités et territoires d'outre mer (non-descripteur)
definition: Département d'outre mer
in scheme: FINANCES PUBLIQUES
in scheme: Géographie
in scheme: Europe
notation: REFIP5279
related: Antilles

marché reconductible
type: ConceptReFip
type: Concept
broader: marché public
definition: Marché public dont le renouvellement des obligations contractuelles est à l'identique sur une période déterminée par le marché.
in scheme: FINANCES PUBLIQUES
in scheme: Commande publique
in scheme: Gestion Publique
notation: REFIP5280
related: reconduction

société d'économie mixte
type: ConceptReFip
type: Concept
alternative label: SEM
broader: société anonyme
definition: Société anonyme dont le capital est majoritairement détenu par une ou plusieurs personnes publiques. Cette participation majoritaire publique est plafonnée à 85 % du capital.
in scheme: FINANCES PUBLIQUES
in scheme: Société
in scheme: Entreprises
in scheme: Forme juridique
narrower: refip-REFIP69
notation: REFIP5281

bénéficiaire
type: ConceptReFip
type: Concept
broader: mots outils (liste additive)
definition: Qui profite d'un bienfait de la loi ou d'un avantage.
in scheme: FINANCES PUBLIQUES
in scheme: Mots Outils
notation: REFIP5286

restitution des impositions directes
type: ConceptReFip
type: Concept
alternative label: restitution d'impôt
broader: restitution de versements indus
definition: Remboursement au contribuable des impôts directs qu'il a versé par le jeu de divers mécanismes fiscaux (bouclier fiscal etc...).
in scheme: FINANCES PUBLIQUES
in scheme: Contentieux Fiscal
in scheme: Fiscalité
narrower: bouclier fiscal
notation: REFIP5288

autoliquidation de l'impôt
type: ConceptReFip
type: Concept
alternative label: autoliquidation de l'imposition
alternative label: imposition autoliquidée
alternative label: impôt autoliquidé
broader: paiement de l'impôt
definition: Paiement des droits versés spontanément au moment du dépôt d'une déclaration, sans émission d'un titre exécutoire.
in scheme: FINANCES PUBLIQUES
in scheme: Recouvrement
in scheme: Fiscalité
notation: REFIP529

cotisation minimale de taxe professionnelle
type: ConceptReFip
type: Concept
alternative label: CMTP
broader: taxe professionnelle
definition: Cotisation supprimée par la loi de finances 2010, qui était due par les entreprises réalisant un certain chiffre d'affaires et dont la cotisation de taxe professionnelle de référence était inférieure à un certain pourcentage de la valeur ajoutée.
in scheme: FINANCES PUBLIQUES
in scheme: Fiscalité
in scheme: Impôt
notation: REFIP5290
scope note: Supprimée par la loi de finances pour 2010 et la réforme de la taxe professionnelle.

coefficient de déduction
type: ConceptReFip
type: Concept
alternative label: coefficient d'admission
alternative label: coefficient d'assujettissement
alternative label: coefficient de taxation
broader: déductibilité
definition: Grandeur permettant à la fois de déterminer les montants de taxe déductible, et au travers de ses variations, les régularisations de taxe auxquelles l’assujetti est tenu.
in scheme: FINANCES PUBLIQUES
in scheme: Liquidation de l'Impôt
in scheme: Fiscalité
notation: REFIP5291

calcul
type: ConceptReFip
type: Concept
broader: mots outils (liste additive)
definition: Opération ou ensemble d'opérations effectuées sur des grandeurs.
in scheme: FINANCES PUBLIQUES
in scheme: Mots Outils
notation: REFIP5292

acte de vente
type: ConceptReFip
type: Concept
broader: acte authentique
definition: Acte authentique (notarié ou plus rarement dressé par un huissier de justice) venant constater la vente entre le propriétaire et l’acquéreur.
in scheme: FINANCES PUBLIQUES
in scheme: Droit et Justice
in scheme: Sources du Droit
in scheme: Sources des Droits Subjectifs
notation: REFIP5293

passif
type: ConceptReFip
type: Concept
broader: bilan
definition: Élément du patrimoine ayant une valeur économique négative pour l’entreprise, c'est-à-dire une obligation de l'entité à l'égard d'un tiers dont il est probable ou certain qu'elle provoquera une sortie de ressources au bénéfice de ce tiers, sans contrepartie au moins équivalente attendue de celui-ci.
in scheme: FINANCES PUBLIQUES
in scheme: Documents comptables
in scheme: Comptabilité
narrower: provision
narrower: réserve de trésorerie
narrower: charges à payer
narrower: valeur d'équivalence
narrower: intérêts courus non échus
narrower: capitaux propres
narrower: refip-REFIP7105
narrower: refip-REFIP789
narrower: refip-REFIP831
notation: REFIP5295

confiscation
type: ConceptReFip
type: Concept
broader: sanction pénale
definition: Peine complémentaire par laquelle la propriété de biens de l'auteur d'une infraction est transférée à l’État.
in scheme: FINANCES PUBLIQUES
in scheme: Droit et Justice
in scheme: Sanction
in scheme: Infractions et Sanctions
notation: REFIP5296

Agence régionale de santé
type: ConceptReFip
type: Concept
alternative label: ARS
broader: établissement public à caractère administratif
definition: Etablissement public administratif chargé de la mise en œuvre de la politique de santé dans la région, l' ARS a pour but d’assurer un pilotage unifié de la santé en région, de mieux répondre aux besoins de la population et d’accroître l’efficacité du système. Un des rôles des ARS est de moderniser et rationaliser l'offre de soins, et de veiller à la bonne gestion des dépenses hospitalières et médicales.
in scheme: FINANCES PUBLIQUES
in scheme: Organisation Structurelle de l'Etat
in scheme: Opérateur de l'Etat
in scheme: Administration de L'Etat
narrower: refip-REFIP718
notation: REFIP5297

revenu accessoire
type: ConceptReFip
type: Concept
broader: revenu imposable
definition: Revenu qui ne provient pas de l'activité principale du contribuable.
in scheme: FINANCES PUBLIQUES
in scheme: Champ d'Application
in scheme: Fiscalité
notation: REFIP5298

aide à la recherche au développement et à l'innovation
type: ConceptReFip
type: Concept
alternative label: aide RDI
broader: ingénierie financière
definition: Aide qui soutient à la fois des projets de recherche industrielle ou des projets de développement expérimental.
in scheme: FINANCES PUBLIQUES
in scheme: Dépenses publiques
in scheme: Gestion Publique
notation: REFIP5299

gestion du matériel
type: ConceptReFip
type: Concept
broader: logistique
definition: Actions et processus de gestion, d'administration, et d'organisation du matériel professionnel de l'acquisition à sa destruction en passant par la maintenance.
in scheme: FINANCES PUBLIQUES
in scheme: Gestion de l'Entreprise
in scheme: Entreprises
in scheme: Vie et Gestion de l'entreprise
notation: REFIP5301
related: matériel
related: refip-REFIP757

prescription de l'action en recouvrement
type: ConceptReFip
type: Concept
broader: recouvrement
definition: Moyen de se libérer d'une obligation au terme d'un certain délai pendant lequel le créancier est resté inactif.
in scheme: FINANCES PUBLIQUES
in scheme: Recouvrement
in scheme: Fiscalité
narrower: interruption de prescription
narrower: refip-REFIP6993
notation: REFIP5302

frais de représentation
type: ConceptReFip
type: Concept
broader: dépenses de fonctionnement
definition: Dépenses afférentes aux relations qu’entretient l’administration avec l’extérieur au titre de ses fonctions.
in scheme: FINANCES PUBLIQUES
in scheme: Dépenses publiques
in scheme: Gestion Publique
notation: REFIP5304

déficit public
type: ConceptReFip
type: Concept
alternative label: déficit budgétaire
broader: dette publique
definition: Besoin de financement des administrations publiques auquel est ajouté le solde des gains et des pertes des opérations sur swaps (produits dérivés). Le besoin de financement est le solde du compte de capital : il intègre non seulement les dépenses courantes de fonctionnement et les opérations de redistribution, mais aussi les dépenses en capital, l'investissement ainsi que les transferts en capital et les impôts en capital.
in scheme: FINANCES PUBLIQUES
in scheme: Budget de l’État
in scheme: Budget
notation: REFIP5305

crime
type: ConceptReFip
type: Concept
broader: refip-REFIP660
definition: Catégorie des infractions les plus graves.
in scheme: FINANCES PUBLIQUES
in scheme: Droit et Justice
in scheme: Infractions et Sanctions
in scheme: Infraction
narrower: terrorisme
notation: REFIP5306

Agence de presse
type: ConceptReFip
type: Concept
broader: presse
definition: Entreprise commerciale qui collecte, traite, met en forme et fournit à titre professionnel tous éléments d’information ayant fait l’objet sous sa propre responsabilité d’un traitement journalistique.
in scheme: FINANCES PUBLIQUES
in scheme: Communication
in scheme: Communication Documentation Informatique
notation: REFIP5307

branche d'activité
type: ConceptReFip
type: Concept
alternative label: secteur d'activité
definition: Ensemble d’unités de production, classées en fonction du bien ou service qu'elles produisent, ayant la même activité de production (on parle d’unités de production homogènes).
in scheme: FINANCES PUBLIQUES
in scheme: Branche d'activité
in scheme: Questions Economiques
narrower: construction
narrower: industrie
narrower: commerce
narrower: tourisme
narrower: agriculture
narrower: services et professions libérales (non-descripteur)
narrower: refip-REFIP710
narrower: refip-REFIP766
notation: REFIP531

publicité du privilège du Trésor
type: ConceptReFip
type: Concept
broader: privilège du Trésor
definition: Procédure, prévue à l'article 1929 quater du code général des impôts, permettant aux tiers d'être informés du non-paiement des dettes fiscales privilégiées de ces personnes. Cette publicité se fait par une inscription sur un registre tenu au greffe du tribunal de commerce ou de grande instance.
in scheme: FINANCES PUBLIQUES
in scheme: Recouvrement
in scheme: Fiscalité
notation: REFIP5310

débat oral et contradictoire
type: ConceptReFip
type: Concept
broader: refip-REFIP7169
definition: Garantie instituée par la jurisprudence dont le respect conditionne la régularité des opérations de vérification et des impositions en résultant. C'est un dialogue entre vérificateur et contribuable à partir des observations du vérificateur sur la comptabilité et sur les conditions d'exploitation et de fonctionnement de l'entreprise lorsque le contrôle a lieu dans les locaux de l'entreprise.
in scheme: FINANCES PUBLIQUES
in scheme: Droit de Reprise de l'Administration
in scheme: Fiscalité
notation: REFIP5312

déclaration des rémunérations versées
type: ConceptReFip
type: Concept
broader: documentation fiscale (non-descripteur)
definition: Formulaire n° 2460 devant être souscrit par tous les employeurs à l'exception de ceux relevant du régime général de sécurité sociale et des administrations, lorsqu'ils payent des sommes entrant, par leur nature, dans la catégorie des traitements et salaires.
in scheme: FINANCES PUBLIQUES
in scheme: Documentation Fiscale
in scheme: Fiscalité
notation: REFIP5313

transport scolaire
type: ConceptReFip
type: Concept
alternative label: ramassage scolaire
broader: transports en commun
definition: Activité de services réguliers créé pour assurer, à titre principal et à l’intention des élèves, la desserte des établissements d’enseignement.
in scheme: FINANCES PUBLIQUES
in scheme: Branche d'activité
in scheme: Questions Economiques
in scheme: Transports
notation: REFIP5314

fourniture de repas
type: ConceptReFip
type: Concept
alternative label: livraison de repas
alternative label: repas à domicile
broader: commerce
definition: Entreprise, association, organisme qui fournit la prestation de livraison de repas pour les personnes âgées, handicapées ou malades.
in scheme: FINANCES PUBLIQUES
in scheme: Branche d'activité
in scheme: Questions Economiques
in scheme: Commerce
narrower: restauration collective
notation: REFIP5316

application CCL
type: ConceptReFip
type: Concept
alternative label: CCL
broader: applications gestion publique (non-descripteur)
definition: Référentiel des budgets des collectivités locales.
in scheme: FINANCES PUBLIQUES
in scheme: Applications Informatiques
in scheme: Applications gestion publique
notation: REFIP5317

Gabon
type: ConceptReFip
type: Concept
broader: Afrique
definition: Pays
in scheme: FINANCES PUBLIQUES
in scheme: Géographie
in scheme: Afrique
notation: REFIP5319

imputation comptable
type: ConceptReFip
type: Concept
broader: règle d'imputation
definition: Affectation d'une somme à un compte, inscription d'un mouvement comptable à un compte crédité ou débité,
in scheme: FINANCES PUBLIQUES
in scheme: Procédures et Techniques Comptables
in scheme: Comptabilité
notation: REFIP5323

régime matrimonial
type: ConceptReFip
type: Concept
broader: droit civil
definition: Statut qui gouverne les intérêts pécuniaires des époux, dans leurs rapports entre eux, et dans leurs rapports avec les tiers et dont l'objet est de régler le sort des biens des époux pendant le mariage et à sa dissolution. Il peut être modifié par une convention.
in scheme: FINANCES PUBLIQUES
in scheme: Droit et Justice
in scheme: Divisions du Droit
in scheme: Droit Privé
narrower: séparation de biens
narrower: communauté réduite aux acquets
narrower: acceptation de communauté
notation: REFIP5324

attribution métier
type: ConceptReFip
type: Concept
broader: pilotage
definition: Liste des différentes missions attribuées à chaque fonction et/ou métier dans la nomenclature des emplois de la DGFIP.
in scheme: FINANCES PUBLIQUES
in scheme: Missions Transverses des Finances publiques
in scheme: Pilotage
notation: REFIP5325

Caisse nationale de prévoyance de la fonction publique
type: ConceptReFip
type: Concept
alternative label: PREFON
broader: organisme de sécurité sociale
definition: Association à but non lucratif dont l'objet est d'offrir aux fonctionnaires et assimilés des régimes de prévoyance complémentaire, notamment en matière de retraite. Préfon-Retraite est un régime de retraite complémentaire facultatif par capitalisation provisionnée, donnant droit en contrepartie de cotisations effectuées au cours de la période d'activité au versement d'une rente viagère.
in scheme: FINANCES PUBLIQUES
in scheme: Organisation Structurelle de l'Etat
in scheme: Organisme de Sécurité Sociale
in scheme: Administration de L'Etat
notation: REFIP5326

règlement de la consultation
type: ConceptReFip
type: Concept
broader: passation des marchés publics
definition: Document qui décrit les caractéristiques d’un marché public et détermine les conditions d’envoi et de jugement des offres. Informe les candidats sur les conditions générales du marché ainsi que sur les règles de concurrence.
in scheme: FINANCES PUBLIQUES
in scheme: Commande publique
in scheme: Gestion Publique
notation: REFIP5327

acte de notoriété
type: ConceptReFip
type: Concept
broader: droit successoral
definition: Acte juridique dressé par un officier public, qui établit la preuve de la qualité d'héritier lors de la succession.
in scheme: FINANCES PUBLIQUES
in scheme: Droit et Justice
in scheme: Divisions du Droit
in scheme: Droit Privé
notation: REFIP5328

pénalité libératoire
type: ConceptReFip
type: Concept
broader: pénalité de recouvrement
in scheme: FINANCES PUBLIQUES
in scheme: Recouvrement
in scheme: Fiscalité
notation: REFIP533
scope note: Supprimée depuis juillet 2010

appellation d'origine contrôlée
type: ConceptReFip
type: Concept
alternative label: AOC
broader: agriculture
definition: Label qui désigne un produit originaire d’une région ou d’un lieu déterminé, dont les caractéristiques sont dues essentiellement à ce milieu géographique. Résulte de la combinaison d’un savoir-faire et d’un terroir. La production est soumise à des procédures d’agrément comportant une habilitation des opérateurs, un contrôle des conditions de production et un contrôle des produits.
in scheme: FINANCES PUBLIQUES
in scheme: Branche d'activité
in scheme: Questions Economiques
in scheme: Agriculture
notation: REFIP5330

droit de place (supprimé)
type: ConceptReFip
type: Concept
broader: ZZ
in scheme: FINANCES PUBLIQUES
notation: REFIP5332

gérant de société
type: ConceptReFip
type: Concept
alternative label: gérant
broader: gérance
definition: Personne placée à la tête d'une société de personnes ou d'une SARL pour la diriger. Dans la SARL, ce représentant est investi des pouvoirs les plus étendus pour agir au nom de la société, sous réserve des pouvoirs attribués aux autres organes sociaux.
in scheme: FINANCES PUBLIQUES
in scheme: Gestion de l'Entreprise
in scheme: Entreprises
in scheme: Vie et Gestion de l'entreprise
notation: REFIP5334

communication
type: ConceptReFip
type: Concept
alternative label: communication de l'information
alternative label: diffusion
alternative label: diffusion de l'information
definition: Ensemble des moyens et techniques permettant la diffusion d'un message auprès d'une audience plus ou moins vaste et hétérogène ou l'action pour quelqu'un ou une organisation d'informer et de promouvoir son activité auprès d'autrui, d'entretenir son image, par tout procédé médiatique.
in scheme: FINANCES PUBLIQUES
in scheme: Communication
in scheme: Communication Documentation Informatique
narrower: courrier
narrower: information
narrower: télécommunication
notation: REFIP5335

dette publique
type: ConceptReFip
type: Concept
alternative label: dette de l'Etat
broader: budget de l'Etat
definition: Total des engagements financiers de l'Etat. La dette de l'Etat résulte du cumul des besoins de financement de l'État, c'est-à-dire de la différence, année après année, entre ses produits (recettes fiscales, produits de privatisations, etc.) et ses charges (dépenses budgétaires, prises de participation, etc.).
in scheme: FINANCES PUBLIQUES
in scheme: Budget de l’État
in scheme: Budget
narrower: déficit public
narrower: dette négociable
narrower: dette non négociable
notation: REFIP5336

principe des coûts historiques
type: ConceptReFip
type: Concept
alternative label: coût brut
alternative label: coût d'achat
alternative label: coût d'acquisition
alternative label: coût historique
broader: refip-REFIP819
definition: Principe selon lequel les biens acquis à titre onéreux sont enregistrés à leur coût d’acquisition, les biens acquis à titre gratuit à leur valeur vénale ou valeur d’usage, et les produits sont enregistrés leur coût de production ou de construction.
in scheme: FINANCES PUBLIQUES
in scheme: Principe comptable
in scheme: Comptabilité
notation: REFIP5337

ticket
type: ConceptReFip
type: Concept
broader: document
definition: Document attestant d’un achat ou d'une remise de valeur ou d'un droit.
in scheme: FINANCES PUBLIQUES
in scheme: Documentation
in scheme: Communication Documentation Informatique
notation: REFIP5339

Antilles néerlandaises
type: ConceptReFip
type: Concept
broader: Caraïbes
definition: Etat fédéral des PAYS-BAS
in scheme: FINANCES PUBLIQUES
in scheme: Géographie
in scheme: Amérique
notation: REFIP534
related: Pays-Bas

répertoire national des entreprises et des établissements
type: ConceptReFip
type: Concept
alternative label: SIRENE
alternative label: numéro SIREN
alternative label: numéro SIRET
alternative label: répertoire SIRENE
broader: vie de l'entreprise (non-descripteur)
definition: Système informatisé du répertoire national des entreprises et des établissements dont la gestion a été confiée à l'Insee enregistre l'état civil de toutes les entreprises et leurs établissements, quelle que soit leur forme juridique et quel que soit leur secteur d'activité, situés en métropole, dans les DOM (Guadeloupe, Guyane, Martinique, La Réunion et Mayotte) et à Saint-Pierre et Miquelon. Les entreprises étrangères qui ont une représentation ou une activité en France y sont également répertoriées.
in scheme: FINANCES PUBLIQUES
in scheme: Vie de l'Entreprise
in scheme: Entreprises
in scheme: Vie et Gestion de l'entreprise
notation: REFIP5340

comparabilité des comptes
type: ConceptReFip
type: Concept
alternative label: comparabilité comptable
broader: principe de permanence des méthodes comptables
definition: Principe assuré par la permanence des méthodes d'évaluation et de présentation des comptes qui ne peuvent être modifiées que si un changement exceptionnel est intervenu dans la situation de l'entité ou dans le contexte économique, industriel ou financier et que le changement de méthodes fournit une meilleure information financière compte tenu des évolutions intervenues.
in scheme: FINANCES PUBLIQUES
in scheme: Principe comptable
in scheme: Comptabilité
notation: REFIP5342

conservation des réquisitions
type: ConceptReFip
type: Concept
broader: conservation du cadastre
definition: Les services de publicité foncière conservent les réquisitions dans leurs archives en prévision de contestations.
in scheme: FINANCES PUBLIQUES
in scheme: Cadastre
in scheme: Fiscalité
notation: REFIP5344

application CADASTRE.GOUV
type: ConceptReFip
type: Concept
alternative label: cadastre.gouv
broader: applications fiscales (non-descripteur)
definition: Service internet de consultation du plan cadastral.
in scheme: FINANCES PUBLIQUES
in scheme: Applications Informatiques
in scheme: Applications fiscales
notation: REFIP5345

tribunal administratif
type: ConceptReFip
type: Concept
broader: juridiction administrative
definition: Juridiction de 1er degré ayant pour mission de juger la majorité des litiges entre l'administration et les personnes.
in scheme: FINANCES PUBLIQUES
in scheme: Droit et Justice
in scheme: Juridiction
in scheme: Organisation Juridictionnelle
notation: REFIP5347

chômage
type: ConceptReFip
type: Concept
alternative label: lutte contre le chômage
broader: conjoncture économique
definition: Situation d'une personne qui, souhaitant travailler et ayant la capacité de le faire (âge notamment), se trouve sans emploi malgré ses recherches.
in scheme: FINANCES PUBLIQUES
in scheme: Questions Economiques
in scheme: Economie générale
narrower: chômage partiel
notation: REFIP5348
related: licenciement
related: assurance chômage

arrhes
type: ConceptReFip
type: Concept
broader: droit des obligations et contrats (non-descripteur)
definition: Sommes versées par un client avant la livraison d'un bien ou avant l’achèvement d’une prestation de service. Dans le cas d'une vente, l’acheteur se réserve ainsi le droit de ne pas donner suite à la vente, auquel cas le vendeur conserve les arrhes en dédommagement.
in scheme: FINANCES PUBLIQUES
in scheme: Droit et Justice
in scheme: Divisions du Droit
in scheme: Droit Privé
notation: REFIP5349

réunion syndicale (supprimé)
type: ConceptReFip
type: Concept
broader: ZZ
in scheme: FINANCES PUBLIQUES
notation: REFIP5350

compétence territoriale
type: ConceptReFip
type: Concept
alternative label: compétence géographique
broader: principes généraux (non-descripteur)
definition: Compétence déterminée en fonction de la localisation géographique (domicile ou résidence d'une partie, situation de l'immeuble litigieux, lieu du délit).
in scheme: FINANCES PUBLIQUES
in scheme: Principes Généraux
in scheme: Droit et Justice
in scheme: Procédure
notation: REFIP5351

application COMPAS
type: ConceptReFip
type: Concept
broader: applications gestion publique (non-descripteur)
definition: Application permettant la consultation de l'ensemble des opérations dématérialisées remises et reçues de la Banque de France.
in scheme: FINANCES PUBLIQUES
in scheme: Applications Informatiques
in scheme: Applications gestion publique
notation: REFIP5352

reliquat
type: ConceptReFip
type: Concept
broader: mots outils (liste additive)
definition: Ce qui reste dû.
in scheme: FINANCES PUBLIQUES
in scheme: Mots Outils
notation: REFIP5353

délibération
type: ConceptReFip
type: Concept
broader: droit administratif
definition: Débat et examen d'une question précédant une décision au sein d'une assemblée, d'un conseil, d'une instance décisionnelle. Elle permet une confrontation des points de vue dans le but de trancher un problème ou un choix difficile.
in scheme: FINANCES PUBLIQUES
in scheme: Droit et Justice
in scheme: Divisions du Droit
in scheme: Droit Public
notation: REFIP5354

avance remboursable ne portant pas intérêt
type: ConceptReFip
type: Concept
broader: aide aux particuliers (non-descripteur)
definition: Avance versée par les établissements de crédit ayant conclu une convention avec l’État à des personnes physiques destinées à financer l'acquisition ou la construction d'une résidence principale en première accession à la propriété.
in scheme: FINANCES PUBLIQUES
in scheme: Dépenses publiques
in scheme: Gestion Publique
notation: REFIP5356

chambre nationale des huissiers de justice
type: ConceptReFip
type: Concept
broader: Ministère de la Justice
definition: Etablissement d'utilité publique, il est l'instance supérieure représentant la profession d'huissier de justice auprès du Ministère de la Justice. La Chambre organise la formation des futurs huissiers de justice et s'occupe du suivi de l'installation et de la vie des études d'huissiers de justice. La Chambre Nationale des Huissiers de Justice, par son bureau, est chargée d'élaborer des propositions à soumettre à la Chancellerie aux fins de toute modification des lois et décrets intéressant la profession. Elle instruit les litiges d'ordre professionnel.
in scheme: FINANCES PUBLIQUES
in scheme: Organisation Structurelle de l'Etat
in scheme: Ministère
in scheme: Administration de L'Etat
notation: REFIP5358

imposition forfaitaire sur les centrales de production d'énergie électrique d'origine nucléaire ou thermique à flamme
type: ConceptReFip
type: Concept
alternative label: IFCPE
broader: imposition forfaitaire sur les entreprises de réseaux
definition: Imposition qui s'applique aux installations de production d'électricité d'origine nucléaire ou thermique à flamme dont la puissance électrique installée est supérieure ou égale à 50 mégawatts. Constitue une composante de l'IFER.
in scheme: FINANCES PUBLIQUES
in scheme: Fiscalité
in scheme: Impôt
notation: REFIP5359

vin
type: ConceptReFip
type: Concept
broader: alcool
definition: Boisson alcoolisée obtenue par la fermentation du raisin.
in scheme: FINANCES PUBLIQUES
in scheme: Branche d'activité
in scheme: Questions Economiques
in scheme: Industrie
notation: REFIP536
related: vigne

programmation immobilière
type: ConceptReFip
type: Concept
alternative label: programme France Domaine
alternative label: programme immobilier
broader: politique immobilière de l'Etat
definition: Action dont le but est de recenser les opérations immobilières (travaux, mise aux normes, entretien) pouvant être réalisées sur une période donnée.
in scheme: FINANCES PUBLIQUES
in scheme: Politique immobilière de l'Etat
in scheme: Gestion Publique
narrower: gestion des immeubles
notation: REFIP5360

effet suspensif
type: ConceptReFip
type: Concept
broader: principes généraux (non-descripteur)
definition: Effet attaché aux voies de recours ordinaires (opposition et appel) en vertu duquel il est temporairement fait échec à l'exécution du jugement soit pendant le délai permettant de former opposition ou appel, soit en cas d'exercice de l'une ou l'autre de ces voies.
in scheme: FINANCES PUBLIQUES
in scheme: Principes Généraux
in scheme: Droit et Justice
in scheme: Procédure
narrower: moratoire
notation: REFIP5362

surface
type: ConceptReFip
type: Concept
broader: mots outils (liste additive)
definition: Étendue plane et mesure de cette étendue.
in scheme: FINANCES PUBLIQUES
in scheme: Mots Outils
notation: REFIP5363

société civile
type: ConceptReFip
type: Concept
broader: société
definition: Société à laquelle la loi n’attribue pas un autre caractère à raison de leur forme, de leur nature ou de leur objet. Elle n’exerce que des activités de nature civile par exemple agricole, intellectuelle, libérale, immobilière, par opposition aux sociétés commerciales.
in scheme: FINANCES PUBLIQUES
in scheme: Société
in scheme: Entreprises
in scheme: Forme juridique
narrower: société immobilière de copropriété
narrower: société civile de placements immobiliers
narrower: groupement agricole d'exploitation en commun
narrower: société civile immobilière
narrower: groupement foncier rural
narrower: société civile professionnelle
narrower: société civile de moyens
narrower: exploitation agricole à responsabilité limitée
narrower: société civile de construction
notation: REFIP5365

cascade de taxe sur la valeur ajoutée
type: ConceptReFip
type: Concept
alternative label: cascade de TVA
alternative label: déduction en cascade
alternative label: rappel et déduction en cascade
broader: refip-REFIP7169
definition: Mécanisme fiscal en cas de vérification simultanée de TVA et d'impôt sur les bénéfices (impôt sur le revenu ou sur les sociétés) ou en cas de vérifications séparées et qui permet, lorsque la vérification de TVA est achevée la première, d'imputer le supplément de TVA sur le bénéfice imposable du même exercice. Les rappels de TVA sont ainsi déduits des résultats de l'exercice au cours duquel ont été réalisées les opérations auxquelles ces rappels se rapportent, même s'il n'existe aucune corrélation entre eux.
in scheme: FINANCES PUBLIQUES
in scheme: Droit de Reprise de l'Administration
in scheme: Fiscalité
notation: REFIP5367

verts budgétaires
type: ConceptReFip
type: Concept
broader: refip-REFIP982
definition: Fascicule édité après le vote de la loi de finances contenant, pour chaque ministère, une analyse détaillée des crédits votés ainsi qu'un certain nombre de documents, notamment les moyens budgétaires en emplois.
in scheme: FINANCES PUBLIQUES
in scheme: Documentation budgétaire
in scheme: Budget
notation: REFIP5369

dotation régionale d'équipement scolaire
type: ConceptReFip
type: Concept
broader: dotation
definition: Dotation destinée à compenser le poids financier des compétences transférées aux régions dans le cadre de la décentralisation, concernant les charges d'investissement des établissements scolaires.
in scheme: FINANCES PUBLIQUES
in scheme: Dépenses publiques
in scheme: Gestion Publique
notation: REFIP5370

contrat de travail à salaire différé (supprimé)
type: ConceptReFip
type: Concept
broader: ZZ
in scheme: FINANCES PUBLIQUES
notation: REFIP5371

régie d'avances
type: ConceptReFip
type: Concept
broader: régie
definition: Service permettant de charger un régisseur d'opérations de dépenses d'une collectivité territoriale ou d'un établissement public local au nom et pour le compte de son comptable public assignataire. Le régisseur d'avances ne peut effectuer que les dépenses prévues par l'acte constitutif de la régie et conformes à la réglementation en vigueur.
in scheme: FINANCES PUBLIQUES
in scheme: Secteur public local
in scheme: Gestion Publique
notation: REFIP5372

Paris
type: ConceptReFip
type: Concept
alternative label: ville de Paris
broader: Ile-de-France
definition: Commune département et capitale de la France
in scheme: FINANCES PUBLIQUES
in scheme: Géographie
in scheme: Europe
notation: REFIP5373

inscription d'un nantissement
type: ConceptReFip
type: Concept
broader: nantissement
definition: Accomplissement des formalités obligatoires prescrites par la loi visant à rendre opposable aux tiers une sûreté mobilière inscrite par un créancier sur un bien meuble incorporel (parts sociales, fonds de commerce par exemple) appartenant à un débiteur.
in scheme: FINANCES PUBLIQUES
in scheme: Recouvrement
in scheme: Fiscalité
notation: REFIP5377

télévision
type: ConceptReFip
type: Concept
alternative label: appareil de télévision
alternative label: télédiffusion
alternative label: téléviseur
broader: média
definition: Ensemble des services et techniques assurant la transmission par câble ou par ondes radioélectriques de programmes audio-visuels pouvant être reproduits sur un écran au fur et à mesure de leur réception.
in scheme: FINANCES PUBLIQUES
in scheme: Communication
in scheme: Communication Documentation Informatique
notation: REFIP5378

rapport de vérification
type: ConceptReFip
type: Concept
broader: documentation fiscale (non-descripteur)
definition: Imprimé n° 3938-A rédigé par le vérificateur à la fin des opérations de contrôle décrivant la procédure engagée, les investigations conduites et ses conclusions.
in scheme: FINANCES PUBLIQUES
in scheme: Documentation Fiscale
in scheme: Fiscalité
notation: REFIP538

intérêt général
type: ConceptReFip
type: Concept
alternative label: intérêt commun
alternative label: intérêt public
broader: droit administratif
definition: Finalité des actions ou des institutions qui intéressent l'ensemble d'une population.
in scheme: FINANCES PUBLIQUES
in scheme: Droit et Justice
in scheme: Divisions du Droit
in scheme: Droit Public
notation: REFIP5380

fonds de solidarité
type: ConceptReFip
type: Concept
broader: établissement public à caractère administratif
definition: Etablissement public national à caractère administratif créé suite à l' institution de la contribution exceptionnelle de solidarité en faveur des travailleurs privés d'emploi. Le Fonds de Solidarité a pour mission de réunir les moyens de financement des allocations qui relèvent du régime de solidarité géré par l'Etat.
in scheme: FINANCES PUBLIQUES
in scheme: Organisation Structurelle de l'Etat
in scheme: Opérateur de l'Etat
in scheme: Administration de L'Etat
notation: REFIP5381

bail emphytéotique
type: ConceptReFip
type: Concept
alternative label: emphytéose
broader: refip-REFIP95
definition: Bail par lequel un propriétaire concède un immeuble pour une durée de 18 à 99 ans, moyennant une redevance annuelle modique appelée "canon emphytéotique" et sous l'obligation de planter ou d'améliorer l'immeuble loué, à un preneur nommé emphytéote qui acquiert le droit réel d'emphytéose.
in scheme: FINANCES PUBLIQUES
in scheme: Droit et Justice
in scheme: Divisions du Droit
in scheme: Droit Privé
narrower: refip-REFIP797
notation: REFIP5382

compte courant postal du Trésor
type: ConceptReFip
type: Concept
alternative label: compte de disponibilités à la banque postale
broader: plan comptable de l'Etat
definition: Compte d'opération permettant de retracer toutes les opérations de trésorerie effectuées par les comptables publics et figurant sur le relevé bancaire.
in scheme: FINANCES PUBLIQUES
in scheme: Documents comptables
in scheme: Comptabilité
notation: REFIP5383

amende fiscale
type: ConceptReFip
type: Concept
broader: sanction fiscale
definition: Sanction fiscale et pécuniaire appliquée par l'administration en vertu de la loi et sous le contrôle des tribunaux et encourue à raison de certaines infractions à la loi fiscale.
in scheme: FINANCES PUBLIQUES
in scheme: Droit de Reprise de l'Administration
in scheme: Fiscalité
notation: REFIP5384

Russie
type: ConceptReFip
type: Concept
broader: Asie
definition: Pays
in scheme: FINANCES PUBLIQUES
in scheme: Géographie
in scheme: Asie
notation: REFIP5385

extraction
type: ConceptReFip
type: Concept
broader: restitution de l'information
definition: Transfert permanent ou temporaire de la totalité ou d'une partie du contenu d'une base de donnée sur un autre support par quelque moyen ou sous quelque forme que ce soit.
in scheme: FINANCES PUBLIQUES
in scheme: Informatique
in scheme: Communication Documentation Informatique
notation: REFIP5386
note: Extraction informatique

carte nationale d'identité
type: ConceptReFip
type: Concept
alternative label: carte d'identité
broader: document administratif
definition: Document officiel qui permet à tout citoyen de justifier de son identité.
in scheme: FINANCES PUBLIQUES
in scheme: Documentation
in scheme: Communication Documentation Informatique
notation: REFIP5387

marge brute d'autofinancement
type: ConceptReFip
type: Concept
alternative label: MBA
alternative label: autofinancement
alternative label: cash-flow
broader: refip-REFIP788
definition: Ratio d'évaluation financière destiné à mettre en évidence l’autonomie financière d’une entreprise au cours d’un exercice comptable. C’est donc la possibilité pour l’entreprise de se financer par ses propres moyens mais avant la distribution des bénéfices.
in scheme: FINANCES PUBLIQUES
in scheme: Analyse financière
in scheme: Comptabilité
notation: REFIP5388

enquête
type: ConceptReFip
type: Concept
alternative label: questionnaire
alternative label: sondage
broader: qualité de service
definition: Technique de recherche d'informations à partir de questions auprès d'un panel d'usagers en vue de connaître leur opinion ou comportement à l'égard d'un problème ou d'un thème particulier.
in scheme: FINANCES PUBLIQUES
in scheme: Missions Transverses des Finances publiques
in scheme: Qualité de service
narrower: enquête de satisfaction
narrower: enquête mystère
notation: REFIP5389

capital libéré (obsolète)
type: ConceptReFip
type: Concept
is replaced by: capital appelé
broader: ZZ
in scheme: FINANCES PUBLIQUES
notation: REFIP539

solidarité au paiement
type: ConceptReFip
type: Concept
alternative label: solidarité de paiement
broader: solidarités diverses et actions patrimoniales (non-descripteur)
definition: Obligation en commun entre débiteurs selon laquelle chacun peut être contraint pour la totalité d'une dette, le paiement fait par un seul libérant les autres.
in scheme: FINANCES PUBLIQUES
in scheme: Recouvrement
in scheme: Fiscalité
narrower: tiers solidaire
narrower: décharge de responsabilité solidaire
notation: REFIP5390
related: refip-REFIP7081

Côtes-d'Armor
type: ConceptReFip
type: Concept
broader: refip-REFIP957
definition: Département français
in scheme: FINANCES PUBLIQUES
in scheme: Géographie
in scheme: Europe
notation: REFIP5391

filiation
type: ConceptReFip
type: Concept
broader: droit civil
definition: Lien juridique entre parents et enfants.
in scheme: FINANCES PUBLIQUES
in scheme: Droit et Justice
in scheme: Divisions du Droit
in scheme: Droit Privé
narrower: droit de garde
notation: REFIP5392

balance comptable
type: ConceptReFip
type: Concept
broader: documents comptables
definition: État établi à partir de l'ensemble de tous les comptes du grand-livre et regroupant tous les totaux en débit et en crédit et tous les soldes débiteurs et créditeurs.
in scheme: FINANCES PUBLIQUES
in scheme: Documents comptables
in scheme: Comptabilité
narrower: balance comptable mensuelle
narrower: balance d'entrée
narrower: balance comptable définitive
notation: REFIP5393

avance au régisseur
type: ConceptReFip
type: Concept
broader: régie
definition: Avance dont le montant est déterminé par l'acte constitutif de la régie et en fonction des besoins réels de celle-ci.
in scheme: FINANCES PUBLIQUES
in scheme: Secteur public local
in scheme: Gestion Publique
notation: REFIP5394

dématérialisation
type: ConceptReFip
type: Concept
broader: documentation
definition: Technique qui supprime le papier au profit de l'électronique.
in scheme: FINANCES PUBLIQUES
in scheme: Documentation
in scheme: Communication Documentation Informatique
notation: REFIP5395
related: formulaire électronique
related: informatique

revenu exceptionnel
type: ConceptReFip
type: Concept
broader: revenu imposable
definition: Revenus non susceptibles d’être recueillis annuellement et exceptionnels dans leur montant (c’est-à-dire excédant la moyenne des revenus imposables au titre des 3 dernières années). Certains revenus limitativement énumérés par la loi sont considérés comme exceptionnels quel que soit leur montant.
in scheme: FINANCES PUBLIQUES
in scheme: Champ d'Application
in scheme: Fiscalité
notation: REFIP5397

disposition transitoire
type: ConceptReFip
type: Concept
broader: droit général (non-descripteur)
definition: Régime juridique temporaire précisant les conditions d'entrée en vigueur de disposition législative, en vue de faciliter la transition et préserver la sécurité juridique.
in scheme: FINANCES PUBLIQUES
in scheme: Droit et Justice
in scheme: Droit Général
notation: REFIP5398

immeuble menaçant ruine
type: ConceptReFip
type: Concept
broader: immeuble
definition: Murs, bâtiments ou édifices qui pourraient par leur effondrement compromettre la sécurité ou lorsque, de manière générale, ils n'offrent pas les garanties de solidité nécessaires à la sécurité publique. Ils font l'objet d'une police administrative spéciale.
in scheme: FINANCES PUBLIQUES
in scheme: Droit et Justice
in scheme: Divisions du Droit
in scheme: Droit Privé
notation: REFIP54

camping
type: ConceptReFip
type: Concept
alternative label: terrain de camping
broader: tourisme
definition: Type d'hébergement touristique en plein air.
in scheme: FINANCES PUBLIQUES
in scheme: Branche d'activité
in scheme: Questions Economiques
in scheme: Tourisme
narrower: caravane
narrower: résidence mobile terrestre
notation: REFIP540

extrait de plan
type: ConceptReFip
type: Concept
broader: extrait cadastral
definition: Copie conforme d'une partie du Plan cadastral délivré par le service du Cadastre.
in scheme: FINANCES PUBLIQUES
in scheme: Cadastre
in scheme: Fiscalité
notation: REFIP5401

faute personnelle
type: ConceptReFip
type: Concept
broader: faute disciplinaire
definition: Faute commise par l'agent en dehors du service. Toutefois, même commise pendant le service, une faute peut être qualifiée de « personnelle » si elle s'avère particulièrement incompatible avec le service public, revêt une particulière gravité ou encore si elle vise la satisfaction d'un intérêt personnel de l'agent
in scheme: FINANCES PUBLIQUES
in scheme: Gestion des ressources humaines
in scheme: Fonction Publique et Gestion des Ressources Humaines
notation: REFIP5402

taxe sur la consommation finale d'électricité
type: ConceptReFip
type: Concept
alternative label: TCFE
alternative label: taxe locale sur l'électricité
broader: autres taxes, droits ou redevances (non-descripteur)
definition: Impôt local prélevé par le fournisseur d'électricité sur la facture au bénéfice des collectivités locales. Remplace la taxe locale sur l'électricité depuis le 1er janvier 2011.
in scheme: FINANCES PUBLIQUES
in scheme: Fiscalité
in scheme: Impôt
notation: REFIP5403
scope note: A compter du 01/01/2011

certificat d'hérédité
type: ConceptReFip
type: Concept
alternative label: certificat d'héritier
broader: droit successoral
definition: Attestation délivrée par le tribunal d’instance ou le maire, au vu de témoignages, aux fins d’établir la qualité d’héritier, hors départements d’Alsace-Moselle. Dans les départements d’Alsace-Moselle, c’est le juge cantonal du lieu d’ouverture de la succession qui établit un certificat d’héritier pour attester de la qualité d’héritier et de la quotité des droits du successible.
in scheme: FINANCES PUBLIQUES
in scheme: Droit et Justice
in scheme: Divisions du Droit
in scheme: Droit Privé
notation: REFIP5404

non-résident Schumacker
type: ConceptReFip
type: Concept
broader: non-résident
definition: Contribuable non-résident mais assimilé à un contribuable domicilié fiscalement en France, bien que tenu à une obligation fiscale limitée, au sens des conventions internationales, sous respect de certaines conditions.
in scheme: FINANCES PUBLIQUES
in scheme: Champ d'Application
in scheme: Fiscalité
notation: REFIP5405

dépôt de garantie
type: ConceptReFip
type: Concept
broader: garanties
definition: Somme d'argent versée par le débiteur pour garantir l'exécution de ses obligations.
in scheme: FINANCES PUBLIQUES
in scheme: Droit et Justice
in scheme: Divisions du Droit
in scheme: Droit Privé
notation: REFIP5406

dépenses d'externalisation
type: ConceptReFip
type: Concept
alternative label: dépenses de sous-traitance
broader: dépenses de l'Etat
definition: Dépenses liées au transfert de tout ou partie d'une fonction d'une organisation (entreprise ou administration) vers un partenaire externe.
in scheme: FINANCES PUBLIQUES
in scheme: Dépenses publiques
in scheme: Gestion Publique
notation: REFIP5407

aide de minimis
type: ConceptReFip
type: Concept
alternative label: règle de minimis
broader: aide aux entreprises
definition: Aide de faible montant accordée à une entreprise par une autorité publique qu'elle qu'elle soit (Etat, collectivité territoriale, établissement public, etc...) sous réserve que cette entreprise respecte les conditions d'attribution prévues par la réglementation
in scheme: FINANCES PUBLIQUES
in scheme: Dépenses publiques
in scheme: Gestion Publique
notation: REFIP5408

prime (non-descripteur)
type: ConceptReFip
type: Concept
broader: aide publique
definition: Terme ne pouvant servir à l'indexation
in scheme: FINANCES PUBLIQUES
in scheme: Dépenses publiques
in scheme: Gestion Publique
narrower: prime de cohésion sociale
narrower: prime à l'arrachage de vignes
narrower: prime à l'amélioration de l'habitat rural
narrower: prime de retour à l'emploi
narrower: refip-REFIP84
notation: REFIP5409
note: Étiquette de nœud

département
type: ConceptReFip
type: Concept
broader: collectivité territoriale
definition: Circonscription administrative de l’État. Le Préfet représente les différentes administrations de l’État au niveau territorial. C’est aussi une collectivité locale autonome avec un organe délibérant et un exécutif élus. Les départements ont des compétences en matière d’action sociale : aide sociale à l’enfance (ASE) ; revenu de solidarité active (RSA) ; allocation personnalisée d’autonomie (APA) ; gestion des services de protection maternelle et infantile (PMI) ; aide aux personnes handicapées avec la création des maisons départementales des personnes handicapées (MDPH) ; mineurs étrangers isolés…
in scheme: FINANCES PUBLIQUES
in scheme: Organisation Territoriale
in scheme: Structures Territoriales
in scheme: Administration de L'Etat
narrower: conseil départemental
narrower: préfecture
notation: REFIP541

champ d'application
type: ConceptReFip
type: Concept
definition: Ensemble des biens, des opérations, des activités ou des situations concernés par une disposition fiscale et détermination des limites dans lesquelles elle s'applique,
in scheme: FINANCES PUBLIQUES
in scheme: Champ d'Application
in scheme: Fiscalité
narrower: fiscalité internationale
narrower: fiscalité du patrimoine
narrower: fiscalité des professionnels
narrower: territorialité de l'impôt
narrower: fiscalité des particuliers
narrower: assiette d'imposition
narrower: base d'imposition
narrower: refip-REFIP7224
notation: REFIP5410

exécution de la dépense (non-descripteur)
type: ConceptReFip
type: Concept
broader: dépenses publiques
definition: Terme ne servant pas à l'indexation.
in scheme: FINANCES PUBLIQUES
in scheme: Dépenses publiques
in scheme: Gestion Publique
narrower: avance de trésorerie
narrower: paiement de la dépense (non-descripteur)
narrower: refip-REFIP996
notation: REFIP5411
note: Étiquette de nœud

paiement de la dépense (non-descripteur)
type: ConceptReFip
type: Concept
broader: exécution de la dépense (non-descripteur)
definition: Terme ne pouvant servir à l'indexation
in scheme: FINANCES PUBLIQUES
in scheme: Dépenses publiques
in scheme: Gestion Publique
narrower: engagement de payer
narrower: délai global de paiement
narrower: convention de règlement
narrower: suspension du délai global de paiement
narrower: pièce budgétaire
narrower: circuit de gestion
narrower: service fait
narrower: paiement sans ordonnancement préalable
narrower: demande de paiement
narrower: refip-REFIP7198
narrower: refip-REFIP7199
notation: REFIP5412
note: Étiquette de nœud

domaine (non-descripteur)
type: ConceptReFip
type: Concept
broader: gestion publique
definition: Terme ne servant pas à l'indexation.
in scheme: FINANCES PUBLIQUES
in scheme: Domaine
in scheme: Gestion Publique
narrower: propriété des personnes publiques
narrower: service livrancier
narrower: évaluation domaniale
notation: REFIP5413
note: Étiquette de nœud

expertise et action économiques et financières
type: ConceptReFip
type: Concept
alternative label: action financière
alternative label: action économique
alternative label: action économique et financière
broader: gestion publique
definition: Actions de la DGFIP à l'échelon inter-régional, régional, et/ou départemental exercées par les MEEF et DEAEF dans les domaines suivants: l'accompagnement des entreprises en difficultés d'une part (veille, accueil et suivi des entreprises en matière de mutations économiques, prévention des difficultés et simplification des démarches); l'accompagnement des particuliers surendettés d'autre part (relations avec les commissions de surendettement); ainsi que l'assistance aux préfets et aux décideurs locaux pour des opérations qui présentent des enjeux économiques ou financiers significatifs.
in scheme: FINANCES PUBLIQUES
in scheme: Gestion Publique
in scheme: Expertise et action économiques et financières
notation: REFIP5414
related: mission d'expertise économique et financière
related: division expertise et actions économiques et financières

division expertise et actions économiques et financières
type: ConceptReFip
type: Concept
replaces: département des études économiques et financières (obsolète)
alternative label: DEAEF
alternative label: DEEF
alternative label: département des études économiques et financières
broader: direction départementale des finances publiques
definition: Structure départementale qui formule des avis sur les demandes d’aides publiques, assiste le Préfet dans la tutelle budgétaire des chambres consulaires et participe à la sécurité économique. Elle est un acteur essentiel dans les dispositifs de prévention et de soutien des entreprises en difficulté (CCSF, CODEFI). Elle apporte également un appui aux particuliers dans le cadre des commissions départementales d’examen du surendettement.
in scheme: FINANCES PUBLIQUES
in scheme: Organisation Structurelle de l'Etat
in scheme: Ministère
in scheme: Administration de L'Etat
notation: REFIP5415
related: mission d'expertise économique et financière
related: expertise et action économiques et financières

contrat et mode de gestion (non-descripteur)
type: ConceptReFip
type: Concept
broader: secteur public local
definition: Terme ne servant pas à l'indexation.
in scheme: FINANCES PUBLIQUES
in scheme: Secteur public local
in scheme: Gestion Publique
narrower: régie
narrower: concession funéraire
narrower: convention de services comptable et financier
narrower: convention de partenariat
notation: REFIP5417
note: Étiquette de nœud

finances locales (non-descripteur)
type: ConceptReFip
type: Concept
broader: secteur public local
definition: Terme ne servant pas à l'indexation.
in scheme: FINANCES PUBLIQUES
in scheme: Secteur public local
in scheme: Gestion Publique
narrower: autonomie financière
narrower: réseau d'alerte
narrower: budget primitif
narrower: budget annexe
narrower: décision modificative
narrower: dépenses du secteur public local
narrower: compte administratif
narrower: fiscalité directe locale
narrower: budget principal
narrower: potentiel fiscal
narrower: transfert restructuration fusion
narrower: refip-REFIP7054
narrower: refip-REFIP936
notation: REFIP5418
note: Étiquette de nœud

documentation fiscale (non-descripteur)
type: ConceptReFip
type: Concept
definition: Terme ne servant pas à l'indexation.
in scheme: FINANCES PUBLIQUES
in scheme: Documentation Fiscale
in scheme: Fiscalité
narrower: documentation hypothécaire
narrower: relevé de condamnation pénale
narrower: déclaration européenne des services
narrower: doctrine administrative
narrower: certificat de situation administrative
narrower: feuille de tête de rôle
narrower: certificat de dégrèvement
narrower: avis d'imposition
narrower: fichier immobilier
narrower: bordereau de situation fiscale
narrower: avis d'enquête
narrower: charte du contribuable
narrower: imprimé fiscal unique
narrower: bulletin de recoupement
narrower: lettre de relance
narrower: bordereau d'inscription
narrower: lettre comminatoire
narrower: rôle d'imposition
narrower: quitus fiscal
narrower: procès-verbal de recherches
narrower: avis de mise en recouvrement
narrower: certificat de non contestation
narrower: avis de vérification
narrower: certificat de résidence
narrower: déclaration d'échanges de biens
narrower: état de poursuites extérieures
narrower: lettre de motivation
narrower: proposition de rectification
narrower: dossier sécurisé
narrower: déclaration des comptes à l'étranger
narrower: fiche de solvabilité
narrower: déclaration des rémunérations versées
narrower: rapport de vérification
narrower: avis de passage
narrower: déclaration sociale nominative
narrower: avis de situation déclarative à l'impôt sur le revenu
narrower: procès-verbal de carence
narrower: refip-REFIP6989
narrower: refip-REFIP7110
narrower: refip-REFIP7137
narrower: refip-REFIP7192
narrower: refip-REFIP7232
narrower: refip-REFIP804
narrower: refip-REFIP88
notation: REFIP5419
scope note: Étiquette de noeud

avis de passage
type: ConceptReFip
type: Concept
broader: documentation fiscale (non-descripteur)
definition: Imprimé n° 3925-SD ou 3925-bis-SD (CERFA n°11870) remis par l'administration au contribuable dès le début des opérations dans le cadre de l'exercice de son droit de communication.
in scheme: FINANCES PUBLIQUES
in scheme: Documentation Fiscale
in scheme: Fiscalité
notation: REFIP542

droit de contrôle de l'administration (non-descripteur)
type: ConceptReFip
type: Concept
definition: Terme ne servant pas à l'indexation.
in scheme: FINANCES PUBLIQUES
in scheme: Droit de Contrôle de l'Administration
in scheme: Fiscalité
narrower: déclaration de soupçon
narrower: établissement stable
narrower: évasion fiscale
narrower: contrôle des entrepôts fiscaux
narrower: droit de communication
narrower: droit d'enquête
narrower: droit de visite et de saisie
narrower: flagrance fiscale
narrower: entreprise éphémère
narrower: fraude fiscale
narrower: demande de justification
narrower: contrôle fiscal
narrower: présomption de revenu
narrower: transfert de bénéfices
narrower: refip-REFIP862
narrower: refip-REFIP870
notation: REFIP5420
scope note: Étiquette de noeud

label
type: ConceptReFip
type: Concept
alternative label: label officiel français
broader: document
definition: Marque se matérialisant par des signes distinctifs (nom, logo,..) qui permet d'indiquer qu'un produit, qu'un lieu remplit les critères enumérés et définis ddans un acte législatif ou réglementaire.
in scheme: FINANCES PUBLIQUES
in scheme: Documentation
in scheme: Communication Documentation Informatique
notation: REFIP5421

norme
type: ConceptReFip
type: Concept
broader: document
definition: Règle à suivre.
in scheme: FINANCES PUBLIQUES
in scheme: Documentation
in scheme: Communication Documentation Informatique
notation: REFIP5422

autres taxes, droits ou redevances (non-descripteur)
type: ConceptReFip
type: Concept
broader: impôt
definition: Terme ne servant pas à l'indexation.
in scheme: FINANCES PUBLIQUES
in scheme: Fiscalité
in scheme: Impôt
narrower: imposition forfaitaire sur les entreprises de réseaux
narrower: taxe de séjour
narrower: taxe sur les installations de production d'énergie éolienne
narrower: taxe générale sur les activités polluantes
narrower: taxe sur la valeur vénale des immeubles possédés en France
narrower: taxe intérieure de consommation sur les produits énergétiques
narrower: taxe parafiscale
narrower: taxe sur les véhicules de sociétés
narrower: droit de stationnement
narrower: taxe sur les surfaces commerciales
narrower: taxe sur la provision pour hausse de prix des entreprises pétrolières
narrower: écotaxe
narrower: taxe sur les huiles végétales destinées à l'alimentation humaine
narrower: taxe intérieure de consommation sur le gaz naturel
narrower: taxe due par les titulaires d'ouvrages hydroélectriques
narrower: imposition forfaitaire annuelle sur les pylônes
narrower: taxe intérieure de consommation sur les houilles les lignites et les cokes
narrower: droit de chancellerie
narrower: taxe sur les conventions d'assurance
narrower: taxe sur la consommation finale d'électricité
narrower: contribution
narrower: refip-REFIP6752
narrower: refip-REFIP7208
narrower: refip-REFIP7210
narrower: refip-REFIP7212
narrower: refip-REFIP7213
narrower: refip-REFIP7217
narrower: refip-REFIP7218
notation: REFIP5423
scope note: Étiquette de noeud

prélèvements et retenues à la source (supprimé)
type: ConceptReFip
type: Concept
broader: ZZ
in scheme: FINANCES PUBLIQUES
notation: REFIP5424

taxes assimilées aux impôts directs locaux (non descripteur)
type: ConceptReFip
type: Concept
broader: impôt
definition: Terme ne pouvant servir à l'indexation
in scheme: FINANCES PUBLIQUES
in scheme: Fiscalité
in scheme: Impôt
narrower: taxe de balayage
narrower: redevance d'enlèvement des ordures ménagères
narrower: participation pour raccordement à l'égout
narrower: taxe annuelle sur les friches commerciales
narrower: taxe pour frais de chambres de métiers et de l'artisanat
narrower: taxe d'enlèvement des ordures ménagères
narrower: taxe spéciale d'équipement
narrower: taxe pour frais de chambres de commerce et d'industrie
narrower: redevance d'assainissement
notation: REFIP5425
scope note: Etiquette de noeud

taxes et participations assises sur les salaires (non-descripteur)
type: ConceptReFip
type: Concept
broader: impôt
definition: Terme ne pouvant servir à l'indexation
in scheme: FINANCES PUBLIQUES
in scheme: Fiscalité
in scheme: Impôt
narrower: participation au développement de la formation professionnelle continue
narrower: taxe sur les salaires
narrower: taxe d'apprentissage
narrower: participation des employeurs à l'effort de construction
narrower: contribution exceptionnelle de solidarité
notation: REFIP5426
scope note: Etiquette de noeud

taxes et redevance de nature immobilière (non-descripteur)
type: ConceptReFip
type: Concept
broader: impôt
definition: Terme ne pouvant servir à l'indexation
in scheme: FINANCES PUBLIQUES
in scheme: Fiscalité
in scheme: Impôt
narrower: taxe d'aménagement
narrower: taxe forfaitaire sur les cessions de terrains nus devenus constructibles
narrower: redevance d'archéologie préventive
narrower: taxe locale d'équipement
narrower: taxe annuelle sur les locaux à usage de bureaux les locaux commerciaux et les locaux de stockage
narrower: refip-REFIP980
notation: REFIP5427
scope note: Etiquette de noeud

crédit d'impôt pour la transition énergétique
type: ConceptReFip
type: Concept
broader: refip-REFIP849
definition: Dispositif accordé au titre des dépenses d’équipements en faveur de la transition énergétique supportées par les contribuables dans leur habitation principale, qu’ils en soient propriétaires, locataires ou occupants à titre gratuit.Le local dans lequel les travaux d'installation ou de remplacement des équipements, matériaux et appareils éligibles sont effectués, doit être situé en France, affecté à l'habitation principale du contribuable et achevé depuis plus de deux ans à la date de début d'exécution des travaux.
in scheme: FINANCES PUBLIQUES
in scheme: Liquidation de l'Impôt
in scheme: Fiscalité
notation: REFIP5428
scope note: Remplace le crédit d'impôt en faveur du développement durable à compter de septembre 2014

solidarités diverses et actions patrimoniales (non-descripteur)
type: ConceptReFip
type: Concept
broader: recouvrement
definition: Terme ne pouvant servir à l'indexation
in scheme: FINANCES PUBLIQUES
in scheme: Recouvrement
in scheme: Fiscalité
narrower: action oblique
narrower: action paulienne
narrower: action en déclaration de simulation
narrower: solidarité au paiement
narrower: refip-REFIP6996
notation: REFIP5429
scope note: Etiquette de noeud

droit général (non-descripteur)
type: ConceptReFip
type: Concept
definition: Terme ne servant pas à l'indexation.
in scheme: FINANCES PUBLIQUES
in scheme: Droit et Justice
in scheme: Droit Général
narrower: erreur matérielle
narrower: erreur de droit
narrower: illégalité
narrower: agrément
narrower: territorialité
narrower: prescription
narrower: quorum
narrower: nullité
narrower: rétroactivité
narrower: sécurité juridique
narrower: dérogation
narrower: extinction
narrower: dissolution
narrower: imprescriptibilité
narrower: abrogation
narrower: personnalité morale
narrower: accréditation
narrower: légalité
narrower: conformité
narrower: opposabilité
narrower: réglementation
narrower: caractère exécutoire
narrower: prorogation
narrower: disposition transitoire
narrower: refip-REFIP7029
narrower: refip-REFIP758
notation: REFIP5430

infractions et sanctions (non-descripteur)
type: ConceptReFip
type: Concept
definition: Terme ne servant pas à l'indexation.
in scheme: FINANCES PUBLIQUES
in scheme: Droit et Justice
in scheme: Infractions et Sanctions
narrower: sanction
narrower: refip-REFIP660
notation: REFIP5431
scope note: Etiquette de noeud

organisation juridictionnelle (non-descripteur)
type: ConceptReFip
type: Concept
definition: Terme ne pouvant servir à l'indexation
in scheme: FINANCES PUBLIQUES
in scheme: Droit et Justice
in scheme: Organisation Juridictionnelle
narrower: conflit de juridictions
narrower: juridiction
narrower: carte judiciaire
narrower: profession juridique (non-descripteur)
notation: REFIP5432
scope note: Etiquette de noeud

profession juridique (non-descripteur)
type: ConceptReFip
type: Concept
broader: organisation juridictionnelle (non-descripteur)
definition: Terme ne pouvant servir à l'indexation
in scheme: FINANCES PUBLIQUES
in scheme: Profession Juridique
in scheme: Droit et Justice
in scheme: Organisation Juridictionnelle
narrower: clerc de notaire
narrower: charges et offices
narrower: conseil juridique
narrower: commissaire enquêteur
narrower: commissaire aux comptes
narrower: magistrature
narrower: refip-REFIP677
notation: REFIP5433
scope note: Etiquette de noeud

principes généraux (non-descripteur)
type: ConceptReFip
type: Concept
broader: procédure
definition: Terme ne pouvant servir à l'indexation
in scheme: FINANCES PUBLIQUES
in scheme: Principes Généraux
in scheme: Droit et Justice
in scheme: Procédure
narrower: compétence d'attribution
narrower: capacité pour agir
narrower: procédure contentieuse
narrower: aide juridictionnelle
narrower: requête
narrower: charge de la preuve
narrower: notification
narrower: signification d'acte
narrower: audience publique
narrower: dessaisissement
narrower: principe du contradictoire
narrower: procuration
narrower: frais de justice
narrower: contrôle d'identité
narrower: scellés
narrower: représentation en justice
narrower: action en justice
narrower: référé
narrower: forclusion
narrower: voie de recours
narrower: injonction
narrower: recevabilité
narrower: décision de justice
narrower: mesure d'accompagnement judiciaire
narrower: procès-verbal
narrower: mise en cause
narrower: compétence exclusive
narrower: commission rogatoire
narrower: compétence territoriale
narrower: effet suspensif
narrower: contestation
narrower: refip-REFIP806
notation: REFIP5434
scope note: Etiquette de noeud

sources du droit (non-descripteur)
type: ConceptReFip
type: Concept
definition: Terme ne pouvant servir à l'indexation
in scheme: FINANCES PUBLIQUES
in scheme: Droit et Justice
in scheme: Sources du Droit
narrower: documentation juridique (non-descripteur)
narrower: sources des droits subjectifs (non-descripteur)
narrower: sources du droit objectif (non-descripteur)
notation: REFIP5438
scope note: Etiquette de noeud

documentation juridique (non-descripteur)
type: ConceptReFip
type: Concept
broader: sources du droit (non-descripteur)
definition: Terme ne servant pas à l'indexation.
in scheme: FINANCES PUBLIQUES
in scheme: Droit et Justice
in scheme: Documentation Juridique
in scheme: Sources du Droit
narrower: Code du domaine de l'Etat
narrower: Code de l'action sociale et des familles
narrower: Code des postes et communications électroniques
narrower: Code de l'expropriation pour cause d'utilité publique
narrower: Code de l'urbanisme
narrower: Code général de la propriété des personnes publiques
narrower: Code de la sécurité sociale
narrower: Code des pensions civiles et militaires
narrower: Code de la route
narrower: Code des tribunaux administratifs et des cours administratives d'appel
narrower: Code de justice administrative
narrower: Code général des collectivités territoriales
narrower: Code des communes
narrower: Code des pensions militaires d'invalidité et des victimes de la guerre
narrower: Code de l'environnement
narrower: Code de la voirie routière
narrower: Code pénal
narrower: Code de l'entrée et du séjour des étrangers et du droit d'asile
narrower: Code de commerce
narrower: Code du travail
narrower: Code rural et de la pêche maritime
narrower: Code de la construction et de l'habitation
narrower: Code de la consommation
narrower: Code civil
narrower: Code électoral
narrower: livre des procédures fiscales
narrower: Code général des impôts
narrower: Code de procédure pénale
narrower: Code de procédure civile
narrower: Code de la santé publique
narrower: Code de procédure fiscale
narrower: refip-REFIP929
narrower: refip-REFIP945
notation: REFIP5439
scope note: Étiquette de noeud

application AGLAE
type: ConceptReFip
type: Concept
alternative label: AGLAE
broader: applications gestion publique (non-descripteur)
definition: Annuaire Général des collectivités Locales et Autres Établissements locaux.
in scheme: FINANCES PUBLIQUES
in scheme: Applications Informatiques
in scheme: Applications gestion publique
notation: REFIP544

sources des droits subjectifs (non-descripteur)
type: ConceptReFip
type: Concept
broader: sources du droit (non-descripteur)
definition: Terme ne pouvant servir à l'indexation
in scheme: FINANCES PUBLIQUES
in scheme: Droit et Justice
in scheme: Sources du Droit
in scheme: Sources des Droits Subjectifs
narrower: acte constitutif
narrower: acte spécial
narrower: acte sous seing privé
narrower: acte innommé
narrower: acte authentique
narrower: acte ampliatif
notation: REFIP5440
scope note: Etiquette de noeud

sources du droit objectif (non-descripteur)
type: ConceptReFip
type: Concept
broader: sources du droit (non-descripteur)
definition: Terme ne pouvant servir à l'indexation
in scheme: FINANCES PUBLIQUES
in scheme: Droit et Justice
in scheme: Sources du Droit
in scheme: Sources du Droit Objectif
narrower: jurisprudence
narrower: législation
notation: REFIP5441
scope note: Etiquette de noeud

applications fiscales (non-descripteur)
type: ConceptReFip
type: Concept
definition: Terme ne servant pas à l'indexation
in scheme: FINANCES PUBLIQUES
in scheme: Applications Informatiques
in scheme: Applications fiscales
narrower: application REBECA
narrower: application AMD
narrower: application REC
narrower: application ALPAGE
narrower: application SGDS
narrower: application GOELAND
narrower: application ESAR
narrower: application TSE
narrower: application OASIS
narrower: application AGRI VITI
narrower: application MICROTHEQUE
narrower: application RIALTO
narrower: application MOOREA
narrower: application EDITION-ROLETH
narrower: application REQUETES foncières
narrower: application BDRP
narrower: application TOPAD
narrower: application COROL
narrower: application MIRIAM
narrower: application MEDOC
narrower: application HYPOSCAN
narrower: application SIRHIUS-REC
narrower: application AFFICHAGE DES REMISES D'AVIS
narrower: application MAJIC-CONTENTIEUX
narrower: application RAR
narrower: application AIDA
narrower: application MIRE
narrower: application ANCRAGES
narrower: application GESPRO
narrower: application TP CDA
narrower: application ICAM
narrower: application TOPAD2
narrower: amendes.gouv
narrower: application BNDP
narrower: application SCOUP
narrower: service de consultation du plan cadastral
narrower: application THEMIS
narrower: application PORTAIL
narrower: application SATELIT
narrower: application RSP
narrower: application RTA
narrower: application REP
narrower: application DDPAC
narrower: application SPI
narrower: application BODACC
narrower: application FIDJI
narrower: serveur professionnel des données cadastrales
narrower: application SIV
narrower: application GOLD
narrower: application ISTP
narrower: application STEFFI
narrower: application TELE-TD
narrower: application ERICA
narrower: application RTU
narrower: application BASE IMAGE AUTONOME
narrower: application FLR
narrower: application COGNOS
narrower: application BACO
narrower: programme COPERNIC
narrower: application BNTP
narrower: application VIDOC
narrower: application VISUDGFIP MULTICRITERE
narrower: application ILIAD
narrower: application MINOS
narrower: application ARCHIPEL
narrower: application GESCO
narrower: application SIT
narrower: application OPALE
narrower: application CFIR
narrower: application TIPI
narrower: application CERA
narrower: application ECUME
narrower: application FI3S
narrower: application VISUDGFIP CADASTRE

applications gestion publique (non-descripteur)
type: ConceptReFip
type: Concept
definition: Terme ne servant pas à l'indexation
in scheme: FINANCES PUBLIQUES
in scheme: Applications Informatiques
in scheme: Applications gestion publique
narrower: application CHORUS
narrower: application TCC
narrower: application VIR
narrower: application SAFRAN
narrower: application DVF
narrower: application PLATINE
narrower: application SAM WEB
narrower: application CAISSE
narrower: application CLARA
narrower: application VENDOM
narrower: application ACROPOLE
narrower: application CEP
narrower: application EVCLI
narrower: application CORIOLIS
narrower: application ECHO
narrower: application OSC
narrower: application CATLOC
narrower: application SCG
narrower: application DFT-NET
narrower: application ACCORD
narrower: application OSTENDE
narrower: application WINCIP
narrower: application ARAMIS
narrower: application ORCHIDEE
narrower: application UTAH
narrower: application SAFI
narrower: application GIDE INTRANET
narrower: application DELPHES
narrower: application CCI
narrower: application HELIOS
narrower: application ACL
narrower: application PUBLIDOM
narrower: application CISIS
narrower: application COLBERT
narrower: application ARCADE
narrower: application SCR3
narrower: application OHIO
narrower: application LIDO
narrower: application FDL
narrower: application TBFEPS
narrower: application VENDOM+
narrower: application HTR
narrower: application SIFT
narrower: application AGATHE
narrower: application ACTES
narrower: application GESVI
narrower: application ASTER
narrower: application RCT
narrower: application DEMAT
narrower: application SCORE
narrower: application DVP
narrower: application VFP
narrower: application CORINTHE
narrower: application CADRAN
narrower: application CDG-D
narrower: application ONTARIO
narrower: application DDR3
narrower: application ALTAIR
narrower: application ANGELIS
narrower: application CGL
narrower: application CENTRALISATION DES IMAGES CHEQUES
narrower: application REP-EPS
narrower: application PSAR
narrower: application CIRCL
narrower: application FIDELIO
narrower: application IRMA
narrower: application OREGHON
narrower: application CCL
narrower: application COMPAS
narrower: application AGLAE
narrower: application CDU WEB
narrower: application HERA
narrower: application CHORUS FORMULAIRES
narrower: refip-REFIP6548

applications missions transverses (non-descripteur)
type: ConceptReFip
type: Concept
definition: Terme ne servant pas à l'indexation.
in scheme: FINANCES PUBLIQUES
in scheme: Applications missions transverses
in scheme: Applications Informatiques
narrower: application AGORA DECISIONNEL
narrower: application STATISTIQUES FICOBA
narrower: application INDIA REMUNERATIONS
narrower: application POLARIS
narrower: application FLORE
narrower: application NOMINOE
narrower: outil de suivi des fluides
narrower: application ETR
narrower: application ESCALE
narrower: application AGORA
narrower: application PAY
narrower: infocentre atlas
narrower: application APTERA
narrower: portail de la gestion publique
narrower: application de gestion des imprimés
narrower: application XEMELIOS
narrower: application LORCA
narrower: application ACANTHE
narrower: application CIR
narrower: application EDEN
narrower: application ANTILOPE
narrower: application BAHIA
narrower: application GAP
narrower: application ASIA
narrower: application BORIS
narrower: application OPERA CDG
narrower: application DUERPAP
narrower: application EDEN-RH
narrower: application OSIRIS
narrower: application AGIR
narrower: application NAUSICAA
narrower: application MADRHAS
narrower: application VENTILRECETTE
narrower: application SIRHIUS
narrower: Projet paysage
narrower: application MODR
narrower: portail CHORUS PRO
narrower: application LAER
narrower: WIFIP
narrower: application ISA
narrower: application OSCAR
narrower: application SYGMAFIP
narrower: application SYMPA
narrower: application SERVICE DE CONSULTATION DES TRACES
narrower: refip-REFIP7011
narrower: refip-REFIP7069
narrower: refip-REFIP7071
narrower: refip-REFIP7103
narrower: refip-REFIP7126
narrower: refip-REFIP7134
narrower: refip-REFIP7143
narrower: refip-REFIP7146
narrower: refip-REFIP7147
narrower: refip-REFIP7162
narrower: refip-REFIP7163
narrower: refip-REFIP7164
narrower: refip-REFIP7168
narrower: refip-REFIP7170
narrower: refip-REFIP7182
narrower: refip-REFIP7190
narrower: refip-REFIP7206
narrower: refip-REFIP7233
narrower: refip-REFIP7234
narrower: refip-REFIP765
narrower: refip-REFIP899
narrower: refip-REFIP992
notation: REFIP5444
scope note: Étiquette de noeud

SNCF réseau
type: ConceptReFip
type: Concept
alternative label: RFF
alternative label: réseau ferré de France
broader: société nationale des chemins de fer français
definition: Etablissement public à caractère industriel et commercial (EPIC), gestionnaire du réseau ferroviaire français.
in scheme: FINANCES PUBLIQUES
in scheme: Organisation Structurelle de l'Etat
in scheme: Opérateur de l'Etat
in scheme: Administration de L'Etat
notation: REFIP5445

cheval de course
type: ConceptReFip
type: Concept
broader: cheval
definition: Cheval effectuant des courses hippiques de vitesse.
in scheme: FINANCES PUBLIQUES
in scheme: Branche d'activité
in scheme: Questions Economiques
in scheme: Agriculture
notation: REFIP5446

Commissariat général à l'égalité des territoires
type: ConceptReFip
type: Concept
alternative label: ACSE
alternative label: Agence nationale pour la cohésion sociale et l'égalité des chances
alternative label: CGET
alternative label: DATAR
alternative label: délégation interministérielle à l'aménagement du territoire et à l'attractivité régionale
broader: structure rattachée au Premier Ministre (non-descripteur)
definition: Etablissement public administratif placé sous tutelle du Premier ministre français, il conseille et appuie le Gouvernement dans la conception et la mise en œuvre des politiques de lutte contre les inégalités territoriales et le développement des capacités des territoires. Il assure le suivi et la coordination interministérielle de ces politiques.
in scheme: FINANCES PUBLIQUES
in scheme: Organisation Structurelle de l'Etat
in scheme: Ministère
in scheme: Administration de L'Etat
notation: REFIP5447

viticulture
type: ConceptReFip
type: Concept
alternative label: viticulteur
broader: agriculture
definition: Activité agricole consistant à travailler la vigne afin de produire du vin.
in scheme: FINANCES PUBLIQUES
in scheme: Branche d'activité
in scheme: Questions Economiques
in scheme: Agriculture
narrower: vigne
notation: REFIP5448

Autorité des normes comptables
type: ConceptReFip
type: Concept
alternative label: Conseil national de la comptabilité
broader: Ministère de l'Economie et des Finances
definition: Organisme consultatif placé auprès du ministre de l'économie, il a pour mission d'émettre des avis et recommandations sur toutes les dispositions d'ordre comptable, concernant l'ensemble des secteurs économiques, qu'elles soient d'origine nationale ou communautaire.
in scheme: FINANCES PUBLIQUES
in scheme: Organisation Structurelle de l'Etat
in scheme: Ministère
in scheme: Administration de L'Etat
notation: REFIP5449

Europe
type: ConceptReFip
type: Concept
definition: Continent
in scheme: FINANCES PUBLIQUES
in scheme: Géographie
in scheme: Europe
narrower: Serbie
narrower: Belgique
narrower: Moldavie
narrower: Bosnie-Herzégovine
narrower: Royaume-Uni
narrower: Portugal
narrower: Ukraine
narrower: Hongrie
narrower: Norvège
narrower: Lettonie
narrower: Pays-Bas
narrower: Principauté d'Andorre
narrower: Italie
narrower: Espagne
narrower: Autriche
narrower: Lituanie
narrower: Monaco
narrower: Finlande
narrower: Slovénie
narrower: Luxembourg
narrower: République Tchèque
narrower: Albanie
narrower: Danemark
narrower: Principauté du Liechtenstein
narrower: Allemagne
narrower: Roumanie
narrower: Bulgarie
narrower: Slovaquie
narrower: Suède
narrower: Croatie
narrower: Irlande
narrower: Grèce
narrower: Malte
narrower: Suisse
narrower: refip-REFIP723
narrower: refip-REFIP741
narrower: refip-REFIP886
narrower: refip-REFIP949
notation: REFIP545

animation
type: ConceptReFip
type: Concept
alternative label: animation de groupe
broader: pilotage
definition: Méthode de conduite visant à faciliter la production des membres d'un groupe en vue d'atteindre un ou plusieurs objectifs de travail.
in scheme: FINANCES PUBLIQUES
in scheme: Missions Transverses des Finances publiques
in scheme: Pilotage
notation: REFIP5450
note: Pilotage

services et professions libérales (non-descripteur)
type: ConceptReFip
type: Concept
broader: branche d'activité
definition: Terme ne pouvant servir à l'indexation
in scheme: FINANCES PUBLIQUES
in scheme: Branche d'activité
in scheme: Questions Economiques
in scheme: Services et professions libérales
narrower: gardiennage
narrower: bureau d'étude
narrower: immobilier
narrower: activité libérale
narrower: abonnement
narrower: assistant familial
notation: REFIP5451
scope note: Etiquette de noeud

travail (non-descripteur)
type: ConceptReFip
type: Concept
definition: Terme ne pouvant servir à l'indexation
in scheme: FINANCES PUBLIQUES
in scheme: Entreprises
in scheme: Travail
narrower: contrat de travail
narrower: lieu de travail
narrower: refip-REFIP6950
notation: REFIP5452
scope note: Etiquette de noeud

économie générale (non-descripteur)
type: ConceptReFip
type: Concept
definition: Terme ne servant pas à l'indexation.
in scheme: FINANCES PUBLIQUES
in scheme: Questions Economiques
in scheme: Economie générale
narrower: exportation
narrower: importation
narrower: indice national du coût de la construction
narrower: privatisation
narrower: indice des fermages
narrower: indice des loyers des activités tertiaires
narrower: tarification
narrower: intervention économique
narrower: consommation
narrower: conjoncture économique
narrower: concurrence
narrower: développement économique et social
narrower: monopole
narrower: inflation
narrower: indice de revalorisation
narrower: nationalisation
narrower: économie souterraine
narrower: refip-REFIP7077
narrower: refip-REFIP7118
notation: REFIP5454
scope note: Étiquette de noeud

nationalisation
type: ConceptReFip
type: Concept
broader: économie générale (non-descripteur)
definition: Opération de transfert à la collectivité nationale des moyens de production privés. La nationalisation d'une entreprise consiste pour un Etat à entrer dans le capital de celle-ci à plus de 50% afin d'en prendre le contrôle direct.
in scheme: FINANCES PUBLIQUES
in scheme: Questions Economiques
in scheme: Economie générale
notation: REFIP5455

Cap numérique
type: ConceptReFip
type: Concept
alternative label: CAP NUM
broader: service à compétence nationale
definition: Service à compétence nationale constituant la maitrise d'ouvrage au service de la stratégie numérique de la DGFIP. Son périmètre de compétences est ouvert à l'ensemble des métiers de la DGFIP.
in scheme: FINANCES PUBLIQUES
in scheme: Organisation Structurelle de l'Etat
in scheme: Ministère
in scheme: Administration de L'Etat
narrower: France Connect
notation: REFIP5456

Direction spécialisée des finances publiques pour l'étranger
type: ConceptReFip
type: Concept
alternative label: DSFIPE
broader: refip-REFIP895
definition: Direction spécialisée assurant des missions particulières relatives au recouvrement des recettes publiques, au paiement des dépenses publiques, à la gestion de la trésorerie ainsi qu'à la gestion financière et comptable des services de l’État représentés à l'étranger, définies par décret.
in scheme: FINANCES PUBLIQUES
in scheme: Organisation Structurelle de l'Etat
in scheme: Ministère
in scheme: Administration de L'Etat
notation: REFIP5457
scope note: Remplace la Trésorerie Générale pour l'étranger à compter de 2015

open data
type: ConceptReFip
type: Concept
alternative label: donnée ouverte
broader: numérique
definition: Mise à disposition de données numériques, d’origine publique ou privée, libres d’accès et réutilisables par tous.
in scheme: FINANCES PUBLIQUES
in scheme: Communication
in scheme: Communication Documentation Informatique
narrower: donnée publique
notation: REFIP5458
related: service public
related: traitement de l'information

donnée publique
type: ConceptReFip
type: Concept
broader: open data
definition: Information produite ou détenue par les administrations, dans le cadre de leurs missions de service public et qui est publiée ou tenue à disposition du public.
in scheme: FINANCES PUBLIQUES
in scheme: Communication
in scheme: Communication Documentation Informatique
notation: REFIP5459

Direction générale des collectivités locales
type: ConceptReFip
type: Concept
alternative label: DGCL
broader: Ministère de l'Intérieur
definition: La Direction générale relève de l’autorité conjointe du ministre de l'Intérieur et du ministre de l'Aménagement du territoire, de la ruralité et des collectivités territoriales. Sa mission est d’être au sein de l’État, l’interlocuteur privilégié des collectivités territoriales. La DGCL est notamment chargée d’élaborer l’ensemble des dispositions concernant les collectivités territoriales, de répartir les concours financiers de l’État entre ces collectivités, de mettre en place les statuts des acteurs locaux (élus et personnels). Elle est également chargée de diffuser des études et des informations statistiques sur les collectivités et assure également le fonctionnement et le secrétariat de nombreuses instances telles que le Comité des finances locales ou la Commission consultative d’évaluation des normes.
in scheme: FINANCES PUBLIQUES
in scheme: Organisation Structurelle de l'Etat
in scheme: Ministère
in scheme: Administration de L'Etat
narrower: comité des finances locales
notation: REFIP5460

mission nationale de contrôle et d'audit des organismes de sécurité sociale (supprimé)
type: ConceptReFip
type: Concept
broader: ZZ
in scheme: FINANCES PUBLIQUES
notation: REFIP5461

Institut de formation en soins infirmiers (supprimé)
type: ConceptReFip
type: Concept
broader: ZZ
in scheme: FINANCES PUBLIQUES
notation: REFIP5462

système bancaire et financier (non-descripteur)
type: ConceptReFip
type: Concept
broader: refip-REFIP79
definition: Terme ne pouvant servir à l'indexation
in scheme: FINANCES PUBLIQUES
in scheme: Systeme bancaire et financier
in scheme: Finance
narrower: établissement de crédit
narrower: marché financier
narrower: refip-REFIP6569
narrower: refip-REFIP6835
notation: REFIP5463

groupe de travail
type: ConceptReFip
type: Concept
broader: pilotage
definition: Groupe d’individus (internes ou externes à la structure), choisis pour leur fonction ou leur compétence technique, réunis afin de mener à bien un projet, dans un délai imparti, avec des moyens spécifiques.
in scheme: FINANCES PUBLIQUES
in scheme: Missions Transverses des Finances publiques
in scheme: Pilotage
narrower: groupe d'expression métier
notation: REFIP5465

dispositif d'investissement locatif Scellier
type: ConceptReFip
type: Concept
alternative label: dispositif Scellier
broader: avantage fiscal
definition: Mesure législative mise en place par la loi de finances rectificative pour 2008 afin de soutenir l'investissement locatif privé. Ce dispositif a pris fin le 31/12/2012 et a été remplacé par le dispositif de la loi Duflot, lui même remplacé à compter de septembre 2014 par le dispositif de la loi Pinel. Le dispositif Scellier prévoit une réduction d'impôt pour les contribuables domiciliés en France qui acquièrent ou font construire un logement neuf entre le 01/01/2009 et le 31/12/2012 dans certaines zones du territoire, à condition qu'ils s'engagent à le louer nu, à usage d'habitation principale pendant une durée minimale de 9 ans. Il s'applique également pour ceux qui souscrivent entre le 01/01/2009 et le 31/12/2012 des parts de SCPI réalisant les mêmes investissements.
in scheme: FINANCES PUBLIQUES
in scheme: Liquidation de l'Impôt
in scheme: Fiscalité
notation: REFIP5468
related: investissement locatif
scope note: Remplacé le 31/12/2012 par le dispositif Duflot

dispositif d'investissement locatif Duflot
type: ConceptReFip
type: Concept
alternative label: dispositif Duflot
alternative label: loi Duflot
broader: avantage fiscal
definition: Dispositif d'investissement locatif dans le secteur intermédiaire. Il est remplacé à compter du 1er septembre 2014 par le dispositif de la loi Pinel. Il concerne les contribuables français qui acquièrent, entre le 01/01/2014 et le 31/12/2016, un logement neuf (destiné à la location) ou en l'état futur d'achèvement. Ces contribuables bénéficient d'une réduction d'impôt sur le revenu de 18% répartie sur une durée de 9 ans.
in scheme: FINANCES PUBLIQUES
in scheme: Liquidation de l'Impôt
in scheme: Fiscalité
notation: REFIP5469
related: investissement locatif
scope note: Remplacé le 01/09/2014 par le dispositif Pinel

travaux d'amélioration
type: ConceptReFip
type: Concept
broader: rénovation de bâtiments
definition: Travaux ayant pour objet d'apporter à un immeuble, un équipement ou un élément de confort nouveau ou mieux adapté aux conditions modernes de vie, sans modifier cependant la structure de cet immeuble.
in scheme: FINANCES PUBLIQUES
in scheme: Branche d'activité
in scheme: Questions Economiques
in scheme: Construction
notation: REFIP547

dispositif d'investissement locatif Pinel
type: ConceptReFip
type: Concept
alternative label: dispositif Pinel
alternative label: loi Pinel
broader: avantage fiscal
definition: Dispositif d'investissement locatif dans le secteur intermédiaire. Il remplace le dispositif Duflot à compter du 1er septembre 2014 avec certaines modifications : l'engagement de location initial peut être de 6 ou de 9 ans, le taux de la réduction d'impôt est fixé à 12% (6 ans) et 18% (9 ans) pour les investissements réalisés en France et 23% et 29% pour ceux réalisés outre-mer. L'engagement de location initial peut être prolongé par période de 3 ans pour un maximum de 12 ans. Pour les investissements réalisés à compter du 1er janvier 2015, le logement peut être donné en location à un ascendant ou un descendant de l'investisseur.
in scheme: FINANCES PUBLIQUES
in scheme: Liquidation de l'Impôt
in scheme: Fiscalité
notation: REFIP5470
related: investissement locatif
scope note: Remplace le dispositif Duflot à compter du 01/09/2014

Ecole des hautes études en santé publique (supprimé)
type: ConceptReFip
type: Concept
broader: ZZ
in scheme: FINANCES PUBLIQUES
notation: REFIP5471

GDF Suez
type: ConceptReFip
type: Concept
alternative label: Engie
alternative label: GDF
alternative label: Gaz de France
broader: organisme privé assurant service public (non-descripteur)
definition: Groupe industriel énergétique français ayant pour nom commercial et dénomination sociale ENGIE.
in scheme: FINANCES PUBLIQUES
in scheme: Organisation Structurelle de l'Etat
in scheme: Organisme Privé Assurant Service Public
in scheme: Administration de L'Etat
notation: REFIP5472

Caisse nationale du régime social des indépendants
type: ConceptReFip
type: Concept
alternative label: CNRSI
alternative label: Caisse nationale d'assurance maladie et maternité des travailleurs non salariés des professions non agricoles
broader: organisme de sécurité sociale
definition: Organisme de droit privé exerçant une mission de service public et doté de personnalité morale et d'autonomie financière, la caisse de Sécurité sociale a pour mission d'assurer la protection sociale obligatoire des travailleurs indépendants, artisans, industriels et commerçants et professions libérales.
in scheme: FINANCES PUBLIQUES
in scheme: Organisation Structurelle de l'Etat
in scheme: Organisme de Sécurité Sociale
in scheme: Administration de L'Etat
notation: REFIP5473

conseiller départemental
type: ConceptReFip
type: Concept
alternative label: conseiller général
broader: élu local
definition: Personne élue au suffrage universel direct pour faire partie d'un conseil départemental. Il est élu dans le cadre du canton pour un mandat de six ans. Le président du conseil départemental est l’organe exécutif du département. Il est assisté d’une commission permanente au sein de laquelle sont élus les vice-présidents. En tant qu’organe exécutif, le président du conseil départemental prépare et exécute les délibérations du conseil. Il est l’ordonnateur des dépenses du département et prescrit l’exécution des recettes. Chaque année, il rend compte au conseil de la situation du département.
in scheme: FINANCES PUBLIQUES
in scheme: Organisation Territoriale
in scheme: Administration de L'Etat
in scheme: 212106
notation: REFIP5474

conseil départemental
type: ConceptReFip
type: Concept
alternative label: Conseil général
broader: département
definition: Assemblée délibérante du département en tant que collectivité territoriale, formée par la réunion des conseillers départementaux (ex-conseillers généraux). Il règle par ses délibérations les affaires du département dans les domaines de compétences que la loi lui attribue, la clause de compétence générale ne concernant plus le département depuis la loi NOTRe d’août 2015.
in scheme: FINANCES PUBLIQUES
in scheme: Organisation Territoriale
in scheme: Structures Territoriales
in scheme: Administration de L'Etat
notation: REFIP5475

accueil collectif de mineurs
type: ConceptReFip
type: Concept
alternative label: centre aéré
alternative label: centre de loisirs
alternative label: centre de vacances
alternative label: colonie de vacances
broader: établissement public communal
definition: Structure accueillant des mineurs avec ou sans hébergement durant le temps de leurs vacances ou de leurs loisirs.
in scheme: FINANCES PUBLIQUES
in scheme: Organisation Territoriale
in scheme: Structures Territoriales
in scheme: Administration de L'Etat
notation: REFIP5476

centre hospitalier universitaire
type: ConceptReFip
type: Concept
alternative label: CHU
broader: centre hospitalier régional
definition: Etablissement public de santé régional ayant passé une convention avec une unité de formation et de recherche (UFR) médicale au sein d'une ou plusieurs universités.
in scheme: FINANCES PUBLIQUES
in scheme: Organisation Territoriale
in scheme: Structures Territoriales
in scheme: Administration de L'Etat
notation: REFIP5477

organisation structurelle de l'Etat (non-descripteur)
type: ConceptReFip
type: Concept
definition: Terme ne pouvant servir à l'indexation
in scheme: FINANCES PUBLIQUES
in scheme: Organisation Structurelle de l'Etat
in scheme: Administration de L'Etat
narrower: organisme de sécurité sociale
narrower: organisme en charge du logement social
narrower: opérateur de l'Etat
narrower: ministère
narrower: autorité administrative
narrower: entreprise publique
narrower: pouvoirs publics
narrower: institutions (non-descripteur)
narrower: organisme consultatif et représentatif (non-descripteur)
narrower: organisme privé assurant service public (non-descripteur)
notation: REFIP5478
scope note: Etiquette de noeud

assujettissement
type: ConceptReFip
type: Concept
broader: fiscalité des professionnels
definition: Opération qui consiste à soumettre une personne physique ou morale à l'impôt. Terme plus particulièrement utilisé pour les taxes sur le chiffre d'affaires dont la TVA et les droits indirects.
in scheme: FINANCES PUBLIQUES
in scheme: Champ d'Application
in scheme: Fiscalité
narrower: assujetti
narrower: refip-REFIP7237
notation: REFIP548

BPIFRANCE
type: ConceptReFip
type: Concept
alternative label: Banque publique d'investissement
broader: établissement public à caractère industriel et commercial
definition: Banque publique d’investissement qui accompagne les entreprises françaises en offrant des solutions de financement pour soutenir leurs projets (création, développement par l'innovation, conquête de nouveaux marchés en France ou à l'international, investissement en fonds propres, reprise ou croissance externe, etc.).
in scheme: FINANCES PUBLIQUES
in scheme: Organisation Structurelle de l'Etat
in scheme: Opérateur de l'Etat
in scheme: Administration de L'Etat
narrower: OSEO
notation: REFIP5483

institutions (non-descripteur)
type: ConceptReFip
type: Concept
broader: organisation structurelle de l'Etat (non-descripteur)
definition: Terme ne servant pas à l'indexation.
in scheme: FINANCES PUBLIQUES
in scheme: Organisation Structurelle de l'Etat
in scheme: Institutions
in scheme: Administration de L'Etat
narrower: Conseil économique social et environnemental
narrower: Banque de France
narrower: Caisse des dépôts et consignations
notation: REFIP5484
scope note: Etiquette de noeud

structure rattachée au Premier Ministre (non-descripteur)
type: ConceptReFip
type: Concept
broader: ministère
definition: Terme ne pouvant servir à l'indexation
in scheme: FINANCES PUBLIQUES
in scheme: Organisation Structurelle de l'Etat
in scheme: Ministère
in scheme: Administration de L'Etat
narrower: intelligence économique
narrower: Autorité qualifiée à la sécurité des systèmes d'information
narrower: Fonds national d'aménagement de développement du territoire
narrower: Commissariat général à l'investissement
narrower: Commissariat général à l'égalité des territoires
narrower: secrétariat général pour la modernisation de l'action publique
narrower: refip-REFIP99
notation: REFIP5485
scope note: Etiquette de noeud

secrétariat général pour la modernisation de l'action publique
type: ConceptReFip
type: Concept
alternative label: SGMAP
alternative label: secrétariat général pour la modernisation de l'Etat
broader: structure rattachée au Premier Ministre (non-descripteur)
definition: Administration de mission qui accompagne le gouvernement pour transformer les administrations et moderniser les services publics. Il évalue les politiques publiques afin de déterminer leur valeur et leur efficacité au regard d’un ensemble de critères et de méthode.
in scheme: FINANCES PUBLIQUES
in scheme: Organisation Structurelle de l'Etat
in scheme: Ministère
in scheme: Administration de L'Etat
notation: REFIP5486

Direction interministérielle des systèmes d'information et de communication (supprimé)
type: ConceptReFip
type: Concept
broader: ZZ
in scheme: FINANCES PUBLIQUES
notation: REFIP5487

Ministère de l'Agriculture de l'Agroalimentaire et de la Forêt (obsolète)
type: ConceptReFip
type: Concept
is replaced by: refip-REFIP7058
broader: ZZ
in scheme: FINANCES PUBLIQUES
notation: REFIP5488

Projet paysage
type: ConceptReFip
type: Concept
broader: applications missions transverses (non-descripteur)
definition: Projet correspondant à la réécriture de l'application PAY et permettant le paiement des traitements, salaires, et accessoires des fonctionnaires et agents des budgets civils de l’État.
in scheme: FINANCES PUBLIQUES
in scheme: Applications missions transverses
in scheme: Applications Informatiques
notation: REFIP5489
related: application PAY
scope note: Remplacera l'application PAY en 2018

acquiescement à la demande
type: ConceptReFip
type: Concept
broader: refip-REFIP977
definition: Reconnaissance du bien-fondé des prétentions de l'adversaire et renonciation à l'action
in scheme: FINANCES PUBLIQUES
in scheme: Procédure Civile
in scheme: Droit et Justice
in scheme: Procédure
notation: REFIP549

application MODR
type: ConceptReFip
type: Concept
alternative label: MODR
broader: applications missions transverses (non-descripteur)
definition: Moteur de recherche transverse interne à destination des agents de la DGFiP.
in scheme: FINANCES PUBLIQUES
in scheme: Applications missions transverses
in scheme: Applications Informatiques
notation: REFIP5490

anciennes dénominations des ministères de l'économie et des finances (supprimé)
type: ConceptReFip
type: Concept
broader: ZZ
in scheme: FINANCES PUBLIQUES
notation: REFIP5491

migration informatique
type: ConceptReFip
type: Concept
broader: chaîne de traitement
definition: Programme consistant à mettre en œuvre un logiciel, une fonctionnalité, voire un système d'exploitation dans un autre environnement que celui d'origine.
in scheme: FINANCES PUBLIQUES
in scheme: Informatique
in scheme: Communication Documentation Informatique
notation: REFIP5492

équipe départementale de renfort
type: ConceptReFip
type: Concept
alternative label: EDR
alternative label: brigade de renfort
alternative label: équipe de remplacement
alternative label: équipe de renfort
broader: direction départementale des finances publiques
definition: Equipe d'agents, constituée à l'échelon départemental, pouvant renforcer et soutenir les services de la DGFIP .
in scheme: FINANCES PUBLIQUES
in scheme: Organisation Structurelle de l'Etat
in scheme: Ministère
in scheme: Administration de L'Etat
notation: REFIP5493

échelon de renfort et d'assistance
type: ConceptReFip
type: Concept
alternative label: EDRA
alternative label: personnel affecté dans les échelons de renfort et d'assistance
broader: fonction de la Direction générale des finances publiques (non-descripteur)
definition: Personnel fournissant une assistance temporaire aux services touchés par l’absentéisme ou subissant des pointes momentanées de charges.
in scheme: FINANCES PUBLIQUES
in scheme: Personnels et fonctions
in scheme: Fonction Publique et Gestion des Ressources Humaines
notation: REFIP5494

mission risques et audit
type: ConceptReFip
type: Concept
alternative label: MNMR
alternative label: MRA
alternative label: mission nationale maîtrise des risques
broader: administration centrale des finances publiques
definition: Mission placée auprès du Directeur général des Finances publiques chargée de définir, piloter et réaliser la politique de maîtrise des risques et de l'audit au sein de la DGFiP.
in scheme: FINANCES PUBLIQUES
in scheme: Organisation Structurelle de l'Etat
in scheme: Ministère
in scheme: Administration de L'Etat
narrower: refip-REFIP7039
notation: REFIP5495

Mutuelle d'action sociale des finances publiques
type: ConceptReFip
type: Concept
alternative label: MAI
alternative label: MASFIP
alternative label: mutuelle des agents des impôts
alternative label: mutuelle du Trésor
broader: administration centrale des finances publiques
definition: Personne morale de droit privé à but non lucratif, la Mutuelle mène dans l’intérêt de ses membres, tant actifs que retraités, ainsi qu'à leurs ayants droit une action de solidarité et d’entraide afin de contribuer à leur développement culturel, moral, intellectuel et physique, ainsi qu’à l’amélioration de leurs conditions de Vie. La MASFIP s'adresse aux adhérents relevant des administrations des finances publiques, de la recherche et de l'industrie, de la concurrence, consommation et répression des fraudes, de l'imprimerie nationale.
in scheme: FINANCES PUBLIQUES
in scheme: Organisation Structurelle de l'Etat
in scheme: Ministère
in scheme: Administration de L'Etat
notation: REFIP5496
scope note: Regroupe l'aspect social de la Mutuelle des agents des impôts et de la Mutuelle du Trésor

secrétariat général des ministères économiques et financiers
type: ConceptReFip
type: Concept
alternative label: secrétariat général
broader: Ministère de l'Economie et des Finances
definition: Structure commune aux deux ministères. Il agit de manière transversale en exerçant tout à la fois des missions de pilotage ministériel dans le domaine de la modernisation, des fonctions support et des missions de gestion des services centraux. En outre, il assiste les ministres dans l'exercice de leurs responsabilités de défense et de sécurité, le secrétaire général étant haut fonctionnaire de défense et de sécurité (HFDS).
in scheme: FINANCES PUBLIQUES
in scheme: Organisation Structurelle de l'Etat
in scheme: Ministère
in scheme: Administration de L'Etat
narrower: mission handicap
narrower: association pour le logement du personnel des administrations financières
narrower: éducation plein-air finances
narrower: association touristique sportive et culturelle des administrations financières
narrower: Institut de la gestion publique et du développement économique
narrower: association pour la gestion des restaurants administratifs financiers
narrower: refip-REFIP769
notation: REFIP5498
related: refip-REFIP7061

îles Vierges britanniques
type: ConceptReFip
type: Concept
broader: Caraïbes
definition: Territoire du Royaume Uni
in scheme: FINANCES PUBLIQUES
in scheme: Géographie
in scheme: Amérique
notation: REFIP55

établissement public économique (non-descripteur)
type: ConceptReFip
type: Concept
broader: établissement public national
definition: Terme ne servant pas à l'indexation.
in scheme: FINANCES PUBLIQUES
in scheme: Organisation Structurelle de l'Etat
in scheme: Opérateur de l'Etat
in scheme: Administration de L'Etat
narrower: chambre consulaire
notation: REFIP5500
scope note: Étiquette de noeud

Centre national de transfert de données fiscales
type: ConceptReFip
type: Concept
alternative label: CNTDF
broader: administration centrale des finances publiques
definition: Centre serveur unique, hébergé par la Direction Générale des Finances Publiques, qui effectue les opérations liées à la gestion des transferts informatisés des informations demandées par les organismes adhérant à la procédure. L'accès à la procédure est ouvert sur adhésion à l'ensemble des organismes et services chargés de la gestion d'un régime obligatoire de sécurité sociale ainsi qu'à certaines institutions.
in scheme: FINANCES PUBLIQUES
in scheme: Organisation Structurelle de l'Etat
in scheme: Ministère
in scheme: Administration de L'Etat
notation: REFIP5504

organisme consultatif et représentatif (non-descripteur)
type: ConceptReFip
type: Concept
broader: organisation structurelle de l'Etat (non-descripteur)
definition: Terme ne pouvant servir à l'indexation
in scheme: FINANCES PUBLIQUES
in scheme: Organisation Structurelle de l'Etat
in scheme: Organisme Consultatif et Représentatif
in scheme: Administration de L'Etat
narrower: commission consultative paritaire
narrower: commission administrative paritaire
narrower: Conseil supérieur du notariat
narrower: comité d'action sociale
narrower: Conseil supérieur de l'ordre des experts-comptables
narrower: Conseil supérieur de la fonction publique de l'Etat
narrower: Conseil supérieur de la fonction publique territoriale
narrower: comité technique de service déconcentré
narrower: Conseil supérieur de la magistrature
narrower: comité d'hygiène et de sécurité et des conditions de travail
narrower: Conseil national des barreaux
narrower: comité technique de service central de réseau
narrower: Conseil supérieur de la fonction publique hospitalière
narrower: comité technique paritaire
narrower: comité de pilotage
narrower: refip-REFIP694
narrower: refip-REFIP7235
notation: REFIP5505
scope note: Etiquette de noeud

organisme privé assurant service public (non-descripteur)
type: ConceptReFip
type: Concept
broader: organisation structurelle de l'Etat (non-descripteur)
definition: Terme ne pouvant servir à l'indexation
in scheme: FINANCES PUBLIQUES
in scheme: Organisation Structurelle de l'Etat
in scheme: Organisme Privé Assurant Service Public
in scheme: Administration de L'Etat
narrower: Union nationale interprofessionnelle pour l'emploi dans l'industrie et le commerce
narrower: société de perception et de répartition des droits
narrower: association pour la formation professionnelle des adultes
narrower: Imprimerie nationale
narrower: Electricité de France
narrower: société d'aménagement foncier et d'établissement rural
narrower: Fonds de garantie
narrower: GDF Suez
notation: REFIP5506
scope note: Etiquette de noeud

organisation territoriale (non-descripteur)
type: ConceptReFip
type: Concept
definition: Terme ne pouvant servir à l'indexation
in scheme: FINANCES PUBLIQUES
in scheme: Organisation Territoriale
in scheme: Administration de L'Etat
narrower: élu local
narrower: structures territoriales (non-descripteur)
notation: REFIP5507
scope note: Etiquette de noeud

structures territoriales (non-descripteur)
type: ConceptReFip
type: Concept
broader: organisation territoriale (non-descripteur)
definition: Terme ne pouvant servir à l'indexation
in scheme: FINANCES PUBLIQUES
in scheme: Organisation Territoriale
in scheme: Structures Territoriales
in scheme: Administration de L'Etat
narrower: collectivité d'outre-mer
narrower: établissement d'hébergement pour personnes âgées dépendantes
narrower: collectivité territoriale
narrower: établissement public de santé
narrower: établissement d'enseignement
narrower: établissement public social et médicosocial
narrower: structure locale (non-descripteur)
narrower: cellule de veille et d'alerte précoce
narrower: refip-REFIP973
notation: REFIP5508
scope note: Etiquette de noeud

structure locale (non-descripteur)
type: ConceptReFip
type: Concept
broader: structures territoriales (non-descripteur)
definition: Terme ne pouvant servir à l'indexation
in scheme: FINANCES PUBLIQUES
in scheme: Organisation Territoriale
in scheme: Structures Territoriales
in scheme: Administration de L'Etat
narrower: commission départementale de coopération intercommunale
narrower: comité départemental d'examen des difficultés de financement des entreprises
narrower: commission départementale de conciliation
narrower: commission des chefs des services financiers et des représentants des organismes de recouvrement des cotisations de sécurité sociale et de l'assurance chômage
narrower: cellule opérationnelle de suivi
narrower: commission intercommunale des impôts directs
narrower: relais services publics
narrower: commission départementale de financement de l'économie
narrower: commission communale des impôts directs
narrower: maison des services aux publics
narrower: refip-REFIP7086
notation: REFIP5509
scope note: Etiquette de noeud

Israël
type: ConceptReFip
type: Concept
broader: Asie
definition: Pays
in scheme: FINANCES PUBLIQUES
in scheme: Géographie
in scheme: Asie
notation: REFIP551

dissimulation du visage
type: ConceptReFip
type: Concept
broader: relations avec le public
definition: Fait de dissimuler son visage, la dissimulation intégrale du visage est interdite dans l'espace public qui est constitué des voies publiques ainsi que les lieux ouverts au public ou affectés à un service public
in scheme: FINANCES PUBLIQUES
in scheme: Missions Transverses des Finances publiques
in scheme: Qualité de service
notation: REFIP5510

congés (non-descripteur)
type: ConceptReFip
type: Concept
broader: refip-REFIP6916
definition: Terme ne servant pas à l'indexation.
in scheme: FINANCES PUBLIQUES
in scheme: Gestion des ressources humaines
in scheme: Temps de travail
in scheme: Fonction Publique et Gestion des Ressources Humaines
narrower: congé ordinaire de maladie
narrower: congé de maternité
narrower: congé pour accident
narrower: congé de paternité
narrower: congé pour formation syndicale
narrower: congé pour maladie professionnelle
narrower: congé pour garde d'enfant malade
narrower: congé longue durée
narrower: congé d'adoption
narrower: congé bonifié
narrower: congé de représentation
narrower: congé annuel
narrower: congé spécial
narrower: congé administratif
narrower: congé longue maladie
narrower: congé de grave maladie
narrower: refip-REFIP6749
narrower: refip-REFIP7142
notation: REFIP5511
note: Ne pas utiliser à l'indexation.

personnels et fonctions (non-descripteur)
type: ConceptReFip
type: Concept
definition: Terme ne pouvant servir à l'indexation
in scheme: FINANCES PUBLIQUES
in scheme: Personnels et fonctions
in scheme: Fonction Publique et Gestion des Ressources Humaines
narrower: fonction (non-descripteur)
narrower: fonction publique
narrower: fonction de la Direction générale des finances publiques (non-descripteur)
notation: REFIP5513
note: Ne pas utiliser à l'indexation.

fonction (non-descripteur)
type: ConceptReFip
type: Concept
broader: personnels et fonctions (non-descripteur)
definition: Terme ne servant pas à l'indexation.
in scheme: FINANCES PUBLIQUES
in scheme: Personnels et fonctions
in scheme: Fonction Publique et Gestion des Ressources Humaines
narrower: charge de mission
narrower: coordonnateur
narrower: collaborateur occasionnel du service public
narrower: commissaire au redressement productif
narrower: conférencier
narrower: conducteur de véhicule
narrower: directeur
narrower: dépositaire public
narrower: fonction effective
narrower: fonction d'encadrement
narrower: fonction élective
narrower: gardien de nuit
narrower: gardien d'immeuble
narrower: refip-REFIP6562
narrower: refip-REFIP6747
narrower: refip-REFIP6777
narrower: refip-REFIP6817
narrower: refip-REFIP6838
notation: REFIP5514

filière de la fonction publique (non-descripteur)
type: ConceptReFip
type: Concept
broader: fonction publique
definition: Terme ne servant pas à l'indexation.
in scheme: FINANCES PUBLIQUES
in scheme: Personnels et fonctions
in scheme: Fonction publique
in scheme: Fonction Publique et Gestion des Ressources Humaines
narrower: filière fiscale
narrower: filière animation
narrower: filière médicosociale
narrower: filière sapeur pompier professionnel
narrower: filière gestion publique
narrower: filière police municipale
narrower: filière administrative
narrower: filière culturelle
narrower: filière technique
narrower: filière sportive
notation: REFIP5516
note: Ne pas utiliser à l'indexation

grade de la Direction générale des Finances publiques (non-descripteur)
type: ConceptReFip
type: Concept
broader: fonction publique de l'Etat
definition: Terme ne servant pas à l'indexation
in scheme: FINANCES PUBLIQUES
in scheme: Personnels et fonctions
in scheme: Fonction publique
in scheme: Fonction Publique et Gestion des Ressources Humaines
narrower: inspecteur divisionnaire des finances publiques hors classe
narrower: inspecteur principal des finances publiques
narrower: administrateur des finances publiques adjoint
narrower: administrateur général des finances publiques
narrower: agent technique des finances publiques
narrower: agent administratif principal des finances publiques
narrower: administrateur des finances publiques
narrower: agent technique principal des finances publiques
narrower: agent administratif des finances publiques
narrower: contrôleur principal des finances publiques
narrower: contrôleur des finances publiques
narrower: conservateur des hypothèques
narrower: correspondant régional de sécurité économique
narrower: géomètre cadastreur des finances publiques
narrower: géomètre principal des finances publiques
narrower: huissier des finances publiques
narrower: inspecteur spécialisé des finances publiques
narrower: inspecteur divisionnaire des finances publiques de classe normale
narrower: inspecteur des finances publiques
narrower: inspecteur stagiaire des finances publiques
narrower: refip-REFIP6767
narrower: refip-REFIP6902
notation: REFIP5517
scope note: Etiquette de noeud

environnement (non-descripteur)
type: ConceptReFip
type: Concept
definition: Terme ne servant pas à l'indexation.
in scheme: FINANCES PUBLIQUES
in scheme: Environnement
in scheme: Questions de Société
narrower: milieu naturel
narrower: protection de l'environnement
narrower: dégradation de l'environnement
notation: REFIP5518
scope note: Étiquette de noeud

vie de l'entreprise (non-descripteur)
type: ConceptReFip
type: Concept
broader: refip-REFIP6942
definition: Terme ne pouvant servir à l'indexation
in scheme: FINANCES PUBLIQUES
in scheme: Vie de l'Entreprise
in scheme: Entreprises
in scheme: Vie et Gestion de l'entreprise
narrower: transfert d'entreprise
narrower: entreprise en difficulté
narrower: cessation d'activité
narrower: centre de formalités des entreprises
narrower: changement d'activité
narrower: répertoire national des entreprises et des établissements
narrower: refip-REFIP682
narrower: refip-REFIP938
notation: REFIP5521

famille éducation population (non-descripteur)
type: ConceptReFip
type: Concept
definition: Terme ne servant pas à l'indexation.
in scheme: FINANCES PUBLIQUES
in scheme: Famille Education Population
in scheme: Questions de Société
narrower: population (non-descripteur)
narrower: enseignement
narrower: famille
notation: REFIP5522
scope note: Etiquette de noeud

diffamation
type: ConceptReFip
type: Concept
alternative label: calomnie
broader: délit
definition: Fausse accusation publique ou privée qui porte atteinte à l'honneur et à la considération d'une personne. Elle relève d'une procédure spécifique permettant de protéger la liberté d'expression.
in scheme: FINANCES PUBLIQUES
in scheme: Droit et Justice
in scheme: Infractions et Sanctions
in scheme: Infraction
notation: REFIP553

population (non-descripteur)
type: ConceptReFip
type: Concept
broader: famille éducation population (non-descripteur)
definition: Terme ne pouvant servir à l'indexation
in scheme: FINANCES PUBLIQUES
in scheme: Famille Education Population
in scheme: Population
in scheme: Questions de Société
narrower: ancien combattant et victime de guerre
narrower: détenu
narrower: expatrié
narrower: gens du voyage
narrower: invalide de guerre
narrower: jeune en difficulté
narrower: jeune travailleur
narrower: refip-REFIP6590
narrower: refip-REFIP6619
narrower: refip-REFIP6644
narrower: refip-REFIP6667
narrower: refip-REFIP6696
narrower: refip-REFIP6706
narrower: refip-REFIP6774
narrower: refip-REFIP6787
notation: REFIP5530
scope note: Etiquette de nœud

santé et protection sociale (non-descripteur)
type: ConceptReFip
type: Concept
definition: Terme ne pouvant servir à l'indexation
in scheme: FINANCES PUBLIQUES
in scheme: Santé et Protection Sociale
in scheme: Questions de Société
narrower: santé (non-descripteur)
narrower: refip-REFIP6655
notation: REFIP5531
scope note: Etiquette de nœud

assurances (non-descripteur)
type: ConceptReFip
type: Concept
broader: refip-REFIP79
definition: Terme ne servant pas à l'indexation.
in scheme: FINANCES PUBLIQUES
in scheme: Assurances
in scheme: Finance
narrower: assurance loyer impayé
narrower: assurance construction dommages-ouvrage
narrower: assurance décès-invalidité
narrower: contrat d'assurance
narrower: compagnie d'assurance
notation: REFIP5532

sûreté immobilière
type: ConceptReFip
type: Concept
broader: mission de service public
definition: Etat de protection contre les dangers ou les menaces venant de l'extérieur touchant aux immeubles.
in scheme: FINANCES PUBLIQUES
in scheme: Etat
in scheme: Mission de Service Public
in scheme: Administration de L'Etat
notation: REFIP5534
scope note: Sécurité touchant aux immeubles contre les dangers ou menaces extérieures

titre de placement (non-descripteur)
type: ConceptReFip
type: Concept
broader: refip-REFIP6956
definition: Terme ne pouvant servir à l'indexation
in scheme: FINANCES PUBLIQUES
in scheme: Instrument financier
in scheme: Valeur Mobiliere
in scheme: Finance
narrower: action
narrower: bon d'acquisition
narrower: certificat coopératif d'investissement
narrower: refip-REFIP6862
narrower: refip-REFIP7107
notation: REFIP5535
scope note: Etiquette de nœud

crédit mutuel (supprimé)
type: ConceptReFip
type: Concept
broader: ZZ
in scheme: FINANCES PUBLIQUES
notation: REFIP5539

santé (non-descripteur)
type: ConceptReFip
type: Concept
broader: santé et protection sociale (non-descripteur)
definition: Terme ne pouvant servir à l'indexation
in scheme: FINANCES PUBLIQUES
in scheme: Santé et Protection Sociale
in scheme: Santé
in scheme: Questions de Société
narrower: médecine préventive
narrower: certificat médical
narrower: contrôle vétérinaire
narrower: cure thermale
narrower: contrôle sanitaire
narrower: cabinet médical
narrower: don du sang
narrower: décès
narrower: don d'organe
narrower: Fichier national des établissements sanitaires et sociaux
narrower: frais médicaux
narrower: facturation individuelle des établissements de santé
narrower: grossesse
narrower: hospitalisation
narrower: handicap
narrower: interne en médecine
narrower: invalidité
narrower: médecin généraliste
narrower: médecin spécialiste
narrower: maladie
narrower: refip-REFIP6642
narrower: refip-REFIP6682
narrower: refip-REFIP6724
narrower: refip-REFIP6824
narrower: refip-REFIP6834
narrower: refip-REFIP6837
narrower: refip-REFIP6959
narrower: refip-REFIP7057
narrower: refip-REFIP7128
notation: REFIP5541
scope note: Etiquette de nœud

culture et loisirs (non-descripteur)
type: ConceptReFip
type: Concept
definition: terme ne pouvant servir à l'indexation
in scheme: FINANCES PUBLIQUES
in scheme: Culture et Loisirs
in scheme: Questions de Société
narrower: activité culturelle
narrower: activité artistique
narrower: loisirs
narrower: refip-REFIP6694
notation: REFIP5542
scope note: Étiquette de nœud

Centre national de documentation des finances publiques
type: ConceptReFip
type: Concept
alternative label: CNDFIP
alternative label: Centre de documentation des finances publiques
broader: Ecole nationale des finances publiques
definition: Structure rattachée à l'ENFiP en charge des missions de veille et de recherches documentaires pour le compte de tous les agents de la DGFiP. Publicateur des circulaires et instructions au BOFiP RHO et GCP, ce service assure également la gestion des référentiels, du plan de classement et l'administration fonctionnelle de la base Nausicaa.
in scheme: FINANCES PUBLIQUES
in scheme: Organisation Structurelle de l'Etat
in scheme: Ministère
in scheme: Administration de L'Etat
notation: REFIP5543

aménagement du territoire urbanisme habitat (non-descripteur)
type: ConceptReFip
type: Concept
definition: Terme ne servant pas à l'indexation
in scheme: FINANCES PUBLIQUES
in scheme: Aménagement du territoire Urbanisme Habitat
in scheme: Questions de Société
narrower: aménagement du territoire
narrower: habitat
notation: REFIP5544
scope note: Étiquette de nœud

déclaration sociale nominative
type: ConceptReFip
type: Concept
alternative label: DSN
broader: documentation fiscale (non-descripteur)
definition: Déclaration ayant pour objectif de remplacer l’ensemble des déclarations actuelles effectuées par les entreprises et leurs mandataires. La DSN repose sur la transmission unique, mensuelle et dématérialisée des données issues de la paie et la transmission dématérialisée de signalements d’événements. Les données fiscales servant au prélèvement à la source de l'impôt sur le revenu sont également transmises par le biais de cette déclaration.
in scheme: FINANCES PUBLIQUES
in scheme: Documentation Fiscale
in scheme: Fiscalité
notation: REFIP5545

avis de situation déclarative à l'impôt sur le revenu
type: ConceptReFip
type: Concept
alternative label: ASDIR
broader: documentation fiscale (non-descripteur)
definition: Avis permettant aux usagers de justifier de leur situation déclarative dès la déclaration de leurs revenus en ligne. Pour les foyers non imposables, il remplace l'avis de non-imposition.
in scheme: FINANCES PUBLIQUES
in scheme: Documentation Fiscale
in scheme: Fiscalité
notation: REFIP5546

questions politiques relations internationales (non-descripteur)
type: ConceptReFip
type: Concept
definition: Terme ne pouvant servir à l'indexation
in scheme: FINANCES PUBLIQUES
in scheme: Questions Politiques Relations Internationales
in scheme: Questions de Société
narrower: politique (non-descripteur)
narrower: refip-REFIP6768
notation: REFIP5547
scope note: Étiquette de nœud

politique (non-descripteur)
type: ConceptReFip
type: Concept
broader: questions politiques relations internationales (non-descripteur)
definition: Terme ne pouvant servir à l'indexation
in scheme: FINANCES PUBLIQUES
in scheme: Questions Politiques Relations Internationales
in scheme: Politique
in scheme: Questions de Société
narrower: élection politique
narrower: refip-REFIP6579
notation: REFIP5548
scope note: Étiquette de nœud

crédit d'impôt pour investissements exploités par les petites et moyennes entreprises en Corse
type: ConceptReFip
type: Concept
alternative label: crédit d'impôt pour investissements exploités par les PME en Corse
broader: refip-REFIP849
definition: Dispositif institué au profit des petites et moyennes entreprises relevant d'un régime réel d'imposition qui réalisent certains investissements productifs en Corse pour les besoins d'une activité industrielle, commerciale, artisanale, agricole ou libérale.
in scheme: FINANCES PUBLIQUES
in scheme: Liquidation de l'Impôt
in scheme: Fiscalité
notation: REFIP555

compensation
type: ConceptReFip
type: Concept
broader: mots outils (liste additive)
definition: Avantage qui compense un inconvénient, un mal, un préjudice ; dédommagement.
in scheme: FINANCES PUBLIQUES
in scheme: Mots Outils
notation: REFIP5554

contribution
type: ConceptReFip
type: Concept
broader: autres taxes, droits ou redevances (non-descripteur)
definition: Au sens fiscal terme équivalent à celui d'impôt ou taxe mais soulignant davantage l'idée de solidarité de tous les citoyens devant les charges publiques.
in scheme: FINANCES PUBLIQUES
in scheme: Fiscalité
in scheme: Impôt
narrower: contribution de solidarité territoriale
narrower: contribution à l'audiovisuel public
narrower: contribution salariale sur les attributions d'actions gratuites
narrower: contribution pour l'aide juridique
narrower: contribution additionnelle à l'imposition forfaitaire sur les entreprises de réseaux
narrower: refip-REFIP7166
narrower: refip-REFIP7186
narrower: refip-REFIP7187
notation: REFIP5555

coopération
type: ConceptReFip
type: Concept
broader: mots outils (liste additive)
definition: Action de participer (avec une ou plusieurs personnes) à une œuvre ou à une action commune.
in scheme: FINANCES PUBLIQUES
in scheme: Mots Outils
notation: REFIP5556

décote
type: ConceptReFip
type: Concept
broader: mots outils (liste additive)
definition: Evaluation inférieure à un cours de référence d'une monnaie, d'une action en bourse, d'un bien, etc...
in scheme: FINANCES PUBLIQUES
in scheme: Mots Outils
notation: REFIP5557

dépôt de fonds
type: ConceptReFip
type: Concept
broader: responsabilité des comptables
definition: Convention par laquelle une personne, appelée le "dépositaire", se charge gracieusement de la conservation d'une somme d'argent que lui remet le "déposant". A la fin de la période de dépôt, le dépositaire doit restituer la somme déposée.
in scheme: FINANCES PUBLIQUES
in scheme: Responsabilité des comptables
in scheme: Missions Transverses des Finances publiques
narrower: dépôt de fonds au Trésor
notation: REFIP5558

droit de mutation
type: ConceptReFip
type: Concept
broader: droits d'enregistrement
definition: Droit d'enregistrement perçu par l'État.
in scheme: FINANCES PUBLIQUES
in scheme: Fiscalité
in scheme: Impôt
narrower: droit de mutation à titre onéreux
narrower: droit de mutation à titre gratuit
notation: REFIP5559

élevage
type: ConceptReFip
type: Concept
alternative label: élevage d'animaux
alternative label: élevage industriel
broader: agriculture
definition: Ensemble des activités qui assurent la multiplication des animaux souvent domestiques, parfois sauvages, pour l'usage des humains.
in scheme: FINANCES PUBLIQUES
in scheme: Branche d'activité
in scheme: Questions Economiques
in scheme: Agriculture
narrower: culture marine
narrower: animal
narrower: bétail
narrower: apiculture
narrower: refip-REFIP812
notation: REFIP5560

expertise
type: ConceptReFip
type: Concept
broader: mots outils (liste additive)
definition: Procédure par laquelle on confie à un ou plusieurs experts le soin de donner un avis, notamment sur des aspects techniques.
in scheme: FINANCES PUBLIQUES
in scheme: Mots Outils
notation: REFIP5561

indemnité forfaitaire
type: ConceptReFip
type: Concept
broader: indemnité
definition: Rémunération accessoire versée à l'agent en compensation forfaitaire des frais engagés dans l’exercice de son activité professionnelle.
in scheme: FINANCES PUBLIQUES
in scheme: Gestion des ressources humaines
in scheme: Rémunération
in scheme: Fonction Publique et Gestion des Ressources Humaines
narrower: indemnité forfaitaire complémentaire pour élections
narrower: indemnité forfaitaire de déplacement dans le département
narrower: indemnité forfaitaire pour travaux supplémentaires
narrower: indemnité forfaitaire de changement de résidence
notation: REFIP5563

prix
type: ConceptReFip
type: Concept
broader: mots outils (liste additive)
definition: Valeur d'échange d'un bien, d'un service, exprimée en monnaie.
in scheme: FINANCES PUBLIQUES
in scheme: Mots Outils
notation: REFIP5565

remembrement
type: ConceptReFip
type: Concept
broader: aménagement foncier agricole et forestier
definition: Aménagement foncier qui consiste à grouper de petites parcelles, pouvant appartenir à différents propriétaires, en parcelles plus grandes, de manière à obtenir une utilisation plus rationnelle et plus rentable des sols.
in scheme: FINANCES PUBLIQUES
in scheme: Aménagement du territoire Urbanisme Habitat
in scheme: Aménagement du Territoire
in scheme: Questions de Société
notation: REFIP5567

taxe foncière
type: ConceptReFip
type: Concept
broader: impôt direct local
definition: Impôt local dû chaque année par tous les propriétaires ou usufruitiers de propriétés bâties.
in scheme: FINANCES PUBLIQUES
in scheme: Fiscalité
in scheme: Impôt
narrower: refip-REFIP6921
narrower: refip-REFIP827
notation: REFIP5569

trésorerie générale
type: ConceptReFip
type: Concept
broader: services déconcentrés des finances publiques
definition: Service déconcentré des Finances publiques, échelon local de l'ancienne Direction générale de la Comptabilité Publique (DGCP).
in scheme: FINANCES PUBLIQUES
in scheme: Organisation Structurelle de l'Etat
in scheme: Ministère
in scheme: Administration de L'Etat
notation: REFIP5570
scope note: Remplacée par les Directions Départementales des Finances Publiques et Directions Régionales des Finances Publiques à compter du 16 juin 2009 décret 2009-707

procédure administrative
type: ConceptReFip
type: Concept
broader: procédure
definition: Procédure suivie devant les juridictions administratives, régie par des règles spécifiques caractérisées par l'importance des éléments écrits par rapport aux éléments oraux ainsi que par ses traits inquisitoires.
in scheme: FINANCES PUBLIQUES
in scheme: Procédure Administrative
in scheme: Droit et Justice
in scheme: Procédure
narrower: recours administratif
narrower: référé administratif
narrower: exception d'illégalité
narrower: réquisition
narrower: refip-REFIP885
notation: REFIP5573

procédure civile
type: ConceptReFip
type: Concept
broader: procédure
definition: Procédure suivie, en matière civile, commerciale, rurale et sociale devant les juridictions de l'ordre judiciaire.
in scheme: FINANCES PUBLIQUES
in scheme: Procédure Civile
in scheme: Droit et Justice
in scheme: Procédure
narrower: sommation
narrower: accord amiable
narrower: exploit d'huissier
narrower: contrainte administrative
narrower: appel en garantie
narrower: force exécutoire
narrower: saisine
narrower: désistement
narrower: référé civil
narrower: assignation
narrower: règlement amiable
narrower: refip-REFIP832
narrower: refip-REFIP863
narrower: refip-REFIP908
narrower: refip-REFIP977
notation: REFIP5574

procédure pénale
type: ConceptReFip
type: Concept
broader: procédure
definition: Ensemble des règles qui définissent la manière de procéder pour la constatation des infractions, l'instruction préparatoire, la poursuite et le jugement des délinquants.
in scheme: FINANCES PUBLIQUES
in scheme: Procédure Pénale
in scheme: Droit et Justice
in scheme: Procédure
narrower: contrainte judiciaire
narrower: témoin
narrower: garde à vue
narrower: contrainte par corps
narrower: ordonnance pénale
narrower: détention provisoire
narrower: plainte
narrower: refip-REFIP967
narrower: refip-REFIP979
notation: REFIP5575

stockage de données informatiques
type: ConceptReFip
type: Concept
alternative label: entrepôt de données
alternative label: magasin de données
broader: base de données
definition: Espace d'accumulation de données informatiques
in scheme: FINANCES PUBLIQUES
in scheme: Informatique
in scheme: Communication Documentation Informatique
notation: REFIP5576
related: infocentre

épargne salariale
type: ConceptReFip
type: Concept
replaces: revenu de participation (obsolète)
alternative label: revenu de participation
broader: participation financière
definition: Système d’épargne collectif mis en place par une entreprise au bénéfice de ses salariés et qui permet à ces derniers d’être associés aux résultats de l’entreprise. L’épargne salariale regroupe plusieurs dispositifs, fiscalement attractifs, que sont la participation aux bénéfices, l'intéressement et les plans d'épargne entreprise.
in scheme: FINANCES PUBLIQUES
in scheme: Gestion de l'Entreprise
in scheme: Entreprises
in scheme: Vie et Gestion de l'entreprise
narrower: participation financière des salariés aux résultats de l'entreprise
narrower: fonds de pension
notation: REFIP5578

période de mise en situation en milieu professionnel
type: ConceptReFip
type: Concept
alternative label: PMSMP
broader: insertion professionnelle
definition: Possibilité pour toute personne s’inscrivant dans une démarche préventive (bénéficiaire salarié en recherche d'emploi ou de réorientation professionnelle) et proactive (bénéficiaire privé d'emploi, inscrit ou non auprès de Pôle emploi), de mobiliser au cours d’un parcours d’insertion, des périodes de mise en situation en milieu professionnel (PMSMP). Ces périodes permettent de se confronter à des situations réelles pour découvrir un métier ou un secteur d’activité, confirmer un projet professionnel ou initier une démarche de recrutement. Elles ne sont assimilables ni à des périodes de travail, ni à des périodes de formation.
in scheme: FINANCES PUBLIQUES
in scheme: Entreprises
in scheme: Travail
in scheme: 212619
notation: REFIP5579

dotation forfaitaire de recensement
type: ConceptReFip
type: Concept
broader: dotation
definition: Dotation versée par l’État aux collectivités pour soutenir les collectivités dans leurs démarches de recrutement, de formation et de rémunération des agents recenseurs et dans la prise en charge de frais de fonctionnement.
in scheme: FINANCES PUBLIQUES
in scheme: Dépenses publiques
in scheme: Gestion Publique
notation: REFIP558

ZZ
type: ConceptReFip
type: Concept
definition: Terme ne pouvant servir à l'indexation
in scheme: FINANCES PUBLIQUES
narrower: Fonds académique de rémunération des personnels d'internat (supprimé)
narrower: Ministère du Travail de l'Emploi et du Dialogue social (obsolète)
narrower: application INTRANET COMMUN (supprimé)
narrower: droit annuel de francisation et de navigation (supprimé)
narrower: mutation secrète (supprimé)
narrower: marché unique (supprimé)
narrower: avis de la Commission d'appel d'offres (supprimé)
narrower: application FIC-SPE (supprimé)
narrower: bien en transit (supprimé)
narrower: Aquitaine (obsolète)
narrower: fonds régional de l'apprentissage et de la formation professionnelle continue (supprimé)
narrower: compte prévisionnel (supprimé)
narrower: présomption d'héritier (supprimé)
narrower: régime spécial des partages avec soultes ou plus-values (supprimé)
narrower: imposition par foyer fiscal (obsolète)
narrower: concession d'endigage (supprimé)
narrower: Ministère du Budget des Comptes publics et de la Fonction publique (obsolète)
narrower: coût d'objectif (supprimé)
narrower: incitation fiscale à l'investissement immobilier locatif (supprimé)
narrower: taxe sur les éditeurs et distributeurs de services de télévision (supprimé)
narrower: Champagne-Ardenne (obsolète)
narrower: Direction interministérielle pour la modernisation de l'action publique (supprimé)
narrower: bénéfice net (supprimé)
narrower: droit d'accroissement (supprimé)
narrower: déclaration des cotisations sociales (supprimé)
narrower: déclaration d'indisponibilité du certificat d'immatriculation (supprimé)
narrower: travailleur migrant (supprimé)
narrower: application SQUADRA (supprimé)
narrower: Bourgogne (obsolète)
narrower: pécule modulable d'incitation à une seconde carrière (supprimé)
narrower: créance conditionnelle (supprimé)
narrower: contribution à la formation professionnelle des artisans au régime micro-social (supprimé)
narrower: fourgon funéraire (supprimé)
narrower: application SRM (supprimé)
narrower: tiers provisionnel (obsolète)
narrower: gestionnaire de la liquidation de la recette (supprimé)
narrower: mission interministérielle sur les mutations économiques (supprimé)
narrower: compte technique (supprimé)
narrower: comité consultatif de la réglementation bancaire et financière (supprimé)
narrower: frais d'acte (supprimé)
narrower: acquisition de clientèle (supprimé)
narrower: application NDL AAR (supprimé)
narrower: acte détachable (supprimé)
narrower: fonds libres des offices d'habitation à loyer modéré (supprimé)
narrower: contrôleur territorial de travaux (obsolète)
narrower: congé sabbatique (supprimé)
narrower: compte général (supprimé)
narrower: marché à tranches (obsolète)
narrower: contrat de plan (obsolète)
narrower: Ministère des Affaires étrangères et du Développement international (obsolète)
narrower: achat déductible (obsolète)
narrower: contribution exceptionnelle et temporaire de retraite des cadres (supprimé)
narrower: provision pour fluctuation des cours (supprimé)
narrower: établissement public de coopération scientifique (supprimé)
narrower: Caisse autonome nationale de la sécurité sociale dans les mines (supprimé)
narrower: Opérateur national de paye (supprimé)
narrower: relevé de condamnation pécuniaire (obsolète)
narrower: Fonds structurels européens (obsolète)
narrower: livraison de bien meuble corporel (obsolète)
narrower: subdélégation d'autorisation de programme individualisée (supprimé)
narrower: mission interministérielle d'inspection du logement social (supprimé)
narrower: commission consultative des services publics locaux (supprimé)
narrower: travail dominical (supprimé)
narrower: application SOLON (supprimé)
narrower: Nord-Pas-de-Calais (obsolète)
narrower: Observatoire économique de l'achat public (obsolète)
narrower: délégation d'emploi (supprimé)
narrower: remise de placement (supprimé)
narrower: restitution d'avoir fiscal (obsolète)
narrower: équarrissage (supprimé)
narrower: Ministère des Finances et des Comptes publics (obsolète)
narrower: appel d'offres sur performances (supprimé)
narrower: Bulletin officiel des services déconcentrés du Trésor (supprimé)
narrower: document d'orientations stratégiques (supprimé)
narrower: fonds particuliers (supprimé)
narrower: formulaire conventionnel (supprimé)

travail à façon
type: ConceptReFip
type: Concept
alternative label: façonnage
broader: refip-REFIP6950
definition: Travail qu'un prestataire (façonneur), un artisan propriétaire de son outil de production, réalise sur une matière première fournie par le commanditaire du travail. L'artisan produit des marchandises sur les ordres du marchand qui les commercialise.
in scheme: FINANCES PUBLIQUES
in scheme: Entreprises
in scheme: Travail
in scheme: 212619
notation: REFIP5581

mots outils (liste additive)
type: ConceptReFip
type: Concept
definition: Terme ne pouvant servir à l'indexation
in scheme: FINANCES PUBLIQUES
in scheme: Mots Outils
narrower: coefficient multiplicateur
narrower: retenue
narrower: adresse
narrower: échéancier
narrower: gestion
narrower: taux de référence
narrower: répartition
narrower: annulation
narrower: taux
narrower: délai
narrower: évaluation
narrower: année civile
narrower: acceptation
narrower: avis
narrower: contingent
narrower: extension
narrower: date d'envoi
narrower: conversion
narrower: date de signature
narrower: coût
narrower: anomalie
narrower: visa
narrower: trop-perçu
narrower: date d'entrée en vigueur
narrower: gratuite
narrower: expérimentation
narrower: cotation
narrower: échéance
narrower: dispense
narrower: cotisation
narrower: option
narrower: accessibilité
narrower: livraison
narrower: liquidation
narrower: date d'effet
narrower: négociation
narrower: périmètre
narrower: date de notification
narrower: date de dépôt
narrower: calendrier
narrower: date d'émission
narrower: frais
narrower: date
narrower: versement
narrower: durée
narrower: désignation
narrower: décompte
narrower: restructuration
narrower: écrêtement
narrower: correction d'erreur
narrower: mise à jour
narrower: revendication
narrower: modèle
narrower: remboursement
narrower: dépassement
narrower: barème
narrower: quote-part
narrower: interdiction
narrower: date limite
narrower: modernisation
narrower: mention
narrower: attestation
narrower: bénéficiaire
narrower: calcul
narrower: reliquat
narrower: surface
narrower: compensation
narrower: coopération
narrower: décote
narrower: expertise
narrower: prix
narrower: délivrance
narrower: irrégularité
narrower: imputation
narrower: majoration exceptionnelle

numérique
type: ConceptReFip
type: Concept
alternative label: culture numérique
alternative label: ère numérique
broader: technologie de l'information et de la communication
definition: Système, dispositif ou procédé employant la représentation d'informations ou de grandeurs physiques au moyen de caractères, tels que des chiffres ou de signaux à valeurs discrètes. Se dit par opposition à analogique.
in scheme: FINANCES PUBLIQUES
in scheme: Communication
in scheme: Communication Documentation Informatique
narrower: numérisation
narrower: open data
notation: REFIP5583

application CDU WEB
type: ConceptReFip
type: Concept
alternative label: CDU WEB
alternative label: outil de suivi des conventions d'utilisation
broader: applications gestion publique (non-descripteur)
definition: Application de suivi de la mise en oeuvre des conventions d'utilisation et de suivi de la réalisation des contrôles triennaux.
in scheme: FINANCES PUBLIQUES
in scheme: Applications Informatiques
in scheme: Applications gestion publique
notation: REFIP5584

groupement hospitalier de territoire
type: ConceptReFip
type: Concept
alternative label: GHT
broader: établissement public de santé
definition: Mode de coopération entre les établissements publics de santé à l'échelle d'un territoire. Ce groupement a pour objet de mettre en oeuvre une stratégie de prise en charge commune et graduée du patient dans le but d'assurer une égalité d'accès à des soins sécurisés et de qualité. Il assure la rationalisation des modes de gestion par une mise en commun de fonctions ou par des transferts d'activités entre établissements. Le groupement n'est pas doté de la personnalité morale.
in scheme: FINANCES PUBLIQUES
in scheme: Organisation Territoriale
in scheme: Structures Territoriales
in scheme: Administration de L'Etat
notation: REFIP5585

application FICOVIE
type: ConceptReFip
type: Concept
alternative label: FICOVIE
alternative label: FICOVIE-agents
alternative label: fichier des contrats de capitalisation et d'assurance-vie
broader: applications fiscales (non-descripteur)
definition: Application recensant les contrats de capitalisation et d'assurance-vie.
in scheme: FINANCES PUBLIQUES
in scheme: Applications Informatiques
in scheme: Applications fiscales
notation: REFIP5586

Agence du numérique
type: ConceptReFip
type: Concept
broader: Direction générale des entreprises
definition: Service à compétence nationale sous la responsabilité du Ministère de l'économie et rattaché à la Direction Générale des Entreprises, chargé de l'impulsion, de l'animation et de l'accompagnement des projets et des initiatives numériques développés dans les territoires par les collectivités publiques, les associations et les particuliers.
in scheme: FINANCES PUBLIQUES
in scheme: Organisation Structurelle de l'Etat
in scheme: Ministère
in scheme: Administration de L'Etat
notation: REFIP5587

monnaie locale complémentaire
type: ConceptReFip
type: Concept
broader: moyen de paiement
definition: Monnaie non soutenue par un gouvernement national (qui n'a pas nécessairement cours légal) et destinée à n'être échangée que dans une zone restreinte.
in scheme: FINANCES PUBLIQUES
in scheme: Moyen de paiement
in scheme: Finance
notation: REFIP5588

France Connect
type: ConceptReFip
type: Concept
broader: Cap numérique
definition: Outil d'identification sécurisé développé par l’État pour faciliter l'accès aux différents services en ligne proposés par l'administration.
in scheme: FINANCES PUBLIQUES
in scheme: Organisation Structurelle de l'Etat
in scheme: Ministère
in scheme: Administration de L'Etat
notation: REFIP5589

Inde
type: ConceptReFip
type: Concept
broader: Asie
definition: Pays
in scheme: FINANCES PUBLIQUES
in scheme: Géographie
in scheme: Asie
notation: REFIP559

Direction de l'immobilier de l'Etat
type: ConceptReFip
type: Concept
alternative label: DIE
alternative label: Direction immobilière de l'Etat
broader: administration centrale des finances publiques
definition: Direction de la DGFIP, la DIE définit la politique immobilière de l'Etat et de ses opérateurs et veille à sa mise en œuvre. Elle est responsable de l'élaboration d'une stratégie globale de pilotage du parc immobilier de l'Etat et de ses opérateurs et de la mise à disposition des outils permettant d'optimiser la gestion du parc. Elle pilote le réseau des responsables de la politique immobilière de l'Etat en région et anime également les services locaux du domaine implantés sur tout le territoire. Elle assure également, sous l'autorité du secrétaire d'Etat au budget, la présidence de la conférence nationale de l'immobilier public.
in scheme: FINANCES PUBLIQUES
in scheme: Organisation Structurelle de l'Etat
in scheme: Ministère
in scheme: Administration de L'Etat
narrower: refip-REFIP7085
notation: REFIP5591
related: refip-REFIP7086
scope note: Remplace le Service France Domaine depuis le 22 septembre 2016

portail CHORUS PRO
type: ConceptReFip
type: Concept
alternative label: CHORUS PRO
broader: applications missions transverses (non-descripteur)
definition: Outil permettant aux fournisseurs du secteur public de transmettre leurs factures de façon dématérialisée.
in scheme: FINANCES PUBLIQUES
in scheme: Applications missions transverses
in scheme: Applications Informatiques
notation: REFIP5592

allocation compensatrice
type: ConceptReFip
type: Concept
broader: coopération intercommunale
definition: Allocation versée par l'Etat aux établissements publics de coopération intercommunale (EPCI) compensant en totalité ou en partie les pertes de recettes consécutives à certaines mesures d'exonération, de réduction des bases ou de plafonnement des taux prises par le législateur en matière de fiscalité directe locale. Les allocations compensatrices viennent en diminution du produit global attendu de la fiscalité directe locale pour la détermination du produit attendu des quatre taxes directes locales.
in scheme: FINANCES PUBLIQUES
in scheme: Secteur public local
in scheme: Gestion Publique
notation: REFIP5593

criminalité
type: ConceptReFip
type: Concept
broader: refip-REFIP6877
definition: Ensemble des crimes et délits constatés.
in scheme: FINANCES PUBLIQUES
in scheme: Questions Politiques Relations Internationales
in scheme: Politique
in scheme: Questions de Société
notation: REFIP5594

comptable agrée
type: ConceptReFip
type: Concept
broader: activité libérale
definition: Technicien comptable qui, en son nom propre et sous sa responsabilité, fait profession de tenir, centraliser, arrêter, surveiller les comptabilités et comptes de toute nature.
in scheme: FINANCES PUBLIQUES
in scheme: Branche d'activité
in scheme: Questions Economiques
in scheme: Services et professions libérales
notation: REFIP5595
related: centre de gestion agréé

comptabilité publique locale
type: ConceptReFip
type: Concept
broader: secteur public local
definition: Comptabilité des collectivités territoriales tenue par les comptables du Trésor. Différentes comptabilités sont applicables au secteur public local, selon le type de collectivités (communes, départements, régions) et selon la nature de l'activité exercée s'il s'agit d'un établissement public local.
in scheme: FINANCES PUBLIQUES
in scheme: Secteur public local
in scheme: Gestion Publique
narrower: comptabilité M 41
narrower: comptabilité M 71
narrower: comptabilité M 61
narrower: comptabilité M 92
narrower: comptabilité M 42
narrower: comptabilité M 31
narrower: comptabilité M 14
narrower: comptabilité M 57
narrower: comptabilité M 21
narrower: comptabilité M 43
narrower: comptabilité M 99
narrower: comptabilité M 4
narrower: comptabilité M 52
narrower: comptabilité M 91
narrower: comptabilité M 832
narrower: comptabilité M 831
narrower: comptabilité M 51
narrower: comptabilité M 22
narrower: comptabilité M 93
narrower: refip-REFIP7049
narrower: refip-REFIP7050
narrower: refip-REFIP712
narrower: refip-REFIP890
notation: REFIP5596

commissionnaire
type: ConceptReFip
type: Concept
alternative label: commissionnaire de transport
alternative label: commissionnaire en douane
broader: commerce
definition: Intermédiaire de commerce qui agit en son nom mais pour le compte d'un commettant dans les limites du mandat qui lui est conféré et pour les opérations qui lui sont confiées.
in scheme: FINANCES PUBLIQUES
in scheme: Branche d'activité
in scheme: Questions Economiques
in scheme: Commerce
notation: REFIP5597

application HERA
type: ConceptReFip
type: Concept
alternative label: HERA
broader: applications gestion publique (non-descripteur)
definition: Application utilisée pour le rapprochement comptable entre les virements « tiers-payants » des Mutuelles, reçus par les comptables de la DGFiP sur leur compte Banque de France,en règlement de facturations hospitalières et les restes à recouvrer présents dans l’application Hélios, qui sont le reflet comptable de ces facturations hospitalières.
in scheme: FINANCES PUBLIQUES
in scheme: Applications Informatiques
in scheme: Applications gestion publique
notation: REFIP5598

application VISUDGFIP
type: ConceptReFip
type: Concept
alternative label: VISUDGFIP
broader: applications fiscales (non-descripteur)
definition: Support de la documentation cadastrale et fiscale mis à disposition des services de la DGFiP et des collectivités territoriales.
in scheme: FINANCES PUBLIQUES
in scheme: Applications Informatiques
in scheme: Applications fiscales
notation: REFIP5599

déclaration des comptes financiers en France (supprimé)
type: ConceptReFip
type: Concept
broader: ZZ
in scheme: FINANCES PUBLIQUES
notation: REFIP56

avantage en nature
type: ConceptReFip
type: Concept
broader: accessoire du salaire
definition: Fourniture par l’employeur à ses salariés de biens ou services soit gratuitement, soit moyennant une participation du salarié inférieure à leur valeur réelle.
in scheme: FINANCES PUBLIQUES
in scheme: Entreprises
in scheme: Travail
in scheme: 212619
notation: REFIP560

application LAER
type: ConceptReFip
type: Concept
replaces: application LASER DE SIMPLIFICATION DES ECHANGES (obsolète)
replaces: application LASER D'ANALYSE FINANCIERE (obsolète)
replaces: refip-REFIP680
alternative label: LASER MCIR
alternative label: application LASER D'ANALYSE FINANCIERE
alternative label: application LASER DE SIMPLIFICATION DES ECHANGES
alternative label: application LASER MULTICRITERES
alternative label: application de simplification des échanges réciproques
alternative label: logiciel d'analyse financière simplifiée des entreprises réseau de la DGFIP
alternative label: plateforme d'échanges LASER
broader: applications missions transverses (non-descripteur)
definition: Application de simplification des échanges réciproques permettant l'organisation en mode dématérialisé de certains échanges de documents entre les chambres régionales des comptes et les directions départementales et régionales des finances publiques correspondantes relevant de leur ressort géographique.
in scheme: FINANCES PUBLIQUES
in scheme: Applications missions transverses
in scheme: Applications Informatiques
notation: REFIP5600

scolarité
type: ConceptReFip
type: Concept
broader: enseignement
definition: Durée d'un cycle d'études, ou cours d'études dans un établissement d'enseignement.
in scheme: FINANCES PUBLIQUES
in scheme: Famille Education Population
in scheme: Enseignement
in scheme: Questions de Société
notation: REFIP5601

Journal d'annonces légales
type: ConceptReFip
type: Concept
alternative label: JAL
broader: document administratif
definition: Périodique d'information habilité à collecter, recevoir et publier les annonces légales des sociétés commerciales et civiles.
in scheme: FINANCES PUBLIQUES
in scheme: Documentation
in scheme: Communication Documentation Informatique
notation: REFIP5602

prélèvement à la source
type: ConceptReFip
type: Concept
alternative label: PAS
broader: paiement de l'impôt
definition: Mode de recouvrement de l’impôt, consistant à faire prélever son montant par un tiers payeur, le plus souvent l’employeur ou le banquier, au moment du versement au contribuable des revenus sur lesquels porte l’impôt.
in scheme: FINANCES PUBLIQUES
in scheme: Recouvrement
in scheme: Fiscalité
narrower: retenue à la source
narrower: refip-REFIP7109
notation: REFIP5603

déclaration d'impôt de solidarité sur la fortune
type: ConceptReFip
type: Concept
alternative label: déclaration d'ISF
broader: refip-REFIP804
definition: Formulaire n° 2725-ISF (Cerfa n°11284*17) devant être souscrit par toute personne physique ayant son domicile fiscal en France, à raison des biens situés en France ou hors de France, lorsque la valeur de son patrimoine dépasse un certain montant.
in scheme: FINANCES PUBLIQUES
in scheme: Documentation Fiscale
in scheme: Fiscalité
notation: REFIP5604

délivrance
type: ConceptReFip
type: Concept
broader: mots outils (liste additive)
definition: Ensemble des infractions et délits commis.
in scheme: FINANCES PUBLIQUES
in scheme: Mots Outils
notation: REFIP5605

application CHORUS FORMULAIRES
type: ConceptReFip
type: Concept
alternative label: CHORUS FORMULAIRES
alternative label: formulaire CHORUS
broader: applications gestion publique (non-descripteur)
definition: Outil de communication permettant de tracer et suivre les échanges entre les services métiers non dotés de Chorus et les plates-formes de gestion et/ou services facturier.
in scheme: FINANCES PUBLIQUES
in scheme: Applications Informatiques
in scheme: Applications gestion publique
notation: REFIP5606

WIFIP
type: ConceptReFip
type: Concept
broader: applications missions transverses (non-descripteur)
definition: Réseau collaboratif de la DGFIP permettant, via une plateforme informatique sécurisée, d'échanger et de partager sur des projets professionnels.
in scheme: FINANCES PUBLIQUES
in scheme: Applications missions transverses
in scheme: Applications Informatiques
notation: REFIP5607
related: réseau collaboratif

fonction financière
type: ConceptReFip
type: Concept
broader: fonction de la Direction générale des finances publiques (non-descripteur)
definition: Fonction pouvant recouvrer les domaines de l'expertise juridique et financière, de l’aide au pilotage, de l'exécution budgétaire et comptable ainsi que l'élaboration et le suivi de la programmation.
in scheme: FINANCES PUBLIQUES
in scheme: Personnels et fonctions
in scheme: Fonction de la Direction générale des Finances publiques (NON DESCRIPTEUR)
in scheme: Fonction Publique et Gestion des Ressources Humaines
notation: REFIP5608

facilités d'horaires
type: ConceptReFip
type: Concept
replaces: facilité d'horaires (supprimé)
alternative label: facilités horaires
broader: aménagement d'horaire
definition: Aménagement d'horaires pouvant être accordé aux agents de la fonction publique notamment pour la rentrée scolaire, les personnels handicapés, ou pour l'exercice des activités syndicales.
in scheme: FINANCES PUBLIQUES
in scheme: Gestion des ressources humaines
in scheme: Temps de travail
in scheme: Fonction Publique et Gestion des Ressources Humaines
notation: REFIP5609

contrat d'accompagnement dans l'emploi
type: ConceptReFip
type: Concept
alternative label: CUI-CAE
broader: contrat unique d'insertion
definition: Contrat de travail à durée déterminée, destiné à faciliter l'insertion professionnelle des personnes sans emploi rencontrant des difficultés sociales et professionnelles particulières d'accès à l'emploi.
in scheme: FINANCES PUBLIQUES
in scheme: Contrat de Travail
in scheme: Entreprises
in scheme: Travail
notation: REFIP561

marché de partenariat
type: ConceptReFip
type: Concept
replaces: refip-REFIP90
alternative label: PPP
alternative label: contrat de partenariat
alternative label: contrat de partenariat public privé
alternative label: partenariat public privé
broader: commande publique
definition: Marché public permettant de confier à un opérateur économique ou à un groupement d’opérateurs économiques une mission globale concernant la construction, la transformation, la rénovation, le démantèlement ou la destruction d’ouvrages, d’équipements ou de biens immatériels nécessaires au service public ou à l’exercice d’une mission d’intérêt général ainsi qu’une partie ou la totalité de leur financement. Le titulaire du marché de partenariat assure la maîtrise d'ouvrage de l'opération à réaliser.
in scheme: FINANCES PUBLIQUES
in scheme: Commande publique
in scheme: Gestion Publique
notation: REFIP5610

centre de contact
type: ConceptReFip
type: Concept
broader: direction régionale des finances publiques
definition: Structure chargée de prendre en charge les appels téléphoniques entrants et les courriels adressés par les usagers particuliers privilégiant les relations à distance. Elle a pour objectif d'alléger les charges d’accueil à distance des Services des Impôts des Particuliers, des trésoreries mixtes et des Centres des Impôts Fonciers de l’ensemble du département.
in scheme: FINANCES PUBLIQUES
in scheme: Organisation Structurelle de l'Etat
in scheme: Ministère
in scheme: Administration de L'Etat
notation: REFIP5611

Pôle juridictionnel
type: ConceptReFip
type: Concept
alternative label: Pôle juridictionnel administratif
alternative label: Pôle juridictionnel judiciaire
broader: direction régionale des finances publiques
definition: Structure chargée du traitement du contentieux juridictionnel de la direction générale des finances publiques devant les tribunaux administratifs ainsi que devant les juridictions civiles.
in scheme: FINANCES PUBLIQUES
in scheme: Organisation Structurelle de l'Etat
in scheme: Ministère
in scheme: Administration de L'Etat
notation: REFIP5612

service d'appui au réseau
type: ConceptReFip
type: Concept
alternative label: SAR
broader: direction régionale des finances publiques
definition: Service agissant pour le compte d'un comptable public, qui reste responsable personnellement et pécuniairement, et exerçant notamment à distance le contrôle et le paiement de la dépense locale, ainsi que le recouvrement des produits locaux d'une ou de plusieurs collectivités, dont les pièces comptables et justificatives sont dématérialisées.
in scheme: FINANCES PUBLIQUES
in scheme: Organisation Structurelle de l'Etat
in scheme: Ministère
in scheme: Administration de L'Etat
notation: REFIP5613

mission nationale d'appui aux organisations innovantes
type: ConceptReFip
type: Concept
alternative label: MNAOI
broader: administration centrale des finances publiques
definition: Service national d'appui aux organisations innovantes en matière de gestion publique locale et hospitalière.
in scheme: FINANCES PUBLIQUES
in scheme: Organisation Structurelle de l'Etat
in scheme: Ministère
in scheme: Administration de L'Etat
notation: REFIP5614

maison des services aux publics
type: ConceptReFip
type: Concept
broader: structure locale (non-descripteur)
definition: Structure destinée à regrouper différents services publics au bénéfice des usagers, essentiellement en zone rurale. Portées par une mairie, une intercommunalité ou un service de l'état, elles accueillent une palette diversifiée de services et de partenaires associés.
in scheme: FINANCES PUBLIQUES
in scheme: Organisation Territoriale
in scheme: Structures Territoriales
in scheme: Administration de L'Etat
notation: REFIP5615

brigade nationale de répression de la délinquance fiscale
type: ConceptReFip
type: Concept
alternative label: BNRDF
alternative label: police fiscale
broader: police judiciaire
definition: Service de l'Etat chargé de la lutte contre la corruption et les infractions financières et fiscales, placé au sein de la direction centrale de la police judiciaire du Ministère de l'Intérieur et constitué de policiers et agents des finances publiques, appelés officiers fiscaux judiciaires lorsqu'ils sont affectés à cette brigade.
in scheme: FINANCES PUBLIQUES
in scheme: Organisation Structurelle de l'Etat
in scheme: Ministère
in scheme: Administration de L'Etat
notation: REFIP5616

comptabilité M 831
type: ConceptReFip
type: Concept
broader: comptabilité publique locale
definition: Instruction M 831 applicable au Centre National de la Fonction Publique Territoriale
in scheme: FINANCES PUBLIQUES
in scheme: Secteur public local
in scheme: Gestion Publique
notation: REFIP5617

prime d'accueil
type: ConceptReFip
type: Concept
broader: indemnité
definition: Indemnisation des agents exerçant de façon permanente des missions d'accueil physique généraliste.
in scheme: FINANCES PUBLIQUES
in scheme: Gestion des ressources humaines
in scheme: Rémunération
in scheme: Fonction Publique et Gestion des Ressources Humaines
notation: REFIP5618

prêt viager hypothécaire
type: ConceptReFip
type: Concept
broader: hypothèque conventionnelle
in scheme: FINANCES PUBLIQUES
in scheme: Recouvrement
in scheme: Fiscalité
notation: REFIP5619

véhicule à deux roues
type: ConceptReFip
type: Concept
alternative label: deux roues
alternative label: moto
alternative label: motocyclette
alternative label: scooter
alternative label: vélomoteur
broader: véhicule terrestre à moteur
definition: Véhicule à deux roues destiné au transport d'une ou 2 personnes.
in scheme: FINANCES PUBLIQUES
in scheme: Branche d'activité
in scheme: Questions Economiques
in scheme: Transports
notation: REFIP562

hypothèque conventionnelle
type: ConceptReFip
type: Concept
broader: hypothèque
definition: Hypothèque résultant des conventions, créée par un contrat conclu entre le créancier (le stipulant), qui entend garantir sa créance au moyen d'une sûreté, et le débiteur (le constituant) qui la concède sur ses biens.
in scheme: FINANCES PUBLIQUES
in scheme: Recouvrement
in scheme: Fiscalité
narrower: hypothèque rechargeable
narrower: prêt viager hypothécaire
notation: REFIP5620

application ISA
type: ConceptReFip
type: Concept
broader: applications missions transverses (non-descripteur)
definition: Intranet de Suivi des Actions, développée par la mission Risques et audit afin d'améliorer la simplicité la transparence et la fluidité du suivi des plans d’actions en administration centrale faisant suite aux audits de la MRA ou aux opérations d'organismes externes.
in scheme: FINANCES PUBLIQUES
in scheme: Applications missions transverses
in scheme: Applications Informatiques
notation: REFIP5621

application JAM
type: ConceptReFip
type: Concept
alternative label: JAM
broader: applications fiscales (non-descripteur)
definition: Application de suivi de l'exécution des jours-amendes prononcés par une juridiction.
in scheme: FINANCES PUBLIQUES
in scheme: Applications Informatiques
in scheme: Applications fiscales
notation: REFIP5622

application OSCAR
type: ConceptReFip
type: Concept
broader: applications missions transverses (non-descripteur)
definition: Outil de suivi centralisé des audits diagnostic de régularité (ADR) du réseau.
in scheme: FINANCES PUBLIQUES
in scheme: Applications missions transverses
in scheme: Applications Informatiques
notation: REFIP5623

acompte provisionnel
type: ConceptReFip
type: Concept
replaces: tiers provisionnel (obsolète)
broader: acompte d'impôt
definition: Paiement de l'impôt de manière échelonné et en partie avant la mise en recouvrement de l'impôt.
in scheme: FINANCES PUBLIQUES
in scheme: Recouvrement
in scheme: Fiscalité
notation: REFIP5624

indemnité pour travail du dimanche et des jours fériés
type: ConceptReFip
type: Concept
replaces: indemnité horaire pour travail du dimanche et des jours fériés (supprimé)
replaces: indemnité forfaitaire pour travail dimanche et jours fériés (supprimé)
alternative label: indemnité forfaitaire pour travail du dimanche et des jours fériés
alternative label: indemnité horaire pour travail du dimanche et des jours fériés
broader: indemnité
definition: Rémunération accessoire versée aux agents de la fonction publique visant à rétribuer le travail effectué le dimanche et/ou les jours fériés.
in scheme: FINANCES PUBLIQUES
in scheme: Gestion des ressources humaines
in scheme: Rémunération
in scheme: Fonction Publique et Gestion des Ressources Humaines
notation: REFIP5625

audit diagnostic de régularité
type: ConceptReFip
type: Concept
alternative label: ADR
broader: audit
definition: Audit visant à s'assurer de la régularité des chaînes de travail d'un service et non de de leurs résultats, et permettant d'obtenir un diagnostic rapide sur le fonctionnement d'un service.
in scheme: FINANCES PUBLIQUES
in scheme: Audit
in scheme: Missions Transverses des Finances publiques
notation: REFIP5626

Pôle de contrôle des revenus et du patrimoine
type: ConceptReFip
type: Concept
alternative label: PCRP
broader: direction départementale des finances publiques
definition: Pôle de la DGFIP chargé de procéder à l'examen global du dossier fiscal des particuliers (revenu et du patrimoine).
in scheme: FINANCES PUBLIQUES
in scheme: Organisation Structurelle de l'Etat
in scheme: Ministère
in scheme: Administration de L'Etat
notation: REFIP5627

congé de solidarité familiale
type: ConceptReFip
type: Concept
replaces: congé d'accompagnement d'une personne en fin de vie (supprimé)
broader: refip-REFIP6657
definition: Congé de droit durant lequel l’agent peut, soit cesser totalement son activité, soit l’exercer sous forme fractionnée ou à temps partiel, pour rester auprès d’une personne qui souffre d’une pathologie mettant en jeu le pronostic vital, ou qui se trouve en phase avancée ou terminale d’une affection grave et incurable.
in scheme: FINANCES PUBLIQUES
in scheme: Gestion des ressources humaines
in scheme: Statut du fonctionnaire
in scheme: Fonction Publique et Gestion des Ressources Humaines
notation: REFIP5628

aide aux rapatriés
type: ConceptReFip
type: Concept
alternative label: aide au désendettement des rapatriés
alternative label: reclassement social et professionnel des rapatriés
broader: action sociale
definition: Dispositif qui accompagne les populations de rapatriés et leurs enfants dans leurs différentes démarches pour une meilleure reconnaissance de leurs droits.
in scheme: FINANCES PUBLIQUES
in scheme: Santé et Protection Sociale
in scheme: Protection Sociale
in scheme: Questions de Société
notation: REFIP5629
related: refip-REFIP6774

imposition d'office
type: ConceptReFip
type: Concept
broader: procédure de contrôle fiscal
definition: Procédure de rectification, dérogatoire du droit commun, applicable en cas de défaillance du contribuable et uniquement dans des cas limitativement énumérées par la Loi. Elle offre des garanties minimales au contribuable. La charge de la preuve incombe au contribuable. Elle prend la forme d’une taxation d’office ou d’une évaluation d’office selon le type de revenus concerné.
in scheme: FINANCES PUBLIQUES
in scheme: Droit de Reprise de l'Administration
in scheme: Fiscalité
narrower: taxation d'office
narrower: évaluation d'office
notation: REFIP563

aménagement urbain
type: ConceptReFip
type: Concept
alternative label: aménagement immobilier
alternative label: politique d'aménagement urbain
broader: refip-REFIP6936
definition: Actions ou opérations d’aménagement ayant pour objets de mettre en œuvre un projet urbain, une politique locale de l’habitat, d’organiser le maintien, l’extension ou l’accueil des activités économiques, de favoriser le développement des loisirs et du tourisme, de réaliser des équipements collectifs ou des locaux de recherche ou d’enseignement supérieur, de lutter contre l’insalubrité, de permettre le renouvellement urbain, de sauvegarder ou de mettre en valeur le patrimoine bâti ou non bâti et les espaces naturels.
in scheme: FINANCES PUBLIQUES
in scheme: Aménagement du territoire Urbanisme Habitat
in scheme: Aménagement du Territoire
in scheme: Questions de Société
narrower: espace vert
narrower: lotissement
narrower: mobilier urbain
narrower: refip-REFIP6850
notation: REFIP5630

assurance vieillesse
type: ConceptReFip
type: Concept
broader: refip-REFIP6796
definition: Système assurant un revenu aux Français en âge de la retraite et ayant suffisamment cotisé au préalable. La retraite des salariés est composée d'une retraite de base et d'une ou plusieurs retraites complémentaires.
in scheme: FINANCES PUBLIQUES
in scheme: Santé et Protection Sociale
in scheme: Protection Sociale
in scheme: Questions de Société
narrower: refip-REFIP6790
notation: REFIP5631

attaché fiscal
type: ConceptReFip
type: Concept
broader: fonction de la Direction générale des finances publiques (non-descripteur)
definition: Agent ayant pour mission de faciliter la coopération avec les administrations fiscales étrangères. Il est plus particulièrement en charge de l’échange de renseignements à des fins fiscales ainsi que des études comparatives ou prospectives sur des sujets du ressort de la DGFiP, tant en matière de fiscalité et de gestion publique que de pilotage, de management et de ressources humaines.
in scheme: FINANCES PUBLIQUES
in scheme: Personnels et fonctions
in scheme: Fonction de la Direction générale des Finances publiques (NON DESCRIPTEUR)
in scheme: Fonction Publique et Gestion des Ressources Humaines
notation: REFIP5632

activité d'importance vitale
type: ConceptReFip
type: Concept
alternative label: plan ORSEC
alternative label: plan Vigipirate
broader: refip-REFIP6877
definition: Ensemble des activités qui soit ont trait, de manière difficilement substituable ou remplaçable, à la production et la distribution de biens ou de services indispensables, soit peuvent présenter un danger grave pour la population. Ces biens ou services doivent être indispensables à la satisfaction des besoins essentiels pour la vie des populations, ou à l'exercice de l'autorité de l'Etat, ou au fonctionnement de l'économie, ou au maintien du potentiel de défense, ou à la sécurité de la nation.
in scheme: FINANCES PUBLIQUES
in scheme: Questions Politiques Relations Internationales
in scheme: Politique
in scheme: Questions de Société
notation: REFIP5633

allocation de solidarité aux personnes âgées
type: ConceptReFip
type: Concept
alternative label: ASPA
alternative label: minimum vieillesse
broader: refip-REFIP6700
definition: Prestation permettant d'assurer un niveau minimum de ressources aux personnes âgées disposant de faibles revenus.
in scheme: FINANCES PUBLIQUES
in scheme: Santé et Protection Sociale
in scheme: Protection Sociale
in scheme: Questions de Société
notation: REFIP5634

assurance décès
type: ConceptReFip
type: Concept
alternative label: branche décès
broader: refip-REFIP6796
definition: Versement, sous certaines conditions,d' une prestation financière aux proches de la personne décédée qui a souscrit une assurance.
in scheme: FINANCES PUBLIQUES
in scheme: Santé et Protection Sociale
in scheme: Protection Sociale
in scheme: Questions de Société
notation: REFIP5635
related: capital décès

assistant familial
type: ConceptReFip
type: Concept
broader: services et professions libérales (non-descripteur)
definition: L’assistant familial exerce une profession définie et réglementée d’accueil permanent à son domicile et dans sa famille de mineurs ou de jeunes majeurs de 18 à 21 ans. L’accueil peut être organisé au titre de la protection de l’enfance ou d’une prise en charge médico-sociale ou thérapeutique. L’assistant familial doit être titulaire d’un agrément délivré par le président du conseil général après vérification que ses conditions d’accueil garantissent la santé, la sécurité et l’épanouissement des mineurs accueillis.
in scheme: FINANCES PUBLIQUES
in scheme: Branche d'activité
in scheme: Questions Economiques
in scheme: Services et professions libérales
notation: REFIP5636

attaché principal d'administration
type: ConceptReFip
type: Concept
alternative label: attaché principal
broader: fonction publique de l'Etat
definition: Fonctionnaire d’État de catégorie A est un cadre qui participe, au sein des directions et des services centraux, aux missions de conception, d'élaboration et de mise en œuvre des politiques publiques ministérielles et interministérielles. Le plus souvent, il est chargé de piloter et de gérer les moyens humains, budgétaires et techniques d’une unité administrative.
in scheme: FINANCES PUBLIQUES
in scheme: Personnels et fonctions
in scheme: Fonction publique
in scheme: Fonction Publique et Gestion des Ressources Humaines
notation: REFIP5637

allocation aux vieux travailleurs salariés (supprimé)
type: ConceptReFip
type: Concept
broader: ZZ
in scheme: FINANCES PUBLIQUES
notation: REFIP5638

adaptation à l'emploi (obsolète)
type: ConceptReFip
type: Concept
is replaced by: refip-REFIP7087
broader: ZZ
in scheme: FINANCES PUBLIQUES
notation: REFIP5639

programme PVFI
type: ConceptReFip
type: Concept
alternative label: PVFI
alternative label: pour vous faciliter l'impôt
broader: qualité de service
definition: Programme de qualité de service anciennement appliqué dans l'administration fiscale mais qui a été remplacé par le référentiel interministériel Marianne.
in scheme: FINANCES PUBLIQUES
in scheme: Missions Transverses des Finances publiques
in scheme: Qualité de service
notation: REFIP564

animateur hospitalier
type: ConceptReFip
type: Concept
broader: fonction publique hospitalière
definition: Fonctionnaire hospitalier de catégorie B de la filière socio-éducative.
in scheme: FINANCES PUBLIQUES
in scheme: Personnels et fonctions
in scheme: Fonction publique
in scheme: Fonction Publique et Gestion des Ressources Humaines
notation: REFIP5640

allocation personnalisée d'autonomie
type: ConceptReFip
type: Concept
alternative label: APA
alternative label: PSD
alternative label: prestation spécifique dépendance
broader: refip-REFIP6700
definition: Prestation permettant de financer une partie des dépenses nécessaires au maintien à domicile de personnes sous certaines conditions de ressources et d'âge.
in scheme: FINANCES PUBLIQUES
in scheme: Santé et Protection Sociale
in scheme: Protection Sociale
in scheme: Questions de Société
notation: REFIP5641
related: dépendance

allocation pour la diversité dans la fonction publique (supprimé)
type: ConceptReFip
type: Concept
broader: ZZ
in scheme: FINANCES PUBLIQUES
notation: REFIP5642

architecte conseil
type: ConceptReFip
type: Concept
alternative label: architecte Conseil de l'Etat
broader: fonction publique de l'Etat
definition: Fonctionnaire d’État nommé soit par le ministre en charge de l’urbanisme soit par le ministre en charge de la culture. Il intervient principalement dans les Directions départementales des territoires et dans les Directions régionales des affaires culturelles. Cependant, il peut assurer des missions spécifiques auprès des services de l'administration centrale du ministère chargé de l'aménagement du territoire. Il exerce un rôle pédagogique auprès des maîtres d’ouvrage le plus en amont possible des opérations et une mission de conseil et d’aide auprès des services, afin d’assurer une plus grande sensibilisation à l’architecture et à l’urbanisme.
in scheme: FINANCES PUBLIQUES
in scheme: Personnels et fonctions
in scheme: Fonction publique
in scheme: Fonction Publique et Gestion des Ressources Humaines
notation: REFIP5643

agent en difficulté
type: ConceptReFip
type: Concept
broader: fonctionnaire
definition: Fonctionnaire considéré en difficultés dès lors qu’il est dans l’incapacité de remplir normalement les fonctions de son grade. Les causes de cette incapacité peuvent être multiples : familiales, sociales, médicales ou purement professionnelles. Il appartient à l’administration, en sa qualité d’employeur, de veiller à ce que les acteurs médico-sociaux (médecin de prévention et assistant de service social) soient systématiquement informés de la situation de ces agents afin de pouvoir les aider à résoudre, dans la mesure du possible, leurs difficultés. Il appartient également à l’administration de saisir le comité médical lorsque la position de l’agent en congé pour raison de santé se prolonge au-delà de 6 mois consécutifs.
in scheme: FINANCES PUBLIQUES
in scheme: Personnels et fonctions
in scheme: Fonction publique
in scheme: Fonction Publique et Gestion des Ressources Humaines
notation: REFIP5644

adulte-relais
type: ConceptReFip
type: Concept
broader: action sociale
definition: Contrat d'insertion assurant des missions de médiation sociale et culturelle de proximité.
in scheme: FINANCES PUBLIQUES
in scheme: Santé et Protection Sociale
in scheme: Protection Sociale
in scheme: Questions de Société
notation: REFIP5645

assurance personnelle
type: ConceptReFip
type: Concept
broader: responsabilité des comptables
definition: Garantie facultative prise par le comptable public pour couvrir les risques financiers liés à sa gestion et à sa responsabilité personnelle et pécuniaire, lui permettant de payer le montant laissé à sa charge après épuisement des voies de recours, notamment après demande en remise gracieuse.
in scheme: FINANCES PUBLIQUES
in scheme: Responsabilité des comptables
in scheme: Missions Transverses des Finances publiques
notation: REFIP5646
scope note: Responsabilité des comptables

animateur territorial
type: ConceptReFip
type: Concept
broader: fonction publique territoriale
definition: Fonctionnaire territorial de catégorie B participant à l'élaboration des projets enfance et jeunesse. Il accueille et anime des groupes d'enfants en activités éducatives. Il participe également à l'encadrement des enfants pendant l'interclasse du midi, les temps périscolaires et extrascolaires. Il conçoit, propose et met en œuvre des activités d'animation et de loisirs dans le cadre du projet éducatif du service ou de l'équipement.
in scheme: FINANCES PUBLIQUES
in scheme: Personnels et fonctions
in scheme: Fonction publique
in scheme: Fonction Publique et Gestion des Ressources Humaines
notation: REFIP5647

activité
type: ConceptReFip
type: Concept
broader: refip-REFIP6657
definition: Position du fonctionnaire qui, titulaire d'un grade, exerce effectivement les fonctions de l'un des emplois correspondant à ce grade.
in scheme: FINANCES PUBLIQUES
in scheme: Gestion des ressources humaines
in scheme: Statut du fonctionnaire
in scheme: Fonction Publique et Gestion des Ressources Humaines
narrower: activité accessoire
narrower: cumul d'activités
notation: REFIP5648
scope note: Position statutaire du fonctionnaire

assistant social
type: ConceptReFip
type: Concept
alternative label: assistant de service social
broader: fonction publique territoriale
definition: Fonctionnaire territorial de catégorie A intervenant auprès des personnes en proie à des difficultés familiales, professionnelles, financières. L’assistant social conseille et apporte un soutien sur tout ce qui touche à la vie quotidienne : informe notamment ses interlocuteurs sur leurs droits (RSA, allocation de rentrée…), leur indique les démarches à entreprendre pour envoyer les enfants en centre de vacances à moindres frais, pour faire une demande de logement social..
in scheme: FINANCES PUBLIQUES
in scheme: Personnels et fonctions
in scheme: Fonction publique
in scheme: Fonction Publique et Gestion des Ressources Humaines
notation: REFIP5649

local nu
type: ConceptReFip
type: Concept
alternative label: immeuble nu
broader: local
definition: Local non meublé.
in scheme: FINANCES PUBLIQUES
in scheme: Cadastre
in scheme: Fiscalité
notation: REFIP565

aide humanitaire
type: ConceptReFip
type: Concept
broader: refip-REFIP6655
definition: Aide d'urgence et ponctuelle mise en place lors d'une situation de crise exceptionnelle ou de catastrophe naturelle.
in scheme: FINANCES PUBLIQUES
in scheme: Santé et Protection Sociale
in scheme: Protection Sociale
in scheme: Questions de Société
narrower: refip-REFIP6860
notation: REFIP5650

administrateur civil
type: ConceptReFip
type: Concept
broader: fonction publique de l'Etat
definition: Haut fonctionnaire de l’État, appartenant au corps des administrateurs civils, à vocation interministérielle relevant du Premier ministre, exerçant des fonctions supérieures d'encadrement, de direction, d'expertise ou de contrôle dans les administrations et les établissements publics administratifs de l'État.
in scheme: FINANCES PUBLIQUES
in scheme: Personnels et fonctions
in scheme: Fonction publique
in scheme: Fonction Publique et Gestion des Ressources Humaines
notation: REFIP5651

adjoint administratif des administrations de l'Etat
type: ConceptReFip
type: Concept
broader: fonction publique de l'Etat
definition: Fonctionnaire de l’État de catégorie C, chargé de tâches administratives d’exécution comportant la connaissance et l’application de règlements administratifs. Il peut être également chargé de l' accueil et de l'orientation du public, de la réception des appels téléphoniques, du classement des dossiers et des autres tâches de secrétariat et de comptabilité.
in scheme: FINANCES PUBLIQUES
in scheme: Personnels et fonctions
in scheme: Fonction publique
in scheme: Fonction Publique et Gestion des Ressources Humaines
notation: REFIP5652

autorisation de prélèvement
type: ConceptReFip
type: Concept
alternative label: formulaire d'autorisation de prélèvement
broader: refip-REFIP6610
definition: Document signé par le titulaire d'un compte autorisant l'établissement bancaire teneur de celui-ci à régler un prélèvement présenté par son créancier.
in scheme: FINANCES PUBLIQUES
in scheme: Moyen de paiement
in scheme: Finance
notation: REFIP5653

accident de trajet
type: ConceptReFip
type: Concept
broader: refip-REFIP6828
definition: Accident survenu pendant le trajet d'aller et/ou retour entre la résidence habituelle et le lieu de travail de l'agent, entre le lieu de travail et l'endroit habituel de restauration.
in scheme: FINANCES PUBLIQUES
in scheme: Gestion des ressources humaines
in scheme: Conditions de travail
in scheme: Fonction Publique et Gestion des Ressources Humaines
notation: REFIP5654

accueil des élèves
type: ConceptReFip
type: Concept
alternative label: accueil des stagiaires
alternative label: accueil des étudiants
broader: enseignement
definition: Accueil et suivi des élèves durant la totalité de leur séjour dans l'établissement.
in scheme: FINANCES PUBLIQUES
in scheme: Famille Education Population
in scheme: Enseignement
in scheme: Questions de Société
notation: REFIP5655

allocation familiale
type: ConceptReFip
type: Concept
broader: refip-REFIP6589
definition: Prestation mensuelle versée aux personnes ayant des enfants à charge et remplissant les conditions requises.
in scheme: FINANCES PUBLIQUES
in scheme: Santé et Protection Sociale
in scheme: Protection Sociale
in scheme: Questions de Société
notation: REFIP5656

assurance maladie complémentaire
type: ConceptReFip
type: Concept
alternative label: couverture maladie complémentaire
alternative label: régime complémentaire
broader: assurance maladie
definition: Système d'assurance maladie complétant celui de la Sécurité sociale en intervenant sous forme d'un complément de remboursement des soins.
in scheme: FINANCES PUBLIQUES
in scheme: Santé et Protection Sociale
in scheme: Protection Sociale
in scheme: Questions de Société
notation: REFIP5657

avancement
type: ConceptReFip
type: Concept
broader: carrière
definition: Progression de carrière dans l'administration.
in scheme: FINANCES PUBLIQUES
in scheme: Gestion des ressources humaines
in scheme: Carrière
in scheme: Fonction Publique et Gestion des Ressources Humaines
narrower: avancement de corps
narrower: avancement au choix
narrower: avancement d'échelon
narrower: avancement de grade
narrower: liste d'aptitude
narrower: refip-REFIP6652
narrower: refip-REFIP6917
notation: REFIP5658
scope note: Ressources humaines

agent territorial
type: ConceptReFip
type: Concept
broader: fonction publique territoriale
definition: Agent de la Fonction publique territoriale.
in scheme: FINANCES PUBLIQUES
in scheme: Personnels et fonctions
in scheme: Fonction publique
in scheme: Fonction Publique et Gestion des Ressources Humaines
narrower: administrateur de la Ville de Paris
narrower: agent technique territorial
narrower: agent recenseur
narrower: agent administratif territorial
notation: REFIP5659

suspension de l'exigibilité des créances
type: ConceptReFip
type: Concept
broader: exigibilité
definition: Suspension du droit que peut faire valoir l'administration fiscale auprès d'un redevable pour obtenir le paiement de l'impôt.
in scheme: FINANCES PUBLIQUES
in scheme: Recouvrement
in scheme: Fiscalité
notation: REFIP566

aptitude physique
type: ConceptReFip
type: Concept
alternative label: inaptitude physique
broader: carrière
definition: Appréciation établie par le médecin du travail quant à la possibilité ou l'impossibilité, pour un agent d’effectuer le travail qui lui est confié en fonction de son état de santé.
in scheme: FINANCES PUBLIQUES
in scheme: Gestion des ressources humaines
in scheme: Carrière
in scheme: Fonction Publique et Gestion des Ressources Humaines
notation: REFIP5660
related: refip-REFIP6962
related: refip-REFIP959

avancement de corps
type: ConceptReFip
type: Concept
broader: avancement
definition: Passage d'un corps à un corps supérieur.
in scheme: FINANCES PUBLIQUES
in scheme: Gestion des ressources humaines
in scheme: Carrière
in scheme: Fonction Publique et Gestion des Ressources Humaines
notation: REFIP5661

affectation
type: ConceptReFip
type: Concept
broader: carrière
definition: Lieu d'exercice des fonctions d'un agent ou mission se rattachant à un poste de travail.
in scheme: FINANCES PUBLIQUES
in scheme: Gestion des ressources humaines
in scheme: Carrière
in scheme: Fonction Publique et Gestion des Ressources Humaines
narrower: refip-REFIP6755
narrower: refip-REFIP6772
narrower: refip-REFIP6874
narrower: refip-REFIP7051
narrower: refip-REFIP7056
notation: REFIP5662
scope note: Ressources humaines

administrateur de la Ville de Paris
type: ConceptReFip
type: Concept
broader: agent territorial
definition: Corps, placé sous l'autorité du maire de Paris et classé dans la catégorie A, exerçant des fonctions supérieures d'encadrement, de direction, d'expertise ou de contrôle dans les services de la commune de Paris et du département de Paris, ainsi que dans les établissements publics qui en relèvent.
in scheme: FINANCES PUBLIQUES
in scheme: Personnels et fonctions
in scheme: Fonction publique
in scheme: Fonction Publique et Gestion des Ressources Humaines
notation: REFIP5663

Agence d'urbanisme
type: ConceptReFip
type: Concept
broader: refip-REFIP6936
definition: Organisme ayant pour mission de suivre les évolutions urbaines, de participer à la définition des politiques d'aménagement et de développement et à l'élaboration des documents d'urbanisme.
in scheme: FINANCES PUBLIQUES
in scheme: Aménagement du territoire Urbanisme Habitat
in scheme: Aménagement du Territoire
in scheme: Questions de Société
notation: REFIP5664

agent judiciaire de l'Etat
type: ConceptReFip
type: Concept
alternative label: agent judiciaire du Trésor
broader: fonction publique de l'Etat
definition: Fonction assurée par le directeur des affaires juridiques des ministères financiers, l'agent judiciaire de l’État a le monopole de la représentation de l’État devant les tribunaux judiciaires dans les contentieux pécuniaires.
in scheme: FINANCES PUBLIQUES
in scheme: Personnels et fonctions
in scheme: Fonction publique
in scheme: Fonction Publique et Gestion des Ressources Humaines
notation: REFIP5665

agent de service
type: ConceptReFip
type: Concept
broader: refip-REFIP6651
definition: Fonctionnaire de la Fonction Publique de catégorie C chargé de tâches de surveillance ou d'accueil, éventuellement de nettoyage ou de service hôtelier.
in scheme: FINANCES PUBLIQUES
in scheme: Personnels et fonctions
in scheme: Fonction publique
in scheme: Fonction Publique et Gestion des Ressources Humaines
notation: REFIP5666

administrateur des offices publics de l'habitat
type: ConceptReFip
type: Concept
alternative label: administrateur des OPHLM
broader: logement social
definition: Membre du conseil d'administration des OPH.
in scheme: FINANCES PUBLIQUES
in scheme: Aménagement du territoire Urbanisme Habitat
in scheme: Habitat
in scheme: Questions de Société
notation: REFIP5667

abandon de poste
type: ConceptReFip
type: Concept
broader: absentéisme
definition: Situation d'absence irrégulière et volontaire de l'agent constituant une faute professionnelle passible d'une sanction pouvant aller de l'avertissement à la radiation des cadres.
in scheme: FINANCES PUBLIQUES
in scheme: Gestion des ressources humaines
in scheme: Temps de travail
in scheme: Fonction Publique et Gestion des Ressources Humaines
notation: REFIP5668
related: faute professionnelle

avis de prélèvement
type: ConceptReFip
type: Concept
broader: refip-REFIP6610
definition: Document signé par le titulaire d'un compte autorisant l'établissement bancaire teneur de celui-ci à régler un prélèvement présenté par son créancier.
in scheme: FINANCES PUBLIQUES
in scheme: Moyen de paiement
in scheme: Finance
notation: REFIP5669

ambassade
type: ConceptReFip
type: Concept
broader: refip-REFIP7066
definition: Lieu où sont établis les locaux d'une représentation diplomatique d'un État auprès d'un autre.
in scheme: FINANCES PUBLIQUES
in scheme: Organisation Structurelle de l'Etat
in scheme: Ministère
in scheme: Administration de L'Etat
notation: REFIP567

assistant de prévention
type: ConceptReFip
type: Concept
alternative label: ACMO
alternative label: agent chargé de la mise en œuvre des règles d'hygiène et de sécurité
broader: fonction de la Direction générale des finances publiques (non-descripteur)
definition: Agent dont la mission est d’assister et de conseiller le chef de service ou l’autorité territoriale auprès duquel il est placé dans la mise en œuvre des règles de sécurité et d’hygiène au travail.Il assure la liaison avec les autres acteurs de prévention en matière d’hygiène, de sécurité et de prévention médicale. Placé au cœur du dispositif du document unique d’évaluation des risques professionnels (DUERP), c’est un acteur de terrain qui participe au recensement des risques (dont les risques psychosociaux) et à l’élaboration du programme de prévention.
in scheme: FINANCES PUBLIQUES
in scheme: Personnels et fonctions
in scheme: Fonction de la Direction générale des Finances publiques (NON DESCRIPTEUR)
in scheme: Fonction Publique et Gestion des Ressources Humaines
notation: REFIP5670

affacturage
type: ConceptReFip
type: Concept
alternative label: factoring
broader: refip-REFIP6835
definition: Technique de recouvrement de créances mise en œuvre par les entreprises et consistant à sous-traiter cette gestion à un établissement de crédit spécialisé.
in scheme: FINANCES PUBLIQUES
in scheme: Systeme bancaire et financier
in scheme: Secteur bancaire
in scheme: Finance
notation: REFIP5671

accès à la fonction publique
type: ConceptReFip
type: Concept
broader: carrière
definition: Différentes voies permettant d'intégrer la fonction publique.
in scheme: FINANCES PUBLIQUES
in scheme: Gestion des ressources humaines
in scheme: Carrière
in scheme: Fonction Publique et Gestion des Ressources Humaines
narrower: insertion des personnes handicapées
narrower: refip-REFIP6779
narrower: refip-REFIP6831
narrower: refip-REFIP6946
notation: REFIP5672
related: validation des acquis de l'expérience
related: limite d'âge

argent de poche
type: ConceptReFip
type: Concept
broader: refip-REFIP6696
definition: Somme d'argent de faible montant qu'une autorité administrative verse à un ayant-droit dont elle a la charge, afin qu'il puisse pourvoir à des besoins non essentiels qui ne sont pas déjà assumés par un autre budget.
in scheme: FINANCES PUBLIQUES
in scheme: Famille Education Population
in scheme: Population
in scheme: Questions de Société
notation: REFIP5673
scope note: Personnes hébergées

assurance loyer impayé
type: ConceptReFip
type: Concept
alternative label: garantie des risques locatifs
alternative label: garantie loyers impayés
broader: assurances (non-descripteur)
definition: Assurance, souscrite par le bailleur, prenant en charge les loyers, les charges et taxes dues, les indemnités d'occupation, en cas de défaillance du locataire, quel que soit le motif du non-paiement.
in scheme: FINANCES PUBLIQUES
in scheme: Assurances
in scheme: Finance
notation: REFIP5674

assurance-vie
type: ConceptReFip
type: Concept
broader: refip-REFIP6643
definition: Contrat par lequel l’assureur prend l’engagement, en contrepartie du versement de cotisations ou primes, de verser au souscripteur, à l’adhérent ou aux bénéficiaires que celui-ci aura désignés, un capital ou une rente, soit en cas de décès, soit en cas de survie de l’assuré, selon des modalités définies dans le contrat.
in scheme: FINANCES PUBLIQUES
in scheme: Systeme bancaire et financier
in scheme: Secteur bancaire
in scheme: Finance
notation: REFIP5675

appel de candidature
type: ConceptReFip
type: Concept
alternative label: appel à candidature
alternative label: poste à profil
alternative label: recrutement sur profil
broader: candidature
definition: Procédure mise en place dans la fonction publique pour un recrutement dans un corps ou sur des fonctions particulières.
in scheme: FINANCES PUBLIQUES
in scheme: Gestion des ressources humaines
in scheme: Carrière
in scheme: Fonction Publique et Gestion des Ressources Humaines
notation: REFIP5676

artiste
type: ConceptReFip
type: Concept
alternative label: artiste peintre
alternative label: auteur-compositeur
alternative label: écrivain
broader: activité artistique
definition: Individu qui exerce un art.
in scheme: FINANCES PUBLIQUES
in scheme: Culture et Loisirs
in scheme: Activité Artistique
in scheme: Questions de Société
notation: REFIP5677

allocation aux adultes handicapés
type: ConceptReFip
type: Concept
broader: refip-REFIP6700
definition: Revenu permettant de garantir un revenu minimum aux personnes handicapées.
in scheme: FINANCES PUBLIQUES
in scheme: Santé et Protection Sociale
in scheme: Protection Sociale
in scheme: Questions de Société
notation: REFIP5678

aide à domicile
type: ConceptReFip
type: Concept
alternative label: aide ménagère
alternative label: aide à la personne
alternative label: auxiliaire de vie
broader: refip-REFIP6847
definition: Mode d'intervention de personnes qualifiées auprès de famille, de personnes âgées, de personnes handicapées ou malades qui se trouvent dans l'incapacité d'accomplir certaines tâches de la vie courante.
in scheme: FINANCES PUBLIQUES
in scheme: Santé et Protection Sociale
in scheme: Protection Sociale
in scheme: Questions de Société
notation: REFIP5679

avancement au choix
type: ConceptReFip
type: Concept
broader: avancement
definition: Sélection sur dossier par l'administration pour accéder au grade ou corps supérieur.
in scheme: FINANCES PUBLIQUES
in scheme: Gestion des ressources humaines
in scheme: Carrière
in scheme: Fonction Publique et Gestion des Ressources Humaines
notation: REFIP5680

activité culturelle
type: ConceptReFip
type: Concept
broader: culture et loisirs (non-descripteur)
definition: Ensemble des activités liées au sport et aux spectacles (théâtre, spectacle comique, opéra, danse, cirque, son et lumière).
in scheme: FINANCES PUBLIQUES
in scheme: Culture et Loisirs
in scheme: Activité Culturelle
in scheme: Questions de Société
narrower: manifestation culturelle
notation: REFIP5681

aide familiale
type: ConceptReFip
type: Concept
broader: refip-REFIP6847
definition: Personne dépendant d'un organisme agréé qui vient s'occuper des enfants en cas d'hospitalisation ou d'immobilisation des parents.
in scheme: FINANCES PUBLIQUES
in scheme: Santé et Protection Sociale
in scheme: Protection Sociale
in scheme: Questions de Société
notation: REFIP5682

ascendant
type: ConceptReFip
type: Concept
alternative label: parent
broader: famille
definition: Personne dont une autre personne est issue par la naissance
in scheme: FINANCES PUBLIQUES
in scheme: Famille Education Population
in scheme: Famille
in scheme: Questions de Société
narrower: mère de famille
narrower: refip-REFIP6585
notation: REFIP5683

ambassadeur
type: ConceptReFip
type: Concept
broader: agent diplomatique et consulaire
definition: Représentant de l’État français dans un pays étranger, nommé par le président de la République en Conseil des ministres sur proposition du ministre des Affaires étrangères. Il assume la plénitude des pouvoirs de l’État à son poste et est responsable de tout ce qui intéresse la France dans le pays où il se trouve.
in scheme: FINANCES PUBLIQUES
in scheme: Personnels et fonctions
in scheme: Fonction publique
in scheme: Fonction Publique et Gestion des Ressources Humaines
notation: REFIP5684

aménagement foncier agricole et forestier
type: ConceptReFip
type: Concept
alternative label: AFAF
alternative label: aménagement foncier
alternative label: aménagement rural
broader: aménagement du territoire
definition: Opération qui par le biais d’échanges et de regroupement de parcelles disséminées a pour but d’améliorer les conditions d’exploitation des propriétés rurales agricoles ou forestières; d’assurer la mise en valeur des espaces naturels ruraux; de contribuer à l’aménagement du territoire communal ou intercommunal défini dans les documents d’urbanisme.
in scheme: FINANCES PUBLIQUES
in scheme: Aménagement du territoire Urbanisme Habitat
in scheme: Aménagement du Territoire
in scheme: Questions de Société
narrower: remembrement
narrower: développement rural
notation: REFIP5685

aide personnalisée de retour à l'emploi (supprimé)
type: ConceptReFip
type: Concept
broader: ZZ
in scheme: FINANCES PUBLIQUES
notation: REFIP5686

allocation de logement familiale (supprimé)
type: ConceptReFip
type: Concept
broader: ZZ
in scheme: FINANCES PUBLIQUES
notation: REFIP5687

allocation chômage
type: ConceptReFip
type: Concept
alternative label: allocation de chômage
alternative label: allocation pour perte d'emploi
alternative label: indemnité de chômage
broader: refip-REFIP6700
definition: Revenu de remplacement permettant de compenser en tout ou partie la perte de revenus du travail.
in scheme: FINANCES PUBLIQUES
in scheme: Santé et Protection Sociale
in scheme: Protection Sociale
in scheme: Questions de Société
notation: REFIP5688
scope note: Remplacée par L'ALLOCATION D'AIDE AU RETOUR A L'EMPLOI (convention du 1/1/2001)

allocation journalière d'accompagnement d'une personne en fin de vie
type: ConceptReFip
type: Concept
broader: refip-REFIP6700
definition: Prestation versée au salarié en congé de solidarité familiale. Cette allocation est aussi accessible au demandeur d'emploi. Le bénéfice de cette allocation est soumis à des conditions qui varient selon que le demandeur de l'allocation est salarié ou demandeur d'emploi.
in scheme: FINANCES PUBLIQUES
in scheme: Santé et Protection Sociale
in scheme: Protection Sociale
in scheme: Questions de Société
notation: REFIP5689

autorisation d'engagement
type: ConceptReFip
type: Concept
alternative label: AE
alternative label: affectation d'une autorisation d'engagement
broader: exécution du budget
definition: Limite supérieure des dépenses pouvant être engagées pendant l’exercice, les paiements afférents pouvant intervenir les années ultérieures.
in scheme: FINANCES PUBLIQUES
in scheme: Exécution du budget
in scheme: Budget
narrower: délégation d'autorisation d'engagement
notation: REFIP569

administrateur territorial
type: ConceptReFip
type: Concept
broader: agent administratif territorial
definition: Fonctionnaire administratif territorial de catégorie A, appelé à occuper les postes de direction des collectivités locales et des établissements publics locaux. Il peut notamment être détaché sur les fonctions de directeur général de grande ville ou d’agglomération, ainsi que de directeur général des services départementaux ou régionaux. Il conduit au quotidien l’action des collectivités territoriales, prépare, met en œuvre les décisions des élus et exerce des missions de conception, d’encadrement et de coordination de l’action territoriale.
in scheme: FINANCES PUBLIQUES
in scheme: Personnels et fonctions
in scheme: Fonction publique
in scheme: Fonction Publique et Gestion des Ressources Humaines
notation: REFIP5690

allocation complémentaire de fonction campagne d'impôt sur le revenu
type: ConceptReFip
type: Concept
broader: allocation complémentaire de fonctions
definition: Complément de rémunération versé à l'occasion de la campagne d'impôt sur le revenu, pour indemniser les personnels chargés de l’information du public.
in scheme: FINANCES PUBLIQUES
in scheme: Gestion des ressources humaines
in scheme: Rémunération
in scheme: Fonction Publique et Gestion des Ressources Humaines
notation: REFIP5691

allocation d'éducation de l'enfant handicapé
type: ConceptReFip
type: Concept
alternative label: AEEH
alternative label: allocation d'éducation spéciale
alternative label: allocation des mineurs handicapés
alternative label: allocation pour enfant infirme
broader: refip-REFIP6589
definition: Prestation destinée à compenser les frais d'éducation et de soins apportés à un enfant en situation de handicap. Cette aide est versée à la personne qui en assume la charge. Elle peut être complétée, dans certains cas, d'un complément d'allocation.
in scheme: FINANCES PUBLIQUES
in scheme: Santé et Protection Sociale
in scheme: Protection Sociale
in scheme: Questions de Société
notation: REFIP5692

assurance construction dommages-ouvrage
type: ConceptReFip
type: Concept
alternative label: assurance construction
broader: assurances (non-descripteur)
definition: Assurance permettant en cas de sinistre de procéder aux remboursements ou à l'exécution de toutes les réparations faisant l'objet de la garantie décennale, sans attendre qu'intervienne une décision de justice.
in scheme: FINANCES PUBLIQUES
in scheme: Assurances
in scheme: Finance
notation: REFIP5693
scope note: Assurance privée

avancement d'échelon
type: ConceptReFip
type: Concept
broader: avancement
definition: Passage d'un échelon à l’échelon immédiatement supérieur à l'intérieur d'un même grade.
in scheme: FINANCES PUBLIQUES
in scheme: Gestion des ressources humaines
in scheme: Carrière
in scheme: Fonction Publique et Gestion des Ressources Humaines
notation: REFIP5694

ancienneté
type: ConceptReFip
type: Concept
broader: carrière
definition: Durée écoulée.
in scheme: FINANCES PUBLIQUES
in scheme: Gestion des ressources humaines
in scheme: Carrière
in scheme: Fonction Publique et Gestion des Ressources Humaines
narrower: ancienneté administrative
notation: REFIP5695

allocation de secours
type: ConceptReFip
type: Concept
alternative label: prestation d'assistance
alternative label: secours alimentaire
alternative label: secours financier
broader: refip-REFIP6700
definition: Allocation de secours financier ou de secours alimentaire. Le département peut octroyer aux familles des Secours d’Urgence ou des Allocations Mensuelles. Les Secours d’Urgence doivent répondre à des besoins primaires et immédiats.
in scheme: FINANCES PUBLIQUES
in scheme: Santé et Protection Sociale
in scheme: Protection Sociale
in scheme: Questions de Société
notation: REFIP5696

accident hors service
type: ConceptReFip
type: Concept
broader: refip-REFIP6828
definition: Accident corporel survenu en dehors des heures de service ou du trajet.
in scheme: FINANCES PUBLIQUES
in scheme: Gestion des ressources humaines
in scheme: Conditions de travail
in scheme: Fonction Publique et Gestion des Ressources Humaines
notation: REFIP5697

alcoolisme
type: ConceptReFip
type: Concept
alternative label: lutte contre l'alcoolisme
broader: maladie
definition: Troubles mentaux et troubles du comportement liés à l'utilisation d'alcool.
in scheme: FINANCES PUBLIQUES
in scheme: Santé et Protection Sociale
in scheme: Santé
in scheme: Questions de Société
notation: REFIP5698
related: alcool

agent d'entretien territorial
type: ConceptReFip
type: Concept
broader: agent technique territorial
definition: Fonctionnaire territorial de catégorie C.
in scheme: FINANCES PUBLIQUES
in scheme: Personnels et fonctions
in scheme: Fonction publique
in scheme: Fonction Publique et Gestion des Ressources Humaines
notation: REFIP5699

carburant
type: ConceptReFip
type: Concept
alternative label: essence
broader: combustible
definition: Combustible qui alimente un moteur thermique.
in scheme: FINANCES PUBLIQUES
in scheme: Branche d'activité
in scheme: Questions Economiques
in scheme: Industrie
narrower: diesel
notation: REFIP57
related: matières premières

assistant médico-administratif
type: ConceptReFip
type: Concept
alternative label: secrétaire médical
broader: fonction publique hospitalière
definition: Fonctionnaire hospitalier de catégorie B assurant le traitement et la coordination des opérations et des informations médico-administratives concernant les patients dans les domaines du secrétariat médical et de l'assistance de régulation médicale.
in scheme: FINANCES PUBLIQUES
in scheme: Personnels et fonctions
in scheme: Fonction publique
in scheme: Fonction Publique et Gestion des Ressources Humaines
notation: REFIP5700

ancienneté administrative
type: ConceptReFip
type: Concept
broader: ancienneté
definition: Durée de services accomplis dans l'administration.
in scheme: FINANCES PUBLIQUES
in scheme: Gestion des ressources humaines
in scheme: Carrière
in scheme: Fonction Publique et Gestion des Ressources Humaines
notation: REFIP5701

autorité compétente
type: ConceptReFip
type: Concept
broader: fonction de la Direction générale des finances publiques (non-descripteur)
definition: Administration ou instance officiellement chargé d'un domaine donné et qui en est juridiquement responsable. Pour les établissements publics, elle est déterminée en fonction des statuts.
in scheme: FINANCES PUBLIQUES
in scheme: Personnels et fonctions
in scheme: Fonction de la Direction générale des Finances publiques (NON DESCRIPTEUR)
in scheme: Fonction Publique et Gestion des Ressources Humaines
notation: REFIP5702

aide sociale à l'enfance
type: ConceptReFip
type: Concept
alternative label: ASE
broader: action sociale
definition: Service départemental dont la mission essentielle est de venir en aide aux enfants et à leur famille par des actions de prévention individuelle ou collective, de protection et de lutte contre la maltraitance.
in scheme: FINANCES PUBLIQUES
in scheme: Santé et Protection Sociale
in scheme: Protection Sociale
in scheme: Questions de Société
notation: REFIP5703

allocation de solidarité spécifique
type: ConceptReFip
type: Concept
broader: refip-REFIP6700
definition: Prestation attribuée aux personnes ayant épuisé leurs droits au chômage sous conditions d'activité antérieure et de ressources.
in scheme: FINANCES PUBLIQUES
in scheme: Santé et Protection Sociale
in scheme: Protection Sociale
in scheme: Questions de Société
notation: REFIP5704

ascenseur
type: ConceptReFip
type: Concept
broader: immeuble d'habitation
definition: Appareil élévateur permettant de transporter des personnes dans une cabine.
in scheme: FINANCES PUBLIQUES
in scheme: Aménagement du territoire Urbanisme Habitat
in scheme: Habitat
in scheme: Questions de Société
notation: REFIP5705

analyste
type: ConceptReFip
type: Concept
broader: fonction de la Direction générale des finances publiques (non-descripteur)
definition: Agent de catégorie A qui travaille au sein d'équipes chargées de la maîtrise d’œuvre du système d’information et de tous les projets informatiques de la DGFIP. Il travaille notamment à la réalisation des études, à l’élaboration des spécifications et des cahiers des charges, au contrôle de conformité architecturale et au respect des normes et standards, aux travaux de développement ou à la maintenance d’applications.
in scheme: FINANCES PUBLIQUES
in scheme: Personnels et fonctions
in scheme: Fonction de la Direction générale des Finances publiques (NON DESCRIPTEUR)
in scheme: Fonction Publique et Gestion des Ressources Humaines
notation: REFIP5706
scope note: Informatique

assurance invalidité
type: ConceptReFip
type: Concept
alternative label: branche invalidité
broader: refip-REFIP6796
definition: Assurance garantissant tout évènement invalidant (notamment à la suite d'une maladie ou d'un accident-hors accident du travail) et conduisant au versement d'une pension d'invalidité.
in scheme: FINANCES PUBLIQUES
in scheme: Santé et Protection Sociale
in scheme: Protection Sociale
in scheme: Questions de Société
notation: REFIP5707

abaissement d'échelon
type: ConceptReFip
type: Concept
broader: refip-REFIP6820
definition: Sanction de 2eme groupe.
in scheme: FINANCES PUBLIQUES
in scheme: Gestion des ressources humaines
in scheme: Statut du fonctionnaire
in scheme: Fonction Publique et Gestion des Ressources Humaines
notation: REFIP5708

astreinte
type: ConceptReFip
type: Concept
broader: refip-REFIP6565
definition: Période pendant laquelle l'agent, sans être sur son lieu de travail, doit pouvoir intervenir si son administration lui demande.
in scheme: FINANCES PUBLIQUES
in scheme: Gestion des ressources humaines
in scheme: Statut du fonctionnaire
in scheme: Fonction Publique et Gestion des Ressources Humaines
notation: REFIP5709

Ministère du Budget des Comptes publics et de la Réforme de l'Etat (obsolète)
type: ConceptReFip
type: Concept
is replaced by: refip-REFIP7061
broader: ZZ
in scheme: FINANCES PUBLIQUES
notation: REFIP571

attaché territorial
type: ConceptReFip
type: Concept
broader: agent administratif territorial
definition: Fonctionnaire territorial de catégorie A affecté au sein des différentes administrations locales, chargé de missions d'études et de conseil pour les décisions de politique locale.
in scheme: FINANCES PUBLIQUES
in scheme: Personnels et fonctions
in scheme: Fonction publique
in scheme: Fonction Publique et Gestion des Ressources Humaines
notation: REFIP5710

allocation viagère
type: ConceptReFip
type: Concept
broader: refip-REFIP6700
definition: Disposition transitoire pour les anciens bénéficiaires du minimum vieillesse (APSA).
in scheme: FINANCES PUBLIQUES
in scheme: Santé et Protection Sociale
in scheme: Protection Sociale
in scheme: Questions de Société
notation: REFIP5711
scope note: Remplacée par l'allocation de solidarité aux personnes âgées

assurance chômage
type: ConceptReFip
type: Concept
alternative label: régime d'assurance chômage
broader: refip-REFIP6700
definition: Dispositif public de prise en charge des personnes physiques habituellement employées en tant que salariés et ayant perdu leur emploi. Ce dispositif est financé par des cotisations prélevées sur les salaires et versées aux bénéficiaires, sous conditions, par le Pôle emploi.
in scheme: FINANCES PUBLIQUES
in scheme: Santé et Protection Sociale
in scheme: Protection Sociale
in scheme: Questions de Société
notation: REFIP5712
related: Union nationale interprofessionnelle pour l'emploi dans l'industrie et le commerce
related: chômage

allocation de rentrée scolaire
type: ConceptReFip
type: Concept
broader: refip-REFIP6589
definition: Prestation versée, sous conditions de ressources, aux familles ayant au moins un enfant scolarisé et âgé de 6 à 18 ans. Elle permet d'aider les familles à financer les dépenses de la rentrée scolaire. Son montant dépend de l'âge de l'enfant.
in scheme: FINANCES PUBLIQUES
in scheme: Santé et Protection Sociale
in scheme: Protection Sociale
in scheme: Questions de Société
notation: REFIP5713
related: refip-REFIP6727

aide médicale urgente (supprimé)
type: ConceptReFip
type: Concept
broader: ZZ
in scheme: FINANCES PUBLIQUES
notation: REFIP5714

action de formation
type: ConceptReFip
type: Concept
broader: refip-REFIP6621
definition: Processus mis en œuvre dans un temps déterminé pour permettre d’atteindre les objectifs pédagogiques de la formation.
in scheme: FINANCES PUBLIQUES
in scheme: Gestion des ressources humaines
in scheme: Formation professionnelle
in scheme: Fonction Publique et Gestion des Ressources Humaines
notation: REFIP5715

agent technique territorial
type: ConceptReFip
type: Concept
broader: agent territorial
definition: Agent affecté en filière technique de la Fonction Publique Territoriale.
in scheme: FINANCES PUBLIQUES
in scheme: Personnels et fonctions
in scheme: Fonction publique
in scheme: Fonction Publique et Gestion des Ressources Humaines
narrower: agent d'entretien territorial
narrower: agent de maîtrise territorial
narrower: adjoint technique territorial
narrower: ingénieur territorial
narrower: refip-REFIP6930
notation: REFIP5716

agio
type: ConceptReFip
type: Concept
broader: frais bancaires
definition: Ensemble des frais, composés généralement des intérêts et commissions bancaires, perçus par la banque à l'occasion d'opérations particulières (découvert, escompte).
in scheme: FINANCES PUBLIQUES
in scheme: Systeme bancaire et financier
in scheme: Secteur bancaire
in scheme: Finance
notation: REFIP5717

allocation aux vieux travailleurs non salariés (supprimé)
type: ConceptReFip
type: Concept
broader: ZZ
in scheme: FINANCES PUBLIQUES
notation: REFIP5718

allocation supplémentaire d'invalidité
type: ConceptReFip
type: Concept
alternative label: ASI
broader: refip-REFIP6700
definition: Prestation mensuelle accordée à certaines personnes invalides ayant de faibles ressources.
in scheme: FINANCES PUBLIQUES
in scheme: Santé et Protection Sociale
in scheme: Protection Sociale
in scheme: Questions de Société
notation: REFIP5719

donnée d'en-tête (supprimé)
type: ConceptReFip
type: Concept
broader: ZZ
in scheme: FINANCES PUBLIQUES
notation: REFIP572

assurance maternité
type: ConceptReFip
type: Concept
alternative label: branche maternité
broader: refip-REFIP6796
definition: Assurance permettant aux femmes enceintes de se faire notamment rembourser les frais liés à leur grossesse et à leur accouchement.
in scheme: FINANCES PUBLIQUES
in scheme: Santé et Protection Sociale
in scheme: Protection Sociale
in scheme: Questions de Société
notation: REFIP5720

agent d'assurance
type: ConceptReFip
type: Concept
alternative label: assureur
broader: compagnie d'assurance
definition: Professionnel indépendant exerçant l'activité d'intermédiaire pour le compte d'une compagnie d'assurance dont il a reçu un mandat.
in scheme: FINANCES PUBLIQUES
in scheme: Assurances
in scheme: Finance
notation: REFIP5721

avertissement disciplinaire
type: ConceptReFip
type: Concept
broader: refip-REFIP6820
definition: Sanction disciplinaire de 1er groupe, non inscrit au dossier de l'agent.
in scheme: FINANCES PUBLIQUES
in scheme: Gestion des ressources humaines
in scheme: Statut du fonctionnaire
in scheme: Fonction Publique et Gestion des Ressources Humaines
notation: REFIP5722

accord de consolidation (supprimé)
type: ConceptReFip
type: Concept
broader: ZZ
in scheme: FINANCES PUBLIQUES
notation: REFIP5723

administrateur des finances publiques adjoint
type: ConceptReFip
type: Concept
alternative label: AFIPA
alternative label: directeur divisionnaire des impôts
alternative label: directeur départemental du Trésor public
alternative label: receveur des finances
broader: grade de la Direction générale des Finances publiques (non-descripteur)
definition: Grade du corps des personnels de catégorie A, les administrateurs des finances publiques adjoints (AFiPA) sont nommés par le ministre chargé du Budget. Ils sont recrutés parmi les inspecteurs principaux (IP), ainsi que parmi les inspecteurs divisionnaires hors classe (IDIV HC).
in scheme: FINANCES PUBLIQUES
in scheme: Personnels et fonctions
in scheme: Fonction publique
in scheme: Fonction Publique et Gestion des Ressources Humaines
notation: REFIP5724

aveugle
type: ConceptReFip
type: Concept
alternative label: malvoyant
alternative label: non voyant
alternative label: personne malvoyante
broader: refip-REFIP6590
definition: Personne atteinte de cécité.
in scheme: FINANCES PUBLIQUES
in scheme: Famille Education Population
in scheme: Population
in scheme: Questions de Société
notation: REFIP5725

ancien combattant et victime de guerre
type: ConceptReFip
type: Concept
broader: population (non-descripteur)
definition: Statut légal reconnu à toute personne membres des forces armées (militaires) ou personne civile ayant pris part à un conflit dans lequel la France est ou était engagée
in scheme: FINANCES PUBLIQUES
in scheme: Famille Education Population
in scheme: Population
in scheme: Questions de Société
notation: REFIP5726
related: Office national des anciens combattants et victimes de guerre

application GAIA
type: ConceptReFip
type: Concept
alternative label: GAIA
broader: applications fiscales (non-descripteur)
definition: Gestion de la Relation Usager par une offre de Démarches en ligne via le Portail Fiscal ou autres canaux (guichet, mail, téléphone, etc.).
in scheme: FINANCES PUBLIQUES
in scheme: Applications Informatiques
in scheme: Applications fiscales
notation: REFIP5727
scope note: Remplacée par l'outil e-contacts à compter du 3 mars 2016

adoption d'enfant
type: ConceptReFip
type: Concept
alternative label: adoption
broader: enfant
definition: Action de prendre au terme d'un jugement pour fils ou fille celui ou celle qui ne l'est pas naturellement.
in scheme: FINANCES PUBLIQUES
in scheme: Famille Education Population
in scheme: Famille
in scheme: Questions de Société
notation: REFIP5728

aménagement d'horaire
type: ConceptReFip
type: Concept
broader: refip-REFIP6916
definition: Possibilité pour l'employeur de déroger à la règle de l'horaire collectif de travail et de pratiquer des horaires individualisés pour répondre aux demandes de certains agents, dans le respect de certaines conditions.
in scheme: FINANCES PUBLIQUES
in scheme: Gestion des ressources humaines
in scheme: Temps de travail
in scheme: Fonction Publique et Gestion des Ressources Humaines
narrower: facilités d'horaires
notation: REFIP5729

tiers détenteur
type: ConceptReFip
type: Concept
broader: tiers
definition: Personne qui a actuellement la main mise matérielle sur une chose sur laquelle une personne, autre que celle dont il le tient, a une hypothèque à exercer, un droit à réclamer.
in scheme: FINANCES PUBLIQUES
in scheme: Droit et Justice
in scheme: Divisions du Droit
in scheme: Droit Privé
notation: REFIP573

autorisation d'emploi
type: ConceptReFip
type: Concept
alternative label: plafond d'autorisation d'emploi
broader: gestion prévisionnelle des ressources humaines
definition: Emploi utilisable dans le cadre de l'année budgétaire, plafonné, l’État en fixe ainsi le volume maximum, qu'il rémunère quel que soit le statut des personnels. Le plafond d'autorisation d'emploi est exprimé en équivalent temps plein annuel travaillé (ETPT). Tous les personnels sont décomptés selon cette même modalité, y compris les agents occasionnels ou saisonniers. Ces plafonds sont fixés au niveau du ministère et déclinés à titre indicatif par programme et par catégorie d’emplois.
in scheme: FINANCES PUBLIQUES
in scheme: Gestion des ressources humaines
in scheme: Gestion prévisionnelle des ressources humaines
in scheme: Fonction Publique et Gestion des Ressources Humaines
notation: REFIP5730

aide aux personnes âgées
type: ConceptReFip
type: Concept
alternative label: assistance aux personnes âgées
broader: refip-REFIP6847
definition: Ensemble d'interventions de différentes natures pour faciliter la vie quotidienne ou permettre à la personne âgée de conserver une vie sociale.
in scheme: FINANCES PUBLIQUES
in scheme: Santé et Protection Sociale
in scheme: Protection Sociale
in scheme: Questions de Société
notation: REFIP5731
related: refip-REFIP6644

allocation temporaire dégressive
type: ConceptReFip
type: Concept
broader: refip-REFIP6700
definition: Allocation versée au salarié qui reprend un nouveau travail moins bien rémunéré que le précédent. L'ATD est réservée, sous conditions, à un salarié licencié pour motif économique. Elle est versée pour une durée limitée.
in scheme: FINANCES PUBLIQUES
in scheme: Santé et Protection Sociale
in scheme: Protection Sociale
in scheme: Questions de Société
notation: REFIP5732

agent de maîtrise territorial
type: ConceptReFip
type: Concept
broader: agent technique territorial
definition: Fonctionnaire territorial de la catégorie C, chargé de missions et de travaux techniques comportant notamment le contrôle de la bonne exécution de travaux confiés à des entrepreneurs ou exécutés en régie, l'encadrement des adjoints techniques territoriaux. Il peut également participer, notamment dans les domaines de l'exploitation des routes, voies navigables et ports maritimes, à la direction et à l'exécution de travaux, ainsi qu'à la réalisation et à la mise en œuvre du métré des ouvrages, des calques, plans, maquettes, cartes et dessins nécessitant une expérience et une compétence professionnelle étendues.
in scheme: FINANCES PUBLIQUES
in scheme: Personnels et fonctions
in scheme: Fonction publique
in scheme: Fonction Publique et Gestion des Ressources Humaines
notation: REFIP5733

attaché d'administration hospitalière (supprimé)
type: ConceptReFip
type: Concept
broader: ZZ
in scheme: FINANCES PUBLIQUES
notation: REFIP5734

acquisition différée
type: ConceptReFip
type: Concept
broader: acquisition immobilière
definition: Opération d'accession à la propriété limitée au seul coût de la construction en neutralisant le prix du terrain pendant toute la durée de remboursement des prêts.
in scheme: FINANCES PUBLIQUES
in scheme: Aménagement du territoire Urbanisme Habitat
in scheme: Habitat
in scheme: Questions de Société
notation: REFIP5735

attribution d'actions
type: ConceptReFip
type: Concept
alternative label: attribution gratuite d'actions
broader: refip-REFIP6545
definition: Dispositif dont dispose les entreprises pour rémunérer, motiver et fidéliser leurs salariés ou leurs actionnaires. Seules les sociétés par actions, que leurs titres soient ou non admis aux négociations sur un marché réglementé, peuvent attribuer des actions gratuites à leurs salariés sur décision d'une Assemblée Générale Extraordinaire.
in scheme: FINANCES PUBLIQUES
in scheme: Systeme bancaire et financier
in scheme: Opération financière
in scheme: Finance
narrower: augmentation de capital
notation: REFIP5736

allocation de soutien familial
type: ConceptReFip
type: Concept
alternative label: allocation d'orphelin
broader: refip-REFIP6589
definition: Prestation versée par la Caisse d'allocations familiales ou la Mutualité sociale agricole à la personne qui élève seule son enfant privé de l'aide de l'un de ses parents, sous conditions.
in scheme: FINANCES PUBLIQUES
in scheme: Santé et Protection Sociale
in scheme: Protection Sociale
in scheme: Questions de Société
notation: REFIP5737

administrateur général des finances publiques
type: ConceptReFip
type: Concept
alternative label: AGFIP
alternative label: TPG
alternative label: chef des services fiscaux
alternative label: directeur des services fiscaux
alternative label: payeur général du Trésor
alternative label: receveur général des finances de Paris
alternative label: trésorier-payeur général
alternative label: trésorier-payeur général de région
broader: grade de la Direction générale des Finances publiques (non-descripteur)
definition: Grade appartenant au corps des administrateurs des finances publiques (AFIP) Les administrateurs généraux des finances publiques (AGFIP) sont recrutés principalement parmi les administrateurs des finances publiques, ainsi qu’au tour extérieur, ouvert aux trois fonctions publiques et aux militaires détenant un grade d’officier supérieur. Ils sont nommés et affectés par décret du Président de la République.
in scheme: FINANCES PUBLIQUES
in scheme: Personnels et fonctions
in scheme: Fonction publique
in scheme: Fonction Publique et Gestion des Ressources Humaines
notation: REFIP5738

autorisation de jeux
type: ConceptReFip
type: Concept
broader: casino
definition: Autorisation accordée par le ministère de l'Intérieur, intervenant après l'avis de principe d'une exploitation de casino émis par l'assemblée délibérante de la collectivité territoriale concernée (conseil municipal - conseil de la communauté de communes) et la mise en œuvre de la procédure de délégation de service public (appel d'offres et mise en concurrence des candidats à l'exploitation du casino).
in scheme: FINANCES PUBLIQUES
in scheme: Culture et Loisirs
in scheme: Loisirs
in scheme: Questions de Société
notation: REFIP5739

Pôle national de soutien au réseau commande publique
type: ConceptReFip
type: Concept
alternative label: PNSR commande publique
alternative label: PNSR de Lyon
alternative label: Pôle commande publique
alternative label: Pôle de Lyon
broader: Pôle national de soutien au réseau
definition: Structure ayant pour mission d'apporter un soutien juridique dans le domaine de la commande publique en répondant aux questions complexes posées par les directions régionales et départementales des finances publiques, les départements comptables ministériels, les recettes des finances territoriales et les agents comptables des établissements publics nationaux.
in scheme: FINANCES PUBLIQUES
in scheme: Organisation Structurelle de l'Etat
in scheme: Ministère
in scheme: Administration de L'Etat
notation: REFIP574

annuité d'emprunt
type: ConceptReFip
type: Concept
broader: intérêts d'emprunt
definition: Paiement annuel effectué par un emprunteur pour le capital emprunté et les intérêts financiers.
in scheme: FINANCES PUBLIQUES
in scheme: Systeme bancaire et financier
in scheme: Secteur bancaire
in scheme: Finance
notation: REFIP5740

accident de service
type: ConceptReFip
type: Concept
broader: refip-REFIP6828
definition: Accident qui se produit dans l'exercice, ou à l'occasion de l'exercice des fonctions ou au cours d'une activité constituant le prolongement du service.
in scheme: FINANCES PUBLIQUES
in scheme: Gestion des ressources humaines
in scheme: Conditions de travail
in scheme: Fonction Publique et Gestion des Ressources Humaines
notation: REFIP5741
scope note: Agents de la Fonction publique

allocation de vétérance
type: ConceptReFip
type: Concept
broader: refip-REFIP6700
definition: Indemnisation versée sous conditions aux anciens sapeurs-pompiers volontaires, du temps consacré au service du public et la reconnaissance matérielle de l'accomplissement d'une mission générale.
in scheme: FINANCES PUBLIQUES
in scheme: Santé et Protection Sociale
in scheme: Protection Sociale
in scheme: Questions de Société
notation: REFIP5742

accident de circulation
type: ConceptReFip
type: Concept
alternative label: accident de la route
broader: circulation routière
definition: Accident sur la voie publique ou sur le réseau routier.
in scheme: FINANCES PUBLIQUES
in scheme: Questions Politiques Relations Internationales
in scheme: Politique
in scheme: Questions de Société
notation: REFIP5743

agent de constatation des douanes
type: ConceptReFip
type: Concept
broader: fonction publique de l'Etat
definition: Fonctionnaire d’État de catégorie C auprès de la Direction générale des douanes et droits indirects. Il peut exercer ses fonctions dans deux branches d'activités distinctes : Soit dans la branche du contrôle des opérations commerciales et d’administration générale, pour des missions de suivi et de contrôle des opérations du commerce international, travail sur documents en entreprises dans le secteur des contributions indirectes (tabacs et alcools, métaux précieux, produits pétroliers), perception de taxes sectorielles (sur les poids lourds, les navires de plaisance etc.). Soit dans la branche de la surveillance, pour des missions de lutte contre la fraude (trafics de contrefaçons, de stupéfiants, d’espèces animales ou végétales protégées, de marchandises prohibées ou fortement taxées etc.).
in scheme: FINANCES PUBLIQUES
in scheme: Personnels et fonctions
in scheme: Fonction publique
in scheme: Fonction Publique et Gestion des Ressources Humaines
notation: REFIP5744

allocation d'aide au retour à l'emploi
type: ConceptReFip
type: Concept
alternative label: ARE
alternative label: aide au retour à l'emploi
alternative label: allocation unique dégressive
broader: refip-REFIP6700
definition: Revenu de remplacement versé sous certaines conditions aux personnes inscrites comme demandeurs d’emploi et involontairement privés d’emploi.
in scheme: FINANCES PUBLIQUES
in scheme: Santé et Protection Sociale
in scheme: Protection Sociale
in scheme: Questions de Société
notation: REFIP5745

aide aux parents d'enfants handicapés
type: ConceptReFip
type: Concept
alternative label: allocation aux parents d'enfants handicapés ou infirmes âgés de moins de 2 ans
alternative label: allocation spéciale pour enfants atteints d'une maladie chronique ou d'une infirmité et poursuivant des études ou un apprentissage au delà de 2 ans et jusqu'à 27 ans.
alternative label: participation aux frais de séjours en centres de vacances spécialisés pour handicapés
alternative label: participation aux frais de séjours en centres familiaux de vacances agréés et gîtes de France
broader: refip-REFIP6700
definition: Dispositif interministériel d'aide aux parents d'enfants en situation de handicap regroupant différents avantages financiers mis en place par l'administration.
in scheme: FINANCES PUBLIQUES
in scheme: Santé et Protection Sociale
in scheme: Protection Sociale
in scheme: Questions de Société
notation: REFIP5746

allocation journalière de présence parentale
type: ConceptReFip
type: Concept
alternative label: AJPP
broader: refip-REFIP6589
definition: Prestation attribuée en cas d'interruption d'activité professionnelle pour rester auprès de son enfant du fait d'une maladie, d'un handicap ou s'il est victime d'un accident d'une particulière gravité. Cette allocation journalière est versée pour chaque jour de congé, dans la limite de 22 jours par mois.
in scheme: FINANCES PUBLIQUES
in scheme: Santé et Protection Sociale
in scheme: Protection Sociale
in scheme: Questions de Société
notation: REFIP5747

autorisation spéciale d'absence (obsolète)
type: ConceptReFip
type: Concept
is replaced by: autorisation d'absence
broader: ZZ
in scheme: FINANCES PUBLIQUES
notation: REFIP5748

allocation de logement sociale
type: ConceptReFip
type: Concept
alternative label: ALS
broader: allocation de logement
definition: Aide financière, versée sous certaines conditions, destinée à réduire le montant de loyer ou de mensualité d'emprunt immobilier.
in scheme: FINANCES PUBLIQUES
in scheme: Santé et Protection Sociale
in scheme: Protection Sociale
in scheme: Questions de Société
notation: REFIP5749

comptabilité M 51
type: ConceptReFip
type: Concept
broader: comptabilité publique locale
definition: Nomenclature budgétaire et comptable M 51 applicable aux régions et à leurs établissements publics.
in scheme: FINANCES PUBLIQUES
in scheme: Secteur public local
in scheme: Gestion Publique
notation: REFIP575

aide-soignant
type: ConceptReFip
type: Concept
alternative label: aide soignant
broader: fonction publique hospitalière
definition: Fonctionnaire hospitalier de catégorie C, membre du personnel de santé, faisant partie des métiers du paramédical, pouvant travailler en hôpital, en maison de retraite, comme aide à domicile, ou au sein de toute institution délivrant des soins médicaux et paramédicaux. Il est en charge de l'hygiène et des besoins des patients. Il veille, sous contrôle infirmier, à la désinfection et à la propreté des locaux, à la toilette, à l'habillage et aux repas des patients, et peut également aider sur certains soins élémentaires.
in scheme: FINANCES PUBLIQUES
in scheme: Personnels et fonctions
in scheme: Fonction publique
in scheme: Fonction Publique et Gestion des Ressources Humaines
notation: REFIP5750

autorisation tacite
type: ConceptReFip
type: Concept
broader: autorisation d'urbanisme
definition: Accord qui n'est pas formellement exprimé, mais qui est sous-entendu, ou qui peut se sous-entendre.
in scheme: FINANCES PUBLIQUES
in scheme: Aménagement du territoire Urbanisme Habitat
in scheme: Aménagement du Territoire
in scheme: Questions de Société
notation: REFIP5751

assistance aux personnes handicapées
type: ConceptReFip
type: Concept
broader: refip-REFIP6847
definition: Prestations de services à la personne de natures différentes afin d'accompagner la personne en situation de handicap pour accomplir les actes essentiels du quotidien.
in scheme: FINANCES PUBLIQUES
in scheme: Santé et Protection Sociale
in scheme: Protection Sociale
in scheme: Questions de Société
notation: REFIP5752
related: refip-REFIP6590

assurance maladie
type: ConceptReFip
type: Concept
alternative label: branche maladie
broader: refip-REFIP6796
definition: Branche de la sécurité sociale qui couvre le risque maladie des salariés et leurs bénéficiaires.
in scheme: FINANCES PUBLIQUES
in scheme: Santé et Protection Sociale
in scheme: Protection Sociale
in scheme: Questions de Société
narrower: assurance maladie complémentaire
narrower: assurance maladie obligatoire
narrower: couverture maladie universelle
notation: REFIP5753
related: Caisse régionale d'assurance maladie
related: refip-REFIP751

agent technique des finances publiques
type: ConceptReFip
type: Concept
alternative label: adjoint technique des impôts
alternative label: adjoint technique du Trésor public
alternative label: agent technique 1ère classe des finances publiques
alternative label: agent technique 2ème classe des finances publiques
broader: grade de la Direction générale des Finances publiques (non-descripteur)
definition: Grade de la catégorie C de la DGFIP, placé sous l’autorité des agents de catégorie B ou A, les agents techniques des finances publiques exercent des fonctions techniques, logistiques et de sécurité au sein des services déconcentrés de la direction générale des finances publiques, des services à compétence nationale relevant de cette direction et des services centraux. Ils bénéficient de formations d’adaptation aux fonctions qui leurs sont confiées.
in scheme: FINANCES PUBLIQUES
in scheme: Personnels et fonctions
in scheme: Fonction publique
in scheme: Fonction Publique et Gestion des Ressources Humaines
notation: REFIP5754

augmentation de capital
type: ConceptReFip
type: Concept
broader: attribution d'actions
definition: Opération par laquelle une société accroît son capital social en émettant de nouvelles actions notamment.
in scheme: FINANCES PUBLIQUES
in scheme: Systeme bancaire et financier
in scheme: Opération financière
in scheme: Finance
notation: REFIP5755

acquisition immobilière
type: ConceptReFip
type: Concept
alternative label: achat immobilier
broader: accession à la propriété
definition: Fait d'acheter un bien immeuble.
in scheme: FINANCES PUBLIQUES
in scheme: Aménagement du territoire Urbanisme Habitat
in scheme: Habitat
in scheme: Questions de Société
narrower: acquisition différée
notation: REFIP5756

agent administratif principal des finances publiques
type: ConceptReFip
type: Concept
alternative label: agent administratif principal 1ère classe des finances publiques
alternative label: agent administratif principal 2ème classe des finances publiques
alternative label: agent administratif principal des impôts
alternative label: agent d'administration principal du Trésor public
broader: grade de la Direction générale des Finances publiques (non-descripteur)
definition: Grade de la catégorie C de la DGFIP, les agents administratifs principaux des finances publiques exercent les fonctions dévolues aux agents administratifs des finances publiques.
in scheme: FINANCES PUBLIQUES
in scheme: Personnels et fonctions
in scheme: Fonction publique
in scheme: Fonction Publique et Gestion des Ressources Humaines
notation: REFIP5757

application GAIA GUICHET
type: ConceptReFip
type: Concept
alternative label: GAIA GUICHET
broader: applications fiscales (non-descripteur)
definition: Outil de l'accueil fiscal de proximité qui permet aux services d'accueil d'assurer la réception des démarches courantes des usagers et de les transmettre au service gestionnaire compétent.
in scheme: FINANCES PUBLIQUES
in scheme: Applications Informatiques
in scheme: Applications fiscales
notation: REFIP5758
scope note: Remplacée par l'outil e-contacts à compter du 3 mars 2016

aidant familial
type: ConceptReFip
type: Concept
broader: refip-REFIP6847
definition: Personne venant en aide à titre non professionnel, pour partie ou totalement, à une personne dépendante de son entourage pour les activités de la vie quotidienne.
in scheme: FINANCES PUBLIQUES
in scheme: Santé et Protection Sociale
in scheme: Protection Sociale
in scheme: Questions de Société
notation: REFIP5759

délégation de service public
type: ConceptReFip
type: Concept
broader: commande publique
definition: Contrat par lequel une personne morale de droit public confie la gestion d’un service public à un délégataire public ou privé.
in scheme: FINANCES PUBLIQUES
in scheme: Commande publique
in scheme: Gestion Publique
narrower: commission de délégation de service public
narrower: affermage
narrower: concession de travaux publics
narrower: concession de service public
narrower: titulaire d'une délégation de service public
notation: REFIP576

allocation de parent isolé
type: ConceptReFip
type: Concept
broader: refip-REFIP6700
definition: Prestation sociale visant à aider financièrement certaines familles monoparentales.
in scheme: FINANCES PUBLIQUES
in scheme: Santé et Protection Sociale
in scheme: Protection Sociale
in scheme: Questions de Société
notation: REFIP5760
scope note: Remplacée par revenu de solidarité active

allocation temporaire d'attente (supprimé)
type: ConceptReFip
type: Concept
broader: ZZ
in scheme: FINANCES PUBLIQUES
notation: REFIP5761

allocation complémentaire de fonctions
type: ConceptReFip
type: Concept
alternative label: ACF
broader: indemnité
definition: Élément du régime indemnitaire des fonctionnaires dont l'attribution et le montant varient selon les fonctions exercées, la manière de servir, les contraintes et/ou les sujétions particulières (technicité, responsabilités particulières, expertise...)
in scheme: FINANCES PUBLIQUES
in scheme: Gestion des ressources humaines
in scheme: Rémunération
in scheme: Fonction Publique et Gestion des Ressources Humaines
narrower: allocation complémentaire de fonction campagne d'impôt sur le revenu
notation: REFIP5762

aide à la cuve
type: ConceptReFip
type: Concept
broader: refip-REFIP6700
definition: Aide financière réservée aux ménages modestes qui se chauffent au fioul. Il n’est accordé qu’une seule aide par ménage non imposable sur cette période. Elle s’applique aux achats de fioul pour la résidence principale.Non renouvelée depuis 2010.
in scheme: FINANCES PUBLIQUES
in scheme: Santé et Protection Sociale
in scheme: Protection Sociale
in scheme: Questions de Société
notation: REFIP5763
scope note: Non reconduite en 2010

adjoint administratif hospitalier
type: ConceptReFip
type: Concept
broader: fonction publique hospitalière
definition: Fonctionnaire hospitalier de catégorie C, assurant les tâches administratives d'exécution comportant la connaissance et l'application des règlements administratifs et comptables. A ce titre, il assure notamment des activités d'accueil et d'information du public, des travaux de secrétariat.
in scheme: FINANCES PUBLIQUES
in scheme: Personnels et fonctions
in scheme: Fonction publique
in scheme: Fonction Publique et Gestion des Ressources Humaines
notation: REFIP5764

agent diplomatique et consulaire
type: ConceptReFip
type: Concept
alternative label: personnel diplomatique et consulaire
broader: fonction publique de l'Etat
definition: Fonctionnaire de l’État auprès du Ministère des Affaires étrangères responsable de la conduite de politiques publiques et de la défense des intérêts de la France et des Français dans un environnement international.
in scheme: FINANCES PUBLIQUES
in scheme: Personnels et fonctions
in scheme: Fonction publique
in scheme: Fonction Publique et Gestion des Ressources Humaines
narrower: ambassadeur
notation: REFIP5765

agent recenseur
type: ConceptReFip
type: Concept
broader: agent territorial
definition: Fonctionnaire recruté, nommé et rémunéré par la commune ou l'établissement public de coopération intercommunale dans les conditions de droit commun de recrutement et de rémunération applicables dans la fonction publique. Agent formé par l’INSEE.
in scheme: FINANCES PUBLIQUES
in scheme: Personnels et fonctions
in scheme: Fonction publique
in scheme: Fonction Publique et Gestion des Ressources Humaines
notation: REFIP5766

allocation différentielle de fin de mandat
type: ConceptReFip
type: Concept
broader: refip-REFIP6700
definition: Prestation versée à certains élus locaux titulaires de fonction exécutives ayant cessé d’exercer leur activité professionnelle pour se consacrer à leur mandat. Ils perçoivent cette allocation, à l’issue de leur mandat, dès lors qu’ils sont inscrits à Pôle emploi ou ont repris une activité professionnelle leur procurant des revenus inférieurs aux indemnités de fonction qu’ils percevaient au titre de leur mandat.
in scheme: FINANCES PUBLIQUES
in scheme: Santé et Protection Sociale
in scheme: Protection Sociale
in scheme: Questions de Société
notation: REFIP5767
related: fin de mandat

assurance décès-invalidité
type: ConceptReFip
type: Concept
broader: assurances (non-descripteur)
definition: Assurance garantissant à un emprunteur que la compagnie prendra en charge le solde de son crédit en cas de décès ou d'invalidité.
in scheme: FINANCES PUBLIQUES
in scheme: Assurances
in scheme: Finance
notation: REFIP5768
scope note: Assurance privée

application GAIA DML
type: ConceptReFip
type: Concept
alternative label: GAIA DEML
alternative label: GAIA DML
alternative label: GAIA démarche en ligne
alternative label: service DML
alternative label: service démarches en ligne
broader: applications fiscales (non-descripteur)
definition: Service qui permet aux usagers particuliers, depuis leur espace personnel sur le site impots.gouv.fr, de faire une réclamation (rectification d’erreur, réclamation contentieuse ou demande gracieuse) ou une autre démarche fiscale courante (déclarer un changement d’adresse, demander un délai de paiement ...) et de suivre l’état d’avancement de cette réclamation ou démarche.
history note: Remplacée par l'outil e-contacts à compter du 3 mars 2016
in scheme: FINANCES PUBLIQUES
in scheme: Applications Informatiques
in scheme: Applications fiscales
notation: REFIP5769

FISCALIS
type: ConceptReFip
type: Concept
broader: fiscalité internationale
definition: Programme pluriannuel de coopération de l'Union européenne qui donne aux administrations fiscales nationales les moyens de générer et d'échanger des informations et du savoir-faire. Il permet d'élaborer et de gérer en partenariat de grands systèmes informatisés trans-européens, ainsi que d'établir des réseaux interpersonnels en mettant en relation des fonctionnaires nationaux de toute l'Europe.
in scheme: FINANCES PUBLIQUES
in scheme: Champ d'Application
in scheme: Fiscalité
notation: REFIP577

administrateur informatique
type: ConceptReFip
type: Concept
broader: fonction de la Direction générale des finances publiques (non-descripteur)
definition: Garant de l’accès au système d’information et de sa sécurité, prévient les anomalies éventuelles, participe au développement et à la maintenance des applications informatiques.
in scheme: FINANCES PUBLIQUES
in scheme: Personnels et fonctions
in scheme: Fonction de la Direction générale des Finances publiques (NON DESCRIPTEUR)
in scheme: Fonction Publique et Gestion des Ressources Humaines
notation: REFIP5770

aménagement et réduction du temps de travail
type: ConceptReFip
type: Concept
alternative label: ARTT
broader: refip-REFIP6916
definition: Ensemble de modalités d'organisation du temps de travail selon un cycle de travail hebdomadaire faisant suite à la parution du décret 2000-815 fixant la durée du temps de travail hebdomadaire à 35h et accordant aux agents ayant une quotité de travail supérieure à cette durée un quota de jours "RTT".
in scheme: FINANCES PUBLIQUES
in scheme: Gestion des ressources humaines
in scheme: Temps de travail
in scheme: Fonction Publique et Gestion des Ressources Humaines
notation: REFIP5771

administrateur des finances publiques
type: ConceptReFip
type: Concept
alternative label: AFIP
alternative label: directeur départemental des impôts
alternative label: receveur des finances du Trésor public de 1ère catégorie
broader: grade de la Direction générale des Finances publiques (non-descripteur)
definition: Corps des administrateurs des finances publiques comprenant quatre grades : - administrateur des finances publiques : 5 échelons ; - administrateur général des finances publiques de classe normale : 5 échelons ; - administrateur général des finances publiques de 1re classe : 3 échelons ; - administrateur général des finances publiques de classe exceptionnelle : 3 échelons et 1 échelon spécial réservé au Directeur régional des finances publiques d’Ile-de-France. Les administrateurs des finances publiques sont nommés par arrêté ministériel et recrutés principalement parmi les administrateurs des finances publiques adjoints, ainsi qu’au tour extérieur, ouvert aux trois fonctions publiques et aux militaires détenant un grade d’officier.
in scheme: FINANCES PUBLIQUES
in scheme: Personnels et fonctions
in scheme: Fonction publique
in scheme: Fonction Publique et Gestion des Ressources Humaines
notation: REFIP5772

audiovisuel public
type: ConceptReFip
type: Concept
broader: service public
definition: Service public regroupant l'ensemble des stations de radio, chaînes de télévision et autres média électroniques dont la première mission est le service public. Ces institutions sont en général détenues partiellement ou dans leur totalité par l'État ou toute autre institution publique.
in scheme: FINANCES PUBLIQUES
in scheme: Etat
in scheme: Mission de Service Public
in scheme: Administration de L'Etat
notation: REFIP5773

agent comptable
type: ConceptReFip
type: Concept
broader: fonction de la Direction générale des finances publiques (non-descripteur)
definition: Comptable public. Il est chargé du recouvrement des recettes, du paiement des dépenses, de la garde et de la conservation des fonds et valeurs de l'établissement et de la tenue de la comptabilité générale. Il assure également des missions de conseil et d’accompagnement des ordonnateurs, et d’actions destinées à s’assurer de la qualité des comptes et de l’information financière.
in scheme: FINANCES PUBLIQUES
in scheme: Personnels et fonctions
in scheme: Fonction de la Direction générale des Finances publiques (NON DESCRIPTEUR)
in scheme: Fonction Publique et Gestion des Ressources Humaines
notation: REFIP5774

adjoint des cadres hospitaliers
type: ConceptReFip
type: Concept
broader: fonction publique hospitalière
definition: Fonctionnaire hospitalier de catégorie B de la filière administrative, assurant des missions d’encadrement et l'instruction administrative ou financière des affaires qui leur sont confiées et prépare lorsqu'il y a lieu les décisions qui en découlent. Il peut se voir confier la responsabilité d'une ou plusieurs unités administratives.
in scheme: FINANCES PUBLIQUES
in scheme: Personnels et fonctions
in scheme: Fonction publique
in scheme: Fonction Publique et Gestion des Ressources Humaines
notation: REFIP5775

autorisation d'urbanisme
type: ConceptReFip
type: Concept
broader: document d'urbanisme
definition: Décision donnée par une autorité administrative d'édifier une ou plusieurs constructions nouvelles ou de modifier une ou plusieurs constructions existantes, préalablement à l'exécution des travaux.
in scheme: FINANCES PUBLIQUES
in scheme: Aménagement du territoire Urbanisme Habitat
in scheme: Aménagement du Territoire
in scheme: Questions de Société
narrower: autorisation tacite
narrower: autorisation d'occupation des sols
notation: REFIP5776

assiette d'imposition
type: ConceptReFip
type: Concept
alternative label: assiette
broader: champ d'application
definition: Eléments retenus pour déterminer la base de calcul d'un impôt ou d'une taxe.
in scheme: FINANCES PUBLIQUES
in scheme: Champ d'Application
in scheme: Fiscalité
notation: REFIP5777

attaché d'administration centrale (supprimé)
type: ConceptReFip
type: Concept
broader: ZZ
in scheme: FINANCES PUBLIQUES
notation: REFIP5778

apprentissage
type: ConceptReFip
type: Concept
broader: formation en alternance
definition: L’apprentissage est une formation en alternance qui associe une formation chez un employeur et des enseignements dispensés dans un centre de formation d’apprentis. L’apprentissage permet d’accéder à tous les niveaux de qualification professionnelle sanctionnée par un diplôme de l’enseignement technologique ou professionnel du second degré ou du supérieur ou un titre homologué.
in scheme: FINANCES PUBLIQUES
in scheme: Entreprises
in scheme: Travail
in scheme: 212619
narrower: apprenti
notation: REFIP5779

économie souterraine
type: ConceptReFip
type: Concept
alternative label: économie clandestine
broader: économie générale (non-descripteur)
definition: Ensemble de la production souterraine, de la production illégale, de la production du secteur informel.
in scheme: FINANCES PUBLIQUES
in scheme: Questions Economiques
in scheme: Economie générale
notation: REFIP578
related: travail dissimulé

agent technique principal des finances publiques
type: ConceptReFip
type: Concept
alternative label: adjoint technique principal des impôts
alternative label: adjoint technique principal du Trésor public
alternative label: agent technique principal 1ère classe des finances publiques
alternative label: agent technique principal 2ème classe des finances publiques
broader: grade de la Direction générale des Finances publiques (non-descripteur)
definition: Grade de la catégorie C de la DGFIP, les agents techniques principaux des finances publiques exercent les fonctions dévolues aux agents techniques des finances publiques.
in scheme: FINANCES PUBLIQUES
in scheme: Personnels et fonctions
in scheme: Fonction publique
in scheme: Fonction Publique et Gestion des Ressources Humaines
notation: REFIP5780

activité syndicale
type: ConceptReFip
type: Concept
broader: dialogue social
definition: Exercice du droit syndical par un agent,en lieu et place de son activité administrative normale (activité militante ou exercice d'un mandat de représentant du personnel).
in scheme: FINANCES PUBLIQUES
in scheme: Gestion des ressources humaines
in scheme: Statut du fonctionnaire
in scheme: Fonction Publique et Gestion des Ressources Humaines
notation: REFIP5781

abattement
type: ConceptReFip
type: Concept
alternative label: abattement fiscal
broader: déduction fiscale
definition: Partie de la matière imposable exemptée d'impôt.
in scheme: FINANCES PUBLIQUES
in scheme: Liquidation de l'Impôt
in scheme: Fiscalité
notation: REFIP5782

agent administratif des finances publiques
type: ConceptReFip
type: Concept
alternative label: agent administratif 1ère classe des finances publiques
alternative label: agent administratif 2ème classe des finances publiques
alternative label: agent administratif des impôts
alternative label: agent d'administration du Trésor public
alternative label: agent de constatation ou d'assiette
alternative label: agent de recouvrement du Trésor public
broader: grade de la Direction générale des Finances publiques (non-descripteur)
definition: Grade de la catégorie C de la DGFIP, les agents administratifs des finances publiques peuvent notamment : Assurer les travaux d'assiette et de recouvrement relatifs aux impôts et taxes de toute nature ainsi que les différentes tâches liées à la tenue du cadastre et à la publicité foncière ; Assister les inspecteurs et contrôleurs des finances publiques dans les contrôles sur pièces des dossiers fiscaux ainsi que dans le traitement du contentieux des impôts et taxes ; Participer à l'accueil des usagers ; Exécuter, sous la responsabilité du chef de service, les opérations financières, comptables et budgétaires de l'Etat, des établissements publics et des collectivités territoriales, telles que le paiement des dépenses, l'encaissement des recettes ou la tenue des comptabilités ; Participer à des fonctions de support informatique.
in scheme: FINANCES PUBLIQUES
in scheme: Personnels et fonctions
in scheme: Fonction publique
in scheme: Fonction Publique et Gestion des Ressources Humaines
notation: REFIP5783

aide médicale de l'Etat
type: ConceptReFip
type: Concept
alternative label: AME
broader: action sociale
definition: Dispositif permettant aux étrangers en situation irrégulière au regard de la réglementation française sur le séjour en France, de bénéficier d'un accès aux soins, sous réserve de remplir certaines conditions.
in scheme: FINANCES PUBLIQUES
in scheme: Santé et Protection Sociale
in scheme: Protection Sociale
in scheme: Questions de Société
notation: REFIP5784

agent d'enquête
type: ConceptReFip
type: Concept
alternative label: agent enquêteur
broader: fonction de la Direction générale des finances publiques (non-descripteur)
definition: Agent exerçant sa mission de recherche du renseignement grâce à un accès élargi aux applications ainsi qu’à des relations privilégiées avec un certain nombre d’organismes. Il peut recourir à l’exercice du droit de communication et sur demande, effectuer des enquêtes de terrain.
in scheme: FINANCES PUBLIQUES
in scheme: Personnels et fonctions
in scheme: Fonction de la Direction générale des Finances publiques (NON DESCRIPTEUR)
in scheme: Fonction Publique et Gestion des Ressources Humaines
notation: REFIP5785

adjoint technique territorial
type: ConceptReFip
type: Concept
alternative label: agent de salubrité territorial
broader: agent technique territorial
definition: Fonctionnaire territorial de catégorie C, chargé des tâches techniques d’exécution, Il exerce ses fonctions dans les domaines du bâtiment, des travaux publics, de la voirie et des réseaux divers, des espaces verts et espaces naturels, de la mécanique et de l’électromécanique, de la restauration, de l’environnement et de l’hygiène, de la logistique et de la sécurité, de la communication et du spectacle, de l’artisanat d’art.
in scheme: FINANCES PUBLIQUES
in scheme: Personnels et fonctions
in scheme: Fonction Publique et Gestion des Ressources Humaines
notation: REFIP5786

allocation de logement
type: ConceptReFip
type: Concept
alternative label: aide au logement
alternative label: allocation logement
broader: refip-REFIP6589
definition: Prestation sociale dont la finalité est de réduire les dépenses de logement des familles.
in scheme: FINANCES PUBLIQUES
in scheme: Santé et Protection Sociale
in scheme: Protection Sociale
in scheme: Questions de Société
narrower: allocation de logement sociale
narrower: aide personnalisée au logement
notation: REFIP5787

aide à la scolarité
type: ConceptReFip
type: Concept
broader: refip-REFIP6700
definition: Ensemble d'aides financières concernant les enfants du cours primaire à la terminale : aides pour la cantine, fonds sociaux collégien et lycéen, bourse des collèges, bourses des lycées, aides aux élèves en internat, bourses d'enseignement d'adaptation.
in scheme: FINANCES PUBLIQUES
in scheme: Santé et Protection Sociale
in scheme: Protection Sociale
in scheme: Questions de Société
narrower: bourse d'accès à l'enseignement supérieur
notation: REFIP5788

assistante maternelle
type: ConceptReFip
type: Concept
alternative label: ASSMAT
alternative label: gardienne d'enfant
alternative label: nourrice
broader: garde d'enfant
definition: Professionnel de la petite enfance qui accueille les enfants pendant le temps de travail de leurs parents. Il est employé directement par ces derniers ou par un organisme dans le cadre d’un service d’accueil.
in scheme: FINANCES PUBLIQUES
in scheme: Santé et Protection Sociale
in scheme: Protection Sociale
in scheme: Questions de Société
notation: REFIP5789

dommages et intérêts
type: ConceptReFip
type: Concept
broader: indemnisation
definition: Compensation financière versée lors d'un préjudice moral ou d'une atteinte à son patrimoine, destinée à réparer le dommage subi par une personne en raison de l'inexécution, de l'exécution tardive, ou de l'exécution défectueuse d'une obligation ou d'un devoir juridique par le cocontractant ou un tiers.
in scheme: FINANCES PUBLIQUES
in scheme: Droit et Justice
in scheme: Divisions du Droit
in scheme: Droit Privé
notation: REFIP579

aide publique à la réinsertion
type: ConceptReFip
type: Concept
broader: refip-REFIP6700
definition: Aide versée sous conditions, destinée à accompagner la réinsertion sociale et professionnelle des travailleurs étrangers qui désirent retourner dans leur pays d'origine.
in scheme: FINANCES PUBLIQUES
in scheme: Santé et Protection Sociale
in scheme: Protection Sociale
in scheme: Questions de Société
notation: REFIP5790

autorisation d'occupation des sols
type: ConceptReFip
type: Concept
broader: autorisation d'urbanisme
definition: Document d'urbanisme attestant que les travaux ou constructions envisagées sont conformes au plan local d'urbanisme (PLU) ou tout autre document en tenant lieu (comme le plan d'occupation des sols (POS)). L'attestation est relative notamment à l'utilisation des sols, à l'implantation, la destination, la nature, l'architecture, les dimensions, l'assainissement des constructions et à l'aménagement de leurs abords.
in scheme: FINANCES PUBLIQUES
in scheme: Aménagement du territoire Urbanisme Habitat
in scheme: Aménagement du Territoire
in scheme: Questions de Société
narrower: coefficient d'occupation des sols
narrower: déclaration préalable de travaux
narrower: refip-REFIP6595
notation: REFIP5791

annualisation du temps de travail (supprimé)
type: ConceptReFip
type: Concept
broader: ZZ
in scheme: FINANCES PUBLIQUES
notation: REFIP5792

accession à la propriété
type: ConceptReFip
type: Concept
broader: habitat
definition: Acquisition d’un logement, le plus souvent la résidence principale.
in scheme: FINANCES PUBLIQUES
in scheme: Aménagement du territoire Urbanisme Habitat
in scheme: Habitat
in scheme: Questions de Société
narrower: acquisition immobilière
narrower: administrateur de biens
narrower: location-accession
narrower: location-attribution
notation: REFIP5793

autorisation d'absence
type: ConceptReFip
type: Concept
alternative label: autorisation spéciale d'absence
broader: refip-REFIP6916
definition: Autorisation accordée à un agent par son chef de service, sous conditions, et subordonnée à une demande préalable expresse de sa part, qui lui permet de ne pas exercer ses fonctions tout en étant considéré comme étant en service.
in scheme: FINANCES PUBLIQUES
in scheme: Gestion des ressources humaines
in scheme: Temps de travail
in scheme: Fonction Publique et Gestion des Ressources Humaines
notation: REFIP5794

activité artistique
type: ConceptReFip
type: Concept
broader: culture et loisirs (non-descripteur)
definition: Activité qui consiste dans l'élaboration, la composition, la conception et l'invention d'œuvres originales.
in scheme: FINANCES PUBLIQUES
in scheme: Culture et Loisirs
in scheme: Activité Artistique
in scheme: Questions de Société
narrower: artiste
narrower: refip-REFIP6597
notation: REFIP5795

allocation de veuvage
type: ConceptReFip
type: Concept
alternative label: assurance veuvage
broader: refip-REFIP6700
definition: Allocation versée au conjoint survivant sous certaines conditions liée notamment à l'âge, à la situation familiale et aux ressources.
in scheme: FINANCES PUBLIQUES
in scheme: Santé et Protection Sociale
in scheme: Protection Sociale
in scheme: Questions de Société
notation: REFIP5796

aide sociale
type: ConceptReFip
type: Concept
alternative label: aide sociale aux personnes âgées
alternative label: aide à caractère social
alternative label: allocation d'aide sociale
broader: refip-REFIP6700
definition: Ensemble des prestations constituant une obligation mise à la charge des collectivités publiques, notamment du département, et destinées à faire face à un état de besoin pour des bénéficiaires dans l'impossibilité d'y pourvoir.
in scheme: FINANCES PUBLIQUES
in scheme: Santé et Protection Sociale
in scheme: Protection Sociale
in scheme: Questions de Société
notation: REFIP5797

agglomération
type: ConceptReFip
type: Concept
alternative label: agglomération urbaine
alternative label: unité urbaine
alternative label: ville
broader: refip-REFIP6936
definition: Ensemble urbain composé de plusieurs villes interconnectées qui gèrent leurs projets en commun.
in scheme: FINANCES PUBLIQUES
in scheme: Aménagement du territoire Urbanisme Habitat
in scheme: Aménagement du Territoire
in scheme: Questions de Société
narrower: contrat d'agglomération
narrower: refip-REFIP6941
notation: REFIP5798

administrateur de biens
type: ConceptReFip
type: Concept
broader: accession à la propriété
definition: Spécialiste du droit immobilier qui gère des logements ou des locaux pour le compte de particuliers ou de sociétés. Il peut également intervenir dans une copropriété en tant que syndic.
in scheme: FINANCES PUBLIQUES
in scheme: Aménagement du territoire Urbanisme Habitat
in scheme: Habitat
in scheme: Questions de Société
notation: REFIP5799

budget
type: ConceptReFip
type: Concept
definition: Ensemble des comptes qui décrivent, pour une année civile, toutes les ressources et toutes les charges de l'État, des autres collectivités publiques et des établissements publics.
in scheme: FINANCES PUBLIQUES
in scheme: Budget
narrower: exécution du budget
narrower: budget de l'Etat
narrower: refip-REFIP978
narrower: refip-REFIP982
notation: REFIP58

action en réparation civile de l'Etat
type: ConceptReFip
type: Concept
alternative label: ARCE
broader: protection fonctionnelle
definition: Action en justice permettant à l'administration d'obtenir du tiers responsable d'un accident dont a été victime un agent de l'État le remboursement des frais engendrés par l'accident et versés par l'administration (traitement de l'agent, prestations, assurance, etc.).
in scheme: FINANCES PUBLIQUES
in scheme: Gestion des ressources humaines
in scheme: Statut du fonctionnaire
in scheme: Fonction Publique et Gestion des Ressources Humaines
notation: REFIP5800

adjoint technique
type: ConceptReFip
type: Concept
broader: refip-REFIP6651
definition: Fonctionnaire de catégorie C chargé des tâches techniques d’exécution.
in scheme: FINANCES PUBLIQUES
in scheme: Personnels et fonctions
in scheme: Fonction publique
in scheme: Fonction Publique et Gestion des Ressources Humaines
notation: REFIP5801

action
type: ConceptReFip
type: Concept
alternative label: action de société
alternative label: action formant rompu
alternative label: action gratuite
alternative label: titre de capital
broader: titre de placement (non-descripteur)
definition: Titre négociable émis par les sociétés par action qui représente une fraction du capital social. Elle confère à son détenteur la propriété d'une partie du capital avec les droits qui y sont associés.
in scheme: FINANCES PUBLIQUES
in scheme: Instrument financier
in scheme: Valeur Mobiliere
in scheme: Finance
notation: REFIP5802

agent de traitement de l'information
type: ConceptReFip
type: Concept
broader: fonction publique de l'Etat
definition: Agent de catégorie C, chargé des tâches d’exploitation informatique. L'agent de traitement assiste le pupitreur pour les opérations simples de commande de l'ordinateur et pour la mise en œuvre et la surveillance du fonctionnement des périphériques dont il peut être éventuellement seul responsable.
in scheme: FINANCES PUBLIQUES
in scheme: Personnels et fonctions
in scheme: Fonction publique
in scheme: Fonction Publique et Gestion des Ressources Humaines
notation: REFIP5803

administrateur civil hors classe
type: ConceptReFip
type: Concept
broader: fonction publique de l'Etat
definition: Grade des administrateurs civils, comprenant 8 échelons.
in scheme: FINANCES PUBLIQUES
in scheme: Personnels et fonctions
in scheme: Fonction publique
in scheme: Fonction Publique et Gestion des Ressources Humaines
notation: REFIP5804

aide personnalisée au logement
type: ConceptReFip
type: Concept
alternative label: APL
broader: allocation de logement
definition: Aide financière versée par la CAF et destinée à réduire le montant du loyer des locataires ou la mensualité d'emprunt immobilier. Elle est attribuée selon la nature du logement et la composition de la famille.
in scheme: FINANCES PUBLIQUES
in scheme: Santé et Protection Sociale
in scheme: Protection Sociale
in scheme: Questions de Société
notation: REFIP5805

allocation d'aide à la mobilité du conjoint
type: ConceptReFip
type: Concept
alternative label: allocation à la mobilité des conjoints
broader: indemnité
definition: Allocation accordée à un agent bénéficiaire de la prime de restructuration, dès lors que son conjoint ou partenaire d'un pacte civil de solidarité est contraint de cesser son activité professionnelle en raison de la mutation ou du déplacement.
in scheme: FINANCES PUBLIQUES
in scheme: Gestion des ressources humaines
in scheme: Rémunération
in scheme: Fonction Publique et Gestion des Ressources Humaines
notation: REFIP5806

assurance maladie obligatoire
type: ConceptReFip
type: Concept
alternative label: régime obligatoire
broader: assurance maladie
definition: Régime obligatoire couvrant tout ou partie des dépenses liées à la maladie, à la maternité et aux accidents.
in scheme: FINANCES PUBLIQUES
in scheme: Santé et Protection Sociale
in scheme: Protection Sociale
in scheme: Questions de Société
notation: REFIP5807

avocat du Trésor
type: ConceptReFip
type: Concept
broader: fonction de la Direction générale des finances publiques (non-descripteur)
definition: Avocat appartenant au réseau des avocats travaillant pour le compte de l’Agent Judiciaire de l’État seul habilité à représenter l’État devant les juridictions de l’ordre judiciaire en ce qui concerne les actions tendant à faire déclarer l’État créancier ou débiteur pour des causes étrangères à l’impôt ou au domaine.
in scheme: FINANCES PUBLIQUES
in scheme: Personnels et fonctions
in scheme: Fonction de la Direction générale des Finances publiques (NON DESCRIPTEUR)
in scheme: Fonction Publique et Gestion des Ressources Humaines
notation: REFIP5808

absentéisme
type: ConceptReFip
type: Concept
broader: refip-REFIP6916
definition: Toute absence non prévue qui trouve une origine directe ou indirecte dans une dégradation des conditions de travail entendues au sens large : les ambiances physiques mais aussi l’organisation du travail, la qualité de la relation d’emploi, la conciliation des temps professionnel et privé, etc.
in scheme: FINANCES PUBLIQUES
in scheme: Gestion des ressources humaines
in scheme: Temps de travail
in scheme: Fonction Publique et Gestion des Ressources Humaines
narrower: abandon de poste
notation: REFIP5809

capitaux propres
type: ConceptReFip
type: Concept
alternative label: actif net
alternative label: capital économique
alternative label: fonds propres
alternative label: situation nette
broader: passif
definition: Partie des fonds propres de l'entreprise.
in scheme: FINANCES PUBLIQUES
in scheme: Documents comptables
in scheme: Comptabilité
notation: REFIP581

attaché d'administration
type: ConceptReFip
type: Concept
broader: fonction publique de l'Etat
definition: Fonctionnaire d' Etat, territorial ou hospitalier de catégorie A pouvant occuper des emplois de cadres intermédiaires dans diverses administrations et/ou établissements publics. Les missions qui lui sont confiées concernent la préparation ou l'élaboration de politiques publiques et la gestion des moyens humains, matériels et financiers.
in scheme: FINANCES PUBLIQUES
in scheme: Personnels et fonctions
in scheme: Fonction publique
in scheme: Fonction Publique et Gestion des Ressources Humaines
notation: REFIP5810

aménagement du territoire
type: ConceptReFip
type: Concept
broader: aménagement du territoire urbanisme habitat (non-descripteur)
definition: Politique publique qui consiste à planifier et coordonner l'utilisation du sol, l'organisation du bâti, ainsi que la répartition des équipements et des activités dans l'espace géographique.
in scheme: FINANCES PUBLIQUES
in scheme: Aménagement du territoire Urbanisme Habitat
in scheme: Aménagement du Territoire
in scheme: Questions de Société
narrower: aménagement foncier agricole et forestier
narrower: barrage
narrower: contrat de pays
narrower: contrat de rivière
narrower: charte de pays
narrower: développement régional
narrower: document d'urbanisme
narrower: refip-REFIP6890
narrower: refip-REFIP6936
narrower: refip-REFIP6964
narrower: refip-REFIP6965
narrower: refip-REFIP6966
narrower: refip-REFIP6968
narrower: refip-REFIP6970
narrower: refip-REFIP6971
narrower: refip-REFIP6974
narrower: refip-REFIP6975
narrower: refip-REFIP6976
narrower: refip-REFIP6980
narrower: refip-REFIP6981
narrower: refip-REFIP6982
notation: REFIP5811

assistant des hôpitaux
type: ConceptReFip
type: Concept
alternative label: assistant hospitalier
broader: fonction publique hospitalière
definition: Fonctionnaire non titulaire hospitalier pouvant pratiquer des actes de soins (médecins) ou des actes pharmaceutiques (pharmacien) ou biologiques (médecin/pharmacien) en établissements publics de santé.
in scheme: FINANCES PUBLIQUES
in scheme: Personnels et fonctions
in scheme: Fonction publique
in scheme: Fonction Publique et Gestion des Ressources Humaines
notation: REFIP5812

amélioration de l'habitat
type: ConceptReFip
type: Concept
broader: habitat
definition: Amélioration ou réfection de logements.
in scheme: FINANCES PUBLIQUES
in scheme: Aménagement du territoire Urbanisme Habitat
in scheme: Habitat
in scheme: Questions de Société
notation: REFIP5813

avancement de grade
type: ConceptReFip
type: Concept
broader: avancement
definition: Passage d'un grade à un grade supérieur à l’intérieur d’un même corps ou cadre d’emplois.
in scheme: FINANCES PUBLIQUES
in scheme: Gestion des ressources humaines
in scheme: Carrière
in scheme: Fonction Publique et Gestion des Ressources Humaines
notation: REFIP5814

agent administratif territorial
type: ConceptReFip
type: Concept
broader: agent territorial
definition: Fonctionnaire territorial affecté en filière administrative.
in scheme: FINANCES PUBLIQUES
in scheme: Personnels et fonctions
in scheme: Fonction publique
in scheme: Fonction Publique et Gestion des Ressources Humaines
narrower: administrateur territorial
narrower: attaché territorial
narrower: adjoint administratif territorial
narrower: refip-REFIP6785
narrower: refip-REFIP6827
notation: REFIP5815

allocation de naissance (supprimé)
type: ConceptReFip
type: Concept
broader: ZZ
in scheme: FINANCES PUBLIQUES
notation: REFIP5816

activité accessoire
type: ConceptReFip
type: Concept
alternative label: emploi accessoire
broader: activité
definition: Emploi accessoire à l'activité principale du fonctionnaire, lucratif ou non, soumis à autorisation et sous certaines conditions.
in scheme: FINANCES PUBLIQUES
in scheme: Gestion des ressources humaines
in scheme: Statut du fonctionnaire
in scheme: Fonction Publique et Gestion des Ressources Humaines
notation: REFIP5817

agent comptable central du Trésor (supprimé)
type: ConceptReFip
type: Concept
broader: ZZ
in scheme: FINANCES PUBLIQUES
notation: REFIP5818

auxiliaire de puériculture
type: ConceptReFip
type: Concept
broader: fonction publique hospitalière
definition: Fonctionnaire hospitalier ou territorial de catégorie C, accompagnant les apprentissages des nourrissons et des jeunes enfants jusqu'à 3 ans, tout en veillant à leur hygiène et à leur confort.
in scheme: FINANCES PUBLIQUES
in scheme: Personnels et fonctions
in scheme: Fonction publique
in scheme: Fonction Publique et Gestion des Ressources Humaines
notation: REFIP5819

activité illicite
type: ConceptReFip
type: Concept
alternative label: activité illégale
alternative label: activité non autorisée
broader: refip-REFIP660
definition: Acte prohibé par la loi ou une disposition réglementaire et contraire à l'ordre public.
in scheme: FINANCES PUBLIQUES
in scheme: Droit et Justice
in scheme: Infractions et Sanctions
in scheme: Infraction
narrower: blanchiment
notation: REFIP582

action sociale
type: ConceptReFip
type: Concept
alternative label: intervention sociale
broader: refip-REFIP6655
definition: Ensemble des moyens, dispositifs législatifs ou réglementaires, visant à aider les personnes ou les groupes les plus fragiles à mieux vivre, à acquérir ou à préserver leur autonomie et à s’adapter au milieu social environnant.
in scheme: FINANCES PUBLIQUES
in scheme: Santé et Protection Sociale
in scheme: Protection Sociale
in scheme: Questions de Société
narrower: aide aux rapatriés
narrower: adulte-relais
narrower: aide sociale à l'enfance
narrower: aide médicale de l'Etat
narrower: garderie
narrower: garde d'enfant
narrower: mesure d'accompagnement social personnalisé
narrower: refip-REFIP6699
narrower: refip-REFIP6825
narrower: refip-REFIP6847
narrower: refip-REFIP6852
notation: REFIP5820

allocation aux grands invalides (supprimé)
type: ConceptReFip
type: Concept
broader: ZZ
in scheme: FINANCES PUBLIQUES
notation: REFIP5821

bon du Trésor
type: ConceptReFip
type: Concept
alternative label: BTAN
alternative label: BTF
alternative label: bon de caisse
alternative label: bon du Trésor négociable
alternative label: bon du Trésor à intérêts annuels
alternative label: bon du Trésor à taux fixe et à intérêt precompté
broader: refip-REFIP6898
definition: Titre de créance émis par le Trésor Public pour le compte de l’Etat afin de lui permettre de se procurer des liquidités à court et à moyen terme.
in scheme: FINANCES PUBLIQUES
in scheme: Instrument financier
in scheme: Valeur Mobiliere
in scheme: Finance
notation: REFIP5822

banque d'affaires
type: ConceptReFip
type: Concept
broader: banque
definition: Etablissement de crédit spécialisé qui réalise traditionnellement des opérations de financement (introductions en bourse, augmentations de capital,...) et de prestations de services (ingénierie financière, rapprochement d'entreprises,...) à destination des grandes entreprises industrielles et commerciales. Elle assure aussi, pour son propre compte, la gestion d'un portefeuille de participations.
in scheme: FINANCES PUBLIQUES
in scheme: Systeme bancaire et financier
in scheme: Etablissement de crédit
in scheme: Finance
notation: REFIP5823

banque d'investissement
type: ConceptReFip
type: Concept
broader: banque
definition: Société qui effectue l'ensemble des activités de conseil, montage, intermédiation et exécution des opérations dites de haut de bilan. Elle exerce des activité de finance d'entreprise, des opérations de financement structurées et de marchés financiers. Elle a une activité de courtage boursier et de gestion de fonds pour compte propre et pour compte de tiers.
in scheme: FINANCES PUBLIQUES
in scheme: Systeme bancaire et financier
in scheme: Etablissement de crédit
in scheme: Finance
notation: REFIP5824

billet d'entrée
type: ConceptReFip
type: Concept
alternative label: ticket d'entrée
broader: manifestation culturelle
definition: Document imprimé utilisé par convention pour l'entrée dans un spectacle, une manifestation.
in scheme: FINANCES PUBLIQUES
in scheme: Culture et Loisirs
in scheme: Activité Culturelle
in scheme: Questions de Société
notation: REFIP5825

bon à moyen terme négociable
type: ConceptReFip
type: Concept
alternative label: BMTN
broader: refip-REFIP6898
definition: Titre de créance négociable émis par les entreprises, les établissements de crédit, les institutions financières ou les sociétés financières, d'une durée initiale supérieure à un an et d'un certain montant unitaire.
in scheme: FINANCES PUBLIQUES
in scheme: Instrument financier
in scheme: Valeur Mobiliere
in scheme: Finance
notation: REFIP5826

bilan de compétences
type: ConceptReFip
type: Concept
broader: formation professionnelle
definition: Dispositif permettant aux agents d'analyser leurs compétences professionnelles et personnelles ainsi que leurs aptitudes et motivations, dans la perspective d'une éventuelle mobilité géographique ou fonctionnelle. Il sert à définir un projet professionnel et, le cas échéant, un projet de formation.
in scheme: FINANCES PUBLIQUES
in scheme: Gestion des ressources humaines
in scheme: Formation professionnelle
in scheme: Fonction Publique et Gestion des Ressources Humaines
notation: REFIP5827

bonification indemnitaire
type: ConceptReFip
type: Concept
broader: refip-REFIP6879
definition: Avantage indemnitaire attribué à certains agents sous certaines conditions.
in scheme: FINANCES PUBLIQUES
in scheme: Gestion des ressources humaines
in scheme: Statut du fonctionnaire
in scheme: Fonction Publique et Gestion des Ressources Humaines
notation: REFIP5828

banque
type: ConceptReFip
type: Concept
alternative label: agence bancaire
alternative label: organisme bancaire
alternative label: établissement bancaire
broader: établissement de crédit
definition: Entreprise qui a une multiplicité d'activités et de services bancaires et financiers. Traditionnellement, elle collecte des ressources, essentiellement par le biais de l'ouverture et de la tenue des comptes bancaires et distribue des crédits.
in scheme: FINANCES PUBLIQUES
in scheme: Systeme bancaire et financier
in scheme: Etablissement de crédit
in scheme: Finance
narrower: banque d'affaires
narrower: banque d'investissement
narrower: Crédit local de France
narrower: chambre de compensation
narrower: crédit foncier de France
narrower: La Banque Postale
narrower: refip-REFIP6542
notation: REFIP5829

bourse de commerce
type: ConceptReFip
type: Concept
broader: marché financier
definition: Lieu où se négocient des marchandises.
in scheme: FINANCES PUBLIQUES
in scheme: Systeme bancaire et financier
in scheme: Marché financier
in scheme: Finance
notation: REFIP5830

billet de trésorerie
type: ConceptReFip
type: Concept
broader: refip-REFIP6898
definition: Titre de créance négociable émis à court terme par des entreprises résidentes et non résidentes, autres que les établissements de crédit, sur le marché monétaire.
in scheme: FINANCES PUBLIQUES
in scheme: Instrument financier
in scheme: Valeur Mobiliere
in scheme: Finance
notation: REFIP5831

BIC-IBAN
type: ConceptReFip
type: Concept
alternative label: bank identifier code
alternative label: international bank account number
broader: refip-REFIP6859
definition: Coordonnées bancaires. Le BIC (Bank Identifier Code) est le code universel d’identification que chaque banque s’est vu attribuer par l’entreprise Society for Worldwide Interbank Financial Telecommunication (SWIFT). Il est composé de 8 ou 11 caractères en fonction de la catégorie de banque. L'IBAN (International Bank Account Number) vise à permettre une identification homogène des comptes bancaires dans tous les pays. Il se construit à partir de l'identifiant national précédé d'un code pays et d'une clé de contrôle à 2 chiffres permettant de vérifier l'exactitude des données.
in scheme: FINANCES PUBLIQUES
in scheme: Moyen de paiement
in scheme: Finance
notation: REFIP5832
scope note: Coordonnées bancaires internationales

Banque centrale européenne
type: ConceptReFip
type: Concept
alternative label: BCE
broader: refip-REFIP6938
definition: Banque centrale des pays de l’Union européenne qui ont adopté l’euro. Sa principale mission consiste à maintenir la stabilité des prix dans la zone euro et à préserver ainsi le pouvoir d’achat de la monnaie unique.
in scheme: FINANCES PUBLIQUES
in scheme: Questions Politiques Relations Internationales
in scheme: Relations Internationales
in scheme: Questions de Société
notation: REFIP5833

brigadier chef
type: ConceptReFip
type: Concept
broader: fonction publique territoriale
definition: Fonctionnaire territorial de catégorie C de la filière police municipale, qui exécute sous l'autorité du maire, les missions de police administrative et judiciaire relevant de la compétence de celui-ci en matière de prévention et de surveillance du bon ordre, de la tranquillité, de la sécurité et de la salubrité publiques.
in scheme: FINANCES PUBLIQUES
in scheme: Personnels et fonctions
in scheme: Fonction publique
in scheme: Fonction Publique et Gestion des Ressources Humaines
notation: REFIP5834

Banque européenne d'investissement
type: ConceptReFip
type: Concept
alternative label: BEI
broader: refip-REFIP6938
definition: Institution financière de l'Union Européenne qui contribue à réaliser les politiques de l'Union en faisant appel aux marchés des capitaux.
in scheme: FINANCES PUBLIQUES
in scheme: Questions Politiques Relations Internationales
in scheme: Relations Internationales
in scheme: Questions de Société
notation: REFIP5835

blâme
type: ConceptReFip
type: Concept
broader: refip-REFIP6820
definition: Sanction disciplinaire du 1er groupe, inscrit au dossier du fonctionnaire et effacé automatiquement au bout de trois ans, si aucune sanction n'est intervenue pendant cette période.
in scheme: FINANCES PUBLIQUES
in scheme: Gestion des ressources humaines
in scheme: Statut du fonctionnaire
in scheme: Fonction Publique et Gestion des Ressources Humaines
notation: REFIP5836

base d'imposition
type: ConceptReFip
type: Concept
broader: champ d'application
definition: Ensemble des revenus, biens, droits ou valeurs retenus pour le calcul de l'impôt, par application d'un taux d'imposition après déduction.
in scheme: FINANCES PUBLIQUES
in scheme: Champ d'Application
in scheme: Fiscalité
narrower: exonération
narrower: revenu imposable
narrower: report d'imposition
narrower: déficit
narrower: refip-REFIP676
notation: REFIP5837

blanchiment
type: ConceptReFip
type: Concept
alternative label: blanchiment d'argent
alternative label: blanchiment de capitaux
alternative label: lutte anti-blanchiment
broader: activité illicite
definition: Processus par lequel la source illicite d'actifs obtenus par une activité délictuelle est dissimulée pour masquer le lien entre les fonds détenus et le délit initial.
in scheme: FINANCES PUBLIQUES
in scheme: Droit et Justice
in scheme: Infractions et Sanctions
in scheme: Infraction
notation: REFIP5838
related: trafic de stupéfiants
related: TRACFIN

bien culturel
type: ConceptReFip
type: Concept
broader: refip-REFIP6694
definition: Ensemble des biens, meubles ou immeubles, quels que soient leur origine ou leur propriétaire, qui présentent une grande importance pour le patrimoine culturel des peuples, tels que les monuments d'architecture, d'art ou d'histoire, religieux ou laïques, les sites archéologiques, les ensembles de constructions qui, en tant que tels, présentent un intérêt historique ou artistique, les œuvres d'art, les manuscrits, livres et autres objets d'intérêt artistique, historique ou archéologique, ainsi que les collections scientifiques et les collections importantes de livres, d'archives ou de reproductions de ces biens.
in scheme: FINANCES PUBLIQUES
in scheme: Culture et Loisirs
in scheme: Patrimoine Culturel
in scheme: Questions de Société
narrower: équipement culturel
narrower: refip-REFIP6559
narrower: refip-REFIP6574
notation: REFIP5839

billet de banque
type: ConceptReFip
type: Concept
broader: refip-REFIP6540
definition: Moyen de paiement généralement en papier imprimé, émis par la banque centrale.
in scheme: FINANCES PUBLIQUES
in scheme: Moyen de paiement
in scheme: Finance
notation: REFIP5840

bulletin de vote
type: ConceptReFip
type: Concept
broader: élection politique
definition: Morceau de papier où est inscrit le choix de l'électeur, qui le dépose dans une urne.
in scheme: FINANCES PUBLIQUES
in scheme: Questions Politiques Relations Internationales
in scheme: Politique
in scheme: Questions de Société
notation: REFIP5841

bonification d'intérêt
type: ConceptReFip
type: Concept
broader: intérêts d'emprunt
definition: Aide financière de l’employeur ou de l’Etat dans le but de diminuer le taux d’intérêt d’un crédit bancaire.
in scheme: FINANCES PUBLIQUES
in scheme: Systeme bancaire et financier
in scheme: Secteur bancaire
in scheme: Finance
notation: REFIP5842

brancardier
type: ConceptReFip
type: Concept
broader: fonction publique hospitalière
definition: Fonctionnaire hospitalier de catégorie C chargé du transport et de l’accompagnement des malades à l’intérieur des centres de soins (hôpital, clinique, maternité) contrairement à l'ambulancier, qui les transporte hors des établissements.
in scheme: FINANCES PUBLIQUES
in scheme: Personnels et fonctions
in scheme: Fonction publique
in scheme: Fonction Publique et Gestion des Ressources Humaines
notation: REFIP5843

Banque populaire Caisse d'épargne (supprimé)
type: ConceptReFip
type: Concept
broader: ZZ
in scheme: FINANCES PUBLIQUES
notation: REFIP5844

bourse d'accès à l'enseignement supérieur
type: ConceptReFip
type: Concept
alternative label: bourse d'enseignement supérieur
alternative label: bourse d'études
alternative label: bourse sur critères sociaux
broader: aide à la scolarité
definition: Aide financière accordée aux étudiants afin de poursuivre leurs études supérieures,
in scheme: FINANCES PUBLIQUES
in scheme: Santé et Protection Sociale
in scheme: Protection Sociale
in scheme: Questions de Société
notation: REFIP5845

bureau de vote
type: ConceptReFip
type: Concept
broader: élection politique
definition: Salle où l'on procède à un vote.
in scheme: FINANCES PUBLIQUES
in scheme: Questions Politiques Relations Internationales
in scheme: Politique
in scheme: Questions de Société
notation: REFIP5846

billet à ordre
type: ConceptReFip
type: Concept
broader: effet de commerce
definition: Reconnaissance de dette émise et signée par le débiteur lui-même qui s'engage à payer à l'échéance au propriétaire du billet le montant indiqué. A défaut de date d'échéance, le billet à ordre est considéré "à vue".
in scheme: FINANCES PUBLIQUES
in scheme: Moyen de paiement
in scheme: Finance
notation: REFIP5847

barème hors échelle (supprimé)
type: ConceptReFip
type: Concept
broader: ZZ
in scheme: FINANCES PUBLIQUES
notation: REFIP5848

bordereau récapitulatif des cotisations
type: ConceptReFip
type: Concept
broader: document de GRH (non-descripteur)
definition: Imprimé devant être produit dans les délais fixés pour le versement des cotisations par les collectivités territoriales, par les établissements publics ainsi que par l’État pour ses agents titulaires et non titulaires payés avec ou sans ordonnancement préalable.
in scheme: FINANCES PUBLIQUES
in scheme: Gestion des ressources humaines
in scheme: Document de GRH
in scheme: Fonction Publique et Gestion des Ressources Humaines
notation: REFIP5849

bonification de pension
type: ConceptReFip
type: Concept
alternative label: bonification pour enfants
alternative label: bonification pour service hors d'Europe
broader: droits à pension
definition: Période venant majorer la durée des services accomplis par le fonctionnaire, le magistrat ou le militaire.
in scheme: FINANCES PUBLIQUES
in scheme: Gestion des ressources humaines
in scheme: Retraite
in scheme: Fonction Publique et Gestion des Ressources Humaines
notation: REFIP5850

bon d'acquisition
type: ConceptReFip
type: Concept
alternative label: bon d'achat d'actions
alternative label: bon de souscription d'actions
broader: titre de placement (non-descripteur)
definition: Option qui permet à son détenteur de se procurer des actions, à un prix déterminé à l’avance, auprès de la société - mère, jusqu’à une certaine date donnée.
in scheme: FINANCES PUBLIQUES
in scheme: Instrument financier
in scheme: Valeur Mobiliere
in scheme: Finance
notation: REFIP5851

barrage
type: ConceptReFip
type: Concept
broader: aménagement du territoire
definition: Ouvrage construit sur un cours d'eau, soit pour dériver ou régulariser le cours, soit pour en utiliser la retenue comme source d'énergie ou comme réserve pour l'irrigation.
in scheme: FINANCES PUBLIQUES
in scheme: Aménagement du territoire Urbanisme Habitat
in scheme: Aménagement du Territoire
in scheme: Questions de Société
notation: REFIP5852
related: cours d'eau

bassin d'emploi à redynamiser
type: ConceptReFip
type: Concept
broader: développement régional
definition: Zones ouvrent droit à divers avantages au profit des entreprises qui s'y implantent ou qui réalisent des extensions d'établissements, notamment sous certaines conditions, des exonérations fiscales et de certaines charges patronales.
in scheme: FINANCES PUBLIQUES
in scheme: Aménagement du territoire Urbanisme Habitat
in scheme: Aménagement du Territoire
in scheme: Questions de Société
notation: REFIP5853

Crédit local de France
type: ConceptReFip
type: Concept
alternative label: CAECL
alternative label: Caisse d'aide à l'équipement des collectivités locales
alternative label: DEXIA
alternative label: emprunt unifié
broader: banque
definition: Etablissement créé en 1987, à partir de la "Caisse d’Aide à l’Equipement des Collectivités Locales" qui finançait l’équipement des collectivités locales. Il a fusionné avec Le Crédit Local belge, pour donner naissance au Crédit Local de France- Dexia.
in scheme: FINANCES PUBLIQUES
in scheme: Systeme bancaire et financier
in scheme: Etablissement de crédit
in scheme: Finance
notation: REFIP5854

compte titre
type: ConceptReFip
type: Concept
alternative label: compte courant de titres
alternative label: compte d'épargne en actions
alternative label: compte titres
alternative label: plan d'épargne en actions
broader: refip-REFIP6643
definition: Compte sur lequel sont inscrits les instruments financiers (des valeurs mobilières françaises ou internationales telles que les actions, obligations, OPCVM…) détenus par le titulaire du compte.
in scheme: FINANCES PUBLIQUES
in scheme: Systeme bancaire et financier
in scheme: Secteur bancaire
in scheme: Finance
narrower: refip-REFIP6658
notation: REFIP5855

charge de mission
type: ConceptReFip
type: Concept
broader: fonction (non-descripteur)
definition: Fonctionnaire qui a la responsabilité d'une étude donnée.
in scheme: FINANCES PUBLIQUES
in scheme: Personnels et fonctions
in scheme: Fonction (NON DESCRIPTEUR)
in scheme: Fonction Publique et Gestion des Ressources Humaines
notation: REFIP5856

course de lévriers
type: ConceptReFip
type: Concept
broader: refip-REFIP6858
definition: Epreuve faisant concourir des chiens lévriers. Un décret datant du 20 octobre 1983 autorise des sociétés de courses de lévriers à organiser le pari mutuel dans leurs réunions de courses.
in scheme: FINANCES PUBLIQUES
in scheme: Culture et Loisirs
in scheme: Loisirs
in scheme: Questions de Société
notation: REFIP5857

compte d'épargne
type: ConceptReFip
type: Concept
alternative label: compte épargne codéveloppement
alternative label: compte épargne construction
alternative label: livret A
alternative label: livret d'épargne entreprise
alternative label: livret d'épargne populaire
alternative label: livret de Caisse d'épargne
alternative label: livret de développement durable
alternative label: livret jeune
broader: refip-REFIP6643
definition: Dépôt d'argent à vue dans une banque, où un organisme assimilé, rapportant intérêts et ne permettant généralement pas d'être utilisé pour des paiements directs.
in scheme: FINANCES PUBLIQUES
in scheme: Systeme bancaire et financier
in scheme: Secteur bancaire
in scheme: Finance
notation: REFIP5858

cessation de fonction
type: ConceptReFip
type: Concept
alternative label: cessation définitive de fonction
broader: carrière
definition: Situation entraînant la radiation des cadres et la perte de la qualité de fonctionnaire dans les cas suivants: démission, licenciement, révocation, abandon de poste, retraite.
in scheme: FINANCES PUBLIQUES
in scheme: Gestion des ressources humaines
in scheme: Carrière
in scheme: Fonction Publique et Gestion des Ressources Humaines
narrower: cessation progressive d'activité
narrower: démission
narrower: départ à la retraite
narrower: limite d'âge
narrower: mise en congé d'office
narrower: refip-REFIP6793
narrower: refip-REFIP7202
notation: REFIP5859

contribution forfaitaire représentative des frais de réacheminement des étrangers en situation irrégulière
type: ConceptReFip
type: Concept
alternative label: contribution des frais de réacheminement
broader: sanction administrative
definition: Amende administrative prononcée au profit de l'Office français de l'immigration et de l'intégration et à l'encontre d'un employeur qui fait appel à des travailleurs en situation irrégulière sur le territoire français.
in scheme: FINANCES PUBLIQUES
in scheme: Droit et Justice
in scheme: Sanction
in scheme: Infractions et Sanctions
notation: REFIP586

coordonnateur
type: ConceptReFip
type: Concept
alternative label: coordinateur
broader: fonction (non-descripteur)
definition: Personne chargée de coordonner, centraliser, mutualiser, organiser différentes actions ou données.
in scheme: FINANCES PUBLIQUES
in scheme: Personnels et fonctions
in scheme: Fonction (NON DESCRIPTEUR)
in scheme: Fonction Publique et Gestion des Ressources Humaines
notation: REFIP5860

contrôle automatisé
type: ConceptReFip
type: Concept
alternative label: contrôle sanction automatisé
alternative label: radar automatique
broader: refip-REFIP6842
definition: Contrôle routier effectué par radar automatique.
in scheme: FINANCES PUBLIQUES
in scheme: Questions Politiques Relations Internationales
in scheme: Politique
in scheme: Questions de Société
notation: REFIP5861

contrôleur des douanes et droits indirects
type: ConceptReFip
type: Concept
broader: fonction publique de l'Etat
definition: Fonctionnaire d’État de catégorie B pouvant exercer ses fonctions dans deux branches d'activité : la branche du contrôle des opérations commerciales et d'administration générale et la branche de la surveillance.
in scheme: FINANCES PUBLIQUES
in scheme: Personnels et fonctions
in scheme: Fonction publique
in scheme: Fonction Publique et Gestion des Ressources Humaines
notation: REFIP5862

clôture pour insuffisance d'actif
type: ConceptReFip
type: Concept
alternative label: clôture pour extinction du passif
broader: liquidation judiciaire
definition: Opération mettant fin à la liquidation judiciaire lorsque le montant des actifs est insuffisant pour payer l'intégralité du passif.
in scheme: FINANCES PUBLIQUES
in scheme: Vie de l'Entreprise
in scheme: Entreprises
in scheme: Vie et Gestion de l'entreprise
notation: REFIP5863

cohabitation
type: ConceptReFip
type: Concept
broader: habitat
definition: Fait que deux personnes ou plus, quel que soit leur sexe, habitent ensemble.
in scheme: FINANCES PUBLIQUES
in scheme: Aménagement du territoire Urbanisme Habitat
in scheme: Habitat
in scheme: Questions de Société
notation: REFIP5864

capital décès
type: ConceptReFip
type: Concept
broader: refip-REFIP6700
definition: Indemnité qui garantit le versement d'un capital aux ayant droit d'un salarié décédé, sous certaines conditions.
in scheme: FINANCES PUBLIQUES
in scheme: Santé et Protection Sociale
in scheme: Protection Sociale
in scheme: Questions de Société
notation: REFIP5865
related: assurance décès

comptable commis d'office
type: ConceptReFip
type: Concept
broader: comptable public
definition: Personne désignée notamment pour rendre les comptes en cas de défaillance d’un comptable ou de gestion de fait.
in scheme: FINANCES PUBLIQUES
in scheme: Personnels et fonctions
in scheme: Fonction de la Direction générale des Finances publiques (NON DESCRIPTEUR)
in scheme: Fonction Publique et Gestion des Ressources Humaines
notation: REFIP5866

contrat d'assurance
type: ConceptReFip
type: Concept
alternative label: police d'assurance
broader: assurances (non-descripteur)
definition: Contrat par lequel l'assuré, se fait remettre moyennant une rémunération (la prime) en cas de réalisation d'un risque, une prestation par l'assureur, qui, prenant en charge un ensemble de risques, les compense conformément à la loi de la statistique.
in scheme: FINANCES PUBLIQUES
in scheme: Assurances
in scheme: Finance
narrower: indemnité d'assurance
narrower: refip-REFIP6645
narrower: refip-REFIP6861
notation: REFIP5867

consul
type: ConceptReFip
type: Concept
broader: fonction publique de l'Etat
definition: Diplomate en poste dans un consulat, chargé de la protection et de l'administration de ses concitoyens dans l'enceinte de sa circonscription consulaire.
in scheme: FINANCES PUBLIQUES
in scheme: Personnels et fonctions
in scheme: Fonction Publique et Gestion des Ressources Humaines
notation: REFIP5868
related: consulat

carrière longue
type: ConceptReFip
type: Concept
broader: refip-REFIP6761
definition: Dispositif de départ anticipé, sous certaines conditions, prévu pour les agents ayant commencé leur activité très jeune.
in scheme: FINANCES PUBLIQUES
in scheme: Gestion des ressources humaines
in scheme: Carrière
in scheme: Fonction Publique et Gestion des Ressources Humaines
notation: REFIP5869

Fonds national de compensation du supplément familial de traitement
type: ConceptReFip
type: Concept
broader: Caisse des dépôts et consignations
definition: Fonds de compensation ayant pour rôle d’égaliser a posteriori les charges en matière de supplément familial que les collectivités versent à leurs agents fonctionnaires.
in scheme: FINANCES PUBLIQUES
in scheme: Organisation Structurelle de l'Etat
in scheme: Institutions
in scheme: Administration de L'Etat
notation: REFIP587

cumul revenu pension
type: ConceptReFip
type: Concept
broader: droits du fonctionnaire
definition: Possibilité de cumuler sa retraite avec une rémunération d'activité
in scheme: FINANCES PUBLIQUES
in scheme: Gestion des ressources humaines
in scheme: Statut du fonctionnaire
in scheme: Fonction Publique et Gestion des Ressources Humaines
notation: REFIP5870

concours externe
type: ConceptReFip
type: Concept
broader: concours de recrutement
definition: Ensemble d'épreuves ouvert aux candidats possédant un niveau de diplôme déterminé, sauf en cas de dérogation prévue limitativement.
in scheme: FINANCES PUBLIQUES
in scheme: Gestion des ressources humaines
in scheme: Carrière
in scheme: Fonction Publique et Gestion des Ressources Humaines
notation: REFIP5871

contrat de mariage
type: ConceptReFip
type: Concept
broader: mariage
definition: Acte obligatoirement rédigé par un notaire et en vertu duquel les futurs époux fixent le sort de leurs biens pendant leur mariage.
in scheme: FINANCES PUBLIQUES
in scheme: Famille Education Population
in scheme: Famille
in scheme: Questions de Société
notation: REFIP5872

célibataire
type: ConceptReFip
type: Concept
broader: refip-REFIP6840
definition: Personne en âge d’être mariée, mais qui ne l’est pas.
in scheme: FINANCES PUBLIQUES
in scheme: Famille Education Population
in scheme: Famille
in scheme: Questions de Société
notation: REFIP5873

congé de paternité
type: ConceptReFip
type: Concept
broader: congés (non-descripteur)
definition: Congé accordé au père de l'enfant ou éventuellement, à la personne qui vit en couple avec la mère, suite à la naissance ou à l'accueil de l'enfant. Le bénéficiaire du congé peut être fonctionnaire ou agent non titulaire.
in scheme: FINANCES PUBLIQUES
in scheme: Gestion des ressources humaines
in scheme: Temps de travail
in scheme: Fonction Publique et Gestion des Ressources Humaines
notation: REFIP5874

contrat de pays
type: ConceptReFip
type: Concept
broader: aménagement du territoire
definition: Document dans lequel plusieurs partenaires (État, région...) s’engagent sur la mise en place d’actions structurantes. Il peut être signé entre le pays, l'agglomération, le département, la région ou encore l'État lorsque les enjeux sont bien identifiés.
in scheme: FINANCES PUBLIQUES
in scheme: Aménagement du territoire Urbanisme Habitat
in scheme: Aménagement du Territoire
in scheme: Questions de Société
notation: REFIP5875

congé de présence parentale
type: ConceptReFip
type: Concept
broader: refip-REFIP6657
definition: Congé au cours duquel le bénéficiaire est en position d’activité, ouvert lorsque la maladie, l'accident ou le handicap d'un enfant à charge présente une particulière gravité rendant indispensables une présence soutenue auprès de lui et des soins contraignants.
in scheme: FINANCES PUBLIQUES
in scheme: Gestion des ressources humaines
in scheme: Statut du fonctionnaire
in scheme: Fonction Publique et Gestion des Ressources Humaines
notation: REFIP5876

contrat de projets Etat-région
type: ConceptReFip
type: Concept
replaces: contrat de plan (obsolète)
alternative label: contrat de plan
broader: développement régional
definition: Document par lequel l'État et une région s'engagent sur la programmation et le financement pluriannuels de projets importants tels que la création d'infrastructures ou le soutien à des filières d'avenir. D'une durée de sept ans, les contrats de projets État-région succèdent aux contrats de plan.
in scheme: FINANCES PUBLIQUES
in scheme: Aménagement du territoire Urbanisme Habitat
in scheme: Aménagement du Territoire
in scheme: Questions de Société
notation: REFIP5877

campagne électorale
type: ConceptReFip
type: Concept
broader: élection politique
definition: Ensemble des opérations de propagande qui précèdent une élection ou un référendum.
in scheme: FINANCES PUBLIQUES
in scheme: Questions Politiques Relations Internationales
in scheme: Politique
in scheme: Questions de Société
narrower: refip-REFIP6648
notation: REFIP5878

contractuel
type: ConceptReFip
type: Concept
broader: fonction publique
definition: Agent non fonctionnaire de l'administration, dont la situation est régie par un contrat qui détermine ses droits et obligations. Les agents contractuels sont l'une des catégories d'agents non titulaires de la fonction publique.
in scheme: FINANCES PUBLIQUES
in scheme: Personnels et fonctions
in scheme: Fonction publique
in scheme: Fonction Publique et Gestion des Ressources Humaines
notation: REFIP5879
related: refip-REFIP6608
related: refip-REFIP6957

TRACFIN
type: ConceptReFip
type: Concept
alternative label: traitement du renseignement et action contre les circuits financiers clandestins
broader: refip-REFIP7061
definition: Service de renseignement placé sous l'autorité du Ministère de l'Action et des Comptes publics. Il concourt au développement d’une économie saine en luttant contre les circuits financiers clandestins, le blanchiment d’argent et le financement du terrorisme.
in scheme: FINANCES PUBLIQUES
in scheme: Organisation Structurelle de l'Etat
in scheme: Ministère
in scheme: Administration de L'Etat
notation: REFIP588
related: déclaration de soupçon
related: trafic de stupéfiants
related: blanchiment

compte de dépôt
type: ConceptReFip
type: Concept
alternative label: compte courant
broader: compte bancaire
definition: Compte bancaire servant à enregistrer les encaissements et les décaissements réalisés par le banquier pour le compte de son client. Il se voit régulièrement associé la possibilité d’utiliser un carnet de chèques et une carte bancaire.
in scheme: FINANCES PUBLIQUES
in scheme: Systeme bancaire et financier
in scheme: Secteur bancaire
in scheme: Finance
narrower: compte courant postal
notation: REFIP5880

contrôleur principal des finances publiques
type: ConceptReFip
type: Concept
alternative label: contrôleur principal des impôts
alternative label: contrôleur principal du Trésor public
broader: grade de la Direction générale des Finances publiques (non-descripteur)
definition: Grade de la catégorie B de la DGFIP, les contrôleurs principaux exercent les fonctions dévoluent aux contrôleurs des finances publiques.
in scheme: FINANCES PUBLIQUES
in scheme: Personnels et fonctions
in scheme: Fonction publique
in scheme: Fonction Publique et Gestion des Ressources Humaines
notation: REFIP5881

comptable supérieur du Trésor
type: ConceptReFip
type: Concept
broader: comptable public
definition: Directeur départemental ou, le cas échéant, régional des finances publiques, depuis la création de la DGFiP.
in scheme: FINANCES PUBLIQUES
in scheme: Personnels et fonctions
in scheme: Fonction de la Direction générale des Finances publiques (NON DESCRIPTEUR)
in scheme: Fonction Publique et Gestion des Ressources Humaines
notation: REFIP5882

couverture maladie universelle
type: ConceptReFip
type: Concept
alternative label: CMU
broader: assurance maladie
definition: Dispositif permettant, jusqu'au 31/12/2015, à une personne qui réside en France de manière stable et régulière de bénéficier de la sécurité sociale française pour ses dépenses de santé sans pour autant que cette personne soit couverte par un régime obligatoire d'assurance maladie.
in scheme: FINANCES PUBLIQUES
in scheme: Santé et Protection Sociale
in scheme: Protection Sociale
in scheme: Questions de Société
notation: REFIP5883

compte joint
type: ConceptReFip
type: Concept
broader: compte bancaire
definition: Compte bancaire collectif pour déposer et utiliser des fonds en commun, dans une confiance réciproque entre cotitulaires. Ces derniers sont solidairement responsables du compte et de ses éventuels incidents de paiement.
in scheme: FINANCES PUBLIQUES
in scheme: Systeme bancaire et financier
in scheme: Secteur bancaire
in scheme: Finance
notation: REFIP5884

cumul d'activités
type: ConceptReFip
type: Concept
broader: activité
definition: Possibilité pour un fonctionnaire ou un contractuel d'exercer en sus de son activité principale, une activité accessoire soumise à autorisation et sous conditions.
in scheme: FINANCES PUBLIQUES
in scheme: Gestion des ressources humaines
in scheme: Statut du fonctionnaire
in scheme: Fonction Publique et Gestion des Ressources Humaines
notation: REFIP5885

carnet de chèques
type: ConceptReFip
type: Concept
alternative label: chéquier
broader: chèque bancaire
definition: Chéquier délivré par une banque et comprenant généralement 25 ou 30 formules de chèques.
in scheme: FINANCES PUBLIQUES
in scheme: Moyen de paiement
in scheme: Finance
notation: REFIP5886

carte professionnelle
type: ConceptReFip
type: Concept
alternative label: Commission d'emploi
alternative label: carte d'identité de fonctionnaire
alternative label: carte de commissionnement
broader: document de GRH (non-descripteur)
definition: Document permettant aux agents d'attester de leur identité, de leur qualité d'agent public de la DGFIP et pour certains, de leur prestation de serment devant le Président du Tribunal de grande instance ou d'instance ou devant le Préfet.
in scheme: FINANCES PUBLIQUES
in scheme: Gestion des ressources humaines
in scheme: Document de GRH
in scheme: Fonction Publique et Gestion des Ressources Humaines
notation: REFIP5887

chèque barré
type: ConceptReFip
type: Concept
broader: chèque bancaire
definition: Chèque qui a pour particularité de ne pouvoir être payé à vue, sauf envers son tireur, et d’être endossable uniquement au profit d’un établissement de crédit.
in scheme: FINANCES PUBLIQUES
in scheme: Moyen de paiement
in scheme: Finance
notation: REFIP5888

candidature
type: ConceptReFip
type: Concept
alternative label: candidat
broader: mobilité du fonctionnaire
definition: Fait de briguer un poste, un emploi, une fonction, un titre ou fait de participer à un concours de recrutement.
in scheme: FINANCES PUBLIQUES
in scheme: Gestion des ressources humaines
in scheme: Carrière
in scheme: Fonction Publique et Gestion des Ressources Humaines
narrower: appel de candidature
notation: REFIP5889
scope note: Ressources humaines

procédure civile d'exécution
type: ConceptReFip
type: Concept
alternative label: voies d'exécution
broader: refip-REFIP877
definition: Ensemble des procédures légales de droit privé permettant à un créancier, titulaire d'un titre exécutoire, de pouvoir obtenir le recouvrement de sa créance.
in scheme: FINANCES PUBLIQUES
in scheme: Recouvrement
in scheme: Fiscalité
narrower: refip-REFIP783
notation: REFIP589
related: saisie

chèque Trésor
type: ConceptReFip
type: Concept
broader: monnaie scripturale
definition: Chèque émis et payable sur le Trésor selon les critères habituels d'un chèque bancaire.
in scheme: FINANCES PUBLIQUES
in scheme: Moyen de paiement
in scheme: Finance
narrower: chèque dépôt de fonds
notation: REFIP5890

Crédit agricole (supprimé)
type: ConceptReFip
type: Concept
broader: ZZ
in scheme: FINANCES PUBLIQUES
notation: REFIP5891

chèque d'accompagnement personnalisé
type: ConceptReFip
type: Concept
broader: refip-REFIP6700
definition: Aide financière accordée par les collectivités territoriales, établissements publics de coopération intercommunale, centres communaux et intercommunaux d’action sociale, caisses des écoles, et associations reconnues d’utilité publique, régulièrement déclarées et ayant pour objet l’action sociale en direction de personnes qui rencontrent des difficultés sociales, et exerçant leur activité statutaire depuis au moins deux ans.
in scheme: FINANCES PUBLIQUES
in scheme: Santé et Protection Sociale
in scheme: Protection Sociale
in scheme: Questions de Société
notation: REFIP5892

conservateur territorial du patrimoine
type: ConceptReFip
type: Concept
broader: fonction publique territoriale
definition: Fonctionnaire territorial de catégorie A placé au sein ou à la tête d'institutions patrimoniales exerçant des responsabilités scientifiques et techniques visant à étudier, classer, conserver, entretenir, enrichir, mettre en valeur et faire connaître le patrimoine d'une collectivité.
in scheme: FINANCES PUBLIQUES
in scheme: Personnels et fonctions
in scheme: Fonction publique
in scheme: Fonction Publique et Gestion des Ressources Humaines
notation: REFIP5893

contrat de travail
type: ConceptReFip
type: Concept
broader: travail (non-descripteur)
definition: Convention par laquelle une personne, le salarié, met son activité professionnelle à la disposition et sous la subordination d'une autre personne, l'employeur, qui lui verse en contrepartie un salaire.
in scheme: FINANCES PUBLIQUES
in scheme: Contrat de Travail
in scheme: Entreprises
in scheme: Travail
narrower: contrat à durée indéterminée
narrower: emploi jeune
narrower: contrat à durée déterminée
narrower: contrat emploi consolidé
narrower: contrat d'apprentissage
narrower: contrat aide
notation: REFIP5894

compte individuel de retraite
type: ConceptReFip
type: Concept
alternative label: compte individuel retraite
broader: document de GRH (non-descripteur)
definition: Compte ouvert pour chaque affilié auprès d'un régime de retraite, permettant de retracer, de manière automatique et continu, l'ensemble des services valables auprès du régime et /ou le montant des cotisations versées ainsi que le nombre de points acquis.
in scheme: FINANCES PUBLIQUES
in scheme: Gestion des ressources humaines
in scheme: Document de GRH
in scheme: Fonction Publique et Gestion des Ressources Humaines
notation: REFIP5895

constitution des droits à pension
type: ConceptReFip
type: Concept
broader: droits à pension
definition: Prise en compte des périodes de services civils effectifs (ainsi que certains services considérés comme tels) et des services militaires. Les périodes admises dans la constitution du droit à pension permettent de déterminer si un droit à pension peut être accordé ou non.
in scheme: FINANCES PUBLIQUES
in scheme: Gestion des ressources humaines
in scheme: Retraite
in scheme: Fonction Publique et Gestion des Ressources Humaines
notation: REFIP5896

conseiller général des établissements de santé
type: ConceptReFip
type: Concept
alternative label: conseiller général des hôpitaux
broader: fonction publique hospitalière
definition: Fonctionnaire hospitalier de catégorie A placé, par voie de détachement, auprès du Ministre en charge de la santé et gérés par l'ARS-agence régionale de la santé. Il se voit confier une mission de coordination, de contrôle et de conseils auprès du ministre en charge de la santé afin de proposer des mesures ce correction, d’amélioration du fonctionnement des établissements de santé. Enfin, il peut se voir confier des missions d’appui technique, d’audit ou de contrôle de gestion sur la demande des chefs d’établissement.
in scheme: FINANCES PUBLIQUES
in scheme: Personnels et fonctions
in scheme: Fonction publique
in scheme: Fonction Publique et Gestion des Ressources Humaines
notation: REFIP5897

chèque de voyage
type: ConceptReFip
type: Concept
alternative label: chèque voyage
alternative label: traveller chèque
alternative label: traveller's check
broader: chèque bancaire
definition: Bon nominatif sécurisé échangeable pour leur montant contre des espèces, en France et à l'étranger, en euros ou en devises étrangères.
in scheme: FINANCES PUBLIQUES
in scheme: Moyen de paiement
in scheme: Finance
notation: REFIP5898

carte d'achat
type: ConceptReFip
type: Concept
broader: monétique
definition: Carte nominative d’approvisionnement et de paiement détenue par un agent. La carte d’achat permet à l’agent détenteur de la carte, de commander directement auprès d’un fournisseur titulaire d’un marché public exécuté par carte d’achat.
in scheme: FINANCES PUBLIQUES
in scheme: Moyen de paiement
in scheme: Finance
notation: REFIP5899

Chine
type: ConceptReFip
type: Concept
broader: Asie
definition: Pays
in scheme: FINANCES PUBLIQUES
in scheme: Géographie
in scheme: Asie
narrower: Hong-Kong
notation: REFIP590

cotisation patronale
type: ConceptReFip
type: Concept
alternative label: cotisations patronales
broader: refip-REFIP6677
definition: Part des cotisations sociales calculée sur les salaires bruts et versée par l’employeur aux organismes chargés du recouvrement.
in scheme: FINANCES PUBLIQUES
in scheme: Gestion des ressources humaines
in scheme: Rémunération
in scheme: Fonction Publique et Gestion des Ressources Humaines
narrower: refip-REFIP6639
notation: REFIP5900

carte d'invalidité
type: ConceptReFip
type: Concept
broader: invalidité
definition: Document ayant pour but d'attester que son détenteur est en situation de handicap. Elle est accessible sous conditions, et permet de bénéficier de certains droits spécifiques, notamment dans les transports. Cette carte est remplacée depuis le 1er janvier 2017 par la carte mobilité inclusion (CMI).
in scheme: FINANCES PUBLIQUES
in scheme: Santé et Protection Sociale
in scheme: Santé
in scheme: Questions de Société
notation: REFIP5901

collaborateur occasionnel du service public
type: ConceptReFip
type: Concept
broader: fonction (non-descripteur)
definition: Personne exerçant des missions occasionnelles pour le compte de l’État, des collectivités territoriales ou des établissements publics administratifs en dépendant ou des organismes privés en charge d’un service public administratif. Au titre de cette activité occasionnelle, il perçoit une rémunération fixée par des dispositions législatives ou réglementaires ou par décision de justice.
in scheme: FINANCES PUBLIQUES
in scheme: Personnels et fonctions
in scheme: Fonction (NON DESCRIPTEUR)
in scheme: Fonction Publique et Gestion des Ressources Humaines
notation: REFIP5902

carrière
type: ConceptReFip
type: Concept
alternative label: carrière professionnelle
broader: gestion des ressources humaines
definition: Parcours professionnel de l'agent.
in scheme: FINANCES PUBLIQUES
in scheme: Gestion des ressources humaines
in scheme: Carrière
in scheme: Fonction Publique et Gestion des Ressources Humaines
narrower: avancement
narrower: aptitude physique
narrower: affectation
narrower: accès à la fonction publique
narrower: ancienneté
narrower: cessation de fonction
narrower: compétence professionnelle
narrower: insuffisance professionnelle
narrower: identifiant DGFIP
narrower: intégration du fonctionnaire
narrower: mobilité du fonctionnaire
narrower: refip-REFIP6539
narrower: refip-REFIP6684
narrower: refip-REFIP6745
narrower: refip-REFIP6758
narrower: refip-REFIP6763
narrower: refip-REFIP6928
notation: REFIP5903

congé sans traitement
type: ConceptReFip
type: Concept
replaces: congé sans solde (obsolète)
alternative label: congé sans solde
broader: refip-REFIP6657
definition: Équivalent de la disponibilité réservée aux titulaires de la fonction publique, l'agent non-titulaire (contractuel ou stagiaire) peut bénéficier d'un congé sans traitement, accordé de droit ou sous réserve des nécessités de service, notamment pour convenances personnelles, pour élever un enfant, pour créer ou reprendre une entreprise.
in scheme: FINANCES PUBLIQUES
in scheme: Gestion des ressources humaines
in scheme: Statut du fonctionnaire
in scheme: Fonction Publique et Gestion des Ressources Humaines
notation: REFIP5904

compte de placement rémunéré
type: ConceptReFip
type: Concept
alternative label: CPR
broader: refip-REFIP6643
definition: Compte à vue ouvert dans une banque sur lequel le solde est rémunéré à un taux fixé par cette dernière.
in scheme: FINANCES PUBLIQUES
in scheme: Systeme bancaire et financier
in scheme: Secteur bancaire
in scheme: Finance
notation: REFIP5905

contrat de performance énergétique
type: ConceptReFip
type: Concept
broader: économie d'énergie
definition: Accord contractuel entre le bénéficiaire et le fournisseur (normalement une société de services énergétiques) d’une mesure visant à améliorer l’efficacité énergétique.
in scheme: FINANCES PUBLIQUES
in scheme: Environnement
in scheme: Protection de l'Environnement
in scheme: Questions de Société
notation: REFIP5906

congé pour formation syndicale
type: ConceptReFip
type: Concept
alternative label: congé de formation syndicale
broader: congés (non-descripteur)
definition: Congé accordé à un agent pour effectuer un stage ou suivre une session de formation syndicale, sous réserve des nécessités de service.
in scheme: FINANCES PUBLIQUES
in scheme: Gestion des ressources humaines
in scheme: Temps de travail
in scheme: Fonction Publique et Gestion des Ressources Humaines
notation: REFIP5907

congé pour maladie professionnelle
type: ConceptReFip
type: Concept
broader: congés (non-descripteur)
definition: Congé accordé lorsque l'incapacité temporaire de travail est consécutive à un accident reconnu imputable au service, à un accident de trajet ou à une maladie professionnelle.
in scheme: FINANCES PUBLIQUES
in scheme: Gestion des ressources humaines
in scheme: Temps de travail
in scheme: Fonction Publique et Gestion des Ressources Humaines
notation: REFIP5908
related: maladie professionnelle

change
type: ConceptReFip
type: Concept
broader: refip-REFIP6835
definition: Comparaison entre deux monnaies.
in scheme: FINANCES PUBLIQUES
in scheme: Systeme bancaire et financier
in scheme: Secteur bancaire
in scheme: Finance
narrower: différence de change
narrower: refip-REFIP6912
notation: REFIP5909

conseiller régional
type: ConceptReFip
type: Concept
broader: élu local
definition: Personne élue qui compose l'assemblée du Conseil régional, le nombre de conseillers régionaux varie en fonction de la population de la région.
in scheme: FINANCES PUBLIQUES
in scheme: Organisation Territoriale
in scheme: Administration de L'Etat
in scheme: 212106
notation: REFIP591

congé parental d'éducation
type: ConceptReFip
type: Concept
alternative label: congé parental
broader: refip-REFIP6657
definition: Congé non rémunéré pendant lequel l'agent cesse totalement son activité professionnelle pour élever son enfant.
in scheme: FINANCES PUBLIQUES
in scheme: Gestion des ressources humaines
in scheme: Statut du fonctionnaire
in scheme: Fonction Publique et Gestion des Ressources Humaines
notation: REFIP5910

correspondant moyens de paiement
type: ConceptReFip
type: Concept
alternative label: correspondant monétique
broader: fonction de la Direction générale des finances publiques (non-descripteur)
definition: Personne accompagnant les comptables publics et les ordonnateurs dans leurs projets d'automatisation des circuits des moyens de paiement.
in scheme: FINANCES PUBLIQUES
in scheme: Personnels et fonctions
in scheme: Fonction de la Direction générale des Finances publiques (NON DESCRIPTEUR)
in scheme: Fonction Publique et Gestion des Ressources Humaines
notation: REFIP5911

congé de formation professionnelle
type: ConceptReFip
type: Concept
alternative label: congé de formation
broader: formation professionnelle
definition: Droit ouvert à tous les fonctionnaires en activité, afin de leur permettre d'étendre ou de parfaire leur formation personnelle, et dont la durée maximale est de 3 ans sur l'ensemble de la carrière.
in scheme: FINANCES PUBLIQUES
in scheme: Gestion des ressources humaines
in scheme: Formation professionnelle
in scheme: Fonction Publique et Gestion des Ressources Humaines
notation: REFIP5912

compensation financière
type: ConceptReFip
type: Concept
broader: refip-REFIP6569
definition: Mécanisme permettant à des intermédiaires financiers de régler les montants dus, par différence entre leurs positions à recevoir et à livrer, et aussi de recevoir ou de livrer les actifs correspondants. La compensation s’applique aux opérations sur les moyens de paiement, sur les valeurs mobilières négociées en bourse ou sur les positions détenues sur les marchés à terme.
in scheme: FINANCES PUBLIQUES
in scheme: Systeme bancaire et financier
in scheme: Opération financière
in scheme: Finance
notation: REFIP5913

cotisation syndicale
type: ConceptReFip
type: Concept
broader: dialogue social
definition: Participation versée par un adhérent à un syndicat.
in scheme: FINANCES PUBLIQUES
in scheme: Gestion des ressources humaines
in scheme: Statut du fonctionnaire
in scheme: Fonction Publique et Gestion des Ressources Humaines
notation: REFIP5914

courtier
type: ConceptReFip
type: Concept
alternative label: courtage
alternative label: société de courtage
broader: établissement de crédit
definition: Entreprise ou personne qui sert d'intermédiaire pour une opération, le plus souvent financière, entre deux parties. L'activité de courtage est réglementée dans de nombreux pays, afin de protéger les intervenants sur le marché.
in scheme: FINANCES PUBLIQUES
in scheme: Systeme bancaire et financier
in scheme: Etablissement de crédit
in scheme: Finance
notation: REFIP5915

chambre de compensation
type: ConceptReFip
type: Concept
broader: banque
definition: Organisme financier intermédiaire de l’acheteur et du vendeur. Son rôle est de garantir le règlement-livraison des transactions.
in scheme: FINANCES PUBLIQUES
in scheme: Systeme bancaire et financier
in scheme: Etablissement de crédit
in scheme: Finance
notation: REFIP5916

certificat médical
type: ConceptReFip
type: Concept
broader: santé (non-descripteur)
definition: Attestation signée par un médecin sur ce qu'il a constaté ou décidé.
in scheme: FINANCES PUBLIQUES
in scheme: Santé et Protection Sociale
in scheme: Santé
in scheme: Questions de Société
notation: REFIP5917

certificat de scolarité
type: ConceptReFip
type: Concept
broader: enseignement
definition: Attestation délivrée par le chef d'établissement à un élève qui est inscrit dans son établissement et qui suit régulièrement les cours.
in scheme: FINANCES PUBLIQUES
in scheme: Famille Education Population
in scheme: Enseignement
in scheme: Questions de Société
notation: REFIP5918

correspondant handicap local
type: ConceptReFip
type: Concept
broader: fonction de la Direction générale des finances publiques (non-descripteur)
definition: Personne chargée de la politique d'insertion des personnes en situation de handicap de la DGFiP au niveau local.
in scheme: FINANCES PUBLIQUES
in scheme: Personnels et fonctions
in scheme: Fonction de la Direction générale des Finances publiques (NON DESCRIPTEUR)
in scheme: Fonction Publique et Gestion des Ressources Humaines
notation: REFIP5919

Code de procédure fiscale
type: ConceptReFip
type: Concept
broader: documentation juridique (non-descripteur)
definition: Ensemble des dispositions législatives et réglementaires régissant le contentieux fiscal.
in scheme: FINANCES PUBLIQUES
in scheme: Droit et Justice
in scheme: Documentation Juridique
in scheme: Sources du Droit
notation: REFIP592

complément familial
type: ConceptReFip
type: Concept
broader: refip-REFIP6589
definition: Prestation versée, sous certaines conditions, aux personnes ayant au moins 3 enfants à charge.
in scheme: FINANCES PUBLIQUES
in scheme: Santé et Protection Sociale
in scheme: Protection Sociale
in scheme: Questions de Société
notation: REFIP5920

coefficient d'occupation des sols
type: ConceptReFip
type: Concept
alternative label: COS
broader: autorisation d'occupation des sols
definition: Indicateur déterminant la surface constructible sur un terrain.
in scheme: FINANCES PUBLIQUES
in scheme: Aménagement du territoire Urbanisme Habitat
in scheme: Aménagement du Territoire
in scheme: Questions de Société
notation: REFIP5921
scope note: Supprimé par Loi n° 2014-366 du 24 mars 2014 pour l'accès au logement et un urbanisme rénové

casino
type: ConceptReFip
type: Concept
alternative label: cercle de jeux
alternative label: maison de jeux
alternative label: établissement de jeux
broader: loisirs
definition: Établissement où l'on peut pratiquer des jeux de hasard et de cartes.
in scheme: FINANCES PUBLIQUES
in scheme: Culture et Loisirs
in scheme: Loisirs
in scheme: Questions de Société
narrower: autorisation de jeux
narrower: jeux de contrepartie
narrower: jeux de cercle
narrower: machine à sous
notation: REFIP5922

congé pour garde d'enfant malade
type: ConceptReFip
type: Concept
broader: congés (non-descripteur)
definition: Congé accordé à un agent par son chef de service dans la mesure compatible avec le bon fonctionnement du service, pour soigner son enfant ou un enfant dont ils ont la charge, lorsqu'il est malade ou qu'il doit en assurer momentanément la garde, lorsque l'accueil habituel de l'enfant n'est pas possible.
in scheme: FINANCES PUBLIQUES
in scheme: Gestion des ressources humaines
in scheme: Temps de travail
in scheme: Fonction Publique et Gestion des Ressources Humaines
notation: REFIP5923

compte à terme
type: ConceptReFip
type: Concept
alternative label: compte d'épargne à long terme
alternative label: contrat d'épargne à long terme
broader: refip-REFIP6643
definition: Compte sur lequel les sommes déposées sont bloquées pendant une certaine période contre une rémunération prévue lors de la souscription.
in scheme: FINANCES PUBLIQUES
in scheme: Systeme bancaire et financier
in scheme: Secteur bancaire
in scheme: Finance
notation: REFIP5924

comptable assignataire
type: ConceptReFip
type: Concept
broader: comptable public
definition: Comptable public auprès duquel est accrédité un ordonnateur et qui seul à compétence, dans sa circonscription territoriale, pour exécuter les opérations de cet ordonnateur.
in scheme: FINANCES PUBLIQUES
in scheme: Personnels et fonctions
in scheme: Fonction de la Direction générale des Finances publiques (NON DESCRIPTEUR)
in scheme: Fonction Publique et Gestion des Ressources Humaines
notation: REFIP5925

chef de service comptable des finances publiques
type: ConceptReFip
type: Concept
broader: fonction de la Direction générale des finances publiques (non-descripteur)
definition: Les chefs de service comptable à la direction générale des finances publiques dirigent les postes comptables à forts enjeux des services déconcentrés. Ils peuvent, par ailleurs, assurer au sein des services de la direction générale des finances publiques des fonctions d’encadrement, d’animation ou d’expertise comportant des responsabilités particulières.
in scheme: FINANCES PUBLIQUES
in scheme: Personnels et fonctions
in scheme: Fonction de la Direction générale des Finances publiques (NON DESCRIPTEUR)
in scheme: Fonction Publique et Gestion des Ressources Humaines
notation: REFIP5926

crédit foncier de France
type: ConceptReFip
type: Concept
broader: banque
definition: Organisme financier spécialisé dans le financement de l'immobilier en France, filiale du groupe bancaire BPCE. Il propose aux particuliers, aux acteurs du secteur public et aux entreprises des solutions de financements immobiliers et des services à l’immobilier.
in scheme: FINANCES PUBLIQUES
in scheme: Systeme bancaire et financier
in scheme: Etablissement de crédit
in scheme: Finance
notation: REFIP5927

catégorie A
type: ConceptReFip
type: Concept
broader: catégorie d'emploi
definition: Fonctionnaires chargés de fonctions de conception, de direction et d’encadrement (attaché d’administration, ingénieur, etc.), ainsi que tous les corps d’enseignants.
in scheme: FINANCES PUBLIQUES
in scheme: Gestion des ressources humaines
in scheme: Statut du fonctionnaire
in scheme: Fonction Publique et Gestion des Ressources Humaines
notation: REFIP5928

chèque vacances
type: ConceptReFip
type: Concept
broader: moyen de paiement
definition: Dispositif permettant aux particuliers de payer leurs dépenses de vacances et de loisirs, mis en place et subventionné par un comité d'entreprise ou un service social, qui en fixe les modalités d'attribution.
in scheme: FINANCES PUBLIQUES
in scheme: Moyen de paiement
in scheme: Finance
notation: REFIP5929

bulletin officiel
type: ConceptReFip
type: Concept
broader: document administratif
definition: Publication officielle destinée à diffuser les nouveautés en termes de textes réglementaires et autres.
in scheme: FINANCES PUBLIQUES
in scheme: Documentation
in scheme: Communication Documentation Informatique
narrower: Bulletin officiel des impôts
narrower: Bulletin officiel des annonces des marchés publics
narrower: Bulletin officiel des annonces civiles et commerciales
narrower: Bulletin officiel des finances publiques-gestion comptable publique
narrower: Bulletin officiel de la comptabilité publique
narrower: Bulletin officiel des finances publiques
narrower: refip-REFIP7014
narrower: refip-REFIP865
notation: REFIP593

classe de découverte
type: ConceptReFip
type: Concept
alternative label: classe de mer
alternative label: classe de neige
broader: enseignement du premier degré
definition: Sortie scolaire avec nuitée.
in scheme: FINANCES PUBLIQUES
in scheme: Famille Education Population
in scheme: Enseignement
in scheme: Questions de Société
notation: REFIP5930

capitalisation
type: ConceptReFip
type: Concept
broader: refip-REFIP6569
definition: Opération qui consiste à intégrer à un capital, les intérêts qu'il a produits pendant une période déterminée. C'est sur ce nouveau capital que seront calculés les intérêts de la période suivante.
in scheme: FINANCES PUBLIQUES
in scheme: Systeme bancaire et financier
in scheme: Opération financière
in scheme: Finance
narrower: capitalisation d'intérêts
notation: REFIP5931

contrôle vétérinaire
type: ConceptReFip
type: Concept
broader: santé (non-descripteur)
definition: Examen de contrôle physique et/ou formalité administrative portant sur les animaux ou les produits visant de manière directe ou indirecte à assurer la protection de la santé publique ou animale.
in scheme: FINANCES PUBLIQUES
in scheme: Santé et Protection Sociale
in scheme: Santé
in scheme: Questions de Société
notation: REFIP5932

comptable du Trésor
type: ConceptReFip
type: Concept
broader: comptable public
definition: Comptable public en charge d'une structure émanant du Trésor public.
in scheme: FINANCES PUBLIQUES
in scheme: Personnels et fonctions
in scheme: Fonction de la Direction générale des Finances publiques (NON DESCRIPTEUR)
in scheme: Fonction Publique et Gestion des Ressources Humaines
notation: REFIP5933

congé longue durée
type: ConceptReFip
type: Concept
alternative label: CLD
alternative label: congé de longue durée
broader: congés (non-descripteur)
definition: Congé de longue durée accordé au fonctionnaire, atteint de certaines pathologies graves, d'origine professionnelle ou non professionnelle, après avis du comité médical.
in scheme: FINANCES PUBLIQUES
in scheme: Gestion des ressources humaines
in scheme: Temps de travail
in scheme: Fonction Publique et Gestion des Ressources Humaines
notation: REFIP5934

carte de crédit
type: ConceptReFip
type: Concept
broader: monétique
definition: Carte bancaire permettant à son utilisateur d’effectuer des paiements dont les règlements peuvent être immédiats ou différés. Elle se voit également associer la faculté de solliciter le crédit accordé par l'organisme financier dispensateur de la carte. Le crédit lié, à la carte, correspond régulièrement à un crédit révolving.
in scheme: FINANCES PUBLIQUES
in scheme: Moyen de paiement
in scheme: Finance
notation: REFIP5935

correspondant social
type: ConceptReFip
type: Concept
broader: fonction de la Direction générale des finances publiques (non-descripteur)
definition: Personne relais de la délégation de l'action sociale, à l'échelon départemental, chargée de l'animation et de l'exécution des missions d'action sociale.
in scheme: FINANCES PUBLIQUES
in scheme: Personnels et fonctions
in scheme: Fonction de la Direction générale des Finances publiques (NON DESCRIPTEUR)
in scheme: Fonction Publique et Gestion des Ressources Humaines
notation: REFIP5936

chèque impayé
type: ConceptReFip
type: Concept
alternative label: chèque sans provision
broader: chèque bancaire
definition: Chèque remis à l'encaissement et revenant impayé, la raison la plus courante étant le défaut de provision sur le compte de l’émetteur.
in scheme: FINANCES PUBLIQUES
in scheme: Moyen de paiement
in scheme: Finance
notation: REFIP5937

cité administrative
type: ConceptReFip
type: Concept
broader: refip-REFIP6936
definition: Bâtiment ou un groupe de bâtiments qui regroupent plusieurs administrations.
in scheme: FINANCES PUBLIQUES
in scheme: Aménagement du territoire Urbanisme Habitat
in scheme: Aménagement du Territoire
in scheme: Questions de Société
notation: REFIP5938

crédit renouvelable
type: ConceptReFip
type: Concept
alternative label: crédit permanent
alternative label: crédit revolving
alternative label: emprunt revolving
broader: refip-REFIP6674
definition: Crédit mis à disposition d'un emprunteur qu'il utilise et reconstitue selon son gré. Cette réserve diminue quand l'emprunteur l'utilise et elle se reconstitue progressivement quand il rembourse son crédit. Il est également appelé "crédit permanent", "crédit revolving" ou "crédit reconstituable".
in scheme: FINANCES PUBLIQUES
in scheme: Systeme bancaire et financier
in scheme: Secteur bancaire
in scheme: Finance
notation: REFIP5939

abus de droit fiscal
type: ConceptReFip
type: Concept
broader: procédure de l'abus de droit
definition: L’administration est en droit d’écarter, comme ne lui étant pas opposables, les actes recherchant le bénéfice d’une application littérale des textes ou de décisions à l’encontre des objectifs poursuivis par leurs auteurs, dans le but d’éluder ou d’atténuer les charges fiscales que l’intéressé, aurait normalement supportées. La procédure de l’abus de droit fiscal concerne tous les impôts et peut être mise en œuvre indifféremment lorsque la situation constitutive de l’abus porte sur l’assiette, la liquidation de l’impôt ou son paiement.
in scheme: FINANCES PUBLIQUES
in scheme: Droit de Reprise de l'Administration
in scheme: Fiscalité
narrower: comité de l'abus de droit fiscal
notation: REFIP594

comptable spécialisé du domaine
type: ConceptReFip
type: Concept
broader: comptable public
definition: Comptable ayant la qualité de comptable public principal, mettant en oeuvre le contrôle interne au sein du poste qu'il dirige. Pour l'ensemble du territoire national, il assure notamment le recouvrement du produit de la cession de tous objets mobiliers ou matériels, des loyers budgétaires, des redevances pour occupation du domaine public par les sociétés concessionnaires d'autoroutes, des redevances dues pour des locaux du domaine de l'Etat confiés en gestion au niveau national.
in scheme: FINANCES PUBLIQUES
in scheme: Personnels et fonctions
in scheme: Fonction de la Direction générale des Finances publiques (NON DESCRIPTEUR)
in scheme: Fonction Publique et Gestion des Ressources Humaines
notation: REFIP5940

compte à l'étranger
type: ConceptReFip
type: Concept
alternative label: compte off-shore
broader: compte bancaire
definition: Compte détenu dans un autre pays que le sien. Il doit être déclaré.
in scheme: FINANCES PUBLIQUES
in scheme: Systeme bancaire et financier
in scheme: Secteur bancaire
in scheme: Finance
notation: REFIP5941

comptable de fait (supprimé)
type: ConceptReFip
type: Concept
broader: ZZ
in scheme: FINANCES PUBLIQUES
notation: REFIP5942

congé d'adoption
type: ConceptReFip
type: Concept
broader: congés (non-descripteur)
definition: Congé accordé à un agent adoptant un enfant, dont la durée dépend du nombre d'enfants adoptés, du nombre d'enfants à charge avant adoption et de l'éventuelle répartition du congé entre les parents.
in scheme: FINANCES PUBLIQUES
in scheme: Gestion des ressources humaines
in scheme: Temps de travail
in scheme: Fonction Publique et Gestion des Ressources Humaines
notation: REFIP5943

Conseil de discipline (supprimé)
type: ConceptReFip
type: Concept
broader: ZZ
in scheme: FINANCES PUBLIQUES
notation: REFIP5944

compagnie d'assurance
type: ConceptReFip
type: Concept
alternative label: société d'assurance
broader: assurances (non-descripteur)
definition: Entreprise qui fournit des services d'assurance.
in scheme: FINANCES PUBLIQUES
in scheme: Assurances
in scheme: Finance
narrower: agent d'assurance
notation: REFIP5945

cure thermale
type: ConceptReFip
type: Concept
alternative label: thermalisme
broader: santé (non-descripteur)
definition: Traitement médical prescrit par un médecin dans une station thermale.
in scheme: FINANCES PUBLIQUES
in scheme: Santé et Protection Sociale
in scheme: Santé
in scheme: Questions de Société
notation: REFIP5946

congé bonifié
type: ConceptReFip
type: Concept
broader: congés (non-descripteur)
definition: Bonification de congé d'une durée maximale de trente jours dont peuvent bénéficier, sous conditions, les agents de la DGFiP qui exercent leurs fonctions : - dans un DOM ; - sur le territoire européen de la France et dont le lieu de résidence habituelle est situé dans un DOM.
in scheme: FINANCES PUBLIQUES
in scheme: Gestion des ressources humaines
in scheme: Temps de travail
in scheme: Fonction Publique et Gestion des Ressources Humaines
notation: REFIP5947

commission de placement
type: ConceptReFip
type: Concept
broader: frais d'émission
definition: Somme perçue par un intermédiaire chargé de placer les titres de société . Ces intermédiaires font appel à leur clientèle ou encore à leurs contacts pour placer le plus rapidement possible les titres financiers émis ou à émettre.
in scheme: FINANCES PUBLIQUES
in scheme: Systeme bancaire et financier
in scheme: Opération financière
in scheme: Finance
notation: REFIP5948

charge de copropriété
type: ConceptReFip
type: Concept
broader: copropriété
definition: Frais et dépenses nécessaires au bon fonctionnement d'une copropriété.
in scheme: FINANCES PUBLIQUES
in scheme: Aménagement du territoire Urbanisme Habitat
in scheme: Habitat
in scheme: Questions de Société
notation: REFIP5949

centre éditique
type: ConceptReFip
type: Concept
broader: direction régionale des finances publiques
definition: Structure responsable de l'éditique de la DGFIP.
in scheme: FINANCES PUBLIQUES
in scheme: Organisation Structurelle de l'Etat
in scheme: Ministère
in scheme: Administration de L'Etat
notation: REFIP595

chèque Caisse dépôts et consignations
type: ConceptReFip
type: Concept
alternative label: chèque CDC
broader: chèque bancaire
definition: Chèque émis par La Caisse des Dépôts et Consignations.
in scheme: FINANCES PUBLIQUES
in scheme: Moyen de paiement
in scheme: Finance
notation: REFIP5950

carte bancaire
type: ConceptReFip
type: Concept
alternative label: CB
alternative label: carte bleue
alternative label: carte de paiement
broader: monétique
definition: Moyen de paiement remis par une banque à son client pour lui permettre d'effectuer des paiements auprès de commerçants et de retirer ou transférer des fonds.
in scheme: FINANCES PUBLIQUES
in scheme: Moyen de paiement
in scheme: Finance
notation: REFIP5951

comptable centralisateur des comptes de l'Etat
type: ConceptReFip
type: Concept
alternative label: 3CE
broader: comptable public
definition: Comptable public chargé de la mission de centralisation finale de la comptabilité de l'Etat. Il est chargé de centraliser la comptabilité des opérations du budget général, des budgets annexes et des comptes spéciaux ; d'enregistrer les opérations permettant au ministre chargé du budget d'arrêter le compte général de l'Etat ; d'effectuer, pour le compte et au nom des comptables principaux, les écritures complémentaires relatives aux opérations de fin d'exercice ; d'établir les documents périodiques retraçant la situation de l'exécution budgétaire, la trésorerie et la situation patrimoniale et financière de l'Etat.
in scheme: FINANCES PUBLIQUES
in scheme: Personnels et fonctions
in scheme: Fonction de la Direction générale des Finances publiques (NON DESCRIPTEUR)
in scheme: Fonction Publique et Gestion des Ressources Humaines
notation: REFIP5952

compte bancaire
type: ConceptReFip
type: Concept
broader: refip-REFIP6835
definition: Support dans lequel une banque enregistre, au compte de son client, ses avoirs et toutes les opérations effectuées par celui-ci. Les dépôts entrant au crédit du compte et les retraits à son débit.
in scheme: FINANCES PUBLIQUES
in scheme: Systeme bancaire et financier
in scheme: Secteur bancaire
in scheme: Finance
narrower: compte de dépôt
narrower: compte joint
narrower: compte à l'étranger
narrower: compte bloque
narrower: clôture de compte
narrower: domiciliation bancaire
narrower: refip-REFIP6744
narrower: refip-REFIP6797
narrower: refip-REFIP6843
notation: REFIP5953

corps
type: ConceptReFip
type: Concept
alternative label: cadre d'emploi
broader: refip-REFIP6879
definition: Ensemble de fonctionnaires soumis à un même statut particulier au sein d'une même catégorie (A, B ou C) pour la fonction publique.
in scheme: FINANCES PUBLIQUES
in scheme: Gestion des ressources humaines
in scheme: Statut du fonctionnaire
in scheme: Fonction Publique et Gestion des Ressources Humaines
narrower: échelon
narrower: grade
notation: REFIP5954

chèque certifié
type: ConceptReFip
type: Concept
broader: chèque bancaire
definition: Chèque émis sur le compte d’un client demandeur et pour lequel la banque appose une certification, attestant de l'existence de la provision durant le délai de présentation qui est de huit jours en Métropole. Passé ce délai, le chèque redevient un chèque ordinaire et la provision cesse d’être bloquée.
in scheme: FINANCES PUBLIQUES
in scheme: Moyen de paiement
in scheme: Finance
notation: REFIP5955

Caisse de retraite et de prévoyance
type: ConceptReFip
type: Concept
broader: refip-REFIP6790
definition: Organisme gérant, dans chaque branche d'activité, les dispositifs de retraites complémentaires assortis de dispositifs de prévoyance destinés à garantir un complément d'indemnisation au salarié en cas de maladie.
in scheme: FINANCES PUBLIQUES
in scheme: Santé et Protection Sociale
in scheme: Protection Sociale
in scheme: Questions de Société
notation: REFIP5956

cellule de veille et d'alerte précoce
type: ConceptReFip
type: Concept
alternative label: CVAP
broader: structures territoriales (non-descripteur)
definition: Cellule pilotée par le commissaire au redressement productif afin de soutenir les entreprises dans la résolution de leurs difficultés.
in scheme: FINANCES PUBLIQUES
in scheme: Organisation Territoriale
in scheme: Structures Territoriales
in scheme: Administration de L'Etat
notation: REFIP5957

compte épargne-temps
type: ConceptReFip
type: Concept
alternative label: CET
alternative label: compte épargne temps
broader: refip-REFIP6916
definition: Dispositif ouvert à la demande de l'agent et qui lui permet d’accumuler des droits à congés rémunérés dans la limite d’un plafond.
in scheme: FINANCES PUBLIQUES
in scheme: Gestion des ressources humaines
in scheme: Temps de travail
in scheme: Fonction Publique et Gestion des Ressources Humaines
narrower: refip-REFIP6712
notation: REFIP5958

commissaire au redressement productif
type: ConceptReFip
type: Concept
broader: fonction (non-descripteur)
definition: Intervenant unique auprès des entreprises en difficulté. Anime une cellule régionale de veille et d'alerte précoce afin d'intervenir en amont et d'aider à une solution viable.
in scheme: FINANCES PUBLIQUES
in scheme: Personnels et fonctions
in scheme: Fonction (NON DESCRIPTEUR)
in scheme: Fonction Publique et Gestion des Ressources Humaines
notation: REFIP5959

catégorie C
type: ConceptReFip
type: Concept
broader: catégorie d'emploi
definition: Fonctionnaires chargés des fonctions d'exécution.
in scheme: FINANCES PUBLIQUES
in scheme: Gestion des ressources humaines
in scheme: Statut du fonctionnaire
in scheme: Fonction Publique et Gestion des Ressources Humaines
notation: REFIP5960

Caisse de Crédit municipal
type: ConceptReFip
type: Concept
alternative label: Crédit municipal
broader: établissement de crédit
definition: Etablissement public à caractère social. Banque à part entière depuis la loi bancaire du 24 janvier 1984, les caisses de crédit municipal disposent, en France, du monopole du prêt sur gages avec pour objectif de proposer une offre de taux limitant la pratique des taux usuraires.
in scheme: FINANCES PUBLIQUES
in scheme: Systeme bancaire et financier
in scheme: Etablissement de crédit
in scheme: Finance
notation: REFIP5961

congé de représentation
type: ConceptReFip
type: Concept
broader: congés (non-descripteur)
definition: Congé accordé aux fonctionnaires et aux agents non titulaires, afin de pouvoir représenter une association loi 1901 ou une mutuelle aux réunions d'une commission ou d'une instance placée auprès des pouvoirs publics.
in scheme: FINANCES PUBLIQUES
in scheme: Gestion des ressources humaines
in scheme: Temps de travail
in scheme: Fonction Publique et Gestion des Ressources Humaines
notation: REFIP5962

chef d'exploitation
type: ConceptReFip
type: Concept
broader: fonction de la Direction générale des finances publiques (non-descripteur)
definition: Agent qui dirige l'ensemble des opérations de production dans le centre automatisé de traitement de l'information.
in scheme: FINANCES PUBLIQUES
in scheme: Personnels et fonctions
in scheme: Fonction de la Direction générale des Finances publiques (NON DESCRIPTEUR)
in scheme: Fonction Publique et Gestion des Ressources Humaines
notation: REFIP5963

compte bloque
type: ConceptReFip
type: Concept
broader: compte bancaire
definition: Compte sur lequel une certaine somme d'argent est bloquée pendant une certaine période. Le blocage du compte peut résulter d'un accord entre le client et son banquier ou d'un événement extérieur comme une saisie opérée sur ce compte.
in scheme: FINANCES PUBLIQUES
in scheme: Systeme bancaire et financier
in scheme: Secteur bancaire
in scheme: Finance
notation: REFIP5964

conversion de titres
type: ConceptReFip
type: Concept
broader: refip-REFIP6545
definition: Modification du mode de détention des titres : au porteur ou nominatif.
in scheme: FINANCES PUBLIQUES
in scheme: Systeme bancaire et financier
in scheme: Opération financière
in scheme: Finance
notation: REFIP5965

congé annuel
type: ConceptReFip
type: Concept
alternative label: congés payés
broader: congés (non-descripteur)
definition: Nombre de jours de congés rémunérés et fixés réglementairement, accordés chaque année aux agents.
in scheme: FINANCES PUBLIQUES
in scheme: Gestion des ressources humaines
in scheme: Temps de travail
in scheme: Fonction Publique et Gestion des Ressources Humaines
notation: REFIP5966

contrat de rivière
type: ConceptReFip
type: Concept
broader: aménagement du territoire
definition: Accord technique et financier entre partenaires concernés pour une gestion globale, concertée et durable à l'échelle d'une unité hydrographique cohérente.
in scheme: FINANCES PUBLIQUES
in scheme: Aménagement du territoire Urbanisme Habitat
in scheme: Aménagement du Territoire
in scheme: Questions de Société
notation: REFIP5967
related: Agence de l'eau
related: cours d'eau

capitalisation d'intérêts
type: ConceptReFip
type: Concept
alternative label: anatocisme
alternative label: incorporation au capital
broader: capitalisation
definition: Anatocisme dans les obligations portant sur un prêt d'argent.
in scheme: FINANCES PUBLIQUES
in scheme: Systeme bancaire et financier
in scheme: Opération financière
in scheme: Finance
notation: REFIP5968

cancer
type: ConceptReFip
type: Concept
alternative label: lutte anti-cancer
alternative label: lutte contre le cancer
broader: maladie
definition: Maladie, tumeur maligne.
in scheme: FINANCES PUBLIQUES
in scheme: Santé et Protection Sociale
in scheme: Santé
in scheme: Questions de Société
notation: REFIP5969

conciliateur fiscal
type: ConceptReFip
type: Concept
alternative label: conciliateur fiscal départemental
broader: fonction de la Direction générale des finances publiques (non-descripteur)
definition: Fonction instaurée afin d'offrir à l’usager un recours hiérarchique en matière de contentieux, gracieux, et de qualité de service.
in scheme: FINANCES PUBLIQUES
in scheme: Personnels et fonctions
in scheme: Fonction de la Direction générale des Finances publiques (NON DESCRIPTEUR)
in scheme: Fonction Publique et Gestion des Ressources Humaines
notation: REFIP5970

contrôle médical
type: ConceptReFip
type: Concept
broader: refip-REFIP6828
definition: Contrôle du droit à congé pour raison de santé. Peut s'exercer à l'occasion d'une contre-visite d'un agent en congé de maladie par un médecin agréé afin de contrôler le bien-fondé de l'arrêt maladie. S'exerce également pour l'octroi et le renouvellement des congés de longue maladie, de longue durée, et des disponibilités pour raison de santé.
in scheme: FINANCES PUBLIQUES
in scheme: Gestion des ressources humaines
in scheme: Conditions de travail
in scheme: Fonction Publique et Gestion des Ressources Humaines
notation: REFIP5971

concours de recrutement
type: ConceptReFip
type: Concept
broader: refip-REFIP6779
definition: Ensemble d'épreuves permettant d'accéder à un emploi.
in scheme: FINANCES PUBLIQUES
in scheme: Gestion des ressources humaines
in scheme: Carrière
in scheme: Fonction Publique et Gestion des Ressources Humaines
narrower: concours externe
narrower: concours interne
notation: REFIP5972

coopération internationale
type: ConceptReFip
type: Concept
broader: refip-REFIP6768
definition: Collaboration entre états qui peut peut s'exercer entre plusieurs pays dans différents domaines.
in scheme: FINANCES PUBLIQUES
in scheme: Questions Politiques Relations Internationales
in scheme: Relations Internationales
in scheme: Questions de Société
notation: REFIP5973

congé d'accompagnement d'une personne en fin de vie (supprimé)
type: ConceptReFip
type: Concept
is replaced by: congé de solidarité familiale
broader: ZZ
in scheme: FINANCES PUBLIQUES
notation: REFIP5974

conseiller en économie familiale et sociale
type: ConceptReFip
type: Concept
broader: fonction publique territoriale
definition: Fonctionnaire territorial de catégorie B spécialiste de l'action socio-éducative, qui aide les personnes en situation précaire à résoudre leurs difficultés quotidiennes.
in scheme: FINANCES PUBLIQUES
in scheme: Personnels et fonctions
in scheme: Fonction publique
in scheme: Fonction Publique et Gestion des Ressources Humaines
notation: REFIP5975

chèque dépôt de fonds
type: ConceptReFip
type: Concept
broader: chèque Trésor
definition: Chèque émis par les titulaires de comptes de dépôts de fonds au Trésor à des bénéficiaires qui peuvent les encaisser auprès du réseau du Trésor.
in scheme: FINANCES PUBLIQUES
in scheme: Moyen de paiement
in scheme: Finance
notation: REFIP5976

contrôleur des finances publiques
type: ConceptReFip
type: Concept
alternative label: contrôleur 1ère classe des finances publiques
alternative label: contrôleur 2ème classe des finances publiques
alternative label: contrôleur des impôts
alternative label: contrôleur du Trésor public
broader: grade de la Direction générale des Finances publiques (non-descripteur)
definition: Grade de la catégorie B de la DGFIP, les contrôleurs des finances publiques participent à la réalisation des missions incombant à la DGFIP au sein des services déconcentrés, des services à compétence nationale relevant de cette direction et des services centraux. Ils peuvent également exercer leurs fonctions dans les services chargés du contrôle budgétaire et comptable ministériel. Les contrôleurs des finances publiques peuvent notamment : 1° Participer aux différentes opérations d'assiette, de recouvrement et de contrôle des impôts et taxes de toute nature ; 2° Participer à la réalisation des opérations financières, comptables et budgétaires de l’État, des établissements publics et des collectivités territoriales ; 3° Prendre part aux opérations de recherche et programmation, en exerçant notamment le droit de communication auprès des administrations publiques et des entreprises et réaliser, en appui et sous l'autorité des inspecteurs, des contrôles sur pièces des dossiers ainsi que des contrôles sur place ; 4° Réaliser des missions de support informatique.
in scheme: FINANCES PUBLIQUES
in scheme: Personnels et fonctions
in scheme: Fonction publique
in scheme: Fonction Publique et Gestion des Ressources Humaines
notation: REFIP5977

co-titulaire
type: ConceptReFip
type: Concept
broader: droit des obligations et contrats (non-descripteur)
definition: Situation juridique dans laquelle se trouvent deux ou plusieurs personnes, qui disposent d'un même droit. Elle intervient même si les co-titulaires ont des droits qui bien que de nature identique, sont inégaux.
in scheme: FINANCES PUBLIQUES
in scheme: Droit et Justice
in scheme: Divisions du Droit
in scheme: Droit Privé
notation: REFIP5978

collaborateur de cabinet
type: ConceptReFip
type: Concept
broader: fonction publique territoriale
definition: Personne ayant la qualité de fonctionnaire, d’agent non titulaire ou de personnes extérieures à la fonction publique, assurant des missions de conseils à l’élu, d’élaboration et de préparation des décisions, de liaison avec les services, les organes politiques et interlocuteurs extérieurs et de représentation de l’élu.
in scheme: FINANCES PUBLIQUES
in scheme: Personnels et fonctions
in scheme: Fonction publique
in scheme: Fonction Publique et Gestion des Ressources Humaines
notation: REFIP5979

agrégation des comptes
type: ConceptReFip
type: Concept
alternative label: agrégation comptable
alternative label: agrégation des données financières et comptables
broader: procédures et techniques comptables (non-descripteur)
definition: Technique comptable qui vise à regrouper le compte principal et les comptes annexes déduction faite des opérations réciproques.
in scheme: FINANCES PUBLIQUES
in scheme: Procédures et Techniques Comptables
in scheme: Comptabilité
narrower: agrégation territorialisée des comptes
narrower: agrégat
notation: REFIP598

charte de pays
type: ConceptReFip
type: Concept
alternative label: charte de développement
broader: aménagement du territoire
definition: Document d'orientation stratégique qui offre une vision de l'évolution d'un territoire pour les 10 ans à venir et détermine des axes privilégiés de développement.
in scheme: FINANCES PUBLIQUES
in scheme: Aménagement du territoire Urbanisme Habitat
in scheme: Aménagement du Territoire
in scheme: Questions de Société
notation: REFIP5980

correspondant RIVOLI TOPAD
type: ConceptReFip
type: Concept
alternative label: CRT
broader: fonction de la Direction générale des finances publiques (non-descripteur)
definition: Agent en charge de la mise à jour dans le référentiel TOPAD, des constantes administratives (modification des adresses ou numéros de téléphone des services, mais aussi créations ou suppressions de services).
in scheme: FINANCES PUBLIQUES
in scheme: Personnels et fonctions
in scheme: Fonction de la Direction générale des Finances publiques (NON DESCRIPTEUR)
in scheme: Fonction Publique et Gestion des Ressources Humaines
notation: REFIP5981

compte nominatif
type: ConceptReFip
type: Concept
broader: régie
definition: Compte individuel ouvert par le comptable permettant la gestion des valeurs pécuniaires confiées à certaines populations ne pouvant détenir de l'argent (lycéen, détenu...)
in scheme: FINANCES PUBLIQUES
in scheme: Secteur public local
in scheme: Gestion Publique
notation: REFIP5982

conseil fiscal
type: ConceptReFip
type: Concept
alternative label: conseiller fiscal
broader: fonction de la Direction générale des finances publiques (non-descripteur)
definition: Activité assurée par la DGFiP aux collectivités territoriales et établissements publics locaux.
in scheme: FINANCES PUBLIQUES
in scheme: Personnels et fonctions
in scheme: Fonction de la Direction générale des Finances publiques (NON DESCRIPTEUR)
in scheme: Fonction Publique et Gestion des Ressources Humaines
notation: REFIP5983

concubinage
type: ConceptReFip
type: Concept
alternative label: union libre
alternative label: vie maritale
broader: refip-REFIP6840
definition: Situation juridique d'un couple de fait formé de deux personnes adultes qui vivent ensemble de façon durable et notoire sans être mariés ni pacsés.
in scheme: FINANCES PUBLIQUES
in scheme: Famille Education Population
in scheme: Famille
in scheme: Questions de Société
notation: REFIP5984

cotisation salariale
type: ConceptReFip
type: Concept
alternative label: cotisations salariales
broader: refip-REFIP6677
definition: Part des cotisations sociales à la charge du salarié et retenue sur son salaire. Le taux et l' assiette variant en fonction des cotisations ou contributions concernées.
in scheme: FINANCES PUBLIQUES
in scheme: Gestion des ressources humaines
in scheme: Rémunération
in scheme: Fonction Publique et Gestion des Ressources Humaines
notation: REFIP5985

corrida
type: ConceptReFip
type: Concept
alternative label: course de taureau
broader: loisirs
definition: Jeu se déroulant dans des arènes et opposant, successivement, plusieurs taureaux à un matador qui doit, grâce à un travail de cape, de piques et de banderilles, amener le taureau dans les conditions permettant sa mise à mort (par l'épée), terme attendu du combat.
in scheme: FINANCES PUBLIQUES
in scheme: Culture et Loisirs
in scheme: Loisirs
in scheme: Questions de Société
notation: REFIP5986

chèque cadeau
type: ConceptReFip
type: Concept
broader: moyen de paiement
definition: Crédit d'achat qui s’effectue ou s’échange en magasin ou dans plusieurs enseignes. Il peut être échangé contre des produits de toute nature.
in scheme: FINANCES PUBLIQUES
in scheme: Moyen de paiement
in scheme: Finance
notation: REFIP5987

contrat d'agglomération
type: ConceptReFip
type: Concept
broader: agglomération
definition: Document dans lequel plusieurs partenaires (État, région...) s’engagent sur la mise en place d’actions structurantes (développement économique, politique de la ville... ) sur une aire urbaine de plus de 50 000 habitants fonctionnant avec une taxe professionnelle unique.
in scheme: FINANCES PUBLIQUES
in scheme: Aménagement du territoire Urbanisme Habitat
in scheme: Aménagement du Territoire
in scheme: Questions de Société
notation: REFIP5988

cessation progressive d'activité
type: ConceptReFip
type: Concept
alternative label: CPA
broader: cessation de fonction
definition: Dispositif , supprimé depuis 2011, permettant, sous certaines conditions, aux agents proches de la retraite de travailler à temps partiel tout en percevant une rémunération supérieure au temps de travail effectué.
in scheme: FINANCES PUBLIQUES
in scheme: Gestion des ressources humaines
in scheme: Carrière
in scheme: Fonction Publique et Gestion des Ressources Humaines
notation: REFIP5989
scope note: Supprimée depuis 2011, seuls les agents admis en cessation progressive d'activité (CPA) avant cette date continuent d'en bénéficier jusqu'à expiration de leurs droits

chèque volé
type: ConceptReFip
type: Concept
broader: chèque bancaire
definition: En cas de vol d'un chèque, le titulaire d'un compte peut demander à sa banque de faire opposition au paiement de celui-ci en apportant une copie de la déclaration de vol auprès des autorités policières.
in scheme: FINANCES PUBLIQUES
in scheme: Moyen de paiement
in scheme: Finance
notation: REFIP5990

cotisation sociale
type: ConceptReFip
type: Concept
alternative label: charge sociale
alternative label: charges sociales
alternative label: cotisations sociales
broader: refip-REFIP6677
definition: Ensemble des prélèvements sur les salaires, à la charge des agents et de leurs employeurs que ces derniers reversent aux administrations de sécurité sociale et aux régimes privés. Ils se décomposent en cotisations à la charge des employeurs, cotisations à la charge des salariés, et cotisations à la charge des travailleurs indépendants et des personnes n'occupant pas d'emploi.
in scheme: FINANCES PUBLIQUES
in scheme: Gestion des ressources humaines
in scheme: Rémunération
in scheme: Fonction Publique et Gestion des Ressources Humaines
notation: REFIP5991

comptable secondaire
type: ConceptReFip
type: Concept
broader: comptable public
definition: Comptable public dont les opérations sont centralisées par un comptable principal auquel il rend compte.
in scheme: FINANCES PUBLIQUES
in scheme: Personnels et fonctions
in scheme: Fonction de la Direction générale des Finances publiques (NON DESCRIPTEUR)
in scheme: Fonction Publique et Gestion des Ressources Humaines
notation: REFIP5992

crédit-bail
type: ConceptReFip
type: Concept
alternative label: cession-bail
alternative label: crédit bail
alternative label: crédit-bail immobilier
alternative label: crédit-bail mobilier
alternative label: lease back
alternative label: lease-back
alternative label: leasing
alternative label: location financement
broader: refip-REFIP6835
definition: Moyen de financement permettant à une entreprise d'acquérir des biens à l'issue d'une période de location dans des conditions variant selon que le bien est mobilier ou immobilier.
in scheme: FINANCES PUBLIQUES
in scheme: Systeme bancaire et financier
in scheme: Secteur bancaire
in scheme: Finance
notation: REFIP5993

carried interest
type: ConceptReFip
type: Concept
alternative label: part et action à rendement subordonné
broader: Fonds commun de créances
definition: Part de la Plus-value réalisée par un fonds d'investissements qui revient à ses dirigeants.
in scheme: FINANCES PUBLIQUES
in scheme: Instrument financier
in scheme: Organisme de Placement Collectif en Valeurs Mobilières
in scheme: Finance
notation: REFIP5994

chèque emploi-service universel
type: ConceptReFip
type: Concept
alternative label: CESU
alternative label: chèque emploi-service
alternative label: chèque service
broader: moyen de paiement
definition: Dispositif permettant à un particulier employeur de déclarer et rémunérer des activités de services à la personne. Ces services sont en principe rendus au domicile du particulier ; il peut également s’agir d’activités exercées hors du domicile dès lors qu’elles s’inscrivent dans le prolongement d’une activité de services à domicile.
in scheme: FINANCES PUBLIQUES
in scheme: Moyen de paiement
in scheme: Finance
notation: REFIP5995

carte familiale de priorité (supprimé)
type: ConceptReFip
type: Concept
broader: ZZ
in scheme: FINANCES PUBLIQUES
notation: REFIP5996

concours interne
type: ConceptReFip
type: Concept
broader: concours de recrutement
definition: Ensemble d'épreuves ouvert aux fonctionnaires et aux agents publics justifiant notamment d'une certaine durée de service dans la fonction publique afin d'accéder au grade supérieur.
in scheme: FINANCES PUBLIQUES
in scheme: Gestion des ressources humaines
in scheme: Carrière
in scheme: Fonction Publique et Gestion des Ressources Humaines
narrower: concours interne spécial
notation: REFIP5997

conditions de travail
type: ConceptReFip
type: Concept
alternative label: conditions de vie au travail
broader: gestion des ressources humaines
definition: Environnement dans lequel travaillent les agents. L'administration a l'obligation de préserver la santé et la sécurité des fonctionnaires, en évaluant les risques professionnels et en proposant des améliorations de conditions de travail.
in scheme: FINANCES PUBLIQUES
in scheme: Gestion des ressources humaines
in scheme: Conditions de travail
in scheme: Fonction Publique et Gestion des Ressources Humaines
narrower: hygiène du travail
narrower: médiation sociale
narrower: refip-REFIP6647
narrower: refip-REFIP6738
narrower: refip-REFIP6822
narrower: refip-REFIP6828
narrower: refip-REFIP7120
narrower: refip-REFIP7236
notation: REFIP5998
related: aménagement du lieu de travail

chèque emploi associatif
type: ConceptReFip
type: Concept
broader: moyen de paiement
definition: Dispositif permettant aux associations et fondations employeurs d'effectuer l'ensemble des formalités liées à l'embauche et à l'emploi de leurs salariés.
in scheme: FINANCES PUBLIQUES
in scheme: Moyen de paiement
in scheme: Finance
notation: REFIP5999

application SYGMAFIP
type: ConceptReFip
type: Concept
alternative label: SYGMAFIP
alternative label: système de gestion des missions d'audit des finances publiques
broader: applications missions transverses (non-descripteur)
definition: Outil permettant le suivi informatisé des audits et intégrant les besoins de la filière fiscale et de la filière gestion publique. Remplace ASIA à/c 01/01/2013.
in scheme: FINANCES PUBLIQUES
in scheme: Applications missions transverses
in scheme: Applications Informatiques
notation: REFIP6
scope note: Remplace l'application ASIA à compter du 01/01/2013

procès-verbal de carence
type: ConceptReFip
type: Concept
alternative label: PVC
broader: documentation fiscale (non-descripteur)
definition: Acte établi par l’huissier dans le cadre d’une saisie-vente en cas d’absence, au domicile du redevable, de biens meubles saisissables ou d’une valeur marchande suffisante. La signification de cet acte a pour effet d’interrompre la prescription de l’action en recouvrement et ne donne pas lieu à la liquidation de frais de poursuites à la charge du redevable
in scheme: FINANCES PUBLIQUES
in scheme: Documentation Fiscale
in scheme: Fiscalité
notation: REFIP60

échange
type: ConceptReFip
type: Concept
alternative label: contrat d'échange
alternative label: échange de biens
alternative label: échange de services
broader: droit des obligations et contrats (non-descripteur)
definition: Double opération de vente, chacune des parties ayant successivement la position de vendeur et celle d'acheteur avec les conséquences fiscales qui en découlent.
in scheme: FINANCES PUBLIQUES
in scheme: Droit et Justice
in scheme: Divisions du Droit
in scheme: Droit Privé
notation: REFIP600
related: refip-REFIP7148

conseiller technique de service social
type: ConceptReFip
type: Concept
broader: fonction publique de l'Etat
definition: Fonctionnaires de catégorie A du ministère chargé des affaires sociales. Les conseillers techniques de service social des administrations de L’État exercent leurs fonctions en administration centrale, dans les services à compétence nationale, dans les services déconcentrés, dans les établissements publics de l’État, au sein des autorités administratives indépendantes, dans les services de l’État ou dans les établissements publics en relevant implantés à l'étranger, dans les juridictions ainsi que dans les formations administratives des armées.
in scheme: FINANCES PUBLIQUES
in scheme: Personnels et fonctions
in scheme: Fonction publique
in scheme: Fonction Publique et Gestion des Ressources Humaines
notation: REFIP6000

comptable public
type: ConceptReFip
type: Concept
broader: fonction de la Direction générale des finances publiques (non-descripteur)
definition: Agent de droit public ayant la charge exclusive de manier les fonds et de tenir les comptes des personnes morales soumises aux règles de la comptabilité publique.
in scheme: FINANCES PUBLIQUES
in scheme: Personnels et fonctions
in scheme: Fonction de la Direction générale des Finances publiques (NON DESCRIPTEUR)
in scheme: Fonction Publique et Gestion des Ressources Humaines
narrower: comptable commis d'office
narrower: comptable supérieur du Trésor
narrower: comptable assignataire
narrower: comptable du Trésor
narrower: comptable spécialisé du domaine
narrower: comptable centralisateur des comptes de l'Etat
narrower: comptable secondaire
narrower: comptable centralisateur
narrower: comptable non centralisateur
notation: REFIP6001

congé spécial
type: ConceptReFip
type: Concept
broader: congés (non-descripteur)
definition: Congé pouvant être accordé aux fonctionnaires territoriaux détachés sur un emploi fonctionnel et aux personnels hospitaliers de direction, âgés d'au moins 55 ans, sous certaines conditions (notamment d'âge et de durée de services). Le bénéficiaire du congé n'occupe plus ses fonctions mais continue d'être rémunéré par l'administration qui l'employait. Il peut exercer une activité rémunérée pendant le congé. À l'issue du congé spécial, ils sont admis d'office à la retraite.
in scheme: FINANCES PUBLIQUES
in scheme: Gestion des ressources humaines
in scheme: Temps de travail
in scheme: Fonction Publique et Gestion des Ressources Humaines
notation: REFIP6002

concours interne spécial
type: ConceptReFip
type: Concept
broader: concours interne
definition: Ensemble d'épreuves ouvert aux agents techniques et administratifs justifiant notamment d'une certaine durée de service dans la fonction publique afin d'accéder au grade supérieur.
in scheme: FINANCES PUBLIQUES
in scheme: Gestion des ressources humaines
in scheme: Carrière
in scheme: Fonction Publique et Gestion des Ressources Humaines
notation: REFIP6003

congé sans solde (obsolète)
type: ConceptReFip
type: Concept
is replaced by: congé sans traitement
broader: ZZ
in scheme: FINANCES PUBLIQUES
notation: REFIP6004

conjoint
type: ConceptReFip
type: Concept
alternative label: épouse
alternative label: époux
broader: famille
definition: Personne unie par le mariage.
in scheme: FINANCES PUBLIQUES
in scheme: Famille Education Population
in scheme: Famille
in scheme: Questions de Société
notation: REFIP6005

congé administratif
type: ConceptReFip
type: Concept
broader: congés (non-descripteur)
definition: Congé accordé aux agents affectés dans certaines collectivités d'outre-mer à l'issue de leur séjour dans cette collectivité.
in scheme: FINANCES PUBLIQUES
in scheme: Gestion des ressources humaines
in scheme: Temps de travail
in scheme: Fonction Publique et Gestion des Ressources Humaines
notation: REFIP6006

conservateur des hypothèques
type: ConceptReFip
type: Concept
broader: grade de la Direction générale des Finances publiques (non-descripteur)
definition: Responsable du service des hypothèques jusqu'à fin 2012, le conservateur des hypothèques bénéficiait d'une rémunération et d'un régime particuliers. La réforme intervenue en 2010 et entrée en vigueur le 1er janvier 2013 a prévu la transformation des conservations des hypothèques en services chargés de la publicité foncière. Le régime du conservateur des hypothèques est depuis supprimé.
in scheme: FINANCES PUBLIQUES
in scheme: Personnels et fonctions
in scheme: Fonction publique
in scheme: Fonction Publique et Gestion des Ressources Humaines
notation: REFIP6007
scope note: Existe jusqu'à fin 2012

chèque bancaire
type: ConceptReFip
type: Concept
broader: monnaie scripturale
definition: Moyen de paiement scriptural qui par lequel le tireur donne l'ordre au tiré de payer à vue une somme d'argent à son profit ou à un bénéficiaire.
in scheme: FINANCES PUBLIQUES
in scheme: Moyen de paiement
in scheme: Finance
narrower: carnet de chèques
narrower: chèque barré
narrower: chèque de voyage
narrower: chèque impayé
narrower: chèque Caisse dépôts et consignations
narrower: chèque certifié
narrower: chèque volé
narrower: chèque de banque
narrower: chèque perdu
narrower: lettre-chèque
notation: REFIP6008

crise
type: ConceptReFip
type: Concept
alternative label: crise sanitaire
alternative label: gestion de crise
broader: sécurité économique
definition: Période troublée que traverse un pays, une société; troubles qui affectent un secteur d'activité, le fonctionnement d'une institution...
in scheme: FINANCES PUBLIQUES
in scheme: Etat
in scheme: Administration de L'Etat
narrower: plan de continuité d'activité
notation: REFIP6009

donation indirecte
type: ConceptReFip
type: Concept
broader: donation
definition: Donation qui résulte d'un acte qui, par sa nature, ne comporte pas nécessairement une libéralité (par exemple une remise de dettes) et qui ne comporte aucun déguisement.
in scheme: FINANCES PUBLIQUES
in scheme: Champ d'Application
in scheme: Fiscalité
notation: REFIP601

Communauté européenne de l'énergie atomique
type: ConceptReFip
type: Concept
alternative label: CEEA
alternative label: EURATOM
broader: refip-REFIP6938
definition: Organisme public européen chargé de coordonner les programmes de recherche sur l'énergie nucléaire.
in scheme: FINANCES PUBLIQUES
in scheme: Questions Politiques Relations Internationales
in scheme: Relations Internationales
in scheme: Questions de Société
notation: REFIP6010

certificat d'urbanisme
type: ConceptReFip
type: Concept
alternative label: certificat d'urbanisme d'information
alternative label: certificat d'urbanisme opérationnel
broader: document d'urbanisme
definition: Acte administratif ayant pour objectif de qualifier la situation juridique d'un terrain en se basant sur les règles d'urbanisme, la constructibilité ainsi que les droits et obligations qui lui sont applicables.
in scheme: FINANCES PUBLIQUES
in scheme: Aménagement du territoire Urbanisme Habitat
in scheme: Aménagement du Territoire
in scheme: Questions de Société
notation: REFIP6011
related: refip-REFIP6935

compétence professionnelle
type: ConceptReFip
type: Concept
alternative label: aptitude professionnelle
alternative label: capacité professionnelle
alternative label: qualification professionnelle
broader: carrière
definition: Capacité de l'agent, correspondant aux connaissances et aptitudes, à accomplir une activité professionnelle conformément à une norme et/ou à une exigence prédéterminée.
in scheme: FINANCES PUBLIQUES
in scheme: Gestion des ressources humaines
in scheme: Carrière
in scheme: Fonction Publique et Gestion des Ressources Humaines
notation: REFIP6012

chèque de banque
type: ConceptReFip
type: Concept
broader: chèque bancaire
definition: Emis par une banque, il garantit le paiement à son porteur pendant la durée de validité du chèque.
in scheme: FINANCES PUBLIQUES
in scheme: Moyen de paiement
in scheme: Finance
notation: REFIP6013

chèque perdu
type: ConceptReFip
type: Concept
broader: chèque bancaire
definition: Chèque égaré qu'il convient d'annuler auprès de la banque en faisant opposition à son encaissement.
in scheme: FINANCES PUBLIQUES
in scheme: Moyen de paiement
in scheme: Finance
notation: REFIP6014

clôture de compte
type: ConceptReFip
type: Concept
alternative label: clôture de compte bancaire
alternative label: clôture de compte courant
broader: compte bancaire
definition: Fermeture d'un compte qui peut être faite à l'initiative de son titulaire ou de l'établissement bancaire.
in scheme: FINANCES PUBLIQUES
in scheme: Systeme bancaire et financier
in scheme: Secteur bancaire
in scheme: Finance
notation: REFIP6015
scope note: Finance

cumul de pensions
type: ConceptReFip
type: Concept
broader: droits du fonctionnaire
definition: Possibilité de cumuler deux ou plusieurs pensions acquises au titre d'une même période d'activité.
in scheme: FINANCES PUBLIQUES
in scheme: Gestion des ressources humaines
in scheme: Statut du fonctionnaire
in scheme: Fonction Publique et Gestion des Ressources Humaines
notation: REFIP6016

conférencier
type: ConceptReFip
type: Concept
broader: fonction (non-descripteur)
definition: Personne qui fait habituellement des conférences.
in scheme: FINANCES PUBLIQUES
in scheme: Personnels et fonctions
in scheme: Fonction (NON DESCRIPTEUR)
in scheme: Fonction Publique et Gestion des Ressources Humaines
notation: REFIP6017

comptable centralisateur
type: ConceptReFip
type: Concept
broader: comptable public
definition: Comptable public qui intègre au jour le jour dans ses écritures, les opérations enregistrées et transférées par les comptables non centralisateurs.
in scheme: FINANCES PUBLIQUES
in scheme: Personnels et fonctions
in scheme: Fonction de la Direction générale des Finances publiques (NON DESCRIPTEUR)
in scheme: Fonction Publique et Gestion des Ressources Humaines
notation: REFIP6018

collecte de fonds
type: ConceptReFip
type: Concept
alternative label: quête
broader: financement
definition: Activité consistant à demander de l'argent pour mener à bien un projet pour, notamment, une organisation à but non lucratif.
in scheme: FINANCES PUBLIQUES
in scheme: Systeme bancaire et financier
in scheme: Opération financière
in scheme: Finance
narrower: mécénat
notation: REFIP6019

transmission d'une entreprise
type: ConceptReFip
type: Concept
broader: cession d'entreprise
definition: Changement dans la personne de l'employeur par suite d'une transmission à titre gratuit (décès, donation) ou d'une cession à titre onéreux d'une entreprise.
in scheme: FINANCES PUBLIQUES
in scheme: Vie de l'Entreprise
in scheme: Entreprises
in scheme: Vie et Gestion de l'entreprise
notation: REFIP602

contrôle sanitaire
type: ConceptReFip
type: Concept
alternative label: inspection sanitaire
broader: santé (non-descripteur)
definition: Contrôle portant sur le respect de la réglementation sanitaire (hygiène et santé), relative à la conservation de la santé publique.
in scheme: FINANCES PUBLIQUES
in scheme: Santé et Protection Sociale
in scheme: Santé
in scheme: Questions de Société
notation: REFIP6020

comptable non centralisateur
type: ConceptReFip
type: Concept
broader: comptable public
definition: Comptable public responsable d'un poste comptable classé non centralisateur.
in scheme: FINANCES PUBLIQUES
in scheme: Personnels et fonctions
in scheme: Fonction de la Direction générale des Finances publiques (NON DESCRIPTEUR)
in scheme: Fonction Publique et Gestion des Ressources Humaines
notation: REFIP6021

caissier
type: ConceptReFip
type: Concept
broader: fonction de la Direction générale des finances publiques (non-descripteur)
definition: Personne chargée du service de la caisse au sein d'une structure DGFIP.
in scheme: FINANCES PUBLIQUES
in scheme: Personnels et fonctions
in scheme: Fonction de la Direction générale des Finances publiques (NON DESCRIPTEUR)
in scheme: Fonction Publique et Gestion des Ressources Humaines
notation: REFIP6022

concession de logement
type: ConceptReFip
type: Concept
broader: nécessité absolue de service
definition: Attribution des logements de fonction aux fonctionnaires en cas de nécessité absolue de service.
in scheme: FINANCES PUBLIQUES
in scheme: Gestion des ressources humaines
in scheme: Statut du fonctionnaire
in scheme: Fonction Publique et Gestion des Ressources Humaines
notation: REFIP6023
related: logement de fonction

clergé (supprimé)
type: ConceptReFip
type: Concept
broader: ZZ
in scheme: FINANCES PUBLIQUES
notation: REFIP6024

copropriété
type: ConceptReFip
type: Concept
broader: refip-REFIP6616
definition: Tout immeuble bâti ou groupe d’immeubles bâtis dont la propriété est répartie en plusieurs personnes par lot, comprenant chacun une partie privative et une quote-part de partie commune.
in scheme: FINANCES PUBLIQUES
in scheme: Aménagement du territoire Urbanisme Habitat
in scheme: Habitat
in scheme: Questions de Société
narrower: charge de copropriété
narrower: refip-REFIP6841
narrower: refip-REFIP6855
notation: REFIP6025

circulation routière
type: ConceptReFip
type: Concept
broader: refip-REFIP6842
definition: Déplacement de véhicules automobiles sur une route.
in scheme: FINANCES PUBLIQUES
in scheme: Questions Politiques Relations Internationales
in scheme: Politique
in scheme: Questions de Société
narrower: accident de circulation
notation: REFIP6026

commissaire de police
type: ConceptReFip
type: Concept
broader: fonction publique de l'Etat
definition: Fonctionnaire d’État appartenant au corps de conception et de direction, chargé de l'élaboration et de la mise en œuvre des doctrines d'emploi et de la direction des services dont il assume la responsabilité opérationnelle et organique. Il a autorité sur les personnels affectés dans son service, il participe à la conception, à la réalisation et à l'évaluation des programmes et des projets relatifs à la prévention de l'insécurité et à la lutte contre la délinquance.
in scheme: FINANCES PUBLIQUES
in scheme: Personnels et fonctions
in scheme: Fonction publique
in scheme: Fonction Publique et Gestion des Ressources Humaines
notation: REFIP6027

contrôleur du règlement
type: ConceptReFip
type: Concept
broader: fonction de la Direction générale des finances publiques (non-descripteur)
definition: Fonction dévouée à CHORUS qui consiste à traiter la demande de paiement.
in scheme: FINANCES PUBLIQUES
in scheme: Personnels et fonctions
in scheme: Fonction de la Direction générale des Finances publiques (NON DESCRIPTEUR)
in scheme: Fonction Publique et Gestion des Ressources Humaines
notation: REFIP6028
scope note: CHORUS

congé longue maladie
type: ConceptReFip
type: Concept
alternative label: CLM
alternative label: congé de longue maladie
broader: congés (non-descripteur)
definition: Congé de longue maladie accordé au fonctionnaire après avis du comité médical, lorsque la maladie présente un caractère invalidant et de gravité confirmée et nécessitant un traitement et des soins prolongés.
in scheme: FINANCES PUBLIQUES
in scheme: Gestion des ressources humaines
in scheme: Temps de travail
in scheme: Fonction Publique et Gestion des Ressources Humaines
notation: REFIP6029

commissions
type: ConceptReFip
type: Concept
broader: intérêts
definition: Mode de rémunération des services fournis par des intermédiaires commerciaux ou financiers.
in scheme: FINANCES PUBLIQUES
in scheme: Systeme bancaire et financier
in scheme: Secteur bancaire
in scheme: Finance
notation: REFIP6030

cumul de revenus
type: ConceptReFip
type: Concept
broader: droits du fonctionnaire
definition: Possibilité de cumuler plusieurs revenus provenant d'activités différentes.
in scheme: FINANCES PUBLIQUES
in scheme: Gestion des ressources humaines
in scheme: Statut du fonctionnaire
in scheme: Fonction Publique et Gestion des Ressources Humaines
notation: REFIP6031

compte courant postal
type: ConceptReFip
type: Concept
alternative label: CCP
alternative label: compte chèque postal
broader: compte de dépôt
definition: Compte courant particulier à la Banque postale.
in scheme: FINANCES PUBLIQUES
in scheme: Systeme bancaire et financier
in scheme: Secteur bancaire
in scheme: Finance
notation: REFIP6032

classement hiérarchique (supprimé)
type: ConceptReFip
type: Concept
broader: ZZ
in scheme: FINANCES PUBLIQUES
notation: REFIP6033

chef de projet
type: ConceptReFip
type: Concept
broader: fonction de la Direction générale des finances publiques (non-descripteur)
definition: Agent qui participe à l'élaboration du cahier des charges des applications dans le cadre d'un système informatique. Il anime, coordonne et suit les travaux relatifs à sa mise en œuvre et à son actualisation.
in scheme: FINANCES PUBLIQUES
in scheme: Personnels et fonctions
in scheme: Fonction de la Direction générale des Finances publiques (NON DESCRIPTEUR)
in scheme: Fonction Publique et Gestion des Ressources Humaines
notation: REFIP6034

congé de grave maladie
type: ConceptReFip
type: Concept
broader: congés (non-descripteur)
definition: Congé accordé à l’agent non titulaire en activité employé de manière continue et comptant au moins trois années de services, ainsi que l’agent titulaire à temps non complet non affilié à la CNRACL, atteint d’une affection dûment constatée, le mettant dans l’impossibilité d’exercer son activité, nécessitant un traitement et des soins prolongés et présentant un caractère invalidant et de gravité confirmée.
in scheme: FINANCES PUBLIQUES
in scheme: Gestion des ressources humaines
in scheme: Temps de travail
in scheme: Fonction Publique et Gestion des Ressources Humaines
notation: REFIP6035

correspondant régional de sécurité économique
type: ConceptReFip
type: Concept
broader: grade de la Direction générale des Finances publiques (non-descripteur)
definition: Correspondant Régional de Sécurité Économique (CRSE) placé au sein de la division de l’expertise et de l’action économiques du pôle gestion publique de la DGFIP, les CRSE sont habilités secret défense, ils travaillent en liaison avec les Chargés de Mission de Sécurité Économique (CMSE), placés auprès des préfets de zone de défense et de sécurité, et les Chargés de mission Régionaux à l’Intelligence Économique (CRIE), placés auprès des directeurs régionaux des entreprises, de la concurrence, de la consommation, du travail et de l’emploi (DIRECCTE). Les missions des CRSE s’articulent autour de quatre thématiques : 1) La prévention et la gestion des crises ; 2) La protection du secret de la défense nationale ; 3) La sécurité des systèmes d’Information ; 4) La diffusion d’une culture de sécurité économique.
in scheme: FINANCES PUBLIQUES
in scheme: Personnels et fonctions
in scheme: Fonction publique
in scheme: Fonction Publique et Gestion des Ressources Humaines
notation: REFIP6036

COFACE (supprimé)
type: ConceptReFip
type: Concept
broader: ZZ
in scheme: FINANCES PUBLIQUES
notation: REFIP6037

certificat coopératif d'investissement
type: ConceptReFip
type: Concept
broader: titre de placement (non-descripteur)
definition: Titre de propriété coté en bourse, le certificat coopératif d’investissement est émis par une société mutualiste ou par une société coopérative. Le certificat coopératif d’investissement est sans droit de vote. Il se voit, néanmoins, attaché une rémunération au profit de son détenteur.
in scheme: FINANCES PUBLIQUES
in scheme: Instrument financier
in scheme: Valeur Mobiliere
in scheme: Finance
notation: REFIP6038

comptable des immobilisations (supprimé)
type: ConceptReFip
type: Concept
broader: ZZ
in scheme: FINANCES PUBLIQUES
notation: REFIP6039

régie de recettes
type: ConceptReFip
type: Concept
broader: régie
definition: Service permettant à un régisseur d'encaisser les recettes énumérées dans l'acte constitutif de la régie, à la place du comptable public assignataire, pour le compte d'une collectivité ou de l'établissement public local. Elle permet d'encaisser des recettes dès que le service a été rendu donc d'abonder rapidement la trésorerie de la collectivité ou de l'établissement public local.
in scheme: FINANCES PUBLIQUES
in scheme: Secteur public local
in scheme: Gestion Publique
notation: REFIP604

chef programmeur (supprimé)
type: ConceptReFip
type: Concept
broader: ZZ
in scheme: FINANCES PUBLIQUES
notation: REFIP6040

charges locatives
type: ConceptReFip
type: Concept
broader: location
definition: Dépenses prises en charges initialement par le propriétaire, mais que celui-ci peut se faire rembourser par le locataire.
in scheme: FINANCES PUBLIQUES
in scheme: Aménagement du territoire Urbanisme Habitat
in scheme: Habitat
in scheme: Questions de Société
notation: REFIP6041

cinéma
type: ConceptReFip
type: Concept
alternative label: industrie cinématographique
alternative label: salle de cinéma
broader: refip-REFIP6694
definition: Art du spectacle; salle de cinéma.
in scheme: FINANCES PUBLIQUES
in scheme: Culture et Loisirs
in scheme: Patrimoine Culturel
in scheme: Questions de Société
notation: REFIP6042

centre d'examen
type: ConceptReFip
type: Concept
broader: refip-REFIP6779
definition: Lieu où se passent les concours et examens.
in scheme: FINANCES PUBLIQUES
in scheme: Gestion des ressources humaines
in scheme: Carrière
in scheme: Fonction Publique et Gestion des Ressources Humaines
notation: REFIP6043

contrôleur budgétaire et comptable ministériel
type: ConceptReFip
type: Concept
alternative label: CBCM
broader: fonction de la Direction générale des finances publiques (non-descripteur)
definition: Personne chargée d’assurer le contrôle budgétaire au sein d’un ministère; d’en être le comptable public et de transmettre aux autorités budgétaires et à l’ordonnateur principal un rapport annuel sur l’exécution budgétaire et une analyse de la situation financière du ministère.
in scheme: FINANCES PUBLIQUES
in scheme: Personnels et fonctions
in scheme: Fonction de la Direction générale des Finances publiques (NON DESCRIPTEUR)
in scheme: Fonction Publique et Gestion des Ressources Humaines
notation: REFIP6044

cabinet médical
type: ConceptReFip
type: Concept
broader: santé (non-descripteur)
definition: Local professionnel où un médecin reçoit ses patients et donne ses consultations.
in scheme: FINANCES PUBLIQUES
in scheme: Santé et Protection Sociale
in scheme: Santé
in scheme: Questions de Société
notation: REFIP6045

conservateur territorial des bibliothèques
type: ConceptReFip
type: Concept
broader: fonction publique territoriale
definition: Fonctionnaire territorial de catégorie A en poste de direction ou d'encadrement dans les bibliothèques municipales classées et les bibliothèques départementales de prêt notamment, les conservateurs territoriaux de bibliothèques définissent les rôles et contributions des bibliothèques en faveur des enjeux sociaux, économiques et culturels de la collectivité.
in scheme: FINANCES PUBLIQUES
in scheme: Personnels et fonctions
in scheme: Fonction publique
in scheme: Fonction Publique et Gestion des Ressources Humaines
notation: REFIP6046

catégorie d'emploi
type: ConceptReFip
type: Concept
broader: refip-REFIP6879
definition: Regroupement des fonctionnaires classés selon le niveau de recrutement en 3 catégories A, B et C.
in scheme: FINANCES PUBLIQUES
in scheme: Gestion des ressources humaines
in scheme: Statut du fonctionnaire
in scheme: Fonction Publique et Gestion des Ressources Humaines
narrower: catégorie B
narrower: catégorie A
narrower: catégorie C
narrower: refip-REFIP7133
notation: REFIP6047

correspondant du Trésor
type: ConceptReFip
type: Concept
broader: fonction de la Direction générale des finances publiques (non-descripteur)
definition: Organisme déposant à titre obligatoire ou facultatif des fonds au Trésor ou étant autorisé à procéder à des opérations de recettes et de dépenses par l'intermédiaire des comptables du Trésor.
in scheme: FINANCES PUBLIQUES
in scheme: Personnels et fonctions
in scheme: Fonction de la Direction générale des Finances publiques (NON DESCRIPTEUR)
in scheme: Fonction Publique et Gestion des Ressources Humaines
notation: REFIP6048

conservateur du patrimoine
type: ConceptReFip
type: Concept
alternative label: conservation du patrimoine
broader: fonction publique de l'Etat
definition: Fonctionnaire d’État placé au sein ou à la tête d'institutions patrimoniales,ayant pour mission d'étudier, de classer, de conserver, d'entretenir, d'enrichir, de mettre en valeur et de faire connaître le patrimoine.
in scheme: FINANCES PUBLIQUES
in scheme: Personnels et fonctions
in scheme: Fonction publique
in scheme: Fonction Publique et Gestion des Ressources Humaines
notation: REFIP6049

compte de tiers
type: ConceptReFip
type: Concept
broader: plan comptable
definition: Compte qui appartient à la classe n° 4 des comptes du plan comptable général, et relève, à ce titre, des comptes de bilan. Les tiers sont toutes les personnes physiques ou morales qui sont en relation avec l'entreprise.
in scheme: FINANCES PUBLIQUES
in scheme: Documents comptables
in scheme: Comptabilité
narrower: fichier client
notation: REFIP605

certificateur du service fait
type: ConceptReFip
type: Concept
broader: fonction de la Direction générale des finances publiques (non-descripteur)
definition: Ordonnateur attestant sous sa responsabilité du service fait.
in scheme: FINANCES PUBLIQUES
in scheme: Personnels et fonctions
in scheme: Fonction de la Direction générale des Finances publiques (NON DESCRIPTEUR)
in scheme: Fonction Publique et Gestion des Ressources Humaines
notation: REFIP6050

conducteur de véhicule
type: ConceptReFip
type: Concept
alternative label: chauffeur
alternative label: chef de garage
broader: fonction (non-descripteur)
definition: Fonctionnaire qui exerce des fonctions de chef de garage ou conducteur de véhicule.
in scheme: FINANCES PUBLIQUES
in scheme: Personnels et fonctions
in scheme: Fonction (NON DESCRIPTEUR)
in scheme: Fonction Publique et Gestion des Ressources Humaines
notation: REFIP6051

changement de domicile
type: ConceptReFip
type: Concept
alternative label: déménagement
broader: domicile personnel
definition: Déménagement.
in scheme: FINANCES PUBLIQUES
in scheme: Famille Education Population
in scheme: Famille
in scheme: Questions de Société
notation: REFIP6052

Commission européenne
type: ConceptReFip
type: Concept
alternative label: Commission des Communautés européennes
broader: refip-REFIP6938
definition: Institution de l’Union européenne (UE). C’est un organe indépendant des États doté de pouvoirs importants. Elle représente et défend les intérêts de l’Union dans son ensemble. Elle présente des propositions législatives. Elle veille à la bonne application des politiques et exécute le budget de l’UE.
in scheme: FINANCES PUBLIQUES
in scheme: Questions Politiques Relations Internationales
in scheme: Relations Internationales
in scheme: Questions de Société
notation: REFIP6053

document unique d'évaluation des risques professionnels
type: ConceptReFip
type: Concept
alternative label: DUERP
broader: document de GRH (non-descripteur)
definition: Document recensant l’ensemble des risques professionnels auxquels sont exposés les agents afin d'organiser la prévention.
in scheme: FINANCES PUBLIQUES
in scheme: Gestion des ressources humaines
in scheme: Document de GRH
in scheme: Fonction Publique et Gestion des Ressources Humaines
notation: REFIP6054
related: refip-REFIP6647

directeur de projet des administrations de l'Etat et de ses établissements (supprimé)
type: ConceptReFip
type: Concept
broader: ZZ
in scheme: FINANCES PUBLIQUES
notation: REFIP6055

déchetterie
type: ConceptReFip
type: Concept
alternative label: décharge publique
alternative label: déchèterie
broader: refip-REFIP6886
definition: Centre de collecte et de tri volontaire des déchets qui peut en assurer la récupération, le recyclage, l'incinération ou le stockage dans un centre d'enfouissement.
in scheme: FINANCES PUBLIQUES
in scheme: Environnement
in scheme: Protection de l'Environnement
in scheme: Questions de Société
notation: REFIP6056

dépositaire de deniers publics (supprimé)
type: ConceptReFip
type: Concept
broader: ZZ
in scheme: FINANCES PUBLIQUES
notation: REFIP6057

directeur de cabinet
type: ConceptReFip
type: Concept
broader: directeur
definition: Personne chargée du cabinet, le plus proche collaborateur de son supérieur qu'il seconde dans ses prises de décision.
in scheme: FINANCES PUBLIQUES
in scheme: Personnels et fonctions
in scheme: Fonction (NON DESCRIPTEUR)
in scheme: Fonction Publique et Gestion des Ressources Humaines
notation: REFIP6058

durée d'assurance
type: ConceptReFip
type: Concept
broader: droits à pension
definition: Total de la durée des services et bonifications pris en compte dans le calcul de la pension civile ou militaire et des durées d’assurance dans les autres régimes de retraite de base obligatoires. Une année civile ne peut valider qu'un maximum de 4 trimestres de durée d'assurance.
in scheme: FINANCES PUBLIQUES
in scheme: Gestion des ressources humaines
in scheme: Retraite
in scheme: Fonction Publique et Gestion des Ressources Humaines
notation: REFIP6059
scope note: Droits à pension

application ADONIS
type: ConceptReFip
type: Concept
alternative label: ADONIS
broader: applications fiscales (non-descripteur)
definition: Application à destination des agents de la DGFIP et des usagers particuliers, permettant un accès aux données fiscales des particuliers au travers du Compte Fiscal Simplifié.
in scheme: FINANCES PUBLIQUES
in scheme: Applications Informatiques
in scheme: Applications fiscales
notation: REFIP606

dividende
type: ConceptReFip
type: Concept
alternative label: distribution de bénéfices
alternative label: distribution de dividendes
broader: refip-REFIP6956
definition: Revenu versé par l'entreprise à ses actionnaires une ou plusieurs fois par an, et payable en numéraire ou en actions.
in scheme: FINANCES PUBLIQUES
in scheme: Instrument financier
in scheme: Valeur Mobiliere
in scheme: Finance
notation: REFIP6060

droits d'enregistrement
type: ConceptReFip
type: Concept
broader: impôt
definition: Impôts et taxes perçues à l'occasion de la formalité de l'enregistrement. Ils portent notamment sur les actes notariés de particuliers ou de professionnels (droits de mutation, succession, donation) mais aussi les arrêts et les jugements des tribunaux.
in scheme: FINANCES PUBLIQUES
in scheme: Fiscalité
in scheme: Impôt
narrower: droit de partage
narrower: taxe sur les permis de conduire
narrower: contribution de sécurité immobilière
narrower: droit fixe
narrower: taxe de publicité foncière
narrower: taxe sur les certificats d'immatriculation des véhicules
narrower: droit de timbre
narrower: droit de mutation
notation: REFIP6061

découvert bancaire
type: ConceptReFip
type: Concept
alternative label: découvert
alternative label: découvert autorisé
broader: refip-REFIP6674
definition: Compte bancaire négatif. Le découvert bancaire, qui n'est pas automatique, peut être autorisé par la banque.
in scheme: FINANCES PUBLIQUES
in scheme: Systeme bancaire et financier
in scheme: Secteur bancaire
in scheme: Finance
notation: REFIP6062

directeur
type: ConceptReFip
type: Concept
broader: fonction (non-descripteur)
definition: Personne qui dirige une organisation ou une institution.
in scheme: FINANCES PUBLIQUES
in scheme: Personnels et fonctions
in scheme: Fonction (NON DESCRIPTEUR)
in scheme: Fonction Publique et Gestion des Ressources Humaines
narrower: directeur de cabinet
narrower: directeur d'établissement
narrower: directeur adjoint
notation: REFIP6063

dialogue social
type: ConceptReFip
type: Concept
broader: refip-REFIP6833
definition: Ensemble des relations entre l'administration et les organisations syndicales dans le cadre des institutions informelles de concertation.
in scheme: FINANCES PUBLIQUES
in scheme: Gestion des ressources humaines
in scheme: Statut du fonctionnaire
in scheme: Fonction Publique et Gestion des Ressources Humaines
narrower: activité syndicale
narrower: cotisation syndicale
narrower: information syndicale
narrower: refip-REFIP6555
narrower: refip-REFIP6578
narrower: refip-REFIP6740
narrower: refip-REFIP6803
narrower: refip-REFIP6808
notation: REFIP6064
related: droit syndical

diplôme
type: ConceptReFip
type: Concept
alternative label: baccalauréat
alternative label: certificat d'aptitude professionnelle
broader: enseignement
definition: Pièce émanant de l'autorité légale et destinée à conférer, établir ou confirmer un droit ou un titre. Le diplôme certifie un niveau de de connaissances ou de compétences reconnues, le plus souvent après des études et la réussite à un examen ou concours. Il peut être obtenu par équivalence, dans le cadre de la reconnaissance des acquis de l'expérience (VAE).
in scheme: FINANCES PUBLIQUES
in scheme: Famille Education Population
in scheme: Enseignement
in scheme: Questions de Société
notation: REFIP6065

divorce
type: ConceptReFip
type: Concept
broader: refip-REFIP6840
definition: Rupture officielle d'un mariage.
in scheme: FINANCES PUBLIQUES
in scheme: Famille Education Population
in scheme: Famille
in scheme: Questions de Société
notation: REFIP6066

directeur de soins
type: ConceptReFip
type: Concept
broader: fonction publique hospitalière
definition: Fonctionnaire hospitalier de catégorie A en charge de superviser l'administration des soins fournis aux patients d'un établissement hospitalier. Il veille à contrôler la qualité de ceux-ci et s'occupe aussi de la gestion des risques ainsi que de la gestion de la qualité.
in scheme: FINANCES PUBLIQUES
in scheme: Personnels et fonctions
in scheme: Fonction publique
in scheme: Fonction Publique et Gestion des Ressources Humaines
notation: REFIP6067

défense nationale
type: ConceptReFip
type: Concept
broader: refip-REFIP6579
definition: Ensemble des moyens et des actions mises en oeuvre pour garantir la sécurité et l'intégrité du territoire et de sa population.
in scheme: FINANCES PUBLIQUES
in scheme: Questions Politiques Relations Internationales
in scheme: Politique
in scheme: Questions de Société
notation: REFIP6068

déduction fiscale
type: ConceptReFip
type: Concept
alternative label: déduction d'impôt
alternative label: imputation fiscale
alternative label: réduction d'impôt
broader: déductibilité
definition: Diminution qui, appliquée au revenu brut, aboutit au revenu imposable à l'impôt sur le revenu. Certaines charges sont déductibles des revenus catégoriels, d'autres viennent en déduction du revenu global. Elles visent à encourager certaines dépenses jugées utiles à la collectivité.
in scheme: FINANCES PUBLIQUES
in scheme: Liquidation de l'Impôt
in scheme: Fiscalité
narrower: déduction pour investissement
narrower: frais déductibles
narrower: avantage fiscal
narrower: report en arrière de déficits
narrower: déduction extra-comptable
narrower: abattement
narrower: déduction pour aléas
narrower: refip-REFIP849
narrower: refip-REFIP94
notation: REFIP6069

matériel agricole
type: ConceptReFip
type: Concept
alternative label: machine agricole
broader: travaux agricoles
definition: Instrument mécanique utilisé par et en remplacement de la main-d'œuvre ou pour augmenter la productivité dans la réalisation des différentes tâches agricoles.
in scheme: FINANCES PUBLIQUES
in scheme: Branche d'activité
in scheme: Questions Economiques
in scheme: Agriculture
notation: REFIP607

directeur général des services
type: ConceptReFip
type: Concept
broader: fonction publique territoriale
definition: Fonctionnaire territorial de catégorie A assurant la coordination des services pour la mise en œuvre des décisions locales.
in scheme: FINANCES PUBLIQUES
in scheme: Personnels et fonctions
in scheme: Fonction Publique et Gestion des Ressources Humaines
notation: REFIP6070

disponibilité
type: ConceptReFip
type: Concept
broader: refip-REFIP6657
definition: Situation du fonctionnaire qui cesse d'exercer son activité professionnelle pendant une certaine période, et est placé temporairement hors de son administration d'origine et cesse de bénéficier de sa rémunération et de ses droits à l'avancement et à la retraite. La mise en disponibilité peut intervenir à la demande du fonctionnaire ou à l'initiative de l'administration.
in scheme: FINANCES PUBLIQUES
in scheme: Gestion des ressources humaines
in scheme: Statut du fonctionnaire
in scheme: Fonction Publique et Gestion des Ressources Humaines
notation: REFIP6071

décompte de retraite
type: ConceptReFip
type: Concept
broader: document de GRH (non-descripteur)
definition: Document délivré par le service des ressources humaines simulant le montant de la future pension d'un agent.
in scheme: FINANCES PUBLIQUES
in scheme: Gestion des ressources humaines
in scheme: Document de GRH
in scheme: Fonction Publique et Gestion des Ressources Humaines
notation: REFIP6072

durée de service
type: ConceptReFip
type: Concept
broader: droits à pension
definition: Période accomplie dans la fonction publique ou en qualité de militaire. Cette durée permet de calculer le taux de la pension du fonctionnaire, du magistrat ou du militaire.
in scheme: FINANCES PUBLIQUES
in scheme: Gestion des ressources humaines
in scheme: Retraite
in scheme: Fonction Publique et Gestion des Ressources Humaines
notation: REFIP6073
scope note: Droits à pension

développement régional
type: ConceptReFip
type: Concept
broader: aménagement du territoire
definition: Ensemble des processus de développement qui concerne les régions en tant qu'échelon d'action publique directement inférieurs aux États.
in scheme: FINANCES PUBLIQUES
in scheme: Aménagement du territoire Urbanisme Habitat
in scheme: Aménagement du Territoire
in scheme: Questions de Société
narrower: bassin d'emploi à redynamiser
narrower: contrat de projets Etat-région
narrower: refip-REFIP6618
notation: REFIP6074
related: fonds européen de développement économique et régional

directeur régional des finances publiques
type: ConceptReFip
type: Concept
broader: fonction de la Direction générale des finances publiques (non-descripteur)
definition: Personne assurant l’efficacité de l’exercice des missions de la DGFiP au sein de la région.
in scheme: FINANCES PUBLIQUES
in scheme: Personnels et fonctions
in scheme: Fonction de la Direction générale des Finances publiques (NON DESCRIPTEUR)
in scheme: Fonction Publique et Gestion des Ressources Humaines
notation: REFIP6075

document d'urbanisme
type: ConceptReFip
type: Concept
broader: aménagement du territoire
definition: Documents publics, plans, schémas, programmes et cartes qui cadrent l'aménagement et l'urbanisme à l'échelle d'un territoire ou d'un pays. Ils comprennent souvent un rapport de présentation, un état des lieux, un argumentaire, une évaluation environnementale ou une étude d'incidence au regard du développement durable ou diverses annexes cartographiques, cadastrales ou écrites.
in scheme: FINANCES PUBLIQUES
in scheme: Aménagement du territoire Urbanisme Habitat
in scheme: Aménagement du Territoire
in scheme: Questions de Société
narrower: autorisation d'urbanisme
narrower: certificat d'urbanisme
narrower: refip-REFIP6582
narrower: refip-REFIP6599
narrower: refip-REFIP6819
notation: REFIP6076

dossier médical personnel (obsolète)
type: ConceptReFip
type: Concept
is replaced by: refip-REFIP7057
broader: ZZ
in scheme: FINANCES PUBLIQUES
notation: REFIP6077

déclaration préalable de travaux
type: ConceptReFip
type: Concept
broader: autorisation d'occupation des sols
definition: Acte administratif qui donne les moyens à l'administration de vérifier que le projet de construction respecte bien les règles d'urbanisme en vigueur. Elle est généralement exigée pour la réalisation d'aménagement de faible importance.
in scheme: FINANCES PUBLIQUES
in scheme: Aménagement du territoire Urbanisme Habitat
in scheme: Aménagement du Territoire
in scheme: Questions de Société
notation: REFIP6078

dossier individuel du fonctionnaire
type: ConceptReFip
type: Concept
alternative label: dossier administratif individuel d'un agent public
broader: document de GRH (non-descripteur)
definition: Ensemble des pièces matérialisées ou dématérialisées relatives à la carrière et à la situation administrative des agents. Il peut être consulté sous conditions.
in scheme: FINANCES PUBLIQUES
in scheme: Gestion des ressources humaines
in scheme: Document de GRH
in scheme: Fonction Publique et Gestion des Ressources Humaines
notation: REFIP6079

Comité interministériel d'audit des programmes (supprimé)
type: ConceptReFip
type: Concept
broader: ZZ
in scheme: FINANCES PUBLIQUES
notation: REFIP608

délégué du directeur général des finances publiques
type: ConceptReFip
type: Concept
alternative label: DDG
alternative label: délégué du directeur général
broader: fonction de la Direction générale des finances publiques (non-descripteur)
definition: Représentant du directeur Général des Finances publiques auprès des responsables locaux de la DGFiP, il participe à l'animation du réseau et à la mise en place de réforme et intervient dans a mise en œuvre locale des indicateurs de performance. Il participe à l'évaluation des cadres supérieurs et contribue aux réflexions prospectives.
in scheme: FINANCES PUBLIQUES
in scheme: Personnels et fonctions
in scheme: Fonction de la Direction générale des Finances publiques (NON DESCRIPTEUR)
in scheme: Fonction Publique et Gestion des Ressources Humaines
notation: REFIP6080

différence de change
type: ConceptReFip
type: Concept
alternative label: différence de conversion
alternative label: gain de change
alternative label: perte de change
alternative label: risque de change
broader: change
definition: Différence de valeurs (perte ou gain) enregistré sur un actif ou sur un passif libellé en devises. Elle correspond à des ajustements de valeurs qui sont nécessaires pour maintenir la valeur comptable et financière des actifs et des devises en phase avec les variations enregistrées sur les marchés.
in scheme: FINANCES PUBLIQUES
in scheme: Systeme bancaire et financier
in scheme: Secteur bancaire
in scheme: Finance
notation: REFIP6081

déclaration de grossesse
type: ConceptReFip
type: Concept
broader: grossesse
definition: Document remis à l'issue d'un examen prénatal qui intervient avant la fin du 3e mois de grossesse et permettant de bénéficier de la prise en charge par l'assurance maternité.
in scheme: FINANCES PUBLIQUES
in scheme: Santé et Protection Sociale
in scheme: Santé
in scheme: Questions de Société
notation: REFIP6082

discipline
type: ConceptReFip
type: Concept
broader: refip-REFIP6833
definition: Ensemble des règles de conduite et des obligations communes imposées aux fonctionnaires.
in scheme: FINANCES PUBLIQUES
in scheme: Gestion des ressources humaines
in scheme: Statut du fonctionnaire
in scheme: Fonction Publique et Gestion des Ressources Humaines
narrower: faute disciplinaire
narrower: refip-REFIP6611
narrower: refip-REFIP6823
notation: REFIP6083
scope note: Ressources Humaines

distinction honorifique
type: ConceptReFip
type: Concept
alternative label: Légion d'honneur
alternative label: Médaille d'honneur du travail
alternative label: Ordre national du mérite
alternative label: décoration militaire
alternative label: médaille militaire
alternative label: palmes académiques
alternative label: titre honorifique
broader: refip-REFIP6694
definition: Objet ou distinction non matérielle remis à une personne, un groupe de personnes ou un organisme en reconnaissance d'un certain degré d'excellence dans un domaine spécifique.
in scheme: FINANCES PUBLIQUES
in scheme: Culture et Loisirs
in scheme: Patrimoine Culturel
in scheme: Questions de Société
notation: REFIP6084

don du sang
type: ConceptReFip
type: Concept
broader: santé (non-descripteur)
definition: Processus par lequel un donneur de sang est volontaire pour se voir prélever du sang qui sera stocké dans une banque du sang avant de transfuser un malade lors d'une transfusion sanguine.
in scheme: FINANCES PUBLIQUES
in scheme: Santé et Protection Sociale
in scheme: Santé
in scheme: Questions de Société
notation: REFIP6085

dette négociable
type: ConceptReFip
type: Concept
alternative label: dette financière négociable
broader: dette publique
definition: Dette contractée sous forme d'instruments financiers échangeables sur les marchés financiers (obligations et bons du Trésor).
in scheme: FINANCES PUBLIQUES
in scheme: Budget de l’État
in scheme: Budget
notation: REFIP6086

difficulté financière
type: ConceptReFip
type: Concept
broader: refip-REFIP6865
definition: Difficulté rencontrée par un débiteur qui, sans être en cessation des paiements, n'est pas en mesure de la surmonter. Une entreprise pourra prétendre aux procédures de traitement des entreprises en difficulté (Plan de sauvegarde). Un particulier pourra bénéficier de mesures d'aides sociales et de facilités pour l'impôt (report ou atténuation).
in scheme: FINANCES PUBLIQUES
in scheme: Systeme bancaire et financier
in scheme: Secteur bancaire
in scheme: Finance
notation: REFIP6087
related: Comité interministériel de restructuration industrielle
related: comité départemental d'examen des difficultés de financement des entreprises
related: délai baisse brutale de revenu
related: médiation du crédit

direction départementale des finances publiques
type: ConceptReFip
type: Concept
alternative label: DDFIP
broader: services déconcentrés des finances publiques
definition: Direction assurant les missions de la DGFIP dévolues au département, notamment, l'assiette, contrôle et recouvrement des impôts, droits, cotisations et taxes de toute nature, la tenue du cadastre et la publicité foncière ainsi que le contrôle et le paiement des dépenses publiques et la production et la valorisation des comptes de l'Etat ainsi que les missions qui lui incombent à l'égard des établissements publics locaux. Enfin, elle s'ocupe de la gestion financière et comptable des collectivités territoriales et de leurs établissements.
in scheme: FINANCES PUBLIQUES
in scheme: Organisation Structurelle de l'Etat
in scheme: Ministère
in scheme: Administration de L'Etat
narrower: brigade d'évaluation domaniale
narrower: inspection de contrôle et d'expertise
narrower: Pôle de topographie et de gestion cadastrale
narrower: service de la caisse
narrower: Pôle de gestion des patrimoines privés
narrower: conservation des hypothèques
narrower: paierie départementale
narrower: service des impôts des entreprises
narrower: comité départemental de maîtrise des risques
narrower: service des impôts des particuliers
narrower: Pôle de recouvrement spécialisé
narrower: service de liaison rémunération
narrower: services techniques
narrower: service du domaine
narrower: service de la publicité foncière
narrower: Pôle d'évaluation des locaux professionnels
narrower: service de la fiscalité directe locale
narrower: recette des finances
narrower: centre des finances publiques
narrower: cellule qualité comptable
narrower: brigade de contrôle fiscalité immobilière
narrower: centre des impôts fonciers
narrower: trésorerie de proximité
narrower: brigade dossiers à fort enjeu
narrower: brigade de contrôle et de recherche
narrower: division expertise et actions économiques et financières
narrower: équipe départementale de renfort
narrower: Pôle de contrôle des revenus et du patrimoine
narrower: refip-REFIP7099
narrower: refip-REFIP7106
narrower: refip-REFIP825
narrower: refip-REFIP940
notation: REFIP6088

décès
type: ConceptReFip
type: Concept
broader: santé (non-descripteur)
definition: Mort d'une personne.
in scheme: FINANCES PUBLIQUES
in scheme: Santé et Protection Sociale
in scheme: Santé
in scheme: Questions de Société
narrower: frais funéraires
narrower: refip-REFIP6554
notation: REFIP6089

extorsion
type: ConceptReFip
type: Concept
broader: délit
definition: Infraction dite « d'appropriation frauduleuse » consistant à obtenir par violence, menace de violences ou contrainte, soit une signature, un engagement ou une renonciation, soit la révélation d'un secret, soit la remise de fonds, de valeurs ou d'un bien quelconque.
in scheme: FINANCES PUBLIQUES
in scheme: Droit et Justice
in scheme: Infractions et Sanctions
in scheme: Infraction
notation: REFIP609

domiciliation bancaire
type: ConceptReFip
type: Concept
broader: compte bancaire
definition: Coordonnées bancaires précises.
in scheme: FINANCES PUBLIQUES
in scheme: Systeme bancaire et financier
in scheme: Secteur bancaire
in scheme: Finance
notation: REFIP6090

descendant
type: ConceptReFip
type: Concept
broader: famille
definition: Personne qui descend directement d'une autre, soit au 1er degré (enfant), soit à un degré plus éloigné (petit-enfant, arrière-petit-enfant).
in scheme: FINANCES PUBLIQUES
in scheme: Famille Education Population
in scheme: Famille
in scheme: Questions de Société
narrower: enfant
notation: REFIP6091

domicile personnel
type: ConceptReFip
type: Concept
broader: famille
definition: Lieu dans lequel une personne est censée demeurer en permanence.
in scheme: FINANCES PUBLIQUES
in scheme: Famille Education Population
in scheme: Famille
in scheme: Questions de Société
narrower: changement de domicile
notation: REFIP6092
related: refip-REFIP6709

durée de travail
type: ConceptReFip
type: Concept
broader: refip-REFIP6916
definition: Vocable générique faisant référence aux dispositions relatives au temps de travail des agents.
in scheme: FINANCES PUBLIQUES
in scheme: Gestion des ressources humaines
in scheme: Temps de travail
in scheme: Fonction Publique et Gestion des Ressources Humaines
notation: REFIP6093

diagnostic
type: ConceptReFip
type: Concept
broader: contrôle interne
definition: Démarche d'évaluation du contrôle interne d'une entité, par son encadrement, dans le but de l'améliorer et de mesurer la robustesse du dispositif de contrôle interne.
in scheme: FINANCES PUBLIQUES
in scheme: Missions Transverses des Finances publiques
in scheme: Maîtrise des risques
notation: REFIP6094

don d'organe
type: ConceptReFip
type: Concept
alternative label: greffe d'organe
alternative label: greffon
alternative label: implant
alternative label: organe humain
alternative label: prélèvement d'organe
alternative label: transplantation d'organe
broader: santé (non-descripteur)
definition: Acte qui permet à une personne, de son vivant ou après sa mort, de faire don de l'un ou de plusieurs de ses organes.
in scheme: FINANCES PUBLIQUES
in scheme: Santé et Protection Sociale
in scheme: Santé
in scheme: Questions de Société
notation: REFIP6095

date de valeur
type: ConceptReFip
type: Concept
broader: refip-REFIP6835
definition: Date de prise en compte dans le système bancaire, d'une opération bancaire donnée (paiement de chèque, prélèvement bancaire, etc.), que celle-ci soit au crédit ou au débit du compte bancaire.
in scheme: FINANCES PUBLIQUES
in scheme: Systeme bancaire et financier
in scheme: Secteur bancaire
in scheme: Finance
notation: REFIP6096

détachement
type: ConceptReFip
type: Concept
broader: refip-REFIP6657
definition: Position administrative du fonctionnaire placé hors de son corps d’origine et continuant à bénéficier dans ce corps de ses droits à avancement, promotion et retraite.
in scheme: FINANCES PUBLIQUES
in scheme: Gestion des ressources humaines
in scheme: Statut du fonctionnaire
in scheme: Fonction Publique et Gestion des Ressources Humaines
notation: REFIP6097

débours
type: ConceptReFip
type: Concept
broader: facturation
definition: Somme qui, soit en vertu de la Loi, soit en vertu du contrat, doit être avancée dans l'intérêt et pour le compte d'autrui. Désigne aussi les avances relatives à des dépenses qui ne sont pas incluses dans la facturation comme les frais de copie, le coût de délivrance d'actes, les frais de transport ou de correspondance, la rémunération de tierces personnes, le règlement d'impôts ou de taxes et frais ou de publicité légale.
in scheme: FINANCES PUBLIQUES
in scheme: Procédures et Techniques Comptables
in scheme: Comptabilité
notation: REFIP6098

décote de pension
type: ConceptReFip
type: Concept
alternative label: coefficient de minoration de la pension
broader: droits à pension
definition: Coefficient de minoration appliqué à la pension d’un fonctionnaire qui prend sa retraite sans avoir une durée d'assurance suffisante pour obtenir une pension au taux plein.
in scheme: FINANCES PUBLIQUES
in scheme: Gestion des ressources humaines
in scheme: Retraite
in scheme: Fonction Publique et Gestion des Ressources Humaines
notation: REFIP6099

Fonds libres des collectivités locales (supprimé)
type: ConceptReFip
type: Concept
broader: ZZ
in scheme: FINANCES PUBLIQUES
notation: REFIP61

ratio
type: ConceptReFip
type: Concept
broader: refip-REFIP788
definition: Proportion entre deux valeurs de même nature. Les ratios sont utilisés pour évaluer la rentabilité, la structure financière, la trésorerie et l'activité d'une entreprise.
in scheme: FINANCES PUBLIQUES
in scheme: Analyse financière
in scheme: Comptabilité
notation: REFIP610

Directeur général des finances publiques
type: ConceptReFip
type: Concept
broader: fonction de la Direction générale des finances publiques (non-descripteur)
definition: Personne assurant l’efficacité de l’exercice des missions de la DGFiP au plan national.
in scheme: FINANCES PUBLIQUES
in scheme: Personnels et fonctions
in scheme: Fonction de la Direction générale des Finances publiques (NON DESCRIPTEUR)
in scheme: Fonction Publique et Gestion des Ressources Humaines
notation: REFIP6100

déclaration de vacance d'emploi (supprimé)
type: ConceptReFip
type: Concept
broader: ZZ
in scheme: FINANCES PUBLIQUES
notation: REFIP6101

dépositaire public
type: ConceptReFip
type: Concept
alternative label: dépositaire de l'autorité publique
broader: fonction (non-descripteur)
definition: Agent qui détient des pouvoirs et les exerce au nom de la puissance publique.
in scheme: FINANCES PUBLIQUES
in scheme: Personnels et fonctions
in scheme: Fonction (NON DESCRIPTEUR)
in scheme: Fonction Publique et Gestion des Ressources Humaines
notation: REFIP6102

devise
type: ConceptReFip
type: Concept
alternative label: monnaie étrangère
broader: refip-REFIP6540
definition: Unité monétaire qui est le plus souvent émise par une banque centrale (euro, dollar, livre sterling…). Une devise est cotée sur le marché des changes ou parfois par la banque centrale du pays. Elle peut être convertible et donc librement échangée contre d’autres devises ou non convertible. Le terme est couramment employé pour désigner une monnaie étrangère qui est différente de celle de son pays.
in scheme: FINANCES PUBLIQUES
in scheme: Moyen de paiement
in scheme: Finance
narrower: euro
narrower: franc
narrower: franc pacifique
narrower: franc CFA
notation: REFIP6103

droit à pension des ascendants (supprimé)
type: ConceptReFip
type: Concept
in scheme: FINANCES PUBLIQUES
notation: REFIP6104

démission
type: ConceptReFip
type: Concept
broader: cessation de fonction
definition: Acte par lequel on renonce à une fonction ou à un mandat.
in scheme: FINANCES PUBLIQUES
in scheme: Gestion des ressources humaines
in scheme: Carrière
in scheme: Fonction Publique et Gestion des Ressources Humaines
notation: REFIP6105

document prévisionnel de gestion des crédits de personnel et des emplois
type: ConceptReFip
type: Concept
alternative label: DPG
alternative label: document prévisionnel de gestion
alternative label: document prévisionnel de gestion des dépenses de personnel et des emplois
broader: gestion prévisionnelle des ressources humaines
definition: Document annuel décrivant l’évolution des personnels par ministère ainsi que l’évolution de la masse salariale, notamment ses déterminants (départs et recrutements, mesures générales portant sur les rémunérations, mesures statutaires ou indemnitaires, etc.). Chaque ministre y précise, pour les programmes dont les crédits et les emplois lui sont mis à disposition, les prévisions mensuelles d’entrées et de sorties de personnels, de consommations d’emplois et de dépenses de personnel. Il sert de référence pour vérifier que les décisions en matière de ressources humaines sont prises dans le respect de l’autorisation parlementaire. En cours d’année, il est le principal outil de pilotage et de suivi budgétaire en matière de personnels et de masse salariale. Son actualisation périodique tient compte des évolutions constatées.
in scheme: FINANCES PUBLIQUES
in scheme: Gestion des ressources humaines
in scheme: Gestion prévisionnelle des ressources humaines
in scheme: Fonction Publique et Gestion des Ressources Humaines
notation: REFIP6106

dépendance
type: ConceptReFip
type: Concept
alternative label: personne dépendante
broader: handicap
definition: Etat de la personne qui, nonobstant les soins qu’elle est susceptible de recevoir, a besoin d’être aidée pour l’accomplissement des actes essentiels de la vie ou requiert une surveillance régulière.
in scheme: FINANCES PUBLIQUES
in scheme: Santé et Protection Sociale
in scheme: Santé
in scheme: Questions de Société
notation: REFIP6107
related: allocation personnalisée d'autonomie
related: refip-REFIP6590
related: refip-REFIP6644
scope note: Handicap - Vieillesse

directeur départemental des finances publiques
type: ConceptReFip
type: Concept
broader: fonction de la Direction générale des finances publiques (non-descripteur)
definition: Personne assurant l’efficacité de l’exercice des missions de la DGFiP au sein du département.
in scheme: FINANCES PUBLIQUES
in scheme: Personnels et fonctions
in scheme: Fonction de la Direction générale des Finances publiques (NON DESCRIPTEUR)
in scheme: Fonction Publique et Gestion des Ressources Humaines
notation: REFIP6108

document de GRH (non-descripteur)
type: ConceptReFip
type: Concept
broader: gestion des ressources humaines
definition: Terme ne servant pas à l'indexation.
in scheme: FINANCES PUBLIQUES
in scheme: Gestion des ressources humaines
in scheme: Document de GRH
in scheme: Fonction Publique et Gestion des Ressources Humaines
narrower: bordereau récapitulatif des cotisations
narrower: carte professionnelle
narrower: compte individuel de retraite
narrower: document unique d'évaluation des risques professionnels
narrower: décompte de retraite
narrower: dossier individuel du fonctionnaire
narrower: état authentique des services
narrower: estimation indicative globale
narrower: lettre de mission
narrower: refip-REFIP6714
narrower: refip-REFIP6753
narrower: refip-REFIP6800
narrower: refip-REFIP6806
narrower: refip-REFIP6910
narrower: refip-REFIP6918
narrower: refip-REFIP7006
notation: REFIP6109
note: Etiquette de noeud

Ille-et-Vilaine
type: ConceptReFip
type: Concept
broader: refip-REFIP957
definition: Département français
in scheme: FINANCES PUBLIQUES
in scheme: Géographie
in scheme: Europe
notation: REFIP611

dépôt de fonds au Trésor
type: ConceptReFip
type: Concept
broader: dépôt de fonds
definition: Service bancaire et financier, offert par la DGFIP, aux organismes soumis à une obligation de dépôt de fonds au Trésor.
in scheme: FINANCES PUBLIQUES
in scheme: Responsabilité des comptables
in scheme: Missions Transverses des Finances publiques
notation: REFIP6110

décoration publique (supprimé)
type: ConceptReFip
type: Concept
broader: ZZ
in scheme: FINANCES PUBLIQUES
notation: REFIP6111

détenu
type: ConceptReFip
type: Concept
broader: population (non-descripteur)
definition: Personne en prison.
in scheme: FINANCES PUBLIQUES
in scheme: Famille Education Population
in scheme: Population
in scheme: Questions de Société
narrower: refip-REFIP6627
notation: REFIP6112

dessinateur
type: ConceptReFip
type: Concept
broader: fonction publique de l'Etat
definition: Fonctionnaire territorial de catégorie C réalisant, à l'aide de logiciels spécialisés, l'ensemble des documents graphiques relatifs à un projet.
in scheme: FINANCES PUBLIQUES
in scheme: Personnels et fonctions
in scheme: Fonction publique
in scheme: Fonction Publique et Gestion des Ressources Humaines
notation: REFIP6113
scope note: Fonction publique

droits à pension
type: ConceptReFip
type: Concept
alternative label: droit à pension
broader: refip-REFIP6725
definition: Droits à pension acquis en qualité d'affilié au régime de retraite et d'invalidité de l'Etat.
in scheme: FINANCES PUBLIQUES
in scheme: Gestion des ressources humaines
in scheme: Retraite
in scheme: Fonction Publique et Gestion des Ressources Humaines
narrower: bonification de pension
narrower: constitution des droits à pension
narrower: durée d'assurance
narrower: durée de service
narrower: décote de pension
narrower: liquidation des droits à pension
narrower: majoration de pension
narrower: refip-REFIP6691
narrower: refip-REFIP6710
narrower: refip-REFIP6851
narrower: refip-REFIP6875
narrower: refip-REFIP6904
notation: REFIP6114

départ à la retraite
type: ConceptReFip
type: Concept
alternative label: mise à la retraite
broader: cessation de fonction
definition: Cessation de fonctions résultant de la décision de l'agent (ou de l'administration) qui, compte tenu de son âge et de sa situation vis-à-vis des organismes de retraite décide de faire valoir ses droits à la retraite.
in scheme: FINANCES PUBLIQUES
in scheme: Gestion des ressources humaines
in scheme: Carrière
in scheme: Fonction Publique et Gestion des Ressources Humaines
narrower: refip-REFIP6761
notation: REFIP6115

déficit
type: ConceptReFip
type: Concept
broader: base d'imposition
definition: Résultat comptable négatif dégagé sur un exercice.
in scheme: FINANCES PUBLIQUES
in scheme: Champ d'Application
in scheme: Fiscalité
notation: REFIP6116

déchéance spéciale du droit à pension (supprimé)
type: ConceptReFip
type: Concept
in scheme: FINANCES PUBLIQUES
notation: REFIP6117

décharge d'activité de service
type: ConceptReFip
type: Concept
alternative label: décharge de service
broader: facilité de service
definition: Autorisation donnée à un agent public d'exercer pendant ses heures de service, une activité syndicale au lieu et place de son activité professionnelle normale. Cette décharge peut être totale ou partielle.
in scheme: FINANCES PUBLIQUES
in scheme: Gestion des ressources humaines
in scheme: Temps de travail
in scheme: Fonction Publique et Gestion des Ressources Humaines
notation: REFIP6118

développement rural
type: ConceptReFip
type: Concept
broader: aménagement foncier agricole et forestier
definition: Gestion du développement humain et orientation des changements technologiques et institutionnels de façon à améliorer l'inclusion, la longévité, les connaissances et les standards de vie dans les zones rurales, et ce dans un contexte d'équité et de durabilité.
in scheme: FINANCES PUBLIQUES
in scheme: Aménagement du territoire Urbanisme Habitat
in scheme: Aménagement du Territoire
in scheme: Questions de Société
narrower: refip-REFIP6662
notation: REFIP6119
related: fonds européen agricole pour le développement rural
related: refip-REFIP6968
related: refip-REFIP6972

délai de route
type: ConceptReFip
type: Concept
broader: refip-REFIP6916
definition: Autorisation d'absence accordée à l'agent notamment en cas de changement de résidence administrative et pour certains événements familiaux....
in scheme: FINANCES PUBLIQUES
in scheme: Gestion des ressources humaines
in scheme: Temps de travail
in scheme: Fonction Publique et Gestion des Ressources Humaines
notation: REFIP6120

directeur d'établissement
type: ConceptReFip
type: Concept
alternative label: chef d'établissement
broader: directeur
definition: Personne qui dirige un établissement public.
in scheme: FINANCES PUBLIQUES
in scheme: Personnels et fonctions
in scheme: Fonction (NON DESCRIPTEUR)
in scheme: Fonction Publique et Gestion des Ressources Humaines
notation: REFIP6121

délinquance
type: ConceptReFip
type: Concept
broader: refip-REFIP6877
definition: Ensemble des comportements qui contreviennent au droit pénal et qui peuvent faire l'objet de poursuites.
in scheme: FINANCES PUBLIQUES
in scheme: Questions Politiques Relations Internationales
in scheme: Politique
in scheme: Questions de Société
notation: REFIP6122

dette non négociable
type: ConceptReFip
type: Concept
alternative label: dette financière non négociable
broader: dette publique
definition: Ensemble des dépôts de certains organismes (collectivités territoriales, établissements publics, etc.) sur le compte du Trésor et qui constitue un moyen de financement de l'Etat.
in scheme: FINANCES PUBLIQUES
in scheme: Budget de l’État
in scheme: Budget
notation: REFIP6123

droit individuel à la formation
type: ConceptReFip
type: Concept
alternative label: DIF
broader: formation professionnelle
definition: Dispositif permettant aux fonctionnaires de bénéficier d'un crédit annuel d'heures de formation, afin de faciliter la mise en œuvre d'un projet d'évolution professionnelle. Remplacé au 01/01/2017 par le compte personnel de formation.
in scheme: FINANCES PUBLIQUES
in scheme: Gestion des ressources humaines
in scheme: Formation professionnelle
in scheme: Fonction Publique et Gestion des Ressources Humaines
notation: REFIP6124
scope note: Dispositif remplacé par le compte personnel de formation depuis le 01/01/2017

directeur adjoint
type: ConceptReFip
type: Concept
broader: directeur
definition: Adjoint de la personne qui dirige une organisation ou une institution.
in scheme: FINANCES PUBLIQUES
in scheme: Personnels et fonctions
in scheme: Fonction (NON DESCRIPTEUR)
in scheme: Fonction Publique et Gestion des Ressources Humaines
notation: REFIP6125

droits du fonctionnaire
type: ConceptReFip
type: Concept
broader: refip-REFIP6833
definition: Prérogatives accordées au fonctionnaire en contre-partie de ses obligations.
in scheme: FINANCES PUBLIQUES
in scheme: Gestion des ressources humaines
in scheme: Statut du fonctionnaire
in scheme: Fonction Publique et Gestion des Ressources Humaines
narrower: protection fonctionnelle
narrower: cumul revenu pension
narrower: cumul de pensions
narrower: cumul de revenus
narrower: refip-REFIP7121
narrower: refip-REFIP7122
notation: REFIP6126

demi-traitement
type: ConceptReFip
type: Concept
broader: refip-REFIP6892
definition: Traitement réduit de moitié dans les cas de maladie longue des fonctionnaires, et notamment en cas de congés-maladie du fonctionnaire depuis plus de 90 jours et pendant la période suivante d'une durée maximale de 270 jours.
in scheme: FINANCES PUBLIQUES
in scheme: Gestion des ressources humaines
in scheme: Rémunération
in scheme: Fonction Publique et Gestion des Ressources Humaines
notation: REFIP6127

droit à pension des conjoints survivants et des orphelins (supprimé)
type: ConceptReFip
type: Concept
in scheme: FINANCES PUBLIQUES
notation: REFIP6128

disponibilité d'office
type: ConceptReFip
type: Concept
broader: refip-REFIP6657
definition: Situation du fonctionnaire qui cesse d'exercer son activité professionnelle, à l'initiative de l'administration, pour raisons de santé.
in scheme: FINANCES PUBLIQUES
in scheme: Gestion des ressources humaines
in scheme: Statut du fonctionnaire
in scheme: Fonction Publique et Gestion des Ressources Humaines
notation: REFIP6129

main-d'oeuvre
type: ConceptReFip
type: Concept
broader: refip-REFIP6950
definition: Ensemble des ouvriers et travailleurs qui fabriquent et construisent dans le cadre d'une usine ou d'une entreprise. Désigne aussi la part du travail dans le prix de revient d'un objet fabriqué.
in scheme: FINANCES PUBLIQUES
in scheme: Entreprises
in scheme: Travail
in scheme: 212619
notation: REFIP613

déplacement d'office
type: ConceptReFip
type: Concept
broader: refip-REFIP6820
definition: Sanction disciplinaire du 2eme groupe entrant dans le champ d'une procédure disciplinaire.
in scheme: FINANCES PUBLIQUES
in scheme: Gestion des ressources humaines
in scheme: Statut du fonctionnaire
in scheme: Fonction Publique et Gestion des Ressources Humaines
notation: REFIP6130

décharge de fonction (supprimé)
type: ConceptReFip
type: Concept
broader: ZZ
in scheme: FINANCES PUBLIQUES
notation: REFIP6131

écoconditionnalité
type: ConceptReFip
type: Concept
broader: protection de l'environnement
definition: Système qui consiste à subordonner le paiement d'aides publiques au respect de normes environnementales.
in scheme: FINANCES PUBLIQUES
in scheme: Environnement
in scheme: Protection de l'Environnement
in scheme: Questions de Société
notation: REFIP6132

échange d'images chèques
type: ConceptReFip
type: Concept
alternative label: EIC
alternative label: image chèque
broader: refip-REFIP6835
definition: Procédure d'échange et de compensation des chèques " non circulants ". L’Échange Image Chèque compense de façon électronique les chèques sur le Système Interbancaire de Télé-compensation (SIT).
in scheme: FINANCES PUBLIQUES
in scheme: Systeme bancaire et financier
in scheme: Secteur bancaire
in scheme: Finance
notation: REFIP6133

état des lieux
type: ConceptReFip
type: Concept
broader: location
definition: Document qui décrit le logement loué pièce par pièce, ainsi que les équipements qu'il comporte. Il doit obligatoirement être joint au contrat de location.
in scheme: FINANCES PUBLIQUES
in scheme: Aménagement du territoire Urbanisme Habitat
in scheme: Habitat
in scheme: Questions de Société
notation: REFIP6134

éducateur spécialisé
type: ConceptReFip
type: Concept
broader: fonction publique territoriale
definition: Fonctionnaire territorial de catégorie B, travailleur social qui participe à l’éducation d’enfants et d’adolescents dits inadaptés. Il soutient aussi des adultes présentant des déficiences physiques et/ou psychiques pour les aider à retrouver de l’autonomie.
in scheme: FINANCES PUBLIQUES
in scheme: Personnels et fonctions
in scheme: Fonction publique
in scheme: Fonction Publique et Gestion des Ressources Humaines
notation: REFIP6135

enfant majeur
type: ConceptReFip
type: Concept
broader: enfant
definition: Enfant âgé de plus de 18 ans.
in scheme: FINANCES PUBLIQUES
in scheme: Famille Education Population
in scheme: Famille
in scheme: Questions de Société
notation: REFIP6136

euro
type: ConceptReFip
type: Concept
broader: devise
definition: Monnaie de l'union économique et monétaire formée au sein de l'Union européenne. En usage dès 1999, pour les transactions financières européennes, il est mis en circulation le 1er janvier 2002 sous sa forme fiduciaire.
in scheme: FINANCES PUBLIQUES
in scheme: Moyen de paiement
in scheme: Finance
notation: REFIP6137

emprunt libératoire (supprimé)
type: ConceptReFip
type: Concept
broader: ZZ
in scheme: FINANCES PUBLIQUES
notation: REFIP6138

évêché (supprimé)
type: ConceptReFip
type: Concept
broader: ZZ
in scheme: FINANCES PUBLIQUES
notation: REFIP6139

erreur de gestion
type: ConceptReFip
type: Concept
broader: refip-REFIP893
definition: Tout acte ou omission commis par un dirigeant de société peut s’analyser comme une erreur dans la direction de l’entreprise. Il y a lieu de qualifier d'erreur toute irrégularité, inexactitude ou omission qui résulte d'une appréciation purement objective de faits matériels ou de l'interprétation erronée de textes fiscaux par un contribuable de bonne foi et ne traduit pas une volonté de ce dernier d'influer sur la gestion de l'entreprise.
in scheme: FINANCES PUBLIQUES
in scheme: Gestion de l'Entreprise
in scheme: Entreprises
in scheme: Vie et Gestion de l'entreprise
notation: REFIP614

effet de commerce
type: ConceptReFip
type: Concept
broader: monnaie scripturale
definition: Reconnaissance de dettes matérialisée par un titre représentant une créance commerciale à court, moyen ou long terme. Transmissible par un simple endossement, il est recouvré à l’échéance par une banque pour son propre compte (si son client lui a escompté l’effet) ou pour le compte de son client (si le client a conservé la propriété de l’effet).
in scheme: FINANCES PUBLIQUES
in scheme: Moyen de paiement
in scheme: Finance
narrower: billet à ordre
narrower: endossement
narrower: lettre de change
notation: REFIP6140

équipement sportif
type: ConceptReFip
type: Concept
alternative label: stade
alternative label: terrain de sport
broader: refip-REFIP6858
definition: Aménagement ou construction permettant la pratique d'un ou plusieurs sports : terrains...
in scheme: FINANCES PUBLIQUES
in scheme: Culture et Loisirs
in scheme: Loisirs
in scheme: Questions de Société
narrower: hippodrome
narrower: refip-REFIP6588
notation: REFIP6141

enfant
type: ConceptReFip
type: Concept
broader: descendant
definition: Garçon ou fille mineurs.
in scheme: FINANCES PUBLIQUES
in scheme: Famille Education Population
in scheme: Famille
in scheme: Questions de Société
narrower: adoption d'enfant
narrower: enfant majeur
narrower: enfant légitime
narrower: enfant recueilli
narrower: enfant naturel
narrower: enfant illégitime
narrower: enfant malade
narrower: enfant handicapé
narrower: enfant à charge
narrower: enfant mineur
narrower: refip-REFIP6553
notation: REFIP6142

emprunt structuré
type: ConceptReFip
type: Concept
alternative label: emprunt toxique
broader: emprunt
definition: Prêt, également appelé « Toxique » combinant dans un seul et même contrat un prêt bancaire classique et un ou plusieurs dérivés, dont les intérêts sont déterminés selon l’évolution d’un indice sous-jacent non standard (taux de change, différentiel entre un taux long et un taux court, écart de valeur entre deux indices d’inflation,…) ou sont calculés selon des formules complexes pouvant être non linéaires de sorte que l’évolution des taux supportés peut être plus que proportionnelle à celle de l’index lui-même (c’est notamment le cas des produits affectés de coefficients multiplicateurs).
in scheme: FINANCES PUBLIQUES
in scheme: Instrument financier
in scheme: Emprunt
in scheme: Finance
notation: REFIP6143

entretien professionnel
type: ConceptReFip
type: Concept
broader: refip-REFIP6541
definition: Rendez-vous individuel, annuel, conduit par le supérieur hiérarchique direct, visant à apprécier la valeur professionnelle d'un fonctionnaire de l'Etat. L'entretien porte sur un certain nombre de thèmes tels que les résultats professionnels obtenus par l’agent, la manière dont l’agent exerce les fonctions, les objectifs à atteindre, les acquis de son expérience professionnelle, ses besoins de formation et ses perspectives d’évolution professionnelle.
in scheme: FINANCES PUBLIQUES
in scheme: Gestion des ressources humaines
in scheme: Statut du fonctionnaire
in scheme: Fonction Publique et Gestion des Ressources Humaines
narrower: refip-REFIP6949
notation: REFIP6144

enseignement
type: ConceptReFip
type: Concept
broader: famille éducation population (non-descripteur)
definition: Structures, personnels et actions visant à transmettre des connaissances (savoir, savoir-faire, compétences...) à un élève.
in scheme: FINANCES PUBLIQUES
in scheme: Famille Education Population
in scheme: Enseignement
in scheme: Questions de Société
narrower: scolarité
narrower: accueil des élèves
narrower: certificat de scolarité
narrower: diplôme
narrower: enseignement professionnel
narrower: enseignement public
narrower: enseignement du premier degré
narrower: enseignement supérieur
narrower: enseignement du second degré
narrower: élève
narrower: enseignement spécialisé
narrower: enseignement privé sous contrat
narrower: fourniture scolaire
narrower: frais de scolarité
narrower: refip-REFIP6727
narrower: refip-REFIP6836
notation: REFIP6145

emprunt
type: ConceptReFip
type: Concept
broader: instrument financier
definition: Opération qui consiste pour une personne physique ou morale à solliciter d'une institution financière la mise à disposition d'une somme d'argent pour une durée et à un taux déterminé. Un emprunt peut aussi correspondre à une émission obligataire réalisée par un émetteur (personne morale privée ou publique) sur le marché des obligations. Un emprunt se matérialise dans les deux cas par un contrat conclu entre l'emprunteur et le prêteur de deniers.
in scheme: FINANCES PUBLIQUES
in scheme: Instrument financier
in scheme: Emprunt
in scheme: Finance
narrower: emprunt structuré
narrower: emprunt obligataire
notation: REFIP6146

établissement de santé privé
type: ConceptReFip
type: Concept
alternative label: clinique
alternative label: hôpital privé
broader: hospitalisation
definition: Entité de soins privé à but lucratif que l'on appelle généralement cliniques - et ceux dépourvus de but lucratif, qui participent le plus souvent au service public hospitalier.
in scheme: FINANCES PUBLIQUES
in scheme: Santé et Protection Sociale
in scheme: Santé
in scheme: Questions de Société
notation: REFIP6147
related: facturation individuelle des établissements de santé

emploi spécifique (supprimé)
type: ConceptReFip
type: Concept
broader: ZZ
in scheme: FINANCES PUBLIQUES
notation: REFIP6148

enseignement professionnel
type: ConceptReFip
type: Concept
broader: enseignement
definition: Enseignement technique secondaire ou supérieur en relation avec le monde de l'entreprise qui permet d'acquérir des connaissances et des compétences dans un domaine professionnel.
in scheme: FINANCES PUBLIQUES
in scheme: Famille Education Population
in scheme: Enseignement
in scheme: Questions de Société
notation: REFIP6149

microfiche
type: ConceptReFip
type: Concept
broader: support de communication
definition: Film photographique découpé en feuilles rectangulaires comportant une ou plusieurs micro-images servant de support de stockage.
in scheme: FINANCES PUBLIQUES
in scheme: Communication
in scheme: Communication Documentation Informatique
notation: REFIP615

émission d'emprunt
type: ConceptReFip
type: Concept
broader: refip-REFIP6545
definition: Mise sur le marché financier d'obligations ou de titres de créance représentant une part de l'emprunt, dans le but de récolter des fonds pour financer les investissements soit des grandes sociétés, soit d'une structure du secteur public, soit de l’État.
in scheme: FINANCES PUBLIQUES
in scheme: Systeme bancaire et financier
in scheme: Opération financière
in scheme: Finance
narrower: émission de bon du Trésor
notation: REFIP6150

enseignement public
type: ConceptReFip
type: Concept
broader: enseignement
definition: Enseignement français, pris en charge par l'Etat, fondé sur de grands principes : liberté de l'enseignement,gratuité, neutralité, laïcité et obligation scolaire.
in scheme: FINANCES PUBLIQUES
in scheme: Famille Education Population
in scheme: Enseignement
in scheme: Questions de Société
notation: REFIP6151

enseignement du premier degré
type: ConceptReFip
type: Concept
alternative label: enseignement en primaire
broader: enseignement
definition: Enseignement pré-élémentaire (maternelle de 3 à 5 ans ) et élémentaire (du CP au CM2) , y compris l'enseignement spécialisé sous tutelle du ministère de l'Éducation nationale.
in scheme: FINANCES PUBLIQUES
in scheme: Famille Education Population
in scheme: Enseignement
in scheme: Questions de Société
narrower: classe de découverte
notation: REFIP6152

emprunt obligatoire (supprimé)
type: ConceptReFip
type: Concept
broader: ZZ
in scheme: FINANCES PUBLIQUES
notation: REFIP6153

emploi à temps partiel
type: ConceptReFip
type: Concept
broader: emploi
definition: Emploi caractérisé par un temps de travail inférieur à la “ durée de travail de référence ” dans la structure concernée.
in scheme: FINANCES PUBLIQUES
in scheme: Gestion des ressources humaines
in scheme: Gestion prévisionnelle des ressources humaines
in scheme: Fonction Publique et Gestion des Ressources Humaines
notation: REFIP6154
scope note: A différencier de "temps partiel" qui correspond à la quotité de temps de travail par rapport au temps de référence.

échelonnement indiciaire
type: ConceptReFip
type: Concept
alternative label: classement indiciaire
alternative label: grille indiciaire
alternative label: échelle indiciaire
broader: refip-REFIP6879
definition: L'échelonnement indiciaire de chaque grade fixe le nombre d'échelons du grade, leur durée et l'indice brut dont ils sont dotés.
in scheme: FINANCES PUBLIQUES
in scheme: Gestion des ressources humaines
in scheme: Statut du fonctionnaire
in scheme: Fonction Publique et Gestion des Ressources Humaines
notation: REFIP6155

entreprise industrielle
type: ConceptReFip
type: Concept
broader: entreprise
definition: Entreprise qui produit des biens (matières transformées en entreprise prêtes à être mises sur le marché pour la consommation du consommateur). L’objectif de l’entreprise industrielle est de transformer des matières premières en produit finis ou semi-finis pour les vendre à d’autres entreprises ou directement au consommateur.
in scheme: FINANCES PUBLIQUES
in scheme: Entreprise
in scheme: Entreprises
in scheme: Forme juridique
notation: REFIP6156

engagement de servir
type: ConceptReFip
type: Concept
broader: refip-REFIP6779
definition: Obligation de rester au service de l’État ou d'une collectivité publique pendant une durée minimum fixée par les statuts.
in scheme: FINANCES PUBLIQUES
in scheme: Gestion des ressources humaines
in scheme: Carrière
in scheme: Fonction Publique et Gestion des Ressources Humaines
notation: REFIP6157

espace économique européen
type: ConceptReFip
type: Concept
broader: refip-REFIP6768
definition: Groupe des Etats membres de l'Union Européenne auxquels s'ajoutent l'Islande, le Liechtenstein et la Norvège.
in scheme: FINANCES PUBLIQUES
in scheme: Questions Politiques Relations Internationales
in scheme: Relations Internationales
in scheme: Questions de Société
narrower: refip-REFIP6938
notation: REFIP6158

état authentique des services
type: ConceptReFip
type: Concept
alternative label: état des services
broader: document de GRH (non-descripteur)
definition: Certificat d'exercice recensant l'ensemble des services effectués par l'agent au sein de la fonction publique et, lui permettant de faire liquider sa pension.
in scheme: FINANCES PUBLIQUES
in scheme: Gestion des ressources humaines
in scheme: Document de GRH
in scheme: Fonction Publique et Gestion des Ressources Humaines
notation: REFIP6159

Projet de loi de finances
type: ConceptReFip
type: Concept
broader: refip-REFIP982
definition: Document unique rassemblant l'ensemble des recettes et des dépenses de l'État, présenté chaque année par le gouvernement. Il propose la nature, le montant et l'affectation des ressources et des charges de l'État selon un équilibre économique et financier déterminé. Il est examiné par le Parlement puis voté dans un délai maximum de 70 jours après son dépôt.
in scheme: FINANCES PUBLIQUES
in scheme: Documentation budgétaire
in scheme: Budget
notation: REFIP616

effectif
type: ConceptReFip
type: Concept
broader: gestion prévisionnelle des ressources humaines
definition: Nombre d'agents d'une structure donnée.
in scheme: FINANCES PUBLIQUES
in scheme: Gestion des ressources humaines
in scheme: Gestion prévisionnelle des ressources humaines
in scheme: Fonction Publique et Gestion des Ressources Humaines
notation: REFIP6160

enfant légitime
type: ConceptReFip
type: Concept
broader: enfant
definition: Enfant conçu ou né de parents unis par le mariage.
in scheme: FINANCES PUBLIQUES
in scheme: Famille Education Population
in scheme: Famille
in scheme: Questions de Société
notation: REFIP6161

estimation indicative globale
type: ConceptReFip
type: Concept
alternative label: EIG
broader: document de GRH (non-descripteur)
definition: Document complétant le relevé de situation individuelle et, recensant les différents droits acquis par l'agent auprès des différents organismes obligatoires de base et complémentaires ainsi qu'une estimation de sa pension.
in scheme: FINANCES PUBLIQUES
in scheme: Gestion des ressources humaines
in scheme: Document de GRH
in scheme: Fonction Publique et Gestion des Ressources Humaines
notation: REFIP6162

enseignement supérieur
type: ConceptReFip
type: Concept
broader: enseignement
definition: Enseignement dispensé dans les universités, les instituts universitaires de technologie (IUT), les instituts universitaires de formation des maîtres (IUFM), les sections de techniciens supérieurs (STS), les classes préparatoires aux grandes écoles (CPGE), les écoles d'ingénieurs, les écoles de commerce, gestion, vente et comptabilité, les écoles paramédicales et sociales, etc.
in scheme: FINANCES PUBLIQUES
in scheme: Famille Education Population
in scheme: Enseignement
in scheme: Questions de Société
narrower: étudiant
notation: REFIP6163
related: refip-REFIP6759

enfant recueilli
type: ConceptReFip
type: Concept
broader: enfant
definition: Enfant confié temporairement au service d'aide à l'enfance.
in scheme: FINANCES PUBLIQUES
in scheme: Famille Education Population
in scheme: Famille
in scheme: Questions de Société
notation: REFIP6164

emploi
type: ConceptReFip
type: Concept
alternative label: création d'emploi
alternative label: suppression d'emploi
broader: gestion prévisionnelle des ressources humaines
definition: Poste de travail prévu au budget et doté des crédits nécessaires à la rémunération de son titulaire.
in scheme: FINANCES PUBLIQUES
in scheme: Gestion des ressources humaines
in scheme: Gestion prévisionnelle des ressources humaines
in scheme: Fonction Publique et Gestion des Ressources Humaines
narrower: emploi à temps partiel
narrower: emploi fonctionnel
narrower: emploi réservé
notation: REFIP6165

équipement culturel
type: ConceptReFip
type: Concept
broader: bien culturel
definition: Equipements publics ou privés destinés à l'animation culturelle, notamment les cinémas, orchestres, écoles d'art, librairie, musées...
in scheme: FINANCES PUBLIQUES
in scheme: Culture et Loisirs
in scheme: Patrimoine Culturel
in scheme: Questions de Société
narrower: musée
narrower: monument commémoratif
narrower: monument historique
notation: REFIP6166

exclusion sociale
type: ConceptReFip
type: Concept
broader: refip-REFIP6655
definition: Marginalisation sociale d'individus, ne correspondant pas ou plus au modèle dominant d'une société,
in scheme: FINANCES PUBLIQUES
in scheme: Santé et Protection Sociale
in scheme: Protection Sociale
in scheme: Questions de Société
notation: REFIP6167

épargne
type: ConceptReFip
type: Concept
broader: refip-REFIP6865
definition: Partie du revenu qui pendant une période donnée n'est pas dépensée. La somme d'argent peut être conservée sous forme liquide (constitution d'encaisses ou de réserves motivées par une recherche de précaution ou l'échéance d'une dépense importante à venir), ou être réinvestie dans le circuit économique sous la forme d'un placement ou d'un investissement.
in scheme: FINANCES PUBLIQUES
in scheme: Systeme bancaire et financier
in scheme: Secteur bancaire
in scheme: Finance
notation: REFIP6168

e-contacts
type: ConceptReFip
type: Concept
broader: applications fiscales (non-descripteur)
definition: Application facilitant la relation à l'usager et permettant aux services de répondre aux différentes demandes des usagers via une messagerie sécurisée accessible depuis l'espace particulier sur impots.gouv.fr.
in scheme: FINANCES PUBLIQUES
in scheme: Applications Informatiques
in scheme: Applications fiscales
notation: REFIP6169

examen professionnel
type: ConceptReFip
type: Concept
broader: refip-REFIP6779
definition: Examen organisé dans le cadre de la promotion interne, c'est-à-dire en vue d'un changement de grade ou de corps. Il n'est donc ouvert qu'aux fonctionnaires titulaires. A la différence des concours ouverts pour un nombre de places déterminé à l'avance, les examens professionnels sanctionnent l'obtention d'une moyenne ou d'un nombre minimum de points.
in scheme: FINANCES PUBLIQUES
in scheme: Gestion des ressources humaines
in scheme: Carrière
in scheme: Fonction Publique et Gestion des Ressources Humaines
notation: REFIP6170

espace de dialogue (obsolète)
type: ConceptReFip
type: Concept
broader: ZZ
in scheme: FINANCES PUBLIQUES
notation: REFIP6171

escompte
type: ConceptReFip
type: Concept
broader: refip-REFIP6674
definition: Cession d'un effet de commerce par une entreprise à la banque en contrepartie duquel elle recevra le montant de l'effet de commerce sans attendre la date d'échéance.
in scheme: FINANCES PUBLIQUES
in scheme: Systeme bancaire et financier
in scheme: Secteur bancaire
in scheme: Finance
notation: REFIP6172

endossement
type: ConceptReFip
type: Concept
broader: effet de commerce
definition: Mode de transmission des effets de commerces. Désigne d'une part l'action consistant à apposer sa signature au dos d'un effet de commerce ou d'un chèque afin de le transférer à l'ordre d'une autre personne et d’autre part, le transfert lui-même par lequel le bénéficiaire d'un effet de commerce donne ordre au débiteur de régler la somme d'argent auprès d'un autre bénéficiaire.
in scheme: FINANCES PUBLIQUES
in scheme: Moyen de paiement
in scheme: Finance
narrower: endos
notation: REFIP6173

élection politique
type: ConceptReFip
type: Concept
alternative label: candidature à une élection politique
broader: politique (non-descripteur)
definition: Désignation au moyen d'un suffrage (vote, approbation) auquel toutes les personnes disposant du droit de vote sont appelées à participer.
in scheme: FINANCES PUBLIQUES
in scheme: Questions Politiques Relations Internationales
in scheme: Politique
in scheme: Questions de Société
narrower: bulletin de vote
narrower: bureau de vote
narrower: campagne électorale
narrower: électeur
narrower: élu parlementaire
narrower: liste électorale
narrower: mandat électif
narrower: refip-REFIP6666
narrower: refip-REFIP6952
notation: REFIP6174

enfant naturel
type: ConceptReFip
type: Concept
broader: enfant
definition: Enfant dont le père et la mère n'étaient pas mariés au moment de sa conception.
in scheme: FINANCES PUBLIQUES
in scheme: Famille Education Population
in scheme: Famille
in scheme: Questions de Société
notation: REFIP6175

enseignement du second degré
type: ConceptReFip
type: Concept
alternative label: enseignement secondaire
broader: enseignement
definition: Enseignement dispensé dans les collèges, les lycées d'enseignement général et technologique, les lycées professionnels du ministère de l'Éducation nationale ou d'autres ministères.
in scheme: FINANCES PUBLIQUES
in scheme: Famille Education Population
in scheme: Enseignement
in scheme: Questions de Société
notation: REFIP6176

enfant illégitime
type: ConceptReFip
type: Concept
alternative label: enfant adultérin
broader: enfant
definition: Enfant conçu dans le cadre d'une relation adultérine.
in scheme: FINANCES PUBLIQUES
in scheme: Famille Education Population
in scheme: Famille
in scheme: Questions de Société
notation: REFIP6177

enfant malade
type: ConceptReFip
type: Concept
broader: enfant
definition: Enfant dont l'état de santé nécessite la présence de l’un des parents auprès de lui.
in scheme: FINANCES PUBLIQUES
in scheme: Famille Education Population
in scheme: Famille
in scheme: Questions de Société
notation: REFIP6178

e-tutorat
type: ConceptReFip
type: Concept
broader: formation à distance
definition: Dispositif d'accompagnement à distance mis en place, éventuellement, lors d'une formation à distance. Il peut prendre la forme d'un soutien technique ou pédagogique de l'apprenant.
in scheme: FINANCES PUBLIQUES
in scheme: Gestion des ressources humaines
in scheme: Formation professionnelle
in scheme: Fonction Publique et Gestion des Ressources Humaines
notation: REFIP6179

vente domaniale
type: ConceptReFip
type: Concept
broader: affectation de biens
definition: Vente de biens publics de nature immobilière ou mobilière que l'État organise par le biais de la DNID.
in scheme: FINANCES PUBLIQUES
in scheme: Domaine
in scheme: Gestion Publique
narrower: récolement
narrower: refip-REFIP855
notation: REFIP618

équivalent temps plein travaillé
type: ConceptReFip
type: Concept
alternative label: ETPT
broader: gestion prévisionnelle des ressources humaines
definition: Unité de décompte dans laquelle sont exprimés à la fois les plafonds d'emplois et les consommations de ces plafonds. Ce décompte est proportionnel à l'activité des agents mesurée par leur quotité de temps de travail et par leur période d'activité sur l'année.
in scheme: FINANCES PUBLIQUES
in scheme: Gestion des ressources humaines
in scheme: Gestion prévisionnelle des ressources humaines
in scheme: Fonction Publique et Gestion des Ressources Humaines
notation: REFIP6180

entreprise artisanale
type: ConceptReFip
type: Concept
broader: entreprise
definition: Entreprise immatriculée au Répertoire des métiers, exploitée par toute personne physique ou morale, qui n’emploie pas plus de 10 salariés, qui exerce une activité de production, de transformation, de réparation ou de prestation de service et figurant sur une liste établie par décret en Conseil d’état.
in scheme: FINANCES PUBLIQUES
in scheme: Entreprise
in scheme: Entreprises
in scheme: Forme juridique
notation: REFIP6181

enfant handicapé
type: ConceptReFip
type: Concept
alternative label: enfant infirme
broader: enfant
definition: Personne de moins de 20 ans avec des incapacités physiques ou mentales qui affectent ou limitent ses activités de la vie quotidienne.
in scheme: FINANCES PUBLIQUES
in scheme: Famille Education Population
in scheme: Famille
in scheme: Questions de Société
notation: REFIP6182

entité ad hoc (supprimé)
type: ConceptReFip
type: Concept
broader: ZZ
in scheme: FINANCES PUBLIQUES
notation: REFIP6183

enseignant
type: ConceptReFip
type: Concept
alternative label: professeur
broader: fonction publique de l'Etat
definition: Fonctionnaire d’État de catégorie A . Il s'agit des professeurs des écoles (enseignants du premier degré), des professeurs certifiés (enseignants du second degré exerçant en collège ou en lycée), des professeurs agrégés (enseignants principalement dans les lycées et les classes préparatoires aux grandes écoles), des professeurs de lycées professionnels, des professeurs d'éducation physique et sportive, des maîtres des établissements privés sous contrats.
in scheme: FINANCES PUBLIQUES
in scheme: Personnels et fonctions
in scheme: Fonction publique
in scheme: Fonction Publique et Gestion des Ressources Humaines
narrower: refip-REFIP6581
notation: REFIP6184
scope note: Education Nationale

élève
type: ConceptReFip
type: Concept
broader: enseignement
definition: Personne qui suit des cours dans un établissement scolaire.
in scheme: FINANCES PUBLIQUES
in scheme: Famille Education Population
in scheme: Enseignement
in scheme: Questions de Société
notation: REFIP6185

éducateur technique spécialisé
type: ConceptReFip
type: Concept
broader: fonction publique territoriale
definition: Fonctionnaire territorial de catégorie B, il travaille auprès de personnes handicapées ou en difficulté pour leur transmettre un savoir-faire professionnel.
in scheme: FINANCES PUBLIQUES
in scheme: Personnels et fonctions
in scheme: Fonction publique
in scheme: Fonction Publique et Gestion des Ressources Humaines
notation: REFIP6186

expatrié
type: ConceptReFip
type: Concept
alternative label: expatriation
broader: population (non-descripteur)
definition: Individu résidant dans un autre pays que le sien.
in scheme: FINANCES PUBLIQUES
in scheme: Famille Education Population
in scheme: Population
in scheme: Questions de Société
notation: REFIP6187

enseignement spécialisé
type: ConceptReFip
type: Concept
alternative label: éducation spécialisée
broader: enseignement
definition: Dispositif du système éducatif français destiné à aider les enfants en difficulté scolaire ou en situation de handicap.
in scheme: FINANCES PUBLIQUES
in scheme: Famille Education Population
in scheme: Enseignement
in scheme: Questions de Société
notation: REFIP6188

éducateur sportif
type: ConceptReFip
type: Concept
broader: fonction publique territoriale
definition: Fonctionnaire territorial de catégorie B, il enseigne et encadre une activité sportive à ses élèves pour le loisir ou en vue d'une compétition, en cours collectifs ou en cours individuels.
in scheme: FINANCES PUBLIQUES
in scheme: Personnels et fonctions
in scheme: Fonction publique
in scheme: Fonction Publique et Gestion des Ressources Humaines
notation: REFIP6189

comptabilité M 22
type: ConceptReFip
type: Concept
broader: comptabilité publique locale
definition: Instruction comptable M 22 applicable aux établissements et services publics sociaux et médico-sociaux.
in scheme: FINANCES PUBLIQUES
in scheme: Secteur public local
in scheme: Gestion Publique
notation: REFIP619

emprunt à l'étranger (supprimé)
type: ConceptReFip
type: Concept
broader: ZZ
in scheme: FINANCES PUBLIQUES
notation: REFIP6190

espace vert
type: ConceptReFip
type: Concept
alternative label: jardin
alternative label: parc
broader: aménagement urbain
definition: Ensemble des parcs et jardins, des espaces boisés ou cultivés, publics ou privés des zones urbaines et périurbaines.
in scheme: FINANCES PUBLIQUES
in scheme: Aménagement du territoire Urbanisme Habitat
in scheme: Aménagement du Territoire
in scheme: Questions de Société
notation: REFIP6191

édifice cultuel
type: ConceptReFip
type: Concept
alternative label: lieu de culte
broader: refip-REFIP6711
definition: Lieu dans lequel se réunissent les pratiquants d'une religion pour prier et célébrer un culte au cours de cérémonies.
in scheme: FINANCES PUBLIQUES
in scheme: Culture et Loisirs
in scheme: Patrimoine Culturel
in scheme: Questions de Société
notation: REFIP6192

enfant à charge
type: ConceptReFip
type: Concept
broader: enfant
definition: Enfant dont les parents assurent financièrement l'entretien (nourriture, logement, habillement) de façon « effective et permanente ». Il peut être compté à charge s'il est mineur sans revenus, infirme ou majeur et rattaché au foyer fiscal.
in scheme: FINANCES PUBLIQUES
in scheme: Famille Education Population
in scheme: Famille
in scheme: Questions de Société
notation: REFIP6193

électeur
type: ConceptReFip
type: Concept
broader: élection politique
definition: Personne ayant le droit de participer à une élection, ou plus généralement à un scrutin.
in scheme: FINANCES PUBLIQUES
in scheme: Questions Politiques Relations Internationales
in scheme: Politique
in scheme: Questions de Société
notation: REFIP6194

emplacement réserve
type: ConceptReFip
type: Concept
broader: refip-REFIP6599
definition: Terrain réservé par une collectivité publique afin de réaliser des voies et ouvrages publics ; des installations d’intérêt général ; des espaces verts ; des programmes de logements dans un but de mixité sociale (dans les zones urbaines ou à urbaniser).
in scheme: FINANCES PUBLIQUES
in scheme: Aménagement du territoire Urbanisme Habitat
in scheme: Aménagement du Territoire
in scheme: Questions de Société
notation: REFIP6195

enfant mineur
type: ConceptReFip
type: Concept
broader: enfant
definition: Enfant, âgé de moins de 18 ans et non émancipé.
in scheme: FINANCES PUBLIQUES
in scheme: Famille Education Population
in scheme: Famille
in scheme: Questions de Société
notation: REFIP6196

éclairage public
type: ConceptReFip
type: Concept
broader: mobilier urbain
definition: Ensemble des moyens d'éclairage mis en œuvre dans les espaces publics, à l'intérieur et à l'extérieur des villes.
in scheme: FINANCES PUBLIQUES
in scheme: Aménagement du territoire Urbanisme Habitat
in scheme: Aménagement du Territoire
in scheme: Questions de Société
notation: REFIP6197

état d'urgence
type: ConceptReFip
type: Concept
broader: refip-REFIP6579
definition: Mesure exceptionnelle pouvant être décidée par le Conseil des ministres, soit en cas de péril imminent résultant d’atteintes graves à l’ordre public, soit en cas de calamité publique (catastrophe naturelle d’une ampleur exceptionnelle). Il permet de renforcer les pouvoirs des autorités civiles et de restreindre certaines libertés publiques ou individuelles pour des personnes soupçonnées d’être une menace pour la sécurité publique.
in scheme: FINANCES PUBLIQUES
in scheme: Questions Politiques Relations Internationales
in scheme: Politique
in scheme: Questions de Société
notation: REFIP6198

élu parlementaire
type: ConceptReFip
type: Concept
alternative label: député
alternative label: sénateur
broader: élection politique
definition: Membre élu des assemblées parlementaires.
in scheme: FINANCES PUBLIQUES
in scheme: Questions Politiques Relations Internationales
in scheme: Politique
in scheme: Questions de Société
notation: REFIP6199

programme HTP-TG
type: ConceptReFip
type: Concept
alternative label: HTP-TG
alternative label: application HTP-TG
broader: applications fiscales (non-descripteur)
definition: Programme permettant d’attribuer les états de poursuites aux huissiers et contrôleurs commissionnés.
in scheme: FINANCES PUBLIQUES
in scheme: Applications Informatiques
in scheme: Applications fiscales
notation: REFIP62

mémoire préalable
type: ConceptReFip
type: Concept
broader: contentieux fiscal
definition: En cas d'opposition aux actes de poursuites, l'opposition doit être formée auprès du DDFIP, la saisine de l'administration s'effectue au moyen d'un mémoire.
in scheme: FINANCES PUBLIQUES
in scheme: Contentieux Fiscal
in scheme: Fiscalité
notation: REFIP620

entrepreneur individuel à responsabilité limitée
type: ConceptReFip
type: Concept
alternative label: EIRL
broader: entreprise
definition: Régime permettant à l'entrepreneur, en cas de faillite, de protéger ses biens personnels en séparant le patrimoine personnel du patrimoine professionnel. Il s'adresse à tout entrepreneur en nom propre qui affecte des biens à son activité professionnelle : auto-entrepreneur, commerçant, agent commercial, artisan, exploitant agricole, profession libérale par exemple. Les personnes morales (sociétés) ne sont pas concernées.
in scheme: FINANCES PUBLIQUES
in scheme: Entreprise
in scheme: Entreprises
in scheme: Forme juridique
notation: REFIP6200

emprunt à lot (supprimé)
type: ConceptReFip
type: Concept
broader: ZZ
in scheme: FINANCES PUBLIQUES
notation: REFIP6201

économie d'énergie
type: ConceptReFip
type: Concept
broader: protection de l'environnement
definition: Maîtrise de la consommation d'énergie, en vue notamment de protéger les ressources naturelles non-renouvelables.
in scheme: FINANCES PUBLIQUES
in scheme: Environnement
in scheme: Protection de l'Environnement
in scheme: Questions de Société
narrower: contrat de performance énergétique
notation: REFIP6202

équivalent temps plein emploi
type: ConceptReFip
type: Concept
alternative label: ETP
alternative label: ETPE
alternative label: équivalent temps plein
broader: gestion prévisionnelle des ressources humaines
definition: Unité de décompte qui permet de quantifier le temps de travail d'un agent, il s'agit donc de la part d'un emploi budgétaire effectivement occupé par cet agent compte tenu de sa quotité de travail.
in scheme: FINANCES PUBLIQUES
in scheme: Gestion des ressources humaines
in scheme: Gestion prévisionnelle des ressources humaines
in scheme: Fonction Publique et Gestion des Ressources Humaines
notation: REFIP6203

emprunt obligataire
type: ConceptReFip
type: Concept
broader: emprunt
definition: Instrument financier émis par une personne morale (Etat, collectivité publique, entreprise publique ou privée) qui reçoit en prêt une certaine somme d'argent de la part des souscripteurs des titres.
in scheme: FINANCES PUBLIQUES
in scheme: Instrument financier
in scheme: Emprunt
in scheme: Finance
notation: REFIP6204

endos
type: ConceptReFip
type: Concept
alternative label: griffe
alternative label: griffe d'endos
broader: endossement
definition: Signature, et/ou autre mention, généralement apposée au dos d’un titre négociable par laquelle un porteur transmet ce titre à une autre personne.
in scheme: FINANCES PUBLIQUES
in scheme: Moyen de paiement
in scheme: Finance
notation: REFIP6205

enrichissement sans cause
type: ConceptReFip
type: Concept
broader: droit civil
definition: Type de quasi-contrat. L'action est admise lorsque le patrimoine d'une personne s'est enrichie au détriment d'une autre et que l' appauvrissement qui en résulte ne trouve sa justification, ni dans une convention ou une libéralité, ni dans une disposition légale ou réglementaire. La personne appauvrie peut exercer l'action de in rem verso.
in scheme: FINANCES PUBLIQUES
in scheme: Droit et Justice
in scheme: Divisions du Droit
in scheme: Droit Privé
narrower: répétition de l'indu
notation: REFIP6206

emploi fonctionnel
type: ConceptReFip
type: Concept
broader: emploi
definition: Emploi d’encadrement supérieur pourvu par détachement ou par recrutement direct, de durée déterminée, se caractérisant par une mobilité obligatoire.
in scheme: FINANCES PUBLIQUES
in scheme: Gestion des ressources humaines
in scheme: Gestion prévisionnelle des ressources humaines
in scheme: Fonction Publique et Gestion des Ressources Humaines
notation: REFIP6207

emprunt d'Etat (supprimé)
type: ConceptReFip
type: Concept
broader: ZZ
in scheme: FINANCES PUBLIQUES
notation: REFIP6208

échelon
type: ConceptReFip
type: Concept
broader: corps
definition: Subdivision d'un grade basée sur l'ancienneté acquise dans le grade. Les durées de séjour dans les échelons sont précisées par les statuts.
in scheme: FINANCES PUBLIQUES
in scheme: Gestion des ressources humaines
in scheme: Statut du fonctionnaire
in scheme: Fonction Publique et Gestion des Ressources Humaines
notation: REFIP6209

immobilisation corporelle
type: ConceptReFip
type: Concept
alternative label: actif corporel
broader: immobilisation
definition: Actif physique détenu, soit pour être utilisé dans la production ou la fourniture de biens ou de services, soit pour être loué à des tiers, soit à des fins de gestion interne et dont l'entité attend qu'il soit utilisé au-delà de l'exercice en cours (terrains, constructions, installations techniques...).
in scheme: FINANCES PUBLIQUES
in scheme: Documents comptables
in scheme: Comptabilité
notation: REFIP621

étudiant
type: ConceptReFip
type: Concept
broader: enseignement supérieur
definition: Personne inscrite dans un établissement d'enseignement post-secondaire
in scheme: FINANCES PUBLIQUES
in scheme: Famille Education Population
in scheme: Enseignement
in scheme: Questions de Société
notation: REFIP6210

entreprise nouvelle
type: ConceptReFip
type: Concept
broader: entreprise
definition: Entreprise récemment créée et réellement nouvelle, non issue d'une concentration, d'une restructuration, d'une extension ou d'une reprise d'activité déjà existante. L'entreprise, selon le cas et sous conditions, peut alors bénéficier de certaines exonérations d'impôt sur les bénéfices.
in scheme: FINANCES PUBLIQUES
in scheme: Entreprise
in scheme: Entreprises
in scheme: Forme juridique
notation: REFIP6211
related: refip-REFIP938

enseignement privé sous contrat
type: ConceptReFip
type: Concept
broader: enseignement
definition: Enseignement dispensé dans des établissements liés à l’État par contrat
in scheme: FINANCES PUBLIQUES
in scheme: Famille Education Population
in scheme: Enseignement
in scheme: Questions de Société
notation: REFIP6212

émission de bon du Trésor
type: ConceptReFip
type: Concept
broader: émission d'emprunt
definition: Opération financière qui consiste à créer des valeurs mobilières par le Trésor Public pour le compte de l’Etat afin de lui permettre de se procurer des liquidités à court et à moyen terme. financières.
in scheme: FINANCES PUBLIQUES
in scheme: Systeme bancaire et financier
in scheme: Opération financière
in scheme: Finance
notation: REFIP6213

équivalence de diplôme (supprimé)
type: ConceptReFip
type: Concept
broader: ZZ
in scheme: FINANCES PUBLIQUES
notation: REFIP6214

emploi réservé
type: ConceptReFip
type: Concept
broader: emploi
definition: Dispositif dit des « emplois réservés » proposant des postes de catégorie B et C. Il concerne en priorité les pensionnés de guerre civils et militaires et les personnes assimilées, leur conjoint survivant, leurs orphelins et leurs enfants ainsi que les enfants de Harkis, les militaires en activité ou libérés depuis moins de trois ans.
in scheme: FINANCES PUBLIQUES
in scheme: Gestion des ressources humaines
in scheme: Gestion prévisionnelle des ressources humaines
in scheme: Fonction Publique et Gestion des Ressources Humaines
notation: REFIP6215

fonction effective
type: ConceptReFip
type: Concept
broader: fonction (non-descripteur)
definition: Activité avérée d'un agent de la fonction publique prise en compte tout au long de sa carrière.
in scheme: FINANCES PUBLIQUES
in scheme: Personnels et fonctions
in scheme: Fonction (NON DESCRIPTEUR)
in scheme: Fonction Publique et Gestion des Ressources Humaines
notation: REFIP6216

frais supplémentaires de repas
type: ConceptReFip
type: Concept
broader: refip-REFIP6766
definition: Frais liés aux déplacements professionnels d'un agent, pendant les plages horaires définies de prise de repas, et pouvant donnant lieu au versement d'une indemnité forfaitaire de repas.
in scheme: FINANCES PUBLIQUES
in scheme: Gestion des ressources humaines
in scheme: Rémunération
in scheme: Fonction Publique et Gestion des Ressources Humaines
notation: REFIP6217

formateur permanent
type: ConceptReFip
type: Concept
alternative label: chargé d'enseignement
alternative label: permanent pédagogique
broader: formateur
definition: Formateur travaillant au sein de l'ENFiP qui assure l'animation des cours, la conception de modules pédagogiques et la rédaction et mise au point de la documentation pédagogique
in scheme: FINANCES PUBLIQUES
in scheme: Personnels et fonctions
in scheme: Fonction de la Direction générale des Finances publiques (NON DESCRIPTEUR)
in scheme: Fonction Publique et Gestion des Ressources Humaines
notation: REFIP6218
related: formation professionnelle initiale
related: formation professionnelle continue

formation en alternance
type: ConceptReFip
type: Concept
alternative label: formation alternée
alternative label: formation en entreprise
broader: formation en milieu professionnel
definition: Système de formation dans lequel se succèdent des périodes en entreprise et des périodes en formation (Centre de formation d’apprentis ou organismes de formation).
in scheme: FINANCES PUBLIQUES
in scheme: Entreprises
in scheme: Travail
in scheme: 212619
narrower: apprentissage
notation: REFIP6219

Caraïbes
type: ConceptReFip
type: Concept
broader: Amérique
definition: Pays
in scheme: FINANCES PUBLIQUES
in scheme: Géographie
in scheme: Amérique
narrower: Saint-Christophe-et-Niévès
narrower: la Grenade
narrower: îles Turques et Caïques
narrower: la Dominique
narrower: République Dominicaine
narrower: îles Caimans
narrower: Anguilla
narrower: les Bermudes
narrower: Sainte-Lucie
narrower: Antilles
narrower: Saint-Vincent-et-les-Grenadines
narrower: Antilles néerlandaises
narrower: îles Vierges britanniques
notation: REFIP622

fonctionnaire international
type: ConceptReFip
type: Concept
broader: fonctionnaire
definition: Fonctionnaire employé par une organisation internationale (OI) doté d’un régime statutaire ou contractuel spécifique, qui peut être propre à chaque organisation. Il exerce une fonction au service de l’ensemble des États membres de l'OI. A ce titre, il bénéficie de privilèges et immunités destinés à garantir son indépendance.
in scheme: FINANCES PUBLIQUES
in scheme: Personnels et fonctions
in scheme: Fonction publique
in scheme: Fonction Publique et Gestion des Ressources Humaines
notation: REFIP6220

fonds de placement immobilier
type: ConceptReFip
type: Concept
alternative label: FPI
broader: refip-REFIP6573
definition: Organismes de placement collectif immobilier et organismes professionnels de placement collectif immobilier. Le FPI a donc vocation à être investi dans des actifs immobiliers à hauteur d'un minimum de 60% d'investissements à caractère immobilier. Les revenus distribués par le FPI sont imposables comme des revenus fonciers classiques.
in scheme: FINANCES PUBLIQUES
in scheme: Instrument financier
in scheme: Organisme de Placement Collectif Immobilier
in scheme: Finance
notation: REFIP6221

fonds européens structurels et d'investissement
type: ConceptReFip
type: Concept
replaces: Fonds structurels européens (obsolète)
alternative label: FESI
alternative label: Fonds structurels européens
broader: fonds (non-descripteur)
definition: Ensemble du fonds européen de développement régional, du Fonds social européen, du Fonds de cohésion, du Fonds européen agricole pour le développement rural et du Fonds européen pour les affaires maritimes et la pêche. Ces fonds ont pour objectif d’investir dans la création d’emplois et dans une économie et un environnement européens sains et durables.
in scheme: FINANCES PUBLIQUES
in scheme: Dépenses publiques
in scheme: Gestion Publique
narrower: fonds social européen
narrower: fonds européen pour la pêche
narrower: fonds européen agricole pour le développement rural
narrower: fonds européen de développement économique et régional
notation: REFIP6222

Fonds commun de placement à risque
type: ConceptReFip
type: Concept
alternative label: FCPR
broader: Fonds commun de placement
definition: Catégorie particulière d'OPCVM qui n'a pas de personnalité morale, et a un actif composé, pour 40% au moins, de valeurs mobilières non admises à la négociation sur un marché réglementé.
in scheme: FINANCES PUBLIQUES
in scheme: Instrument financier
in scheme: Organisme de Placement Collectif en Valeurs Mobilières
in scheme: Finance
narrower: Fonds commun de placement dans l'innovation
narrower: fonds d'investissement de proximité
notation: REFIP6223

fonds de titrisation (supprimé)
type: ConceptReFip
type: Concept
broader: ZZ
in scheme: FINANCES PUBLIQUES
notation: REFIP6224

finance islamique (supprimé)
type: ConceptReFip
type: Concept
broader: ZZ
in scheme: FINANCES PUBLIQUES
notation: REFIP6225

faute simple (supprimé)
type: ConceptReFip
type: Concept
broader: ZZ
in scheme: FINANCES PUBLIQUES
notation: REFIP6226

frais financiers
type: ConceptReFip
type: Concept
broader: compte financier
definition: Ensemble des frais liés aux emprunts financiers contractés par une entreprise. Dans un compte de résultats, le résultat financier correspond au solde des produits financiers soustraits des charges financières. Les frais financiers comptabilisent ainsi la totalité des charges versées par l'entreprise à ses établissements financiers.
in scheme: FINANCES PUBLIQUES
in scheme: Documents comptables
in scheme: Comptabilité
notation: REFIP6227

frais funéraires
type: ConceptReFip
type: Concept
alternative label: frais d'obsèques
broader: décès
definition: Ensemble des frais liés aux cérémonies funèbres qui accompagnent l'organisation et la prise en charge du transport du corps du défunt du lieu de décès au lieu d'inhumation ou de crémation
in scheme: FINANCES PUBLIQUES
in scheme: Santé et Protection Sociale
in scheme: Santé
in scheme: Questions de Société
notation: REFIP6228

fin de mandat
type: ConceptReFip
type: Concept
broader: mandat électif
definition: Fin de prise de fonction, d'une charge dans une assemblée.
in scheme: FINANCES PUBLIQUES
in scheme: Questions Politiques Relations Internationales
in scheme: Politique
in scheme: Questions de Société
notation: REFIP6229
related: allocation différentielle de fin de mandat

facilité d'horaires (supprimé)
type: ConceptReFip
type: Concept
is replaced by: facilités d'horaires
broader: ZZ
in scheme: FINANCES PUBLIQUES
notation: REFIP6230

formation professionnelle
type: ConceptReFip
type: Concept
broader: gestion des ressources humaines
definition: Ensemble des dispositifs mis en œuvre, tout au long de la vie des fonctionnaires, afin de leur permettre d'exercer, avec la plus grande efficacité, les fonctions qui leur sont confiées durant l'ensemble de leur carrière, de favoriser leur développement professionnel, leur mobilité, ainsi que la réalisation de leurs aspirations personnelles.
in scheme: FINANCES PUBLIQUES
in scheme: Gestion des ressources humaines
in scheme: Formation professionnelle
in scheme: Fonction Publique et Gestion des Ressources Humaines
narrower: bilan de compétences
narrower: congé de formation professionnelle
narrower: droit individuel à la formation
narrower: formation à distance
narrower: formation professionnelle initiale
narrower: formation professionnelle continue
narrower: refip-REFIP6621
narrower: refip-REFIP6625
narrower: refip-REFIP6638
narrower: refip-REFIP7087
notation: REFIP6231
related: validation des acquis de l'expérience

Fonds monétaire international
type: ConceptReFip
type: Concept
alternative label: FMI
broader: refip-REFIP6576
definition: Institution internationale chargée de promouvoir la coopération monétaire internationale, garantir la stabilité financière, faciliter les échanges internationaux, contribuer à un niveau élevé d'emploi, à la stabilité économique et faire reculer la pauvreté.
in scheme: FINANCES PUBLIQUES
in scheme: Questions Politiques Relations Internationales
in scheme: Relations Internationales
in scheme: Questions de Société
notation: REFIP6232

Fichier national des établissements sanitaires et sociaux
type: ConceptReFip
type: Concept
alternative label: FINESS
alternative label: base FINESS
alternative label: fichier FINESS
alternative label: répertoire FINESS
broader: santé (non-descripteur)
definition: Répertoire national permettant de connaître les établissements et services relevant de l'action sanitaire et sociale.
in scheme: FINANCES PUBLIQUES
in scheme: Santé et Protection Sociale
in scheme: Santé
in scheme: Questions de Société
notation: REFIP6233

fourniture scolaire
type: ConceptReFip
type: Concept
broader: enseignement
definition: Ensemble des supports et matériels individuels nécessaires à l'élève pour effectuer les tâches et les actions entrant dans le cadre de la mise en oeuvre des programmes scolaires.
in scheme: FINANCES PUBLIQUES
in scheme: Famille Education Population
in scheme: Enseignement
in scheme: Questions de Société
notation: REFIP6234

fonction d'encadrement
type: ConceptReFip
type: Concept
broader: fonction (non-descripteur)
definition: Fonction exercée par les cadres assurant la responsabilité d'un service ou d'une mission.
in scheme: FINANCES PUBLIQUES
in scheme: Personnels et fonctions
in scheme: Fonction (NON DESCRIPTEUR)
in scheme: Fonction Publique et Gestion des Ressources Humaines
notation: REFIP6235

frais médicaux
type: ConceptReFip
type: Concept
broader: santé (non-descripteur)
definition: Dépenses de santé engagées par un particulier ou ses représentants pour lui-même ou les personnes à sa charge.
in scheme: FINANCES PUBLIQUES
in scheme: Santé et Protection Sociale
in scheme: Santé
in scheme: Questions de Société
narrower: feuille de soins
narrower: refip-REFIP6913
notation: REFIP6236

fonction publique
type: ConceptReFip
type: Concept
broader: personnels et fonctions (non-descripteur)
definition: Ensemble des fonctionnaires, c’est-à-dire l’ensemble des personnes nommées dans un emploi permanent et titularisées dans un grade de la hiérarchie des administrations de l’État, des collectivités territoriales ou des hôpitaux.
in scheme: FINANCES PUBLIQUES
in scheme: Personnels et fonctions
in scheme: Fonction publique
in scheme: Fonction Publique et Gestion des Ressources Humaines
narrower: filière de la fonction publique (non-descripteur)
narrower: contractuel
narrower: fonctionnaire
narrower: fonction publique hospitalière
narrower: fonction publique territoriale
narrower: fonction publique de l'Etat
narrower: refip-REFIP6957
notation: REFIP6237

formation à distance
type: ConceptReFip
type: Concept
alternative label: e-formation
alternative label: enseignement assisté par ordinateur
alternative label: formation assistée par internet
alternative label: formation en ligne
alternative label: formation ouverte à distance
broader: formation professionnelle
definition: Méthode pédagogique de formation innovante, complémentaire au présentiel, qui se caractérise par l’utilisation des technologies de l’information et de la communication. Elle permet de se former, à distance, soit sur son poste de travail si les conditions le permettent, soit dans un espace dédié.
in scheme: FINANCES PUBLIQUES
in scheme: Gestion des ressources humaines
in scheme: Formation professionnelle
in scheme: Fonction Publique et Gestion des Ressources Humaines
narrower: e-tutorat
notation: REFIP6238

FranceAgriMer
type: ConceptReFip
type: Concept
alternative label: Etablissement national des produits de l'agriculture et de la mer
alternative label: OFIMER
alternative label: office national interprofessionnel des produits de la mer et de l'aquaculture
broader: établissement public à caractère administratif
definition: Etablissement national des produits de l’agriculture et de la mer sous tutelle de l’État ayant pour missions de favoriser la concertation au sein des filières de l'agriculture et de la forêt, d'assurer la connaissance et l'organisation des marchés, de gérer des aides publiques nationales et communautaires. FranceAgriMer met en œuvre les politiques publiques de régulation des marchés, assure une veille économique qui renforce l'efficacité des filières et favorise leur organisation.
in scheme: FINANCES PUBLIQUES
in scheme: Organisation Structurelle de l'Etat
in scheme: Opérateur de l'Etat
in scheme: Administration de L'Etat
notation: REFIP6239

facturation individuelle des établissements de santé
type: ConceptReFip
type: Concept
alternative label: FIDES
broader: santé (non-descripteur)
definition: Mode de facturation de l'activité des établissements de santé en France
in scheme: FINANCES PUBLIQUES
in scheme: Santé et Protection Sociale
in scheme: Santé
in scheme: Questions de Société
notation: REFIP6240
related: établissement public de santé
related: établissement de santé privé

fonctionnaire
type: ConceptReFip
type: Concept
alternative label: agent de la fonction publique
broader: fonction publique
definition: Personne employée et nommée par une personne publique dans un emploi permanent et titularisée à son poste dans un grade de la hiérarchie administrative, au sein de l'une des trois fonction publique. La titularisation est un élément important. Les lauréats d’un concours de la fonction publique effectuent souvent une période de stage afin de vérifier leurs aptitudes. Au terme de cette période, ils deviennent fonctionnaires par leur titularisation. Il s’agit d’un acte pris par une autorité de l’administration qui les emploie. Il constitue une garantie obligeant l’administration à trouver au fonctionnaire un emploi correspondant à son grade en cas de suppression de son poste.
in scheme: FINANCES PUBLIQUES
in scheme: Personnels et fonctions
in scheme: Fonction publique
in scheme: Fonction Publique et Gestion des Ressources Humaines
narrower: agent en difficulté
narrower: fonctionnaire international
narrower: refip-REFIP6608
narrower: refip-REFIP6651
narrower: refip-REFIP6678
notation: REFIP6241

famille
type: ConceptReFip
type: Concept
broader: famille éducation population (non-descripteur)
definition: Partie d'un ménage comprenant au moins deux personnes
in scheme: FINANCES PUBLIQUES
in scheme: Famille Education Population
in scheme: Famille
in scheme: Questions de Société
narrower: ascendant
narrower: conjoint
narrower: descendant
narrower: domicile personnel
narrower: famille nombreuse
narrower: livret de famille
narrower: refip-REFIP6840
notation: REFIP6242

fonction élective
type: ConceptReFip
type: Concept
broader: fonction (non-descripteur)
definition: Charge élective d'un agent de la fonction publique (membre du gouvernement, d'un mandat local, ou exerçant une fonction publique élective) pouvant empêcher l'exercice normal de ses fonctions principales.
in scheme: FINANCES PUBLIQUES
in scheme: Personnels et fonctions
in scheme: Fonction (NON DESCRIPTEUR)
in scheme: Fonction Publique et Gestion des Ressources Humaines
notation: REFIP6243

Fonds commun de créances
type: ConceptReFip
type: Concept
alternative label: FCC
broader: Fonds commun de placement
definition: Copropriétés n'ayant pas la personnalité morale qui sont destinés à permettre la titrisation des créances bancaires. La titrisation consiste, pour un établissement de crédit, à céder des créances inscrites à son bilan à un organisme tiers, le FCC, qui émet en contrepartie des parts représentatives de ces créances.
in scheme: FINANCES PUBLIQUES
in scheme: Instrument financier
in scheme: Organisme de Placement Collectif en Valeurs Mobilières
in scheme: Finance
narrower: carried interest
notation: REFIP6244

faute professionnelle
type: ConceptReFip
type: Concept
broader: faute disciplinaire
definition: Faute commise par un personnel dans l'exécution de son travail. Il peut s'agir de manquements, de négligences. La faute professionnelle peut relever de la faute simple, grave ou lourde et donner lieu à des sanctions à ce titre.
in scheme: FINANCES PUBLIQUES
in scheme: Gestion des ressources humaines
in scheme: Statut du fonctionnaire
in scheme: Fonction Publique et Gestion des Ressources Humaines
narrower: faute de service
narrower: faute grave
narrower: faute lourde
notation: REFIP6245
related: abandon de poste

famille nombreuse
type: ConceptReFip
type: Concept
broader: famille
definition: Type de famille dont le nombre d'enfants est supérieur à 3 en France.
in scheme: FINANCES PUBLIQUES
in scheme: Famille Education Population
in scheme: Famille
in scheme: Questions de Société
notation: REFIP6246

Fonds commun de placement dans l'innovation
type: ConceptReFip
type: Concept
alternative label: FCPI
broader: Fonds commun de placement à risque
definition: Fonds communs de placement à risques dont l'actif est constitué, pour 70 % au moins, de titres financiers, parts de société à responsabilité limitée et avances en compte courant.
in scheme: FINANCES PUBLIQUES
in scheme: Instrument financier
in scheme: Organisme de Placement Collectif en Valeurs Mobilières
in scheme: Finance
notation: REFIP6247

feuille de soins
type: ConceptReFip
type: Concept
alternative label: feuille de maladie
broader: frais médicaux
definition: Document délivré par un professionnel de la santé, sur lequel sont inscrits les actes médicaux réalisés.
in scheme: FINANCES PUBLIQUES
in scheme: Santé et Protection Sociale
in scheme: Santé
in scheme: Questions de Société
notation: REFIP6248

facilité de service
type: ConceptReFip
type: Concept
broader: refip-REFIP6916
definition: Facilités de service pouvant être accordées aux agents qui font acte de candidature à une fonction publique élective, qui participent aux travaux des assemblées publiques électives, ou qui exercent une activité syndicale. Les conditions d'octroi de ces facilités sont différentes selon leur objet.
in scheme: FINANCES PUBLIQUES
in scheme: Gestion des ressources humaines
in scheme: Temps de travail
in scheme: Fonction Publique et Gestion des Ressources Humaines
narrower: décharge d'activité de service
notation: REFIP6249

frais de procédure
type: ConceptReFip
type: Concept
broader: frais de justice
definition: Frais engagés dans le cadre d'un procès. Ils comprennent différentes sommes, tels que les dépens, les frais irrépétibles, les honoraires ou les émoluments.
in scheme: FINANCES PUBLIQUES
in scheme: Principes Généraux
in scheme: Droit et Justice
in scheme: Procédure
narrower: frais irrépétibles
narrower: dépens
notation: REFIP625

formation professionnelle initiale
type: ConceptReFip
type: Concept
alternative label: formation initiale
alternative label: formation professionnelle statutaire
alternative label: formation statutaire
broader: formation professionnelle
definition: Ensemble des dispositifs de formation, prévus dans les statuts particuliers des différents corps des personnels de l’État. Destinés aux fonctionnaires accédant à l'un de ces corps, ils leur permettent d'acquérir les connaissances théoriques et pratiques nécessaires à l'exercice de leurs fonctions et la connaissance de l'environnement, dans lequel elles s'exercent.
in scheme: FINANCES PUBLIQUES
in scheme: Gestion des ressources humaines
in scheme: Formation professionnelle
in scheme: Fonction Publique et Gestion des Ressources Humaines
notation: REFIP6250
related: formateur permanent
related: formateur

fondation du patrimoine
type: ConceptReFip
type: Concept
broader: refip-REFIP6694
definition: Organisme privé indépendant à but non lucratif, dont la vocation est de défendre et de valoriser un patrimoine en voie de disparition non protégé par l'État
in scheme: FINANCES PUBLIQUES
in scheme: Culture et Loisirs
in scheme: Patrimoine Culturel
in scheme: Questions de Société
notation: REFIP6251

frais de scolarité
type: ConceptReFip
type: Concept
alternative label: droits d'inscription
broader: enseignement
definition: Somme exigée par une institution d'enseignement pour suivre un programme d'études.
in scheme: FINANCES PUBLIQUES
in scheme: Famille Education Population
in scheme: Enseignement
in scheme: Questions de Société
notation: REFIP6252

formation professionnelle continue
type: ConceptReFip
type: Concept
alternative label: formation continue
broader: formation professionnelle
definition: Ensemble des dispositifs proposés aux agents, afin de maintenir ou de parfaire leurs compétences, au regard du contexte professionnel dans lequel ils exercent leurs fonctions. Ces dispositifs sont destinés à assurer leur adaptation immédiate au poste de travail, leur adaptation à l'évolution prévisible des métiers, ou le développement de leurs qualifications ou l'acquisition de nouvelles qualifications.
in scheme: FINANCES PUBLIQUES
in scheme: Gestion des ressources humaines
in scheme: Formation professionnelle
in scheme: Fonction Publique et Gestion des Ressources Humaines
notation: REFIP6253
related: formateur permanent
related: formateur interne occasionnel
related: formateur

faute de service
type: ConceptReFip
type: Concept
broader: faute professionnelle
definition: Faute commise par un agent dans l'exercice de ses fonctions, c'est-à-dire pendant le service, avec les moyens de celui-ci et en dehors de tout intérêt personnel.
in scheme: FINANCES PUBLIQUES
in scheme: Gestion des ressources humaines
in scheme: Statut du fonctionnaire
in scheme: Fonction Publique et Gestion des Ressources Humaines
notation: REFIP6254

filière fiscale
type: ConceptReFip
type: Concept
broader: filière de la fonction publique (non-descripteur)
definition: Filière métier de la Direction générale des finances publiques.
in scheme: FINANCES PUBLIQUES
in scheme: Personnels et fonctions
in scheme: Fonction publique
in scheme: Fonction Publique et Gestion des Ressources Humaines
notation: REFIP6255

formateur interne occasionnel
type: ConceptReFip
type: Concept
alternative label: formateur occasionnel
alternative label: professionnel associé
broader: formateur
definition: Agent ayant la mission d’animer des formations articulées à des situations de travail dans le but de développer et de faire acquérir des compétences.
in scheme: FINANCES PUBLIQUES
in scheme: Personnels et fonctions
in scheme: Fonction de la Direction générale des Finances publiques (NON DESCRIPTEUR)
in scheme: Fonction Publique et Gestion des Ressources Humaines
notation: REFIP6256
related: formation professionnelle continue

force publique
type: ConceptReFip
type: Concept
broader: refip-REFIP6579
definition: Ensemble des services de l'Etat et des communautés territoriales qui sont chargés du maintient de l'ordre, de la sécurité et de l'exécution des lois.
in scheme: FINANCES PUBLIQUES
in scheme: Questions Politiques Relations Internationales
in scheme: Politique
in scheme: Questions de Société
notation: REFIP6257

frais de gardiennage
type: ConceptReFip
type: Concept
alternative label: frais de fourrière
broader: fourrière
definition: Frais a acquitter suite à la mise en fourrière d'un véhicule.
in scheme: FINANCES PUBLIQUES
in scheme: Questions Politiques Relations Internationales
in scheme: Politique
in scheme: Questions de Société
notation: REFIP6258

frais hospitalier
type: ConceptReFip
type: Concept
alternative label: forfait hospitalier
alternative label: forfait journalier
alternative label: forfait journalier hospitalier
alternative label: frais d'hospitalisation
alternative label: frais de séjour hospitalier
broader: hospitalisation
definition: Ensemble des frais de séjour, journaliers, qui comprennent l'ensemble des prestations assurées par l'hôpital.
in scheme: FINANCES PUBLIQUES
in scheme: Santé et Protection Sociale
in scheme: Santé
in scheme: Questions de Société
narrower: refip-REFIP6659
narrower: refip-REFIP6927
notation: REFIP6259

faute grave
type: ConceptReFip
type: Concept
broader: faute professionnelle
definition: Qualification par les tribunaux d'une faute lorsqu'elle provient d'un fait ou d'un ensemble de faits qui rendent impossible le maintien du fonctionnaire dans son poste, suite à des manquements graves du fonctionnaire.
in scheme: FINANCES PUBLIQUES
in scheme: Gestion des ressources humaines
in scheme: Statut du fonctionnaire
in scheme: Fonction Publique et Gestion des Ressources Humaines
notation: REFIP6260

franc
type: ConceptReFip
type: Concept
broader: devise
definition: Unité monétaire de la France, avant l'euro.
in scheme: FINANCES PUBLIQUES
in scheme: Moyen de paiement
in scheme: Finance
notation: REFIP6261

faute lourde
type: ConceptReFip
type: Concept
broader: faute professionnelle
definition: Qualification par les tribunaux d'une faute lorsqu'elle est commise dans l'intention de nuire à l'employeur qui doit en apporter la preuve .
in scheme: FINANCES PUBLIQUES
in scheme: Gestion des ressources humaines
in scheme: Statut du fonctionnaire
in scheme: Fonction Publique et Gestion des Ressources Humaines
notation: REFIP6262

fonction comptable
type: ConceptReFip
type: Concept
broader: fonction de la Direction générale des finances publiques (non-descripteur)
definition: Fonction dévolue aux agents comptables spécialistes des règles comptables et financières.
in scheme: FINANCES PUBLIQUES
in scheme: Personnels et fonctions
in scheme: Fonction de la Direction générale des Finances publiques (NON DESCRIPTEUR)
in scheme: Fonction Publique et Gestion des Ressources Humaines
notation: REFIP6263

filière animation
type: ConceptReFip
type: Concept
broader: filière de la fonction publique (non-descripteur)
definition: Filière métier de la fonction publique territoriale intervenant dans le cadre de politiques éducatives conduites par les collectivités territoriales auprès de différents publics, enfants, jeunes voire personnes âgées.
in scheme: FINANCES PUBLIQUES
in scheme: Personnels et fonctions
in scheme: Fonction publique
in scheme: Fonction Publique et Gestion des Ressources Humaines
notation: REFIP6264

fonction publique hospitalière
type: ConceptReFip
type: Concept
alternative label: FPH
broader: fonction publique
definition: Ensemble des fonctionnaires répartis dans les établissements suivants : les établissements d’hospitalisation publics; les maisons de retraite publiques; les établissements publics ou à caractère public relevant des services départementaux de l’aide sociale à l’enfance; les établissements publics pour mineurs ou adultes handicapés ou inadaptés; les centres d’hébergement et de réadaptation sociale publics ou à caractère public. Les praticiens hospitaliers n’appartiennent pas à la FPH.
in scheme: FINANCES PUBLIQUES
in scheme: Personnels et fonctions
in scheme: Fonction publique
in scheme: Fonction Publique et Gestion des Ressources Humaines
narrower: infirmier
narrower: puéricultrice
narrower: animateur hospitalier
narrower: assistant médico-administratif
narrower: aide-soignant
narrower: adjoint administratif hospitalier
narrower: adjoint des cadres hospitaliers
narrower: assistant des hôpitaux
narrower: auxiliaire de puériculture
narrower: brancardier
narrower: conseiller général des établissements de santé
narrower: directeur de soins
narrower: refip-REFIP6592
narrower: refip-REFIP6821
narrower: refip-REFIP6945
notation: REFIP6265

filière médicosociale
type: ConceptReFip
type: Concept
broader: filière de la fonction publique (non-descripteur)
definition: Filière métier de la fonction publique territoriale recouvrant 4 secteurs : l’action éducative et sociale qui s’exerce auprès des différentes tranches d’âge de la population sollicitant une aide auprès des institutions publiques ; l’action sanitaire qui s’adresse à l’ensemble des populations dans un objectif de prévention de santé publique; l’assistance médicale et la petite enfance.
in scheme: FINANCES PUBLIQUES
in scheme: Personnels et fonctions
in scheme: Fonction publique
in scheme: Fonction Publique et Gestion des Ressources Humaines
notation: REFIP6266

formateur
type: ConceptReFip
type: Concept
broader: fonction de la Direction générale des finances publiques (non-descripteur)
definition: Enseignant permanent ou occasionnel au sein de la DGFiP.
in scheme: FINANCES PUBLIQUES
in scheme: Personnels et fonctions
in scheme: Fonction de la Direction générale des Finances publiques (NON DESCRIPTEUR)
in scheme: Fonction Publique et Gestion des Ressources Humaines
narrower: formateur permanent
narrower: formateur interne occasionnel
notation: REFIP6267
related: formation professionnelle initiale
related: formation professionnelle continue
scope note: Formation DGFIP

financement
type: ConceptReFip
type: Concept
broader: refip-REFIP6569
definition: Opération permettant à un agent économique de se procurer les ressources nécessaires au financement de sa trésorerie ou de ses besoins d’investissement principalement par le biais des crédits bancaires ou par le recours à l’émission de titres pour les Etats.
in scheme: FINANCES PUBLIQUES
in scheme: Systeme bancaire et financier
in scheme: Opération financière
in scheme: Finance
narrower: collecte de fonds
notation: REFIP6268

fonction publique territoriale
type: ConceptReFip
type: Concept
alternative label: FPT
broader: fonction publique
definition: Ensemble des fonctionnaires travaillant dans les collectivités territoriales (régions, départements, communes, y compris collectivités à statut particulier et collectivités d’outre mer) et les Etablissements publics locaux, qu'ils soient fonctionnaires ou non fonctionnaires, et les bénéficiaires d’emplois aidés.
in scheme: FINANCES PUBLIQUES
in scheme: Personnels et fonctions
in scheme: Fonction publique
in scheme: Fonction Publique et Gestion des Ressources Humaines
narrower: éducateur de jeunes enfants
narrower: animateur territorial
narrower: assistant social
narrower: agent territorial
narrower: brigadier chef
narrower: conservateur territorial du patrimoine
narrower: conseiller en économie familiale et sociale
narrower: collaborateur de cabinet
narrower: conservateur territorial des bibliothèques
narrower: directeur général des services
narrower: éducateur spécialisé
narrower: éducateur technique spécialisé
narrower: éducateur sportif
narrower: garde forestier
narrower: garde champêtre
narrower: refip-REFIP6846
narrower: refip-REFIP6878
notation: REFIP6269

homologation
type: ConceptReFip
type: Concept
broader: rôle d'imposition
definition: Action consistant à revêtir les rôles des mentions juridiques et des signatures qui les rendent exécutoires.
in scheme: FINANCES PUBLIQUES
in scheme: Documentation Fiscale
in scheme: Fiscalité
notation: REFIP627
scope note: Homologation des rôles

frais bancaires
type: ConceptReFip
type: Concept
broader: refip-REFIP6835
definition: Somme perçue par une institution financière pour le fonctionnement des comptes bancaires de ses clients.
in scheme: FINANCES PUBLIQUES
in scheme: Systeme bancaire et financier
in scheme: Secteur bancaire
in scheme: Finance
narrower: agio
notation: REFIP6270

fonction publique de l'Etat
type: ConceptReFip
type: Concept
alternative label: FPE
broader: fonction publique
definition: Ensemble des fonctionnaires répartis entre les administrations centrales de l'État et les services déconcentrés, mais également au niveau de la région et du département, au sein des établissements publics d'enseignement, ainsi que dans les établissements publics administratifs rattachés aux différents ministères.
in scheme: FINANCES PUBLIQUES
in scheme: Personnels et fonctions
in scheme: Fonction publique
in scheme: Fonction Publique et Gestion des Ressources Humaines
narrower: sous-préfet
narrower: corps diplomatique
narrower: grade de la Direction générale des Finances publiques (non-descripteur)
narrower: attaché principal d'administration
narrower: architecte conseil
narrower: administrateur civil
narrower: adjoint administratif des administrations de l'Etat
narrower: agent judiciaire de l'Etat
narrower: agent de constatation des douanes
narrower: agent diplomatique et consulaire
narrower: agent de traitement de l'information
narrower: administrateur civil hors classe
narrower: attaché d'administration
narrower: contrôleur des douanes et droits indirects
narrower: consul
narrower: conseiller technique de service social
narrower: commissaire de police
narrower: conservateur du patrimoine
narrower: dessinateur
narrower: enseignant
narrower: Haut fonctionnaire de défense et de sécurité
narrower: militaire
narrower: refip-REFIP6546
narrower: refip-REFIP6563
narrower: refip-REFIP6789
narrower: refip-REFIP6802
narrower: refip-REFIP6854
narrower: refip-REFIP6885
narrower: refip-REFIP6887
notation: REFIP6271

filière sapeur pompier professionnel
type: ConceptReFip
type: Concept
broader: filière de la fonction publique (non-descripteur)
definition: Filière métier de la Fonction Publique Territoriale regroupant l'ensemble des sapeurs-pompiers professionnels.
in scheme: FINANCES PUBLIQUES
in scheme: Personnels et fonctions
in scheme: Fonction publique
in scheme: Fonction Publique et Gestion des Ressources Humaines
notation: REFIP6272

filière gestion publique
type: ConceptReFip
type: Concept
broader: filière de la fonction publique (non-descripteur)
definition: Filière métier de la Direction générale des finances publiques.
in scheme: FINANCES PUBLIQUES
in scheme: Personnels et fonctions
in scheme: Fonction publique
in scheme: Fonction Publique et Gestion des Ressources Humaines
notation: REFIP6273

frais d'émission
type: ConceptReFip
type: Concept
broader: refip-REFIP6545
definition: Ensemble des frais liés à l'émission de titres (actions, obligations, etc.). Il peut s'agir de la commission de placement, des frais juridiques ou encore des frais de cotations.
in scheme: FINANCES PUBLIQUES
in scheme: Systeme bancaire et financier
in scheme: Opération financière
in scheme: Finance
narrower: commission de placement
notation: REFIP6274

fonction de la Direction générale des finances publiques (non-descripteur)
type: ConceptReFip
type: Concept
broader: personnels et fonctions (non-descripteur)
definition: Terme ne servant pas à l'indexation.
in scheme: FINANCES PUBLIQUES
in scheme: Personnels et fonctions
in scheme: Fonction de la Direction générale des Finances publiques (NON DESCRIPTEUR)
in scheme: Fonction Publique et Gestion des Ressources Humaines
narrower: autorité hiérarchique
narrower: échelon de renfort et d'assistance
narrower: fonction financière
narrower: attaché fiscal
narrower: assistant de prévention
narrower: autorité compétente
narrower: analyste
narrower: administrateur informatique
narrower: agent comptable
narrower: agent d'enquête
narrower: avocat du Trésor
narrower: correspondant moyens de paiement
narrower: correspondant handicap local
narrower: chef de service comptable des finances publiques
narrower: correspondant social
narrower: chef d'exploitation
narrower: conciliateur fiscal
narrower: correspondant RIVOLI TOPAD
narrower: conseil fiscal
narrower: comptable public
narrower: caissier
narrower: contrôleur du règlement
narrower: chef de projet
narrower: contrôleur budgétaire et comptable ministériel
narrower: correspondant du Trésor
narrower: certificateur du service fait
narrower: directeur régional des finances publiques
narrower: délégué du directeur général des finances publiques
narrower: Directeur général des finances publiques
narrower: directeur départemental des finances publiques
narrower: fonction comptable
narrower: formateur
narrower: gestionnaire
narrower: refip-REFIP6560
narrower: refip-REFIP6598
narrower: refip-REFIP6623
narrower: refip-REFIP6633
narrower: refip-REFIP6635
narrower: refip-REFIP6654
narrower: refip-REFIP6675
narrower: refip-REFIP6676
narrower: refip-REFIP6719
narrower: refip-REFIP6729
narrower: refip-REFIP6734
narrower: refip-REFIP6769
narrower: refip-REFIP6775
narrower: refip-REFIP6783
narrower: refip-REFIP6795
narrower: refip-REFIP7007
narrower: refip-REFIP7038
narrower: refip-REFIP7040
narrower: refip-REFIP7084
notation: REFIP6275

frais de déplacement
type: ConceptReFip
type: Concept
broader: refip-REFIP6766
definition: Frais liés aux déplacements professionnels temporaires hors de sa résidence administrative et hors de sa résidence familiale pouvant donner lieu au versement d'indemnités forfaitaires destinées à rembourser ses frais supplémentaires de nourriture et de logement et au remboursement des frais de transport.
in scheme: FINANCES PUBLIQUES
in scheme: Gestion des ressources humaines
in scheme: Rémunération
in scheme: Fonction Publique et Gestion des Ressources Humaines
notation: REFIP6276
related: titre d'abonnement aux transports en commun

filière police municipale
type: ConceptReFip
type: Concept
broader: filière de la fonction publique (non-descripteur)
definition: Filière métier de la fonction publique territoriale regroupant les agents affectés dans les services de police municipale ou de police spéciale (garde-champêtre).
in scheme: FINANCES PUBLIQUES
in scheme: Personnels et fonctions
in scheme: Fonction publique
in scheme: Fonction Publique et Gestion des Ressources Humaines
notation: REFIP6277

franc pacifique
type: ConceptReFip
type: Concept
broader: devise
definition: Monnaie en circulation dans les COM.
in scheme: FINANCES PUBLIQUES
in scheme: Moyen de paiement
in scheme: Finance
notation: REFIP6278

filière administrative
type: ConceptReFip
type: Concept
broader: filière de la fonction publique (non-descripteur)
definition: Filière métier pour les personnels effectuant des tâches principalement administratives.
in scheme: FINANCES PUBLIQUES
in scheme: Personnels et fonctions
in scheme: Fonction publique
in scheme: Fonction Publique et Gestion des Ressources Humaines
notation: REFIP6279

contestation
type: ConceptReFip
type: Concept
broader: principes généraux (non-descripteur)
definition: Remise en cause.
in scheme: FINANCES PUBLIQUES
in scheme: Principes Généraux
in scheme: Droit et Justice
in scheme: Procédure
notation: REFIP628

filiale d'entreprise
type: ConceptReFip
type: Concept
alternative label: filiale
alternative label: société filiale
broader: groupe d'entreprises
definition: Entreprise qui possède une autonomie juridique et la personnalité morale et dont 50% du capital a été formé par des apports réalisés par une autre société dite société mère qui en assure généralement la direction, l'administration et le contrôle par l'intermédiaire d'une ou de plusieurs personnes, administrateurs ou gérants qu'elle a désignés.
in scheme: FINANCES PUBLIQUES
in scheme: Entreprise
in scheme: Entreprises
in scheme: Forme juridique
notation: REFIP6280

Fonds commun de placement
type: ConceptReFip
type: Concept
alternative label: FCP
broader: organisme de placement collectif en valeurs mobilières
definition: Copropriétés d'instruments financiers (valeurs mobilières et instruments financiers à terme) et de dépôts (bancaires) dont les parts sont émises et rachetées, à la demande des porteurs, pour leur valeur liquidative majorée ou diminuée, selon le cas, des frais et commissions . Les FCP n'ont pas de personnalité morale.
in scheme: FINANCES PUBLIQUES
in scheme: Instrument financier
in scheme: Organisme de Placement Collectif en Valeurs Mobilières
in scheme: Finance
narrower: Fonds commun de placement à risque
narrower: Fonds commun de créances
notation: REFIP6281

frais de changement de résidence
type: ConceptReFip
type: Concept
broader: refip-REFIP6766
definition: Frais occasionnés lors d'un changement de résidence administrative pouvant donner lieu à versement d'une indemnité forfaitaire de changement de résidence et à prise en charge des frais de voyage.
in scheme: FINANCES PUBLIQUES
in scheme: Gestion des ressources humaines
in scheme: Rémunération
in scheme: Fonction Publique et Gestion des Ressources Humaines
notation: REFIP6282

filière culturelle
type: ConceptReFip
type: Concept
broader: filière de la fonction publique (non-descripteur)
definition: Filière métier de la fonction de la fonction publique territoriale regroupant l'ensemble des emplois s'occupant de la conservation, l'enrichissement, la mise en valeur du patrimoine et maîtrisant les techniques documentaires. Ses emplois s'exercent au sein des bibliothèques, des musées, des centre d'archives des services culturels d'une collectivité. Elle regroupe également les enseignants des différentes disciplines artistiques (musique, danse, art dramatique, arts plastiques…).
in scheme: FINANCES PUBLIQUES
in scheme: Personnels et fonctions
in scheme: Fonction publique
in scheme: Fonction Publique et Gestion des Ressources Humaines
notation: REFIP6283

franc CFA
type: ConceptReFip
type: Concept
broader: devise
definition: Monnaie commune à plusieurs pays d'Afrique constituant en partie la zone franc d'Afrique centrale (CEMAC) et la zone franc d'Afrique de l'Ouest (UEMOA).
in scheme: FINANCES PUBLIQUES
in scheme: Moyen de paiement
in scheme: Finance
notation: REFIP6284

frais de mission
type: ConceptReFip
type: Concept
broader: refip-REFIP6766
definition: Frais liés aux déplacements professionnels d'un agent, muni d'un ordre de mission, pour se déplacer hors de sa résidence administrative et familiale, comprenant notamment frais de transport, de nourriture et de logement.
in scheme: FINANCES PUBLIQUES
in scheme: Gestion des ressources humaines
in scheme: Rémunération
in scheme: Fonction Publique et Gestion des Ressources Humaines
notation: REFIP6285
related: titre d'abonnement aux transports en commun
related: indemnité de mission

filière technique
type: ConceptReFip
type: Concept
broader: filière de la fonction publique (non-descripteur)
definition: Filière métier pour les personnels effectuant des tâches principalement techniques.
in scheme: FINANCES PUBLIQUES
in scheme: Personnels et fonctions
in scheme: Fonction publique
in scheme: Fonction Publique et Gestion des Ressources Humaines
notation: REFIP6286

faute disciplinaire
type: ConceptReFip
type: Concept
broader: discipline
definition: Toute faute commise par un fonctionnaire dans l'exercice ou à l'occasion de l'exercice de ses fonctions l'expose à une sanction disciplinaire, sans préjudice, le cas échéant, des peines prévues par la loi pénale.
in scheme: FINANCES PUBLIQUES
in scheme: Gestion des ressources humaines
in scheme: Statut du fonctionnaire
in scheme: Fonction Publique et Gestion des Ressources Humaines
narrower: faute personnelle
narrower: faute professionnelle
notation: REFIP6287

fourrière
type: ConceptReFip
type: Concept
alternative label: mise en fourrière
broader: refip-REFIP6842
definition: Lieu de dépôt des voitures qui ont été découvertes sans propriétaire sur la voie publique, ou qui ont été saisis ou encore qui se sont trouvés dans une situation gênant une quelconque activité sur le domaine public.
in scheme: FINANCES PUBLIQUES
in scheme: Questions Politiques Relations Internationales
in scheme: Politique
in scheme: Questions de Société
narrower: frais de gardiennage
notation: REFIP6288

filière sportive
type: ConceptReFip
type: Concept
broader: filière de la fonction publique (non-descripteur)
definition: Filière métier de la fonction publique territoriale regroupant les Opérateurs territoriaux des activités physiques et sportives, les conseillers territoriaux des activités physiques et sportives qui exercent leurs fonctions dans les régions, les départements, les communes et leurs établissements publics.
in scheme: FINANCES PUBLIQUES
in scheme: Personnels et fonctions
in scheme: Fonction publique
in scheme: Fonction Publique et Gestion des Ressources Humaines
notation: REFIP6289

adjoint administratif territorial
type: ConceptReFip
type: Concept
broader: agent administratif territorial
definition: Fonctionnaire territorial de catégorie C chargé de tâches administratives d’exécution, qui supposent la connaissance et comportent l’application de règles administratives et comptables. Il assure également des fonctions d’accueil et assure des travaux de guichet, de correspondance administrative et de comptabilité.
in scheme: FINANCES PUBLIQUES
in scheme: Personnels et fonctions
in scheme: Fonction Publique et Gestion des Ressources Humaines
notation: REFIP629

fonds d'investissement de proximité
type: ConceptReFip
type: Concept
broader: Fonds commun de placement à risque
definition: Fonds communs de placement à risques dont l'actif est constitué, pour 70 % au moins, de titres financiers, parts de société à responsabilité limitée et avances en compte courant, dont au moins 20 % dans de nouvelles entreprises exerçant leur activité ou juridiquement constituées depuis moins de huit ans,
in scheme: FINANCES PUBLIQUES
in scheme: Instrument financier
in scheme: Organisme de Placement Collectif en Valeurs Mobilières
in scheme: Finance
notation: REFIP6290

gratification
type: ConceptReFip
type: Concept
broader: refip-REFIP6766
definition: Rétribution versée à un étudiant ou stagiaire, exonérée de cotisations sociales sous certaines conditions. Elle est obligatoire quand la durée de stage est supérieure à 2 mois consécutifs.
in scheme: FINANCES PUBLIQUES
in scheme: Gestion des ressources humaines
in scheme: Rémunération
in scheme: Fonction Publique et Gestion des Ressources Humaines
notation: REFIP6291

gestionnaire de recette (supprimé)
type: ConceptReFip
type: Concept
broader: ZZ
in scheme: FINANCES PUBLIQUES
notation: REFIP6292

garderie
type: ConceptReFip
type: Concept
alternative label: crèche
alternative label: halte-garderie
broader: action sociale
definition: Structure qui accueille collectivement les enfants pendant la journée.
in scheme: FINANCES PUBLIQUES
in scheme: Santé et Protection Sociale
in scheme: Protection Sociale
in scheme: Questions de Société
notation: REFIP6293

gestion des ressources humaines
type: ConceptReFip
type: Concept
alternative label: GRH
alternative label: ressources humaines
definition: Recouvre l'ensemble des pratiques mises en œuvre pour administrer, mobiliser et développer les ressources humaines impliquées dans l'activité d'un service ou d'une structure publique.
in scheme: FINANCES PUBLIQUES
in scheme: Gestion des ressources humaines
in scheme: Fonction Publique et Gestion des Ressources Humaines
narrower: carrière
narrower: conditions de travail
narrower: document de GRH (non-descripteur)
narrower: formation professionnelle
narrower: gestion prévisionnelle des ressources humaines
narrower: refip-REFIP6725
narrower: refip-REFIP6751
narrower: refip-REFIP6829
narrower: refip-REFIP6916
notation: REFIP6294

géomètre cadastreur des finances publiques
type: ConceptReFip
type: Concept
alternative label: géomètre des finances publiques
alternative label: technicien géomètre des finances publiques
broader: grade de la Direction générale des Finances publiques (non-descripteur)
definition: Grade de la catégorie B de la DGFIP, le géomètre cadastreur participe aux différents travaux liés à la tenue du cadastre et à la gestion de l'assiette des impôts fonciers dans le cadre des missions incombant à la DGFIP. Il assure des travaux de confection, de mise à jour et de gestion des bases informatiques du plan cadastral ; des travaux résultant d'opérations d'aménagements fonciers agricoles et forestiers ; la réalisation de documents d'arpentage pour l'Etat, les collectivités territoriales et les établissements publics.
in scheme: FINANCES PUBLIQUES
in scheme: Personnels et fonctions
in scheme: Fonction publique
in scheme: Fonction Publique et Gestion des Ressources Humaines
notation: REFIP6295
related: géomètre topographe

groupement européen de coopération territoriale
type: ConceptReFip
type: Concept
alternative label: GECT
broader: refip-REFIP6938
definition: Instrument de coopération mis en place par le Parlement européen et le Conseil. Doté de la personnalité juridique, il a pour vocation de répondre aux difficultés rencontrées dans le domaine de la coopération transfrontalière et de faciliter et promouvoir la coopération transfrontalière, transnationale et inter-régionale entre ses membres.
in scheme: FINANCES PUBLIQUES
in scheme: Questions Politiques Relations Internationales
in scheme: Relations Internationales
in scheme: Questions de Société
notation: REFIP6296

gestionnaire des demandes de paiement
type: ConceptReFip
type: Concept
broader: gestionnaire
definition: Fonction dévouée à CHORUS, responsable des demandes de paiement dans un service facturier.
in scheme: FINANCES PUBLIQUES
in scheme: Personnels et fonctions
in scheme: Fonction de la Direction générale des Finances publiques (NON DESCRIPTEUR)
in scheme: Fonction Publique et Gestion des Ressources Humaines
notation: REFIP6297

gens du voyage
type: ConceptReFip
type: Concept
alternative label: accueil des gens du voyage
alternative label: aire d'accueil des gens du voyage
broader: population (non-descripteur)
definition: Communauté des voyageurs ne disposant pas de domicile fixe ;
in scheme: FINANCES PUBLIQUES
in scheme: Famille Education Population
in scheme: Population
in scheme: Questions de Société
notation: REFIP6298

grande entreprise
type: ConceptReFip
type: Concept
broader: entreprise
definition: Entreprise qui vérifie au moins une des deux conditions suivantes : avoir au moins 5000 salariés ou avoir plus de 1,5 milliards d'euros de chiffre d'affaires et plus de 2 milliards d'euros de total de bilan.
in scheme: FINANCES PUBLIQUES
in scheme: Entreprise
in scheme: Entreprises
in scheme: Forme juridique
notation: REFIP6299

préfecture
type: ConceptReFip
type: Concept
broader: département
definition: Division administrative territoriale.
in scheme: FINANCES PUBLIQUES
in scheme: Organisation Territoriale
in scheme: Structures Territoriales
in scheme: Administration de L'Etat
narrower: préfet
notation: REFIP63

contentieux fiscal
type: ConceptReFip
type: Concept
definition: Ensemble des voies de droit au moyen desquelles sont réglés les litiges nés de l'application de la loi par l'administration fiscale.
in scheme: FINANCES PUBLIQUES
in scheme: Contentieux Fiscal
in scheme: Fiscalité
narrower: substitution de base légale
narrower: compensation contentieuse
narrower: contentieux indemnitaire
narrower: réclamation fiscale
narrower: juridiction gracieuse
narrower: décision administrative contentieuse
narrower: contentieux de série
narrower: délai de réclamation
narrower: référé fiscal
narrower: demande en restitution
narrower: mémoire préalable
notation: REFIP630
related: contentieux administratif

gestion de l'entreprise (non-descripteur)
type: ConceptReFip
type: Concept
broader: refip-REFIP6942
definition: Terme ne servant pas à l'indexation
in scheme: FINANCES PUBLIQUES
in scheme: Gestion de l'Entreprise
in scheme: Entreprises
in scheme: Vie et Gestion de l'entreprise
narrower: actionnariat
narrower: comité d'entreprise
narrower: logistique
narrower: conseil d'administration
narrower: portage financier
narrower: portage salarial
narrower: participation financière
narrower: administrateur de société
narrower: assemblée générale
narrower: gérance
narrower: refip-REFIP893
narrower: refip-REFIP998
notation: REFIP6300
scope note: Etiquette de Noeud

groupement européen d'intérêt économique
type: ConceptReFip
type: Concept
alternative label: GEIE
broader: refip-REFIP6938
definition: Entité juridique de droit européen instituée dans le but de faciliter la coopération transnationale entre entreprises et de leur permettre de rationaliser et développer leurs activités économiques.
in scheme: FINANCES PUBLIQUES
in scheme: Questions Politiques Relations Internationales
in scheme: Relations Internationales
in scheme: Questions de Société
notation: REFIP6301

groupe d'entreprises
type: ConceptReFip
type: Concept
alternative label: groupe de sociétés
alternative label: holding
alternative label: société holding
broader: entreprise
definition: Ensemble d'entreprises appartenant à des personnes physiques ou morales juridiquement distinctes et indépendantes les unes des autres dont l'activité est contrôlée par une société mère, qui par l'intermédiaire d'un ou de plusieurs dirigeants, détient sur chacune d'elles un certain pouvoir financier, de gestion et d'administration économique.
in scheme: FINANCES PUBLIQUES
in scheme: Entreprise
in scheme: Entreprises
in scheme: Forme juridique
narrower: filiale d'entreprise
narrower: refip-REFIP6881
notation: REFIP6302

gardien de nuit
type: ConceptReFip
type: Concept
alternative label: veilleur de nuit
broader: fonction (non-descripteur)
definition: Fonctionnaire de catégorie C chargé de surveiller un bâtiment.
in scheme: FINANCES PUBLIQUES
in scheme: Personnels et fonctions
in scheme: Fonction (NON DESCRIPTEUR)
in scheme: Fonction Publique et Gestion des Ressources Humaines
notation: REFIP6303
related: gardiennage

grade
type: ConceptReFip
type: Concept
broader: corps
definition: Subdivision d'un corps relevant d'une catégorie hiérarchique, donnant vocation à occuper un ensemble d’emplois et permettant à l'agent d’exercer alors un certain nombre de fonctions, définies par le statut particulier.
in scheme: FINANCES PUBLIQUES
in scheme: Gestion des ressources humaines
in scheme: Statut du fonctionnaire
in scheme: Fonction Publique et Gestion des Ressources Humaines
notation: REFIP6304

gestionnaire
type: ConceptReFip
type: Concept
broader: fonction de la Direction générale des finances publiques (non-descripteur)
in scheme: FINANCES PUBLIQUES
in scheme: Personnels et fonctions
in scheme: Fonction de la Direction générale des Finances publiques (NON DESCRIPTEUR)
in scheme: Fonction Publique et Gestion des Ressources Humaines
narrower: gestionnaire des demandes de paiement
narrower: gestionnaire du service fait
narrower: gestionnaire de tiers clients
narrower: gestionnaire de tiers fournisseurs
narrower: refip-REFIP7138
notation: REFIP6305

garde forestier
type: ConceptReFip
type: Concept
broader: fonction publique territoriale
definition: Fonctionnaire territorial de catégorie B rattaché à l'Office national des forêts. Il prend part aux diverses activités techniques de la forêt, patrouille et protège l'intégrité du terrain dont il a la charge et garantit la sécurité de la faune et de la flore, en luttant par exemple contre le braconnage, la cueillette d'espèces menacées ou le vol de bois.
in scheme: FINANCES PUBLIQUES
in scheme: Personnels et fonctions
in scheme: Fonction publique
in scheme: Fonction Publique et Gestion des Ressources Humaines
notation: REFIP6306

grossesse
type: ConceptReFip
type: Concept
broader: santé (non-descripteur)
definition: État d’une femme enceinte.
in scheme: FINANCES PUBLIQUES
in scheme: Santé et Protection Sociale
in scheme: Santé
in scheme: Questions de Société
narrower: déclaration de grossesse
notation: REFIP6307

garde d'enfant
type: ConceptReFip
type: Concept
alternative label: garde d'enfant à domicile
alternative label: garde à domicile
broader: action sociale
definition: Métier , personne salariée gardant des enfants à son, domicile
in scheme: FINANCES PUBLIQUES
in scheme: Santé et Protection Sociale
in scheme: Protection Sociale
in scheme: Questions de Société
narrower: assistante maternelle
notation: REFIP6308
scope note: Profession

gestionnaire du service fait
type: ConceptReFip
type: Concept
broader: gestionnaire
definition: Fonction dévouée à CHORUS, responsable du service fait dans un centre de services partagés.
in scheme: FINANCES PUBLIQUES
in scheme: Personnels et fonctions
in scheme: Fonction de la Direction générale des Finances publiques (NON DESCRIPTEUR)
in scheme: Fonction Publique et Gestion des Ressources Humaines
notation: REFIP6309

dépenses d'intervention
type: ConceptReFip
type: Concept
alternative label: charges d'intervention
broader: dépenses de l'Etat
definition: Les charges d’intervention sont les transferts, les versements sans contrepartie équivalente au profit des ménages, des entreprises, des collectivités territoriales et autres collectivités). Il s'agit aussi des charges résultant de la mise en jeu de la garantie de l’État : les dépenses d’intervention des collectivités territoriales sont les dépenses effectuées au titre des compétences qui leur ont été transférées par l’État.
in scheme: FINANCES PUBLIQUES
in scheme: Dépenses publiques
in scheme: Gestion Publique
narrower: frais de secours
notation: REFIP631
related: intervention économique

gestion prévisionnelle des ressources humaines
type: ConceptReFip
type: Concept
alternative label: GPRH
broader: gestion des ressources humaines
definition: Gestion visant à anticiper l’impact des réformes, à adapter les modes de gestion des ressources humaines, à enrichir et valoriser les compétences des agents publics. Dans son approche pluriannuelle de la GRH, elle se fonde en amont sur les orientations stratégiques de la politique RH découlant notamment des évolutions prévisibles des services (missions, organisation, ressources…) et sur l’analyse de données quantitatives et qualitatives relatives à la gestion prévisionnelle des emplois des effectifs et des compétences. Elle conduit à l’élaboration de plans d’actions qui portent sur l’ensemble des actes de la GRH.
in scheme: FINANCES PUBLIQUES
in scheme: Gestion des ressources humaines
in scheme: Gestion prévisionnelle des ressources humaines
in scheme: Fonction Publique et Gestion des Ressources Humaines
narrower: autorisation d'emploi
narrower: document prévisionnel de gestion des crédits de personnel et des emplois
narrower: effectif
narrower: emploi
narrower: équivalent temps plein travaillé
narrower: équivalent temps plein emploi
narrower: refip-REFIP6939
notation: REFIP6310

gestionnaire de fiches immobilisations (supprimé)
type: ConceptReFip
type: Concept
broader: ZZ
in scheme: FINANCES PUBLIQUES
notation: REFIP6311

garantie sociale des chefs et dirigeants d'entreprises (supprimé)
type: ConceptReFip
type: Concept
broader: ZZ
in scheme: FINANCES PUBLIQUES
notation: REFIP6312

garantie de rémunération
type: ConceptReFip
type: Concept
broader: refip-REFIP6807
definition: Dispositif visant à compenser une perte de rémunération subie par l'agent à la suite d'un changement d'affectation consécutif à une opération de restructuration ou d'une suppression d'emploi. La garantie est versée principalement sous forme d'indemnité d'accompagnement à la mobilité (IAM) ou de complément indemnitaire d'accompagnement (CIA).
in scheme: FINANCES PUBLIQUES
in scheme: Gestion des ressources humaines
in scheme: Rémunération
in scheme: Fonction Publique et Gestion des Ressources Humaines
notation: REFIP6313
related: indemnité d'accompagnement à la mobilité

gardien d'immeuble
type: ConceptReFip
type: Concept
alternative label: concierge
broader: fonction (non-descripteur)
definition: Fonctionnaire de catégorie C veillant au maintien de l’état de propreté des parties communes et au bon fonctionnement des installations techniques. Il assure également une relation d’accueil et d’information.
in scheme: FINANCES PUBLIQUES
in scheme: Personnels et fonctions
in scheme: Fonction (NON DESCRIPTEUR)
in scheme: Fonction Publique et Gestion des Ressources Humaines
notation: REFIP6314
related: gardiennage

géomètre principal des finances publiques
type: ConceptReFip
type: Concept
broader: grade de la Direction générale des Finances publiques (non-descripteur)
definition: Grade de la catégorie B de la DGFIP, les géomètres principaux exercent les fonctions dévolues aux géomètres des finances publiques.
in scheme: FINANCES PUBLIQUES
in scheme: Personnels et fonctions
in scheme: Fonction publique
in scheme: Fonction Publique et Gestion des Ressources Humaines
notation: REFIP6315

gestionnaire de tiers clients
type: ConceptReFip
type: Concept
broader: gestionnaire
definition: Le tiers est soit client lorsque l’État vend soit fournisseur lorsque l’État achète. La gestion des tiers dans CHORUS nécessite la mise en place d'un gestionnaire qui gère une base nationale unique, contrairement à NDL. Les tiers qu'ils soient clients de l’État, sont contrôlés au travers des RIB et de la qualité du référentiel.
in scheme: FINANCES PUBLIQUES
in scheme: Personnels et fonctions
in scheme: Fonction de la Direction générale des Finances publiques (NON DESCRIPTEUR)
in scheme: Fonction Publique et Gestion des Ressources Humaines
notation: REFIP6316

gestionnaire de tiers fournisseurs
type: ConceptReFip
type: Concept
broader: gestionnaire
definition: Le tiers est soit client lorsque l’État vend soit fournisseur lorsque l’État achète. La gestion des tiers dans CHORUS nécessite la mise en place d'un gestionnaire qui gère une base nationale unique, contrairement à NDL. Les tiers qu'ils soient clients de l’État, sont contrôlés au travers des RIB et de la qualité du référentiel.
in scheme: FINANCES PUBLIQUES
in scheme: Personnels et fonctions
in scheme: Fonction Publique et Gestion des Ressources Humaines
notation: REFIP6317

garde champêtre
type: ConceptReFip
type: Concept
broader: fonction publique territoriale
definition: Fonctionnaire territorial, communal ou intercommunal, de catégorie C, ayant pour mission la protection du domaine rural.
in scheme: FINANCES PUBLIQUES
in scheme: Personnels et fonctions
in scheme: Fonction publique
in scheme: Fonction Publique et Gestion des Ressources Humaines
notation: REFIP6318

garantie civile (supprimé)
type: ConceptReFip
type: Concept
broader: ZZ
in scheme: FINANCES PUBLIQUES
notation: REFIP6319

tribunal correctionnel
type: ConceptReFip
type: Concept
broader: juridiction pénale
definition: Formation du tribunal de grande instance compétente en matière de délit pénal.
in scheme: FINANCES PUBLIQUES
in scheme: Droit et Justice
in scheme: Juridiction
in scheme: Organisation Juridictionnelle
notation: REFIP632

gestionnaire de la comptabilité d'analyse des coûts (supprimé)
type: ConceptReFip
type: Concept
broader: ZZ
in scheme: FINANCES PUBLIQUES
notation: REFIP6320

heure supplémentaire
type: ConceptReFip
type: Concept
broader: refip-REFIP6916
definition: Heures effectuées à la demande du chef de service, en cas de crise ou d'urgence avérée, en dépassement des bornes horaires définies par le cycle de travail. Le nombre d’heures supplémentaires accomplies ne peut dépasser un contingent mensuel de 25. Les heures supplémentaires peuvent être compensées, ou indemnisées pour les seules catégories B et C.
in scheme: FINANCES PUBLIQUES
in scheme: Gestion des ressources humaines
in scheme: Temps de travail
in scheme: Fonction Publique et Gestion des Ressources Humaines
notation: REFIP6321

horaires variables
type: ConceptReFip
type: Concept
broader: refip-REFIP6916
definition: Organisation du temps de travail selon laquelle chaque agent a le choix de ses horaires journaliers de travail au regard de ses besoins personnels dans le respect du règlement intérieur de son service et des contraintes propres au service.
in scheme: FINANCES PUBLIQUES
in scheme: Gestion des ressources humaines
in scheme: Temps de travail
in scheme: Fonction Publique et Gestion des Ressources Humaines
notation: REFIP6322

habitat insalubre
type: ConceptReFip
type: Concept
alternative label: habitat indigne
alternative label: immeuble insalubre
broader: logement
definition: Logement présentant, par lui-même ou par ses conditions d’occupation, un danger pour la santé de ses occupants et du voisinage.
in scheme: FINANCES PUBLIQUES
in scheme: Aménagement du territoire Urbanisme Habitat
in scheme: Habitat
in scheme: Questions de Société
notation: REFIP6323

hospitalisation
type: ConceptReFip
type: Concept
broader: santé (non-descripteur)
definition: Admission d’un patient dans un établissement de santé.
in scheme: FINANCES PUBLIQUES
in scheme: Santé et Protection Sociale
in scheme: Santé
in scheme: Questions de Société
narrower: établissement de santé privé
narrower: frais hospitalier
narrower: hospitalisation à domicile
narrower: malade hospitalisé
notation: REFIP6324
related: établissement public de santé

huissier des finances publiques
type: ConceptReFip
type: Concept
alternative label: huissier du Trésor public
broader: grade de la Direction générale des Finances publiques (non-descripteur)
definition: Personnel de catégorie A de la DGFIP habilité à signifier tous les actes juridiques rendus nécessaires pour le recouvrement des créances publiques dans les conditions définies par décret .
in scheme: FINANCES PUBLIQUES
in scheme: Personnels et fonctions
in scheme: Fonction publique
in scheme: Fonction Publique et Gestion des Ressources Humaines
notation: REFIP6325

heure complémentaire
type: ConceptReFip
type: Concept
broader: refip-REFIP6916
definition: Heure réalisée par un agent à temps non complet, rémunérée sur la base du taux horaire résultant d’une proratisation de son traitement et donc sans majoration.
in scheme: FINANCES PUBLIQUES
in scheme: Gestion des ressources humaines
in scheme: Temps de travail
in scheme: Fonction Publique et Gestion des Ressources Humaines
notation: REFIP6326

harmonisation indemnitaire
type: ConceptReFip
type: Concept
alternative label: rationalisation indemnitaire
alternative label: réforme indemnitaire
broader: refip-REFIP6807
definition: Processus de passage en revue des divers régimes indemnitaires existants notamment en cas de réorganisation (fusion de filières ou de structures), permettant d'aboutir à une harmonisation des indemnités, à une rationalisation de leur nombre, et à une précision sur leurs modalités d'utilisation.
in scheme: FINANCES PUBLIQUES
in scheme: Gestion des ressources humaines
in scheme: Rémunération
in scheme: Fonction Publique et Gestion des Ressources Humaines
notation: REFIP6327

hippodrome
type: ConceptReFip
type: Concept
alternative label: champ de course
broader: équipement sportif
definition: Champ de courses hippiques.
in scheme: FINANCES PUBLIQUES
in scheme: Culture et Loisirs
in scheme: Loisirs
in scheme: Questions de Société
notation: REFIP6328

hospitalisation à domicile
type: ConceptReFip
type: Concept
broader: hospitalisation
definition: Forme d'hospitalisation permettant d'assurer au domicile des soins médicaux et paramédicaux importants, pour une période limitée mais renouvelable en fonction de l'évolution de l'état de santé.
in scheme: FINANCES PUBLIQUES
in scheme: Santé et Protection Sociale
in scheme: Santé
in scheme: Questions de Société
notation: REFIP6329
related: refip-REFIP6834

jugement
type: ConceptReFip
type: Concept
broader: décision de justice
definition: Toute décision juridictionnelle prise par un ou plusieurs magistrats. Ou désigne l'action d'examiner une affaire en vue de lui donner une solution.
in scheme: FINANCES PUBLIQUES
in scheme: Principes Généraux
in scheme: Droit et Justice
in scheme: Procédure
narrower: jugement de conversion
narrower: jugement d'ouverture
notation: REFIP633

hospitalisation d'office (supprimé)
type: ConceptReFip
type: Concept
broader: ZZ
in scheme: FINANCES PUBLIQUES
notation: REFIP6330

handicap
type: ConceptReFip
type: Concept
broader: santé (non-descripteur)
definition: Incapacité d'une personne à vivre et à agir dans son environnement en raison de déficiences physiques, mentales, ou sensorielles.
in scheme: FINANCES PUBLIQUES
in scheme: Santé et Protection Sociale
in scheme: Santé
in scheme: Questions de Société
narrower: dépendance
notation: REFIP6331

Haut fonctionnaire de défense et de sécurité
type: ConceptReFip
type: Concept
alternative label: HFDS
broader: fonction publique de l'Etat
definition: Haut fonctionnaire des ministères économiques et financiers nommé par décret, sur proposition des ministres auprès desquels il est placé. Fonction confiée à Bercy, depuis mai 2010, au Secrétaire général des ministères économiques et financiers. Il conseille et assiste pour toutes les questions relatives aux mesures de défense et de sécurité, et aux situations d'urgence affectant la défense, la sécurité et la vie de la nation, tout particulièrement dans le domaine économique.
in scheme: FINANCES PUBLIQUES
in scheme: Personnels et fonctions
in scheme: Fonction publique
in scheme: Fonction Publique et Gestion des Ressources Humaines
notation: REFIP6332

harcèlement
type: ConceptReFip
type: Concept
alternative label: harcèlement moral
alternative label: harcèlement sexuel
broader: refip-REFIP6738
definition: Répétition de propos et de comportements ayant pour but ou effet une dégradation des conditions de vie de la victime, se traduisant par des conséquences sur la santé physique ou mentale de la personne harcelée.
in scheme: FINANCES PUBLIQUES
in scheme: Gestion des ressources humaines
in scheme: Conditions de travail
in scheme: Fonction Publique et Gestion des Ressources Humaines
notation: REFIP6333

hygiène du travail
type: ConceptReFip
type: Concept
broader: conditions de travail
definition: Selon la définition du Bureau International du Travail (BIT), science et art de détecter, d'évaluer et de maîtriser les nuisances et les facteurs de l'environnement professionnel qui peuvent altérer la santé et le bien-être des travailleurs et des membres de la communauté.
in scheme: FINANCES PUBLIQUES
in scheme: Gestion des ressources humaines
in scheme: Conditions de travail
in scheme: Fonction Publique et Gestion des Ressources Humaines
notation: REFIP6334

habitation à loyer modéré
type: ConceptReFip
type: Concept
alternative label: HLM
broader: logement social
definition: Logement social géré par un organisme d'habitations à loyer modéré qui bénéficie d'un financement public partiel dont le loyer est largement inférieur à ceux du secteur locatif privé.
in scheme: FINANCES PUBLIQUES
in scheme: Aménagement du territoire Urbanisme Habitat
in scheme: Habitat
in scheme: Questions de Société
notation: REFIP6335

hors-échelle
type: ConceptReFip
type: Concept
alternative label: emploi hors échelle
alternative label: emploi supérieur hors échelle
broader: refip-REFIP6879
definition: Classement de certains cadres d'emplois et emplois fonctionnels à un échelon auquel correspond un traitement indiciaire supérieur au traitement afférent à certain indice majoré.
in scheme: FINANCES PUBLIQUES
in scheme: Gestion des ressources humaines
in scheme: Statut du fonctionnaire
in scheme: Fonction Publique et Gestion des Ressources Humaines
notation: REFIP6336

habitat
type: ConceptReFip
type: Concept
alternative label: habitation
broader: aménagement du territoire urbanisme habitat (non-descripteur)
definition: Ensemble des conditions relatives au logement.
in scheme: FINANCES PUBLIQUES
in scheme: Aménagement du territoire Urbanisme Habitat
in scheme: Habitat
in scheme: Questions de Société
narrower: accession à la propriété
narrower: amélioration de l'habitat
narrower: cohabitation
narrower: immeuble d'habitation
narrower: location
narrower: refip-REFIP6616
narrower: refip-REFIP6709
narrower: refip-REFIP6759
narrower: refip-REFIP6764
notation: REFIP6337

indemnité parlementaire (supprimé)
type: ConceptReFip
type: Concept
broader: ZZ
in scheme: FINANCES PUBLIQUES
notation: REFIP6338

inspecteur spécialisé des finances publiques
type: ConceptReFip
type: Concept
broader: grade de la Direction générale des Finances publiques (non-descripteur)
definition: Grade de la catégorie A de la DGFIP appartenant au corps des inspecteurs spécialisés de la DGFIP, ils effectuent des missions de contrôle fiscal ou des missions d'expertise des comptes publics. La liste des emplois d'inspecteur spécialisé est fixée par arrêté du ministre chargé du budget.
in scheme: FINANCES PUBLIQUES
in scheme: Personnels et fonctions
in scheme: Fonction publique
in scheme: Fonction Publique et Gestion des Ressources Humaines
notation: REFIP6339

indemnité d'éloignement
type: ConceptReFip
type: Concept
alternative label: prime d'éloignement
broader: indemnité
definition: Rémunération accessoire ouverte aux agents affectés en Nouvelle-Calédonie, en Polynésie française et dans les îles Wallis et Futuna à la condition que cette affectation entraîne, pour les agents concernés, un déplacement effectif pour aller servir en dehors du territoire dans lequel est situé le centre de ses intérêts matériels et moraux.
in scheme: FINANCES PUBLIQUES
in scheme: Gestion des ressources humaines
in scheme: Rémunération
in scheme: Fonction Publique et Gestion des Ressources Humaines
notation: REFIP6340

inspecteur divisionnaire des finances publiques de classe normale
type: ConceptReFip
type: Concept
alternative label: inspecteur départemental des impôts de 2ème classe
alternative label: inspecteur départemental des impôts de 3eme classe
alternative label: receveur percepteur du Trésor public
alternative label: trésorier principal du Trésor public
broader: grade de la Direction générale des Finances publiques (non-descripteur)
definition: Grade de catégorie A de la DGFIP, nommé par le ministre chargé du Budget, les inspecteurs divisionnaires de classe normale (IDIV CN) sont choisis parmi les inspecteurs (I) des finances publiques ayant atteint au moins le 9e échelon et comptant au moins sept ans de services effectifs dans un corps de catégorie A. Les IDIV peuvent se voir confier au sein d’une direction régionale, départementale ou locale des finances publiques ou d’une direction spécialisée relevant de la direction générale des finances publiques ou auprès d’un responsable d’un service à compétence nationale relevant de la DGFiP, la responsabilité d’un service notamment d’un service de contrôle fiscal ou des fonctions d’encadrement au sein de ces services ou la responsabilité d’un poste comptable ou les fonctions d’adjoint au responsable d’un tel poste. Ils peuvent également assurer des missions d’expertise ou des missions particulières au sein de ces structures ou en administration centrale.
in scheme: FINANCES PUBLIQUES
in scheme: Personnels et fonctions
in scheme: Fonction publique
in scheme: Fonction Publique et Gestion des Ressources Humaines
notation: REFIP6341

indemnité de conseil
type: ConceptReFip
type: Concept
broader: indemnité
definition: Rémunération accessoire versée aux comptables publics apportant personnellement une aide technique aux collectivités territoriales, en dehors des prestations obligatoires inhérentes à leurs fonctions de comptable assignataire, en matière budgétaire, économique, financière, fiscale et comptable.
in scheme: FINANCES PUBLIQUES
in scheme: Gestion des ressources humaines
in scheme: Rémunération
in scheme: Fonction Publique et Gestion des Ressources Humaines
notation: REFIP6342

inaptitude professionnelle (supprimé)
type: ConceptReFip
type: Concept
broader: ZZ
in scheme: FINANCES PUBLIQUES
notation: REFIP6343

indemnité compensatrice
type: ConceptReFip
type: Concept
broader: indemnité
definition: Rémunération destinée à compenser certains types de dépenses.
in scheme: FINANCES PUBLIQUES
in scheme: Gestion des ressources humaines
in scheme: Rémunération
in scheme: Fonction Publique et Gestion des Ressources Humaines
narrower: indemnité compensatrice de congés annuels
narrower: indemnité compensatrice pour frais de transport
notation: REFIP6344

indemnité d'engagement de service public exclusif (supprimé)
type: ConceptReFip
type: Concept
broader: ZZ
in scheme: FINANCES PUBLIQUES
notation: REFIP6345

indemnité de performance et de fonctions (supprimé)
type: ConceptReFip
type: Concept
broader: ZZ
in scheme: FINANCES PUBLIQUES
notation: REFIP6346

indemnité exceptionnelle compensant les effets de la hausse de la contribution sociale généralisée (obsolète)
type: ConceptReFip
type: Concept
is replaced by: indemnité dégressive
broader: ZZ
in scheme: FINANCES PUBLIQUES
notation: REFIP6347

indemnité forfaitaire pour travaux supplémentaires des services déconcentrés (obsolète)
type: ConceptReFip
type: Concept
is replaced by: indemnité forfaitaire pour travaux supplémentaires
broader: ZZ
in scheme: FINANCES PUBLIQUES
notation: REFIP6348

indemnité forfaitaire complémentaire pour élections
type: ConceptReFip
type: Concept
alternative label: IFCE
broader: indemnité forfaitaire
definition: Rémunération accessoire versée aux agents territoriaux effectuant des travaux supplémentaires lors de consultations électorales.
in scheme: FINANCES PUBLIQUES
in scheme: Gestion des ressources humaines
in scheme: Rémunération
in scheme: Fonction Publique et Gestion des Ressources Humaines
notation: REFIP6349

frais de reprographie
type: ConceptReFip
type: Concept
broader: dépenses de fonctionnement
definition: Dépenses afférentes à des frais de reproduction de documents.
in scheme: FINANCES PUBLIQUES
in scheme: Dépenses publiques
in scheme: Gestion Publique
notation: REFIP635

incapacité de travail (supprimé)
type: ConceptReFip
type: Concept
broader: ZZ
in scheme: FINANCES PUBLIQUES
notation: REFIP6350

indemnité de gestion
type: ConceptReFip
type: Concept
broader: indemnité
definition: Rémunération accessoire versée à certains personnels comptables ou non comptables.
in scheme: FINANCES PUBLIQUES
in scheme: Gestion des ressources humaines
in scheme: Rémunération
in scheme: Fonction Publique et Gestion des Ressources Humaines
notation: REFIP6351

immeuble de rapport
type: ConceptReFip
type: Concept
broader: immeuble d'habitation
definition: Bâtiment à usage de bureaux ou d'habitations conçu comme un placement par le propriétaire ou les propriétaires.
in scheme: FINANCES PUBLIQUES
in scheme: Aménagement du territoire Urbanisme Habitat
in scheme: Habitat
in scheme: Questions de Société
notation: REFIP6352

indemnité de formation
type: ConceptReFip
type: Concept
alternative label: indemnité d'enseignement
alternative label: indemnité horaire d'enseignement
alternative label: indemnité pour enseignement complémentaire
broader: indemnité
definition: Rémunération accessoire versée à un agent participant à des actions de formation et ou d'enseignement.
in scheme: FINANCES PUBLIQUES
in scheme: Gestion des ressources humaines
in scheme: Rémunération
in scheme: Fonction Publique et Gestion des Ressources Humaines
notation: REFIP6353

indemnité de responsabilité
type: ConceptReFip
type: Concept
broader: indemnité
definition: Rémunération accessoire versée aux agents exerçant certaines fonctions à responsabilité (ex : régisseurs, directeurs etc).
in scheme: FINANCES PUBLIQUES
in scheme: Gestion des ressources humaines
in scheme: Rémunération
in scheme: Fonction Publique et Gestion des Ressources Humaines
notation: REFIP6354

indemnité forfaitaire de déplacement dans le département
type: ConceptReFip
type: Concept
broader: indemnité forfaitaire
definition: Rémunération accessoire versée à certains personnels itinérants de la DGFIP jusqu'au 31 août 2014.
in scheme: FINANCES PUBLIQUES
in scheme: Gestion des ressources humaines
in scheme: Rémunération
in scheme: Fonction Publique et Gestion des Ressources Humaines
notation: REFIP6355
scope note: Supprimée depuis le 11/12/2014

indemnité forfaitaire pour travaux supplémentaires
type: ConceptReFip
type: Concept
alternative label: IFTS
alternative label: indemnité forfaitaire pour travaux supplémentaires des administrations centrales
alternative label: indemnité forfaitaire pour travaux supplémentaires des services déconcentrés
broader: indemnité forfaitaire
definition: Rémunération accessoire versée aux agents de catégorie A et B,sous conditions indiciaire, variant suivant le supplément de travail fourni et l’importance des sujétions auxquelles le bénéficiaire est appelé à faire face dans l’exercice effectif de ses fonctions.
in scheme: FINANCES PUBLIQUES
in scheme: Gestion des ressources humaines
in scheme: Rémunération
in scheme: Fonction Publique et Gestion des Ressources Humaines
notation: REFIP6356

immeuble
type: ConceptReFip
type: Concept
alternative label: bien immeuble
broader: droit civil
definition: Bien non susceptible d'être déplacé ou qui est réputé (par la loi ou la jurisprudence) comme ne pouvant être déplacé.
in scheme: FINANCES PUBLIQUES
in scheme: Droit et Justice
in scheme: Divisions du Droit
in scheme: Droit Privé
narrower: immeuble à usage mixte
narrower: bien vacant et sans maître
narrower: immeuble par destination
narrower: immeuble menaçant ruine
notation: REFIP6357

indemnité spécifique de service
type: ConceptReFip
type: Concept
broader: indemnité
definition: Rémunération accessoire versée aux agents des cadre d'emploi d'ingénieurs et de techniciens territoriaux, et liée au service rendu, sans que ceux-ci soient limités à une participation directe à la conception ou à la réalisation de travaux.
in scheme: FINANCES PUBLIQUES
in scheme: Gestion des ressources humaines
in scheme: Rémunération
in scheme: Fonction Publique et Gestion des Ressources Humaines
notation: REFIP6358

insuffisance professionnelle
type: ConceptReFip
type: Concept
broader: carrière
definition: Inaptitude d'un agent à exercer les fonctions de son corps.
in scheme: FINANCES PUBLIQUES
in scheme: Gestion des ressources humaines
in scheme: Carrière
in scheme: Fonction Publique et Gestion des Ressources Humaines
notation: REFIP6359

indemnité horaire pour travail du dimanche et des jours fériés (supprimé)
type: ConceptReFip
type: Concept
is replaced by: indemnité pour travail du dimanche et des jours fériés
broader: ZZ
in scheme: FINANCES PUBLIQUES
notation: REFIP6360

inspecteur des finances publiques
type: ConceptReFip
type: Concept
alternative label: inspecteur des impôts
alternative label: inspecteur du Trésor public
broader: grade de la Direction générale des Finances publiques (non-descripteur)
definition: Personnel de catégorie A de la DGFIP participant au sein d’une direction régionale, départementale ou locale des finances publiques ou d’une direction spécialisée de la DGFIP ou auprès d’un responsable d’un service à compétence nationale relevant de la DGFiP, aux travaux d’expertise ou de conception dans le cadre des missions incombant à la DGFiP. Ils peuvent se voir confier l’encadrement de personnels de catégorie B et C. Ils assurent notamment la responsabilité des opérations d’assiette et de recouvrement, la réalisation des opérations de contrôle fiscal et les travaux de contentieux de l’impôt. Ils peuvent se voir confier la responsabilité des opérations relevant de la comptabilité et du contrôle des dépenses et recettes de l’Etat, des établissements publics et des collectivités territoriales. Ils peuvent se voir confier la responsabilité d’un poste comptable ou les fonctions d’adjoint au responsable d’un tel poste ainsi que les fonctions d’huissier.
in scheme: FINANCES PUBLIQUES
in scheme: Personnels et fonctions
in scheme: Fonction publique
in scheme: Fonction Publique et Gestion des Ressources Humaines
notation: REFIP6361

indice majoré
type: ConceptReFip
type: Concept
alternative label: indice net majoré
broader: refip-REFIP6677
definition: Indice de traitement, permettant le calcul du traitement des agents.
in scheme: FINANCES PUBLIQUES
in scheme: Gestion des ressources humaines
in scheme: Rémunération
in scheme: Fonction Publique et Gestion des Ressources Humaines
notation: REFIP6362

indemnité de feu (supprimé)
type: ConceptReFip
type: Concept
broader: ZZ
in scheme: FINANCES PUBLIQUES
notation: REFIP6363

irrégularité
type: ConceptReFip
type: Concept
broader: mots outils (liste additive)
definition: Non conformité à la règle.
in scheme: FINANCES PUBLIQUES
in scheme: Mots Outils
notation: REFIP6364

indemnité forfaitaire pour travaux supplémentaires des administrations centrales (obsolète)
type: ConceptReFip
type: Concept
is replaced by: indemnité forfaitaire pour travaux supplémentaires
broader: ZZ
in scheme: FINANCES PUBLIQUES
notation: REFIP6365

indemnité pour travaux dangereux insalubres incommodes ou salissants (supprimé)
type: ConceptReFip
type: Concept
broader: ZZ
in scheme: FINANCES PUBLIQUES
notation: REFIP6366

indemnité de cherté de vie (supprimé)
type: ConceptReFip
type: Concept
broader: ZZ
in scheme: FINANCES PUBLIQUES
notation: REFIP6367

indemnité de départ en retraite
type: ConceptReFip
type: Concept
broader: indemnité
definition: Indemnité versée aux contractuels régis par des contrats de droit privé (à la date de départ en retraite).
in scheme: FINANCES PUBLIQUES
in scheme: Gestion des ressources humaines
in scheme: Rémunération
in scheme: Fonction Publique et Gestion des Ressources Humaines
notation: REFIP6368

indemnité de mission
type: ConceptReFip
type: Concept
broader: indemnité
definition: Indemnisation versée à un agent en mission, comprenant le remboursement forfaitaire des frais de repas et le remboursement forfaitaire des frais d'hébergement.
in scheme: FINANCES PUBLIQUES
in scheme: Gestion des ressources humaines
in scheme: Rémunération
in scheme: Fonction Publique et Gestion des Ressources Humaines
notation: REFIP6369
related: frais de mission

défaut de publication des actes
type: ConceptReFip
type: Concept
broader: publicité d'acte juridique
definition: Absence de publication. La publication est un mode de publicité employé normalement en matière d'actes législatifs et réglementaires, et consistant à diffuser la connaissance de l'acte en cause au moyen de modes de communication de masse, en particulier par l'insertion dans un recueil officiel de textes (ex le Journal Officiel pour l’État).
in scheme: FINANCES PUBLIQUES
in scheme: Droit et Justice
in scheme: Divisions du Droit
in scheme: Droit Privé
notation: REFIP637

indemnité de sujétions d'activité (supprimé)
type: ConceptReFip
type: Concept
broader: ZZ
in scheme: FINANCES PUBLIQUES
notation: REFIP6370

identifiant DGFIP
type: ConceptReFip
type: Concept
alternative label: identifiant agent
broader: carrière
definition: Matricule attribué à chaque agent de la DGFIP.
in scheme: FINANCES PUBLIQUES
in scheme: Gestion des ressources humaines
in scheme: Carrière
in scheme: Fonction Publique et Gestion des Ressources Humaines
notation: REFIP6371

indemnité de caisse et de responsabilité
type: ConceptReFip
type: Concept
alternative label: indemnité de caisse
broader: indemnité
definition: Indemnité allouée aux agents comptables des services de l'Etat dotés d'un budget annexe et aux comptables des établissements publics nationaux. Son montant est déterminé au regard du budget de fonctionnement de l'établissement et/ou en fonction des dispositions du texte institutif de l'établissement concerné
in scheme: FINANCES PUBLIQUES
in scheme: Gestion des ressources humaines
in scheme: Rémunération
in scheme: Fonction Publique et Gestion des Ressources Humaines
notation: REFIP6372

indemnité de garantie individuelle du pouvoir d'achat
type: ConceptReFip
type: Concept
alternative label: GIPA
broader: indemnité
definition: Prime versée au fonctionnaire lorsque l'avancement automatique à l'ancienneté et le montant de revalorisation annuel de la valeur du point fonction publique sont inférieurs à l'inflation, sur une période de référence de 4 ans. Son objectif est de garantir le maintien de pouvoir d'achat des agents.
in scheme: FINANCES PUBLIQUES
in scheme: Gestion des ressources humaines
in scheme: Rémunération
in scheme: Fonction Publique et Gestion des Ressources Humaines
notation: REFIP6373

instrument financier à terme
type: ConceptReFip
type: Concept
alternative label: contrat financier
alternative label: contrat à terme
broader: instrument financier
definition: Contrat financier irrévocable par lequel une des contreparties (établissements financiers) s'engage à acheter ou à vendre à un certain prix, à une date d’échéance donnée, un actif pouvant porter sur une devise, un taux d’intérêt, une action, un indice ou encore des matières premières.
in scheme: FINANCES PUBLIQUES
in scheme: Instrument financier
in scheme: Instrument financier à terme
in scheme: Finance
narrower: refip-REFIP6845
notation: REFIP6374

instrument financier
type: ConceptReFip
type: Concept
alternative label: produit financier
broader: refip-REFIP79
definition: Titres et contrats financiers. Les titres sont principalement les titres de capital émis par les sociétés par actions, les titres de créance, ainsi que les parts ou actions d'organismes de placement collectif. Les contrats financiers, également dénommés " instruments financiers à terme ", sont les contrats à terme qui figurent sur une liste fixée par décret.
in scheme: FINANCES PUBLIQUES
in scheme: Instrument financier
in scheme: Finance
narrower: organisme de placement collectif en valeurs mobilières
narrower: emprunt
narrower: instrument financier à terme
narrower: refip-REFIP6573
narrower: refip-REFIP6956
notation: REFIP6375

incompatibilité de fonction
type: ConceptReFip
type: Concept
broader: refip-REFIP6565
definition: Interdiction légale de cumuler soit certaines fonctions publiques, soit certains mandants électifs, soit une fonction publique ou un mandat électif avec certaines situations privées.
in scheme: FINANCES PUBLIQUES
in scheme: Gestion des ressources humaines
in scheme: Statut du fonctionnaire
in scheme: Fonction Publique et Gestion des Ressources Humaines
notation: REFIP6376

indemnité mensuelle de technicité
type: ConceptReFip
type: Concept
alternative label: IMT
broader: indemnité
definition: Rémunération accessoire versée aux agents visant à rétribuer l'exercice de certaines fonctions exigeant un certain niveau de qualification et de technicité.
in scheme: FINANCES PUBLIQUES
in scheme: Gestion des ressources humaines
in scheme: Rémunération
in scheme: Fonction Publique et Gestion des Ressources Humaines
notation: REFIP6377

indemnité de technicité pour conduite de véhicule ou d'engin (supprimé)
type: ConceptReFip
type: Concept
broader: ZZ
in scheme: FINANCES PUBLIQUES
notation: REFIP6378

installation classée
type: ConceptReFip
type: Concept
broader: protection de l'environnement
definition: Toute exploitation industrielle ou agricole susceptible de créer des risques ou de provoquer des pollutions ou nuisances, notamment pour la sécurité et la santé des riverains.
in scheme: FINANCES PUBLIQUES
in scheme: Environnement
in scheme: Protection de l'Environnement
in scheme: Questions de Société
notation: REFIP6379

intégration du fonctionnaire
type: ConceptReFip
type: Concept
broader: carrière
definition: Acte portant accession d'un fonctionnaire à un corps ou nouveau corps.
in scheme: FINANCES PUBLIQUES
in scheme: Gestion des ressources humaines
in scheme: Carrière
in scheme: Fonction Publique et Gestion des Ressources Humaines
notation: REFIP6380

indemnité de fonctions
type: ConceptReFip
type: Concept
broader: indemnité
definition: Rémunération accessoire versée à un agent s'acquittant de fonctions particulières.
in scheme: FINANCES PUBLIQUES
in scheme: Gestion des ressources humaines
in scheme: Rémunération
in scheme: Fonction Publique et Gestion des Ressources Humaines
notation: REFIP6381

indemnité de mutation (supprimé)
type: ConceptReFip
type: Concept
broader: ZZ
in scheme: FINANCES PUBLIQUES
notation: REFIP6382

indemnité dégressive
type: ConceptReFip
type: Concept
replaces: indemnité exceptionnelle compensant les effets de la hausse de la contribution sociale généralisée (obsolète)
broader: indemnité
definition: Rémunération accessoire dégressive versée mensuellement aux fonctionnaires qui percevaient l'indemnité exceptionnelle en 2014. Son montant décroît en fonction des gains liés à l'avancement de carrière de l'agent dès lors qu'il est rémunéré à un indice supérieur à l'indice majoré 400.
in scheme: FINANCES PUBLIQUES
in scheme: Gestion des ressources humaines
in scheme: Rémunération
in scheme: Fonction Publique et Gestion des Ressources Humaines
notation: REFIP6383
note: Remplace l'indemnité exceptionnelle compensant les effets de la hausse de la contribution sociale généralisée à compter du 29 avril 2015

indemnité compensatrice de congés annuels
type: ConceptReFip
type: Concept
broader: indemnité compensatrice
definition: Rémunération destinée à compenser les congés annuels non pris par l’agent contractuel ou auxiliaire, du fait de l’administration, au moment de la rupture de son engagement.
in scheme: FINANCES PUBLIQUES
in scheme: Gestion des ressources humaines
in scheme: Rémunération
in scheme: Fonction Publique et Gestion des Ressources Humaines
notation: REFIP6384

impayé
type: ConceptReFip
type: Concept
broader: refip-REFIP6685
definition: Créance non honorée par le débiteur et qui se concrétise par le rejet du moyen de paiement (chèque, prélèvement etc...).
in scheme: FINANCES PUBLIQUES
in scheme: Paiement
in scheme: Finance
notation: REFIP6385

indemnité spéciale
type: ConceptReFip
type: Concept
broader: indemnité
definition: Rémunération accessoire versée dans certaines circonstances à certains fonctionnaires.
in scheme: FINANCES PUBLIQUES
in scheme: Gestion des ressources humaines
in scheme: Rémunération
in scheme: Fonction Publique et Gestion des Ressources Humaines
narrower: indemnité spéciale de terrain
notation: REFIP6386

indemnité de sujétions spéciales
type: ConceptReFip
type: Concept
broader: indemnité
definition: Rémunération accessoire attribuée pour compenser les contraintes subies et les risques encourus dans l'exercice des fonctions. Cette indemnité est d'application interministérielle et propre à certaines administrations.
in scheme: FINANCES PUBLIQUES
in scheme: Gestion des ressources humaines
in scheme: Rémunération
in scheme: Fonction Publique et Gestion des Ressources Humaines
notation: REFIP6387

indemnité compensatrice pour frais de transport
type: ConceptReFip
type: Concept
alternative label: indemnité compensatoire pour frais de transport en Corse
broader: indemnité compensatrice
definition: Rémunération destinée à compenser les dépenses de transports, sous certaines conditions, des fonctionnaires et agents des collectivités territoriales et de leurs établissements publics.
in scheme: FINANCES PUBLIQUES
in scheme: Gestion des ressources humaines
in scheme: Rémunération
in scheme: Fonction Publique et Gestion des Ressources Humaines
notation: REFIP6388
related: titre d'abonnement aux transports en commun

incident de paiement
type: ConceptReFip
type: Concept
broader: refip-REFIP6685
definition: Tout rejet par la banque d'un ordre de paiement par chèque, virement ou prélèvement pour défaut ou insuffisance de provision. Il génère des frais.
in scheme: FINANCES PUBLIQUES
in scheme: Paiement
in scheme: Finance
notation: REFIP6389

Hautes-Pyrénées
type: ConceptReFip
type: Concept
broader: refip-REFIP7036
definition: Département français
in scheme: FINANCES PUBLIQUES
in scheme: Géographie
in scheme: Europe
notation: REFIP639

indemnité de double résidence (supprimé)
type: ConceptReFip
type: Concept
broader: ZZ
in scheme: FINANCES PUBLIQUES
notation: REFIP6390

immeuble d'habitation
type: ConceptReFip
type: Concept
alternative label: bâtiment d'habitation
broader: habitat
definition: Bâtiment collectif à usage d'habitation.
in scheme: FINANCES PUBLIQUES
in scheme: Aménagement du territoire Urbanisme Habitat
in scheme: Habitat
in scheme: Questions de Société
narrower: ascenseur
narrower: immeuble de rapport
narrower: logement
narrower: refip-REFIP6549
notation: REFIP6391

indemnité de déplacement
type: ConceptReFip
type: Concept
broader: indemnité
definition: Rémunération accessoire versée à un agent appelé à se déplacer pour les besoins du service, pour effectuer un stage ou pour assurer un intérim, hors de sa résidence administrative ou familiale.
in scheme: FINANCES PUBLIQUES
in scheme: Gestion des ressources humaines
in scheme: Rémunération
in scheme: Fonction Publique et Gestion des Ressources Humaines
notation: REFIP6392

insolvabilité
type: ConceptReFip
type: Concept
alternative label: solvabilité
broader: organisation d'insolvabilité
definition: Incapacité d'une personne physique ou morale à payer ses dettes sur le court, moyen et long terme.
in scheme: FINANCES PUBLIQUES
in scheme: Droit de Contrôle de l'Administration
in scheme: Fiscalité
notation: REFIP6393

indemnité d'expatriation
type: ConceptReFip
type: Concept
broader: indemnité
definition: Rémunération accessoire versée aux expatriés, dont le montant varie selon le pays et le groupe d’indemnité de résidence auquel ils appartiennent.
in scheme: FINANCES PUBLIQUES
in scheme: Gestion des ressources humaines
in scheme: Rémunération
in scheme: Fonction Publique et Gestion des Ressources Humaines
notation: REFIP6394

indemnité de panier
type: ConceptReFip
type: Concept
broader: indemnité
definition: Rémunération accessoire versée aux fonctionnaires et agents territoriaux accomplissant leurs fonctions entre 21 heures et 6 heures, pendant au moins 6 heures consécutives.
in scheme: FINANCES PUBLIQUES
in scheme: Gestion des ressources humaines
in scheme: Rémunération
in scheme: Fonction Publique et Gestion des Ressources Humaines
notation: REFIP6395

indemnité de stage
type: ConceptReFip
type: Concept
broader: indemnité
definition: Indemnités versées aux agents appelés à effectuer un stage de formation initiale préalable à titularisation.
in scheme: FINANCES PUBLIQUES
in scheme: Gestion des ressources humaines
in scheme: Rémunération
in scheme: Fonction Publique et Gestion des Ressources Humaines
notation: REFIP6396

incapacité permanente partielle
type: ConceptReFip
type: Concept
alternative label: IPP
broader: refip-REFIP6828
definition: Importance des séquelles qui subsisteront définitivement et qui diminuent la capacité physique ou mentale d'une personne victime d'un accident du travail ou d'une maladie professionnelle. Elle est évaluée par un médecin expert afin de déterminer les indemnités que pourra percevoir le fonctionnaire.
in scheme: FINANCES PUBLIQUES
in scheme: Gestion des ressources humaines
in scheme: Conditions de travail
in scheme: Fonction Publique et Gestion des Ressources Humaines
notation: REFIP6397

intérêt légal
type: ConceptReFip
type: Concept
broader: intérêts
definition: Somme d'argent due au créancier en cas de retard de paiement par le débiteur. Le taux de l'intérêt légal est fixé chaque semestre par arrêté du ministre chargé de l'économie.
in scheme: FINANCES PUBLIQUES
in scheme: Systeme bancaire et financier
in scheme: Secteur bancaire
in scheme: Finance
notation: REFIP6398

indice brut
type: ConceptReFip
type: Concept
broader: refip-REFIP6677
definition: Indice de carrière, et déterminant la position de l'agent sur une échelle indiciaire.
in scheme: FINANCES PUBLIQUES
in scheme: Gestion des ressources humaines
in scheme: Rémunération
in scheme: Fonction Publique et Gestion des Ressources Humaines
notation: REFIP6399

déduction pour aléas
type: ConceptReFip
type: Concept
broader: déduction fiscale
definition: Dispositif institué au profit des exploitants agricoles soumis à un régime réel d'imposition et qui ont souscrit une assurance couvrant les dommages aux cultures ou la mortalité du bétail, afin de déduire, sous certaines conditions et dans certaines limites, au titre de chaque exercice, de leur bénéfice imposable, une certaine somme.
in scheme: FINANCES PUBLIQUES
in scheme: Liquidation de l'Impôt
in scheme: Fiscalité
notation: REFIP64
scope note: Permet aux exploitants agricoles de déduire annuellement une partie de leur bénéfice imposable

contribution exceptionnelle de solidarité
type: ConceptReFip
type: Concept
alternative label: CES
broader: taxes et participations assises sur les salaires (non-descripteur)
definition: Contribution versée par tous les agents de l’État, des collectivités territoriales et des établissements publics administratifs, ainsi que les salariés qui ne sont pas affiliés au régime de l'assurance chômage. Cette contribution alimente le Fonds de solidarité.
in scheme: FINANCES PUBLIQUES
in scheme: Fiscalité
in scheme: Impôt
notation: REFIP640
scope note: Suppression de la contribution exceptionnelle de solidarité à compter du 1er janvier 2018

indemnité différentielle
type: ConceptReFip
type: Concept
broader: indemnité
definition: Rémunération accessoire versée aux agents percevant une rémunération inférieure à une valeur de référence, dans certains cas limitativement prévus par la loi.
in scheme: FINANCES PUBLIQUES
in scheme: Gestion des ressources humaines
in scheme: Rémunération
in scheme: Fonction Publique et Gestion des Ressources Humaines
notation: REFIP6400

indemnité particulière de sujétion et d'installation
type: ConceptReFip
type: Concept
alternative label: IPSI
broader: indemnité
definition: Rémunération accessoire versée aux agents titulaires ou stagiaires affectés dans certains départements d’outre-mer avant le 1er octobre 2013, variant selon le type de collectivité et des fonctions et grades du fonctionnaire.
in scheme: FINANCES PUBLIQUES
in scheme: Gestion des ressources humaines
in scheme: Rémunération
in scheme: Fonction Publique et Gestion des Ressources Humaines
notation: REFIP6401
scope note: Remplacée par l'indemnité de sujétion géographique à compter du 1er octobre 2013

insertion des personnes handicapées
type: ConceptReFip
type: Concept
broader: accès à la fonction publique
definition: Ensemble de dispositions légales visant à favoriser l'emploi et l'égalité des chances et des droits pour les personnes handicapées.
in scheme: FINANCES PUBLIQUES
in scheme: Gestion des ressources humaines
in scheme: Carrière
in scheme: Fonction Publique et Gestion des Ressources Humaines
notation: REFIP6402

immigré
type: ConceptReFip
type: Concept
alternative label: immigration
broader: refip-REFIP6619
definition: Personne née étrangère à l'étranger et résidant en France.
in scheme: FINANCES PUBLIQUES
in scheme: Famille Education Population
in scheme: Population
in scheme: Questions de Société
notation: REFIP6403

indemnité de préavis
type: ConceptReFip
type: Concept
broader: indemnité
definition: Indemnité compensatrice dont peut bénéficier, dans certains cas, le salarié qui n'exécute pas son préavis. Le montant de l'indemnité compensatrice est calculée en tenant compte de la durée du préavis non effectuée.
in scheme: FINANCES PUBLIQUES
in scheme: Gestion des ressources humaines
in scheme: Rémunération
in scheme: Fonction Publique et Gestion des Ressources Humaines
notation: REFIP6404

indemnité exceptionnelle
type: ConceptReFip
type: Concept
broader: indemnité
definition: Rémunération accessoire dont le versement est conditionné par un événement particulier
in scheme: FINANCES PUBLIQUES
in scheme: Gestion des ressources humaines
in scheme: Rémunération
in scheme: Fonction Publique et Gestion des Ressources Humaines
notation: REFIP6405

indemnité exceptionnelle de mutation (supprimé)
type: ConceptReFip
type: Concept
broader: ZZ
in scheme: FINANCES PUBLIQUES
notation: REFIP6406

invalide de guerre
type: ConceptReFip
type: Concept
alternative label: mutilé de guerre
broader: population (non-descripteur)
definition: Personne souffrant d'une infirmité due à la guerre, de blessures ou maladies contractées par le fait ou à l'occasion du service.
in scheme: FINANCES PUBLIQUES
in scheme: Famille Education Population
in scheme: Population
in scheme: Questions de Société
notation: REFIP6407
related: invalidité

indemnité d'accompagnement à la mobilité
type: ConceptReFip
type: Concept
alternative label: IAM
broader: indemnité
definition: Garantie de rémunération versée à un agent fonctionnaire qui, dans le cadre d'une restructuration de son service à l'initiative de l'administration, est conduit à exercer ses fonctions dans un autre emploi, et qui subirait à cette occasion une perte financière. Elle correspond à la différence entre le montant indemnitaire effectivement perçu dans son emploi d'origine et celui en vigueur dans le corps, cadre d'emploi ou emploi d’accueil.
in scheme: FINANCES PUBLIQUES
in scheme: Gestion des ressources humaines
in scheme: Rémunération
in scheme: Fonction Publique et Gestion des Ressources Humaines
notation: REFIP6408
related: garantie de rémunération

impôt
type: ConceptReFip
type: Concept
alternative label: cotisation d'impôt
alternative label: imposition
alternative label: taxe
definition: Prestation pécuniaire, requise des personnes physiques ou morales, par voie d'autorité et à titre obligatoire, perçu à titre définitif, sans contrepartie identifiable. Il peut être perçu au profit de l'État, des collectivités territoriales et des établissements publics de coopération intercommunale.
in scheme: FINANCES PUBLIQUES
in scheme: Fiscalité
in scheme: Impôt
narrower: impôt acquitté hors de France
narrower: prélèvement obligatoire
narrower: imposition supplémentaire
narrower: impôts et taxes affectés
narrower: impôt direct
narrower: taxe additionnelle
narrower: caractère confiscatoire
narrower: imposition tardive
narrower: autres taxes, droits ou redevances (non-descripteur)
narrower: taxes assimilées aux impôts directs locaux (non descripteur)
narrower: taxes et participations assises sur les salaires (non-descripteur)
narrower: taxes et redevance de nature immobilière (non-descripteur)
narrower: droits d'enregistrement
narrower: refip-REFIP824
narrower: refip-REFIP934
notation: REFIP6409

responsabilité contractuelle
type: ConceptReFip
type: Concept
broader: responsabilité civile
definition: Obligation pour le contractant qui ne remplit pas (en tout, en partie, ou à temps) une obligation que le contrat mettait à sa charge, de réparer (en nature si possible sinon en argent) le dommage causé à l'autre partie.
in scheme: FINANCES PUBLIQUES
in scheme: Droit et Justice
in scheme: Divisions du Droit
in scheme: Droit Privé
notation: REFIP641

incapacité temporaire de travail
type: ConceptReFip
type: Concept
alternative label: ITT
alternative label: incapacité temporaire partielle
alternative label: incapacité temporaire totale
broader: refip-REFIP6828
definition: Période pendant laquelle un fonctionnaire est inapte physiquement à exercer une quelconque activité.
in scheme: FINANCES PUBLIQUES
in scheme: Gestion des ressources humaines
in scheme: Conditions de travail
in scheme: Fonction Publique et Gestion des Ressources Humaines
notation: REFIP6410

inspecteur stagiaire des finances publiques
type: ConceptReFip
type: Concept
alternative label: inspecteur stagiaire des impôts
alternative label: inspecteur stagiaire du Trésor public
broader: grade de la Direction générale des Finances publiques (non-descripteur)
definition: Grade de la catégorie A de la DGFIP, les inspecteurs stagiaires suivent à compter de leur nomination un cycle de formation d'une durée de dix-huit mois qui comprend, d'une part, une période de formation professionnelle d'un an à l'issue de laquelle ils ont vocation à être titularisés et, d'autre part, une formation d'adaptation d'une durée de six mois.
in scheme: FINANCES PUBLIQUES
in scheme: Personnels et fonctions
in scheme: Fonction publique
in scheme: Fonction Publique et Gestion des Ressources Humaines
notation: REFIP6411

indemnité d'exercice de missions des préfectures
type: ConceptReFip
type: Concept
alternative label: IEMP
broader: indemnité
definition: Rémunération accessoire versée aux agents territoriaux, après une décision du conseil délibérant, aux fonctionnaires des filières administrative, technique et sociale qui participent aux missions des préfectures dans lesquelles ils sont affectés.
in scheme: FINANCES PUBLIQUES
in scheme: Gestion des ressources humaines
in scheme: Rémunération
in scheme: Fonction Publique et Gestion des Ressources Humaines
notation: REFIP6412

indemnité de logement
type: ConceptReFip
type: Concept
alternative label: indemnité compensatrice de logement
broader: indemnité
definition: Rémunération accessoire versée à un agent en principe bénéficiaire d'un logement de fonction et à qui l'administration ne peut lui en allouer un.
in scheme: FINANCES PUBLIQUES
in scheme: Gestion des ressources humaines
in scheme: Rémunération
in scheme: Fonction Publique et Gestion des Ressources Humaines
notation: REFIP6413
related: logement de fonction

information syndicale
type: ConceptReFip
type: Concept
replaces: heure mensuelle d'information syndicale (obsolète)
alternative label: heure mensuelle d'information syndicale
alternative label: réunion syndicale
broader: dialogue social
definition: Ensemble d'informations diffusées lors de réunions, par voie d'affichage, de tracts ou par messages électroniques par les organisations syndicales
in scheme: FINANCES PUBLIQUES
in scheme: Gestion des ressources humaines
in scheme: Statut du fonctionnaire
in scheme: Fonction Publique et Gestion des Ressources Humaines
notation: REFIP6414

Institution de retraite complémentaire des agents non titulaires de l'Etat et des collectivités publiques
type: ConceptReFip
type: Concept
alternative label: IRCANTEC
broader: refip-REFIP6737
definition: A la fois régime réglementaire proposant aux agents non titulaires de l'Etat et des collectivités publiques un régime complémentaire au régime général et au régime agricole et caisse de retraite complémentaire des salariés de droit public, des agents non titulaires de la fonction publique.
in scheme: FINANCES PUBLIQUES
in scheme: Santé et Protection Sociale
in scheme: Protection Sociale
in scheme: Questions de Société
notation: REFIP6415

indemnité de départ volontaire
type: ConceptReFip
type: Concept
broader: indemnité
definition: Prime versée à tout agent de la fonction publique quittant définitivement ses fonctions s'il remplit certaines conditions, celles-ci variant selon le motif à l'origine du départ.
in scheme: FINANCES PUBLIQUES
in scheme: Gestion des ressources humaines
in scheme: Rémunération
in scheme: Fonction Publique et Gestion des Ressources Humaines
notation: REFIP6416

indemnité complémentaire de restructuration (supprimé)
type: ConceptReFip
type: Concept
broader: ZZ
in scheme: FINANCES PUBLIQUES
notation: REFIP6417

ingénieur territorial
type: ConceptReFip
type: Concept
broader: agent technique territorial
definition: Fonctionnaire territorial de catégorie A constituant un cadre d'emploi scientifique et technique.
in scheme: FINANCES PUBLIQUES
in scheme: Personnels et fonctions
in scheme: Fonction publique
in scheme: Fonction Publique et Gestion des Ressources Humaines
notation: REFIP6418

indemnité forfaitaire de frais de représentation (supprimé)
type: ConceptReFip
type: Concept
broader: ZZ
in scheme: FINANCES PUBLIQUES
notation: REFIP6419

inspecteur général des finances (supprimé)
type: ConceptReFip
type: Concept
broader: ZZ
in scheme: FINANCES PUBLIQUES
notation: REFIP6420

indemnité pour le gardiennage des églises communales
type: ConceptReFip
type: Concept
broader: indemnité
definition: Rémunération accessoire allouée par les communes aux prêtres assurant le gardiennage des églises communales dont ils sont affectataires. Elle peut également être allouée à un agent territorial assurant effectivement le gardiennage lorsque les circonstances locales l’exigent.
in scheme: FINANCES PUBLIQUES
in scheme: Gestion des ressources humaines
in scheme: Rémunération
in scheme: Fonction Publique et Gestion des Ressources Humaines
notation: REFIP6421

incapacité permanente de travail
type: ConceptReFip
type: Concept
alternative label: IPT
broader: refip-REFIP6828
definition: Perte définitive de la capacité à travailler, à la suite d'une maladie professionnelle ou d'un accident du travail. Entraîne mise en retraite pour invalidité et ouvre droit au versement d'une rente viagère d'invalidité cumulable avec la pension de retraite.
in scheme: FINANCES PUBLIQUES
in scheme: Gestion des ressources humaines
in scheme: Conditions de travail
in scheme: Fonction Publique et Gestion des Ressources Humaines
notation: REFIP6422

indemnité exceptionnelle de sommet de grade (supprimé)
type: ConceptReFip
type: Concept
broader: ZZ
in scheme: FINANCES PUBLIQUES
notation: REFIP6423

indemnité forfaitaire de changement de résidence
type: ConceptReFip
type: Concept
alternative label: indemnité de changement de résidence
broader: indemnité forfaitaire
definition: Indemnité forfaitaire versée à un agent dans le cadre de son changement de résidence administrative
in scheme: FINANCES PUBLIQUES
in scheme: Gestion des ressources humaines
in scheme: Rémunération
in scheme: Fonction Publique et Gestion des Ressources Humaines
notation: REFIP6424

intérêts d'emprunt
type: ConceptReFip
type: Concept
broader: intérêts
definition: Coût monétaire d'un emprunt. Les intérêts d'emprunt correspondent à la rémunération du créancier et pour l'emprunteur ils correspondent au loyer du capital qui a été mis à sa disposition.
in scheme: FINANCES PUBLIQUES
in scheme: Systeme bancaire et financier
in scheme: Secteur bancaire
in scheme: Finance
narrower: annuité d'emprunt
narrower: bonification d'intérêt
notation: REFIP6425

indemnité d'assurance
type: ConceptReFip
type: Concept
broader: contrat d'assurance
definition: Somme versée par la compagnie d'assurance, après un sinistre, à l'assuré.
in scheme: FINANCES PUBLIQUES
in scheme: Assurances
in scheme: Finance
notation: REFIP6426
related: refip-REFIP6861

indemnité de technicité (supprimé)
type: ConceptReFip
type: Concept
broader: ZZ
in scheme: FINANCES PUBLIQUES
notation: REFIP6427

inspecteur central du Trésor (supprimé)
type: ConceptReFip
type: Concept
broader: ZZ
in scheme: FINANCES PUBLIQUES
notation: REFIP6428

imputation
type: ConceptReFip
type: Concept
broader: mots outils (liste additive)
definition: Affectation d'une somme à un compte déterminé dont elle doit être déduite.
in scheme: FINANCES PUBLIQUES
in scheme: Mots Outils
notation: REFIP6429

aide à l'exportation
type: ConceptReFip
type: Concept
alternative label: aide publique à l'export
alternative label: aide à l'export
broader: aide aux entreprises
definition: Destinées aux PME et TPE françaises ayant pour objectif de soutenir un projet à vocation export clairement identifié : par exemple, conclure un contrat avec un nouveau client, agent ou distributeur ou envoyer une mission pour prospecter de nouveaux marchés.
in scheme: FINANCES PUBLIQUES
in scheme: Dépenses publiques
in scheme: Gestion Publique
notation: REFIP643

indemnité de jury d'examen et de concours
type: ConceptReFip
type: Concept
broader: indemnité
definition: Rémunération accessoire versée aux agents apportant leur concours en qualité de membres de jury d’examen et de concours.
in scheme: FINANCES PUBLIQUES
in scheme: Gestion des ressources humaines
in scheme: Rémunération
in scheme: Fonction Publique et Gestion des Ressources Humaines
notation: REFIP6430

indemnité journalière d'assurance maladie maternité
type: ConceptReFip
type: Concept
broader: refip-REFIP6700
definition: Somme versée par l'Assurance maladie à l'assuré dans le cas d'un arrêt de travail pour maladie, d'arrêt maternité, d'arrêt pour maladie professionnelle ou en cas d' accident du travail.
in scheme: FINANCES PUBLIQUES
in scheme: Santé et Protection Sociale
in scheme: Protection Sociale
in scheme: Questions de Société
notation: REFIP6431

indemnité
type: ConceptReFip
type: Concept
broader: refip-REFIP6807
definition: Rémunération accessoire non incluse dans le traitement, et versée en rémunération d'une sujétion de service ou en remboursement d'une dépense avancée par l'agent que l'employeur prend en charge.
in scheme: FINANCES PUBLIQUES
in scheme: Gestion des ressources humaines
in scheme: Rémunération
in scheme: Fonction Publique et Gestion des Ressources Humaines
narrower: indemnité d'administration et de technicité
narrower: indemnité de licenciement
narrower: indemnité temporaire
narrower: indemnité forfaitaire
narrower: prime d'accueil
narrower: indemnité pour travail du dimanche et des jours fériés
narrower: allocation complémentaire de fonctions
narrower: allocation d'aide à la mobilité du conjoint
narrower: indemnité d'éloignement
narrower: indemnité de conseil
narrower: indemnité compensatrice
narrower: indemnité de gestion
narrower: indemnité de formation
narrower: indemnité de responsabilité
narrower: indemnité spécifique de service
narrower: indemnité de départ en retraite
narrower: indemnité de mission
narrower: indemnité de caisse et de responsabilité
narrower: indemnité de garantie individuelle du pouvoir d'achat
narrower: indemnité mensuelle de technicité
narrower: indemnité de fonctions
narrower: indemnité dégressive
narrower: indemnité spéciale
narrower: indemnité de sujétions spéciales
narrower: indemnité de déplacement
narrower: indemnité d'expatriation
narrower: indemnité de panier
narrower: indemnité de stage
narrower: indemnité différentielle
narrower: indemnité particulière de sujétion et d'installation
narrower: indemnité de préavis
narrower: indemnité exceptionnelle
narrower: indemnité d'accompagnement à la mobilité
narrower: indemnité d'exercice de missions des préfectures
narrower: indemnité de logement
narrower: indemnité de départ volontaire
narrower: indemnité pour le gardiennage des églises communales
narrower: indemnité de jury d'examen et de concours
narrower: indemnité de sujétion géographique
narrower: indemnité de résidence
narrower: indemnité d'astreinte
narrower: indemnité horaire pour travaux supplémentaires
narrower: refip-REFIP6583
narrower: refip-REFIP6591
narrower: refip-REFIP6604
narrower: refip-REFIP6624
narrower: refip-REFIP6629
narrower: refip-REFIP6636
narrower: refip-REFIP664
narrower: refip-REFIP6641
narrower: refip-REFIP6668
narrower: refip-REFIP6671
narrower: refip-REFIP6672
narrower: refip-REFIP6683
narrower: refip-REFIP6687
narrower: refip-REFIP6692
narrower: refip-REFIP6695
narrower: refip-REFIP6702
narrower: refip-REFIP7052
narrower: refip-REFIP7055
narrower: refip-REFIP7203
narrower: refip-REFIP7204
narrower: refip-REFIP7229
notation: REFIP6432

intérêts
type: ConceptReFip
type: Concept
broader: refip-REFIP6835
definition: Rémunération d'un prêt, sous forme généralement d'un versement périodique de l'emprunteur au prêteur. Pour le prêteur, c'est le prix de sa renonciation temporaire à la liquidité. Pour l'emprunteur, c'est un coût correspondant à une utilisation anticipée.
in scheme: FINANCES PUBLIQUES
in scheme: Systeme bancaire et financier
in scheme: Secteur bancaire
in scheme: Finance
narrower: commissions
narrower: intérêt légal
narrower: intérêts d'emprunt
narrower: refip-REFIP6932
notation: REFIP6433

indemnité spéciale de fonctions (supprimé)
type: ConceptReFip
type: Concept
broader: ZZ
in scheme: FINANCES PUBLIQUES
notation: REFIP6434

indemnité de sujétion géographique
type: ConceptReFip
type: Concept
broader: indemnité
definition: Rémunération accessoire versée aux fonctionnaires de l’État et aux magistrats, titulaires et stagiaires affectés en Guyane, à Saint-Martin, à Saint-Pierre-et-Miquelon, à Saint-Barthélemy ou à Mayotte, s'ils y accomplissent une durée minimale de quatre années consécutives de services.
in scheme: FINANCES PUBLIQUES
in scheme: Gestion des ressources humaines
in scheme: Rémunération
in scheme: Fonction Publique et Gestion des Ressources Humaines
notation: REFIP6435
scope note: Remplace l’indemnité particulière de sujétion et d'installation à compter du 1er octobre 2013

indemnité spéciale de terrain
type: ConceptReFip
type: Concept
broader: indemnité spéciale
definition: Rémunération accessoire versée à certains agents du cadastre jusqu'au 30 juin 2014 en contrepartie de divers frais qu'ils sont tenus de supporter dans l'exercice de leur fonction.
in scheme: FINANCES PUBLIQUES
in scheme: Gestion des ressources humaines
in scheme: Rémunération
in scheme: Fonction Publique et Gestion des Ressources Humaines
notation: REFIP6436

insuffisance d'actif
type: ConceptReFip
type: Concept
broader: entreprise en difficulté
definition: Fait de ne pas disposer des sommes nécessaires au paiement total des créanciers.
in scheme: FINANCES PUBLIQUES
in scheme: Vie de l'Entreprise
in scheme: Entreprises
in scheme: Vie et Gestion de l'entreprise
notation: REFIP6437

indemnité pour confection de budget (supprimé)
type: ConceptReFip
type: Concept
broader: ZZ
in scheme: FINANCES PUBLIQUES
notation: REFIP6438

interne en médecine
type: ConceptReFip
type: Concept
alternative label: interne des hôpitaux
broader: santé (non-descripteur)
definition: Etudiant universitaire en médecine acquérant une formation clinique à plein temps au sein d'un centre hospitalier universitaire ou d'un cabinet agréé.
in scheme: FINANCES PUBLIQUES
in scheme: Santé et Protection Sociale
in scheme: Santé
in scheme: Questions de Société
notation: REFIP6439

application SYMPA
type: ConceptReFip
type: Concept
alternative label: SYMPA
broader: applications missions transverses (non-descripteur)
definition: Application web qui permet de créer et gérer des listes de diffusion nationales et locales, statiques ou dynamiques, indépendamment du client de messagerie utilisé.
in scheme: FINANCES PUBLIQUES
in scheme: Applications missions transverses
in scheme: Applications Informatiques
notation: REFIP644
related: liste de diffusion

indemnité forfaitaire pour travail dimanche et jours fériés (supprimé)
type: ConceptReFip
type: Concept
is replaced by: indemnité pour travail du dimanche et des jours fériés
broader: ZZ
in scheme: FINANCES PUBLIQUES
notation: REFIP6440

indemnité de résidence
type: ConceptReFip
type: Concept
broader: indemnité
definition: Rémunération accessoire versée aux agents de la fonction publique, calculée sur la base du traitement brut (soumis aux retenues pour pension) fixée par un taux variable réparti en trois zones territoriales, basé sur le lieu de l'établissement où il exerce ses fonctions.
in scheme: FINANCES PUBLIQUES
in scheme: Gestion des ressources humaines
in scheme: Rémunération
in scheme: Fonction Publique et Gestion des Ressources Humaines
notation: REFIP6441

invalidité
type: ConceptReFip
type: Concept
broader: santé (non-descripteur)
definition: Incapacité acquise par un assuré social par suite d'un accident ou d'une maladie non professionnelle ou d'une usure prématurée de l'organisme.
in scheme: FINANCES PUBLIQUES
in scheme: Santé et Protection Sociale
in scheme: Santé
in scheme: Questions de Société
narrower: carte d'invalidité
notation: REFIP6442
related: invalide de guerre

indemnité d'astreinte
type: ConceptReFip
type: Concept
broader: indemnité
definition: Rémunération accessoire attribuée à un agent soumis à une période d'astreinte.
in scheme: FINANCES PUBLIQUES
in scheme: Gestion des ressources humaines
in scheme: Rémunération
in scheme: Fonction Publique et Gestion des Ressources Humaines
notation: REFIP6443

indemnité horaire pour travaux supplémentaires
type: ConceptReFip
type: Concept
alternative label: IHTS
broader: indemnité
definition: Rémunération accessoire versée aux agents de catégorie B et C et aux agents non titulaires de droit public de même niveau et exerçant les mêmes fonctions, et rétribuant le travail effectué au delà de la durée réglementaire.
in scheme: FINANCES PUBLIQUES
in scheme: Gestion des ressources humaines
in scheme: Rémunération
in scheme: Fonction Publique et Gestion des Ressources Humaines
notation: REFIP6444

journée ministre
type: ConceptReFip
type: Concept
broader: refip-REFIP6916
definition: Autorisation d'absence exceptionnelle accordée aux agents.
in scheme: FINANCES PUBLIQUES
in scheme: Gestion des ressources humaines
in scheme: Temps de travail
in scheme: Fonction Publique et Gestion des Ressources Humaines
notation: REFIP6445

jeux de contrepartie
type: ConceptReFip
type: Concept
broader: casino
definition: Jeux dans les casinos : la boule ; la roulette ; le trente et quarante ; le black jack...
in scheme: FINANCES PUBLIQUES
in scheme: Culture et Loisirs
in scheme: Loisirs
in scheme: Questions de Société
notation: REFIP6446

jeune en difficulté
type: ConceptReFip
type: Concept
broader: population (non-descripteur)
definition: Jeunes précarisés et en danger d’exclusion et/ou présentant des troubles du comportement et/ou connaissant des difficultés familiales comme la maltraitance et les violences intra-familiales.
in scheme: FINANCES PUBLIQUES
in scheme: Famille Education Population
in scheme: Population
in scheme: Questions de Société
notation: REFIP6447

jeune entreprise innovante
type: ConceptReFip
type: Concept
alternative label: JEI
broader: refip-REFIP6704
definition: Statut s’appliquant à des petites et moyennes entreprises de moins de 8 ans dont une partie des dépenses est affectée à la recherche. Il permet de bénéficier d'exonérations fiscales et sociales.
in scheme: FINANCES PUBLIQUES
in scheme: Entreprise
in scheme: Entreprises
in scheme: Forme juridique
notation: REFIP6448

jeune travailleur
type: ConceptReFip
type: Concept
broader: population (non-descripteur)
definition: Ensemble des salariés âgés de moins de dix-huit ans et stagiaires âgés de moins de dix-huit ans qui accomplissent des stages d'initiation ou d'application en milieu professionnel dans le cadre d'un enseignement alterné ou du déroulement de leur scolarité.
in scheme: FINANCES PUBLIQUES
in scheme: Famille Education Population
in scheme: Population
in scheme: Questions de Société
notation: REFIP6449

journée de solidarité
type: ConceptReFip
type: Concept
broader: refip-REFIP6916
definition: Journée de travail supplémentaire qui prend la forme d’une journée d'ARTT en moins destinée au financement d’actions en faveur de l’autonomie des personnes âgées ou handicapées.
in scheme: FINANCES PUBLIQUES
in scheme: Gestion des ressources humaines
in scheme: Temps de travail
in scheme: Fonction Publique et Gestion des Ressources Humaines
notation: REFIP6450

jeux en ligne
type: ConceptReFip
type: Concept
broader: loisirs
definition: Jeu numérique qui nécessite une connexion active à un réseau
in scheme: FINANCES PUBLIQUES
in scheme: Culture et Loisirs
in scheme: Loisirs
in scheme: Questions de Société
notation: REFIP6451

jeux de cercle
type: ConceptReFip
type: Concept
broader: casino
definition: Jeux pratiqués dans certains casinos où les joueurs jouent les uns contre les autres.
in scheme: FINANCES PUBLIQUES
in scheme: Culture et Loisirs
in scheme: Loisirs
in scheme: Questions de Société
notation: REFIP6452

jury
type: ConceptReFip
type: Concept
broader: refip-REFIP6779
definition: Commission désignée par une autorité compétente pour apprécier, sélectionner et classer les candidats. Le jury est composé d'un président et de membres.
in scheme: FINANCES PUBLIQUES
in scheme: Gestion des ressources humaines
in scheme: Carrière
in scheme: Fonction Publique et Gestion des Ressources Humaines
notation: REFIP6453

jour de carence
type: ConceptReFip
type: Concept
alternative label: jour de carence pour maladie
alternative label: journée de carence
broader: congé ordinaire de maladie
definition: Jour de congé de maladie non rémunéré.
in scheme: FINANCES PUBLIQUES
in scheme: Gestion des ressources humaines
in scheme: Temps de travail
in scheme: Fonction Publique et Gestion des Ressources Humaines
notation: REFIP6454

jeux d'argent
type: ConceptReFip
type: Concept
alternative label: jeux de hasard
broader: loisirs
definition: Jeu qui permet un gain potentiel en espèces et qui exige une mise de la part des participants.
in scheme: FINANCES PUBLIQUES
in scheme: Culture et Loisirs
in scheme: Loisirs
in scheme: Questions de Société
notation: REFIP6455

logement
type: ConceptReFip
type: Concept
broader: immeuble d'habitation
definition: Local utilisé pour l'habitation.
in scheme: FINANCES PUBLIQUES
in scheme: Aménagement du territoire Urbanisme Habitat
in scheme: Habitat
in scheme: Questions de Société
narrower: habitat insalubre
narrower: logement vacant
narrower: logement de fonction
narrower: logement social
notation: REFIP6456

logement vacant
type: ConceptReFip
type: Concept
broader: logement
definition: Logement individuel ou collectif vide de toute occupation.
in scheme: FINANCES PUBLIQUES
in scheme: Aménagement du territoire Urbanisme Habitat
in scheme: Habitat
in scheme: Questions de Société
notation: REFIP6457

location-accession
type: ConceptReFip
type: Concept
broader: accession à la propriété
definition: Contrat de vente qui permet à un locataire d’acheter un logement après l’avoir loué pendant une période définie avec le propriétaire au moment de la signature du contrat.
in scheme: FINANCES PUBLIQUES
in scheme: Aménagement du territoire Urbanisme Habitat
in scheme: Habitat
in scheme: Questions de Société
notation: REFIP6458

logement de fonction
type: ConceptReFip
type: Concept
broader: logement
definition: Bien à usage d'habitation, attribué aux travailleurs sous forme de rémunération en nature.
in scheme: FINANCES PUBLIQUES
in scheme: Aménagement du territoire Urbanisme Habitat
in scheme: Habitat
in scheme: Questions de Société
notation: REFIP6459
related: concession de logement
related: indemnité de logement

lettre de mission
type: ConceptReFip
type: Concept
alternative label: ordre de mission
broader: document de GRH (non-descripteur)
definition: Document présentant un accord écrit précisant l'ensemble des modalités et objectifs à atteindre pour réaliser une mission.
in scheme: FINANCES PUBLIQUES
in scheme: Gestion des ressources humaines
in scheme: Document de GRH
in scheme: Fonction Publique et Gestion des Ressources Humaines
notation: REFIP6460

location
type: ConceptReFip
type: Concept
alternative label: contrat de location
broader: habitat
definition: Action de donner ou de prendre à bail un local, un véhicule, ou tout autre bien matériel à une personne.
in scheme: FINANCES PUBLIQUES
in scheme: Aménagement du territoire Urbanisme Habitat
in scheme: Habitat
in scheme: Questions de Société
narrower: charges locatives
narrower: état des lieux
narrower: location saisonnière
narrower: locataire
narrower: location meublée
narrower: loyer
narrower: refip-REFIP6864
notation: REFIP6461

ligne de trésorerie
type: ConceptReFip
type: Concept
broader: refip-REFIP6674
definition: Crédit ouvert pour un an par une banque sur lequel un droit de tirage permanent est défini dans les termes d’un contrat passé entre la banque et son client. Elle a pour objectif de couvrir des besoins ponctuels ou saisonniers résultant des éventuels décalages entre les sorties et les entrées de fonds d’un client ou entre les recettes et les dépenses.
in scheme: FINANCES PUBLIQUES
in scheme: Systeme bancaire et financier
in scheme: Secteur bancaire
in scheme: Finance
notation: REFIP6462

La Banque Postale
type: ConceptReFip
type: Concept
alternative label: Banque Postale
alternative label: LBP
alternative label: agence LBP
broader: banque
definition: Banque française née le 1er janvier 2006, héritière des services financiers de La Poste.
in scheme: FINANCES PUBLIQUES
in scheme: Systeme bancaire et financier
in scheme: Etablissement de crédit
in scheme: Finance
notation: REFIP6463

lettre de change
type: ConceptReFip
type: Concept
broader: effet de commerce
definition: Ecrit par lequel le tireur donne l'ordre de payer au tiré, à l'échéance fixée, une certaine somme au bénéficiaire ou au porteur de la lettre. Elle peut faire l'objet d'une acceptation par le tiré qui se reconnaît alors débiteur vis à vis du bénéficiaire. Elle est aussi un moyen de financement grâce au recours à l'escompte.
in scheme: FINANCES PUBLIQUES
in scheme: Moyen de paiement
in scheme: Finance
narrower: lettre de change-relevé
notation: REFIP6464

location saisonnière
type: ConceptReFip
type: Concept
broader: location
definition: Location meublée consentie notamment pendant une période de vacances, conclue pour une durée maximale et non renouvelable de quatre-vingt-dix jours consécutifs.
in scheme: FINANCES PUBLIQUES
in scheme: Aménagement du territoire Urbanisme Habitat
in scheme: Habitat
in scheme: Questions de Société
notation: REFIP6465

lotissement
type: ConceptReFip
type: Concept
broader: aménagement urbain
definition: Division en propriété ou en jouissance d’une unité foncière ou de plusieurs unités foncières contiguës ayant pour objet d’en détacher un ou plusieurs lots destinés à être bâtis.
in scheme: FINANCES PUBLIQUES
in scheme: Aménagement du territoire Urbanisme Habitat
in scheme: Aménagement du Territoire
in scheme: Questions de Société
notation: REFIP6466

limite d'âge
type: ConceptReFip
type: Concept
alternative label: critère d'âge
broader: cessation de fonction
definition: Age au-delà duquel l'agent ne peut plus rester dans une fonction ou se présenter à certains concours.
in scheme: FINANCES PUBLIQUES
in scheme: Gestion des ressources humaines
in scheme: Carrière
in scheme: Fonction Publique et Gestion des Ressources Humaines
notation: REFIP6467
related: accès à la fonction publique

lettre de change-relevé
type: ConceptReFip
type: Concept
broader: lettre de change
definition: Moyen d'échanger des lettres de change de manière dématérialisée.
in scheme: FINANCES PUBLIQUES
in scheme: Moyen de paiement
in scheme: Finance
notation: REFIP6468

local syndical (supprimé)
type: ConceptReFip
type: Concept
broader: ZZ
in scheme: FINANCES PUBLIQUES
notation: REFIP6469

comptabilité M 93
type: ConceptReFip
type: Concept
broader: comptabilité publique locale
definition: Plan comptable M 93 applicable aux établissements publics à caractère scientifique culturel et professionnel.
in scheme: FINANCES PUBLIQUES
in scheme: Secteur public local
in scheme: Gestion Publique
notation: REFIP647

local à usage de bureaux
type: ConceptReFip
type: Concept
broader: local professionnel
definition: Local destiné à accueillir une activité de bureaux.
in scheme: FINANCES PUBLIQUES
in scheme: Cadastre
in scheme: Fiscalité
notation: REFIP6470

locataire
type: ConceptReFip
type: Concept
alternative label: colocataire
broader: location
definition: Personne qui loue un bien.
in scheme: FINANCES PUBLIQUES
in scheme: Aménagement du territoire Urbanisme Habitat
in scheme: Habitat
in scheme: Questions de Société
notation: REFIP6471

liste électorale
type: ConceptReFip
type: Concept
broader: élection politique
definition: Registre comportant tous les noms des citoyens d'une circonscription électorale admis à voter.
in scheme: FINANCES PUBLIQUES
in scheme: Questions Politiques Relations Internationales
in scheme: Politique
in scheme: Questions de Société
notation: REFIP6472

location-attribution
type: ConceptReFip
type: Concept
alternative label: locataire attributaire
broader: accession à la propriété
definition: Contrat par lequel le propriétaire d'un bien s'engage à en transférer la propriété à un acquéreur au terme d'une période donnée et moyennant un prix préalablement fixé.
in scheme: FINANCES PUBLIQUES
in scheme: Aménagement du territoire Urbanisme Habitat
in scheme: Habitat
in scheme: Questions de Société
notation: REFIP6473

lettre-chèque
type: ConceptReFip
type: Concept
alternative label: chèque lettre
broader: chèque bancaire
definition: Formule de chèque imprimée par le client tireur, se présentant sous la forme d’une lettre d'accompagnement et d’un chèque détachable.
in scheme: FINANCES PUBLIQUES
in scheme: Moyen de paiement
in scheme: Finance
notation: REFIP6474

logement-foyer
type: ConceptReFip
type: Concept
alternative label: foyer-logement
broader: logement social
definition: Logement collectif à titre de résidence principale et comportant d'une part des locaux privatifs meublés ou non et d'autre part des locaux affectés à la vie collective. Ces établissements sont le plus souvent destinés au logement de personnes âgées, mais ils accueillent aussi des personnes handicapées, des jeunes travailleurs, des étudiants, des travailleurs migrants ou des personnes défavorisées.
in scheme: FINANCES PUBLIQUES
in scheme: Aménagement du territoire Urbanisme Habitat
in scheme: Habitat
in scheme: Questions de Société
notation: REFIP6475

logement social
type: ConceptReFip
type: Concept
broader: logement
definition: Logement construit avec l'aide financière de l'État, appartenant aux organismes HLM (offices publics d'HLM et sociétés anonymes) ou gérés par eux, afin de loger des personnes aux revenus modestes.
in scheme: FINANCES PUBLIQUES
in scheme: Aménagement du territoire Urbanisme Habitat
in scheme: Habitat
in scheme: Questions de Société
narrower: administrateur des offices publics de l'habitat
narrower: habitation à loyer modéré
narrower: logement-foyer
narrower: refip-REFIP6731
notation: REFIP6476

location-vente
type: ConceptReFip
type: Concept
broader: droit des obligations et contrats (non-descripteur)
definition: Contrat conclu entre un loueur et un locataire qui à un moment quelconque du contrat mais, le plus souvent à l' échéance, peut décider de devenir propriétaire du ou des biens qui en ont été l'objet. Le contrat contient donc de la part du bailleur, une promesse unilatérale de vente dont la réalisation reste subordonnée au paiement du prix fixé à l'avance augmenté des intérêts et des frais. La location-vente peut porter sur des biens d'équipement, un fonds de commerce, de l'outillage, une voiture, un parc automobile ou des biens immobiliers.
in scheme: FINANCES PUBLIQUES
in scheme: Droit et Justice
in scheme: Divisions du Droit
in scheme: Droit Privé
notation: REFIP6477

location meublée
type: ConceptReFip
type: Concept
alternative label: location en meublé
alternative label: logement meublé
broader: location
definition: Local d'habitation équipé d’un mobilier en nombre et en qualités suffisants pour permettre au locataire d’y dormir, manger et vivre convenablement au regard des exigences de la vie courante .
in scheme: FINANCES PUBLIQUES
in scheme: Aménagement du territoire Urbanisme Habitat
in scheme: Habitat
in scheme: Questions de Société
notation: REFIP6478

livret de famille
type: ConceptReFip
type: Concept
broader: famille
definition: Document officiel délivré aux époux à l'occasion de leur mariage. Il contient un extrait de l'acte de mariage des époux et des informations sur le droit de la famille : mariage, filiation, adoption, autorité parentale ...Toute modification liée à l'état civil des personnes inscrites dans le livret (séparation, naissance, adoption...) doit faire l'objet d'une mise à jour.
in scheme: FINANCES PUBLIQUES
in scheme: Famille Education Population
in scheme: Famille
in scheme: Questions de Société
notation: REFIP6479

tribunal de commerce
type: ConceptReFip
type: Concept
broader: juridiction commerciale
definition: Juridiction spécialisée, du premier degré de l'ordre judiciaire, compétente pour juger des contestations relatives aux engagements entre commerçants, des contestations entre associés de sociétés de commerce et celles relatives aux actes de commerce.
in scheme: FINANCES PUBLIQUES
in scheme: Droit et Justice
in scheme: Juridiction
in scheme: Organisation Juridictionnelle
notation: REFIP648

liste d'aptitude
type: ConceptReFip
type: Concept
broader: avancement
definition: Promotion interne, au choix de l'administration, d’un fonctionnaire dans un nouveau corps.
in scheme: FINANCES PUBLIQUES
in scheme: Gestion des ressources humaines
in scheme: Carrière
in scheme: Fonction Publique et Gestion des Ressources Humaines
notation: REFIP6480

lieu de travail
type: ConceptReFip
type: Concept
broader: travail (non-descripteur)
definition: Lieu d'exercice de l'activité professionnelle.
in scheme: FINANCES PUBLIQUES
in scheme: Lieu de Travail
in scheme: Entreprises
in scheme: Travail
narrower: aménagement du lieu de travail
notation: REFIP6481
related: affichage légal

loisirs
type: ConceptReFip
type: Concept
broader: culture et loisirs (non-descripteur)
definition: Activité effectuée durant le temps libre (culturelle, sportive, touristique, de plein air, etc.).
in scheme: FINANCES PUBLIQUES
in scheme: Culture et Loisirs
in scheme: Loisirs
in scheme: Questions de Société
narrower: casino
narrower: corrida
narrower: jeux en ligne
narrower: jeux d'argent
narrower: refip-REFIP6858
notation: REFIP6482

loyer
type: ConceptReFip
type: Concept
alternative label: encadrement des loyers
broader: location
definition: Somme versée par un locataire en contrepartie de la jouissance d'un logement.
in scheme: FINANCES PUBLIQUES
in scheme: Aménagement du territoire Urbanisme Habitat
in scheme: Habitat
in scheme: Questions de Société
notation: REFIP6483

liquidation des droits à pension
type: ConceptReFip
type: Concept
broader: droits à pension
definition: Calcul de la pension de retraite ou d'invalidité.
in scheme: FINANCES PUBLIQUES
in scheme: Gestion des ressources humaines
in scheme: Retraite
in scheme: Fonction Publique et Gestion des Ressources Humaines
notation: REFIP6484

monétique
type: ConceptReFip
type: Concept
broader: monnaie électronique
definition: Ensemble des traitements électroniques, informatiques et télématiques nécessaires à la gestion de cartes bancaires ainsi que des transactions associées.
in scheme: FINANCES PUBLIQUES
in scheme: Moyen de paiement
in scheme: Finance
narrower: carte d'achat
narrower: carte de crédit
narrower: carte bancaire
narrower: refip-REFIP6587
notation: REFIP6485

mandat-lettre (supprimé)
type: ConceptReFip
type: Concept
broader: ZZ
in scheme: FINANCES PUBLIQUES
notation: REFIP6486

moniteur éducateur (supprimé)
type: ConceptReFip
type: Concept
in scheme: FINANCES PUBLIQUES
notation: REFIP6487

musée
type: ConceptReFip
type: Concept
broader: équipement culturel
definition: Lieu, édifice où sont réunies, en vue de leur conservation et de leur présentation au public, des collections d'œuvres d'art, de biens culturels, scientifiques ou techniques.
in scheme: FINANCES PUBLIQUES
in scheme: Culture et Loisirs
in scheme: Patrimoine Culturel
in scheme: Questions de Société
notation: REFIP6488

marché d'options négociables (supprimé)
type: ConceptReFip
type: Concept
broader: ZZ
in scheme: FINANCES PUBLIQUES
notation: REFIP6489

cours d'eau
type: ConceptReFip
type: Concept
alternative label: fleuve
alternative label: rivière
broader: milieu naturel
definition: Tout type d’eau vive entre une source et une embouchure ou un delta.
in scheme: FINANCES PUBLIQUES
in scheme: Environnement
in scheme: Milieu Naturel
in scheme: Questions de Société
notation: REFIP649
related: domaine public fluvial
related: barrage
related: contrat de rivière

monument commémoratif
type: ConceptReFip
type: Concept
alternative label: monument aux morts
alternative label: mémorial
broader: équipement culturel
definition: Monument servant à commémorer un événement ou à honorer une ou plusieurs personnes.
in scheme: FINANCES PUBLIQUES
in scheme: Culture et Loisirs
in scheme: Patrimoine Culturel
in scheme: Questions de Société
notation: REFIP6490

moyen de paiement
type: ConceptReFip
type: Concept
alternative label: mode de règlement
broader: refip-REFIP79
definition: Ensemble de techniques ou de supports mis à la disposition des clients pour effectuer des règlements et des transferts de fonds (chèques, cartes, effets de commerce, virement, prélèvements).
in scheme: FINANCES PUBLIQUES
in scheme: Moyen de paiement
in scheme: Finance
narrower: monnaie locale complémentaire
narrower: chèque vacances
narrower: chèque cadeau
narrower: chèque emploi-service universel
narrower: chèque emploi associatif
narrower: mandat postal
narrower: monnaie électronique
narrower: monnaie scripturale
narrower: monnaie fiduciaire
narrower: refip-REFIP6897
narrower: refip-REFIP6911
narrower: refip-REFIP6929
narrower: refip-REFIP7104
narrower: refip-REFIP7136
notation: REFIP6491

machine à sous
type: ConceptReFip
type: Concept
broader: casino
definition: Appareil électronique ou mécanique de jeu de hasard ou d'argent.
in scheme: FINANCES PUBLIQUES
in scheme: Culture et Loisirs
in scheme: Loisirs
in scheme: Questions de Société
notation: REFIP6492

motif médical
type: ConceptReFip
type: Concept
alternative label: raison médicale
broader: motif de priorité
definition: Raison à caractère médical pouvant justifier le déplacement ou le reclassement professionnel d'un fonctionnaire.
in scheme: FINANCES PUBLIQUES
in scheme: Gestion des ressources humaines
in scheme: Carrière
in scheme: Fonction Publique et Gestion des Ressources Humaines
notation: REFIP6493

médecin assermenté et agréé
type: ConceptReFip
type: Concept
broader: médecin généraliste
definition: Médecin généraliste ou spécialiste que l'administration désigne pour siéger aux comités médicaux ou qui sont chargés par elle ou par les comités médicaux et commissions de réforme d'effectuer les contre-visites et expertises.
in scheme: FINANCES PUBLIQUES
in scheme: Santé et Protection Sociale
in scheme: Santé
in scheme: Questions de Société
notation: REFIP6494

majoration exceptionnelle
type: ConceptReFip
type: Concept
broader: mots outils (liste additive)
definition: Augmentation, sous conditions, d'une somme à titre exceptionnel.
in scheme: FINANCES PUBLIQUES
in scheme: Mots Outils
notation: REFIP6495

mécénat
type: ConceptReFip
type: Concept
alternative label: parrainage
broader: collecte de fonds
definition: Soutien financier, humain ou matériel apporté sans contrepartie directe par une entreprise ou une personne physique ou morale pour tout domaine d'intérêt général : recherche, éducation, environnement, sport, solidarité, innovation.
in scheme: FINANCES PUBLIQUES
in scheme: Systeme bancaire et financier
in scheme: Opération financière
in scheme: Finance
notation: REFIP6496

mère de famille
type: ConceptReFip
type: Concept
broader: ascendant
definition: Parent biologique ou adoptif de sexe féminin d'un enfant.
in scheme: FINANCES PUBLIQUES
in scheme: Famille Education Population
in scheme: Famille
in scheme: Questions de Société
notation: REFIP6497

monnaie divisionnaire
type: ConceptReFip
type: Concept
broader: refip-REFIP6540
definition: Ensemble des pièces ou monnaie métallique utilisée principalement dans les transactions de faible montant.
in scheme: FINANCES PUBLIQUES
in scheme: Moyen de paiement
in scheme: Finance
narrower: refip-REFIP6697
notation: REFIP6498

majoration de pension pour enfants
type: ConceptReFip
type: Concept
broader: majoration de pension
definition: Majoration du montant de la pension de retraite pour tout fonctionnaire ou militaire ayant élevé au moins 3 enfants, pendant au moins 9 ans soit avant leur 16e anniversaire, soit avant l'âge auquel ils ont cessé d'être à charge pour les prestations familiales (selon les prestations, 20 ans ou 21 ans au plus tard).
in scheme: FINANCES PUBLIQUES
in scheme: Gestion des ressources humaines
in scheme: Retraite
in scheme: Fonction Publique et Gestion des Ressources Humaines
notation: REFIP6499

application SERVICE DE CONSULTATION DES TRACES
type: ConceptReFip
type: Concept
alternative label: ITM
alternative label: application ITM
alternative label: consultation des traces
broader: applications missions transverses (non-descripteur)
definition: Service de consultation des traces ayant pour objectif de mettre à disposition des différents acteurs du contrôle interne de traçabilité une interface de restitution unique, homogène et normalisée au sein du Portail applicatif.
in scheme: FINANCES PUBLIQUES
in scheme: Applications missions transverses
in scheme: Applications Informatiques
notation: REFIP650

mobilité du fonctionnaire
type: ConceptReFip
type: Concept
alternative label: mobilité
alternative label: mobilité fonctionnelle
alternative label: mobilité géographique
broader: carrière
definition: Changement d'affectation suite à mutation, mise à disposition, détachement...
in scheme: FINANCES PUBLIQUES
in scheme: Gestion des ressources humaines
in scheme: Carrière
in scheme: Fonction Publique et Gestion des Ressources Humaines
narrower: candidature
narrower: mutation de personnel
narrower: refip-REFIP6720
narrower: refip-REFIP6765
notation: REFIP6500
related: refip-REFIP7140

mesure d'accompagnement social personnalisé
type: ConceptReFip
type: Concept
alternative label: MASP
broader: action sociale
definition: Dispositif d’accompagnement social et budgétaire en faveur de personnes dont la santé ou la sécurité est menacée ou compromise du fait des difficultés qu’elles éprouvent à gérer leurs prestations sociales.
in scheme: FINANCES PUBLIQUES
in scheme: Santé et Protection Sociale
in scheme: Protection Sociale
in scheme: Questions de Société
notation: REFIP6501

montant
type: ConceptReFip
type: Concept
broader: mots outils (liste additive)
definition: Valeur monétaire d'une chose.
in scheme: FINANCES PUBLIQUES
in scheme: Mots Outils
notation: REFIP6502

motif de priorité
type: ConceptReFip
type: Concept
alternative label: motif prioritaire
broader: mutation de personnel
definition: Raison entraînant la dérogation au principe d'ancienneté administrative dans le cadre d'un mouvement de mutation.
in scheme: FINANCES PUBLIQUES
in scheme: Gestion des ressources humaines
in scheme: Carrière
in scheme: Fonction Publique et Gestion des Ressources Humaines
narrower: motif médical
narrower: refip-REFIP6781
notation: REFIP6503

médiation sociale
type: ConceptReFip
type: Concept
broader: conditions de travail
definition: Dispositif visant à améliorer la qualité des relations de travail et contribue, à côté des autres outils d'amélioration des conditions de vie au travail, à la prévention des risques psychosociaux. Elle vise également à apporter un soutien au management et aux agents, en appréhendant les situations interpersonnelles complexes, et aider au règlement amiable des conflits au sein d'un collectif de travail.
in scheme: FINANCES PUBLIQUES
in scheme: Gestion des ressources humaines
in scheme: Conditions de travail
in scheme: Fonction Publique et Gestion des Ressources Humaines
notation: REFIP6504

Mutualité sociale agricole
type: ConceptReFip
type: Concept
alternative label: MSA
alternative label: mutualité agricole
alternative label: régime social agricole
broader: refip-REFIP6863
definition: Organisme de protection sociale obligatoire des salariés et exploitants du secteur agricole.
in scheme: FINANCES PUBLIQUES
in scheme: Santé et Protection Sociale
in scheme: Protection Sociale
in scheme: Questions de Société
notation: REFIP6505
related: Caisse centrale de la mutualité sociale agricole

manifestation culturelle
type: ConceptReFip
type: Concept
alternative label: divertissement
alternative label: manifestation sportive
alternative label: spectacle
alternative label: spectacle vivant
broader: activité culturelle
definition: Présentation de spectacles (danse, théâtre, concert, opéra, etc.) par des acteurs, danseurs, musiciens, ou festivals ou, spectacles et compétitions sportives.
in scheme: FINANCES PUBLIQUES
in scheme: Culture et Loisirs
in scheme: Activité Culturelle
in scheme: Questions de Société
narrower: billet d'entrée
notation: REFIP6506

mobilier urbain
type: ConceptReFip
type: Concept
broader: aménagement urbain
definition: Ensemble d’équipements publics urbains (abri-bus, poubelles, colonne Morris, plans de ville, dos de kiosque, ..) qui peuvent servir de supports à un affichage publicitaire. Il comprend également les installations d’éclairage public.
in scheme: FINANCES PUBLIQUES
in scheme: Aménagement du territoire Urbanisme Habitat
in scheme: Aménagement du Territoire
in scheme: Questions de Société
narrower: éclairage public
notation: REFIP6507

marché financier
type: ConceptReFip
type: Concept
alternative label: bourse des valeurs
alternative label: marché de capitaux
broader: système bancaire et financier (non-descripteur)
definition: Bourse où différents types d'acteurs s'échangent des valeurs mobilières, à savoir des actions, des obligations, des devises, des matières premières, des produits dérivés et des capitaux au comptant ou à terme.
in scheme: FINANCES PUBLIQUES
in scheme: Systeme bancaire et financier
in scheme: Marché financier
in scheme: Finance
narrower: bourse de commerce
narrower: refip-REFIP6940
narrower: refip-REFIP6990
narrower: refip-REFIP7167
notation: REFIP6508

mandat postal
type: ConceptReFip
type: Concept
alternative label: cash compte
alternative label: mandat cash
alternative label: mandat international
alternative label: mandat-poste
broader: moyen de paiement
definition: Moyen de transfert de fonds liquides par le biais des services postaux.
in scheme: FINANCES PUBLIQUES
in scheme: Moyen de paiement
in scheme: Finance
notation: REFIP6509

apiculture
type: ConceptReFip
type: Concept
broader: élevage
definition: Branche de l’agriculture, qui consiste à l’élevage d’abeilles à miel pour exploiter les produits de la ruche.
in scheme: FINANCES PUBLIQUES
in scheme: Branche d'activité
in scheme: Questions Economiques
in scheme: Agriculture
notation: REFIP651

micro-entreprise
type: ConceptReFip
type: Concept
broader: refip-REFIP6704
definition: Petite entreprise individuelle ou auto-entreprise dont le régime se caractérise principalement par une franchise en base de TVA, un abattement forfaitaire lors du calcul du résultat de l'entreprise et des obligations comptables et déclaratives simplifiées. Le chiffre d'affaire ne doit pas dépasser un certain seuil.
in scheme: FINANCES PUBLIQUES
in scheme: Entreprise
in scheme: Entreprises
in scheme: Forme juridique
notation: REFIP6510

monnaie électronique
type: ConceptReFip
type: Concept
broader: moyen de paiement
definition: Valeur monétaire qui est stockée sous une forme électronique, y compris magnétique, représentant une créance ; elle est émise contre la remise de fonds aux fins d'opérations de paiement. C'est en quelque sorte un équivalent numérique de l'argent liquide.
in scheme: FINANCES PUBLIQUES
in scheme: Moyen de paiement
in scheme: Finance
narrower: monétique
notation: REFIP6511

meuble
type: ConceptReFip
type: Concept
alternative label: bien meuble
broader: droit civil
definition: Catégorie de biens caractérisés par le fait qu'ils peuvent être déplacés. On en distingue deux catégories : les biens meubles corporels et les biens meubles incorporels.
in scheme: FINANCES PUBLIQUES
in scheme: Droit et Justice
in scheme: Divisions du Droit
in scheme: Droit Privé
notation: REFIP6512

mouvement de paye
type: ConceptReFip
type: Concept
alternative label: mouvement de paie
broader: refip-REFIP6677
definition: Toute opération entraînant une modification au niveau de la rémunération du personnel.
in scheme: FINANCES PUBLIQUES
in scheme: Gestion des ressources humaines
in scheme: Rémunération
in scheme: Fonction Publique et Gestion des Ressources Humaines
notation: REFIP6513

médecin généraliste
type: ConceptReFip
type: Concept
alternative label: médecin
alternative label: médecin de famille
alternative label: médecin libéral
alternative label: médecin référent
alternative label: médecin traitant
broader: santé (non-descripteur)
definition: Professionnel de santé qui s’occupe de l’ensemble des problèmes de santé d’un patient.
in scheme: FINANCES PUBLIQUES
in scheme: Santé et Protection Sociale
in scheme: Santé
in scheme: Questions de Société
narrower: médecin assermenté et agréé
notation: REFIP6514

monnaie scripturale
type: ConceptReFip
type: Concept
broader: moyen de paiement
definition: Ensemble des soldes créditeurs des comptes bancaires ouverts auprès des établissements de crédit. Cette monnaie circule entre les agents économiques grâce aux moyens de paiement scripturaux que sont principalement les cartes, les chèques, les virements et les prélèvements.
in scheme: FINANCES PUBLIQUES
in scheme: Moyen de paiement
in scheme: Finance
narrower: chèque Trésor
narrower: chèque bancaire
narrower: effet de commerce
narrower: refip-REFIP6551
narrower: refip-REFIP6556
narrower: refip-REFIP6610
narrower: refip-REFIP6859
narrower: refip-REFIP6888
narrower: refip-REFIP6906
narrower: refip-REFIP6924
narrower: refip-REFIP6947
notation: REFIP6515

monument historique
type: ConceptReFip
type: Concept
alternative label: bâtiment classé
alternative label: immeuble classé
alternative label: monument classé
alternative label: monument inscrit
broader: équipement culturel
definition: Immeuble ou un objet mobilier recevant un statut juridique particulier destiné à le protéger, du fait de son intérêt historique, artistique, architectural mais aussi technique ou scientifique. Il bénéficie d'une protection juridique.
in scheme: FINANCES PUBLIQUES
in scheme: Culture et Loisirs
in scheme: Patrimoine Culturel
in scheme: Questions de Société
notation: REFIP6516

mise à la retraite d'office
type: ConceptReFip
type: Concept
broader: refip-REFIP6820
definition: Sanction disciplinaire du 4ème groupe, entraînant l'exclusion définitive du service et la perte de la qualité de fonctionnaire.
in scheme: FINANCES PUBLIQUES
in scheme: Gestion des ressources humaines
in scheme: Statut du fonctionnaire
in scheme: Fonction Publique et Gestion des Ressources Humaines
notation: REFIP6517

minimum garanti
type: ConceptReFip
type: Concept
broader: refip-REFIP6584
definition: Montant minimum d'une pension de retraite de fonctionnaire accordé sous certaines conditions.
in scheme: FINANCES PUBLIQUES
in scheme: Gestion des ressources humaines
in scheme: Rémunération
in scheme: Fonction Publique et Gestion des Ressources Humaines
notation: REFIP6518

médecin spécialiste
type: ConceptReFip
type: Concept
broader: santé (non-descripteur)
definition: Professionnel de santé exerçant une spécialité médicale.
in scheme: FINANCES PUBLIQUES
in scheme: Santé et Protection Sociale
in scheme: Santé
in scheme: Questions de Société
narrower: refip-REFIP6617
narrower: refip-REFIP6762
notation: REFIP6519

militaire
type: ConceptReFip
type: Concept
alternative label: officier
alternative label: officier de réserve
broader: fonction publique de l'Etat
definition: Membre des forces armées effectuant des missions dévolues à chacune des armées.
in scheme: FINANCES PUBLIQUES
in scheme: Personnels et fonctions
in scheme: Fonction publique
in scheme: Fonction Publique et Gestion des Ressources Humaines
notation: REFIP6520

mandat-carte (supprimé)
type: ConceptReFip
type: Concept
broader: ZZ
in scheme: FINANCES PUBLIQUES
notation: REFIP6521

maladie professionnelle
type: ConceptReFip
type: Concept
broader: refip-REFIP6828
definition: Maladie trouvant son origine dans le travail habituel du fonctionnaire ou dans les conditions d'exécution du service. Peut résulter de l'exposition prolongée à un risque professionnel ou d'une intoxication lente, sous l'effet répété de certaines substances ou émanations.
in scheme: FINANCES PUBLIQUES
in scheme: Gestion des ressources humaines
in scheme: Conditions de travail
in scheme: Fonction Publique et Gestion des Ressources Humaines
notation: REFIP6522
related: congé pour maladie professionnelle

mise à disposition
type: ConceptReFip
type: Concept
broader: refip-REFIP6657
definition: Situation du fonctionnaire qui exerce des fonctions hors de son service, mais est toujours rattaché à son corps d'origine. Il est considéré comme occupant son emploi et continue à percevoir la rémunération correspondante.
in scheme: FINANCES PUBLIQUES
in scheme: Gestion des ressources humaines
in scheme: Statut du fonctionnaire
in scheme: Fonction Publique et Gestion des Ressources Humaines
notation: REFIP6523

majoration de pension
type: ConceptReFip
type: Concept
broader: droits à pension
definition: Augmentation du montant de la pension accordée pour certains motifs comme, par exemple, le fait d'avoir élevé 3 enfants ou avoir travaillé en situation de handicap.
in scheme: FINANCES PUBLIQUES
in scheme: Gestion des ressources humaines
in scheme: Retraite
in scheme: Fonction Publique et Gestion des Ressources Humaines
narrower: majoration de pension pour enfants
notation: REFIP6524

mise en congé d'office
type: ConceptReFip
type: Concept
alternative label: congé d'office
broader: cessation de fonction
definition: Mesure visant à protéger la santé du fonctionnaire concerné et le bon fonctionnement du service lorsque l'administration estime, au vu d'une attestation médicale ou sur le rapport des supérieurs hiérarchiques, que l'état de santé d'un fonctionnaire pourrait justifier qu'il soit placé en congé longue maladie, l’administration peut alors provoquer l'examen médical de l'agent et saisir le comité médical.
in scheme: FINANCES PUBLIQUES
in scheme: Gestion des ressources humaines
in scheme: Carrière
in scheme: Fonction Publique et Gestion des Ressources Humaines
notation: REFIP6525

mutation de personnel
type: ConceptReFip
type: Concept
alternative label: mutation
broader: mobilité du fonctionnaire
definition: Changement d'affectation entraînant un changement de résidence administrative, et/ou des fonctions exercées.
in scheme: FINANCES PUBLIQUES
in scheme: Gestion des ressources humaines
in scheme: Carrière
in scheme: Fonction Publique et Gestion des Ressources Humaines
narrower: motif de priorité
notation: REFIP6526

mutuelle
type: ConceptReFip
type: Concept
alternative label: mutuelle d'assurance
alternative label: mutuelle de santé
alternative label: société mutualiste
broader: refip-REFIP6863
definition: Association à but non lucratif qui offre à ses membres, appartenant à une même branche professionnelle, un système d'assurance ou de prévoyance volontaire.
in scheme: FINANCES PUBLIQUES
in scheme: Santé et Protection Sociale
in scheme: Protection Sociale
in scheme: Questions de Société
notation: REFIP6527

monnaie fiduciaire
type: ConceptReFip
type: Concept
broader: moyen de paiement
definition: Monnaie comprenant les pièces et les billets de banque.
in scheme: FINANCES PUBLIQUES
in scheme: Moyen de paiement
in scheme: Finance
narrower: refip-REFIP6540
notation: REFIP6528

mariage
type: ConceptReFip
type: Concept
broader: refip-REFIP6840
definition: Union entre deux personnes, de sexes différents ou de même sexe, consacrée par une déclaration solennelle reçue par un officier d'état civil.
in scheme: FINANCES PUBLIQUES
in scheme: Famille Education Population
in scheme: Famille
in scheme: Questions de Société
narrower: contrat de mariage
notation: REFIP6529

transfert restructuration fusion
type: ConceptReFip
type: Concept
alternative label: TRF
broader: finances locales (non-descripteur)
in scheme: FINANCES PUBLIQUES
in scheme: Secteur public local
in scheme: Gestion Publique
notation: REFIP653

mission
type: ConceptReFip
type: Concept
broader: mots outils (liste additive)
definition: Charge donnée à quelqu'un d'accomplir une tâche définie.
in scheme: FINANCES PUBLIQUES
in scheme: Mots Outils
notation: REFIP6530

maladie
type: ConceptReFip
type: Concept
broader: santé (non-descripteur)
definition: Altération qui engendre un mauvais fonctionnement de l'organisme.
in scheme: FINANCES PUBLIQUES
in scheme: Santé et Protection Sociale
in scheme: Santé
in scheme: Questions de Société
narrower: alcoolisme
narrower: cancer
narrower: maladie contagieuse
narrower: refip-REFIP6693
narrower: refip-REFIP6922
notation: REFIP6531

maladie contagieuse
type: ConceptReFip
type: Concept
broader: maladie
definition: Altération provoquée par la transmission d'un micro-organisme ou d'un agent infectieux.
in scheme: FINANCES PUBLIQUES
in scheme: Santé et Protection Sociale
in scheme: Santé
in scheme: Questions de Société
notation: REFIP6532

malade hospitalisé
type: ConceptReFip
type: Concept
alternative label: personne hospitalisée
broader: hospitalisation
definition: Personne admise dans un hôpital ou un autre établissement, qui y occupe un lit
in scheme: FINANCES PUBLIQUES
in scheme: Santé et Protection Sociale
in scheme: Santé
in scheme: Questions de Société
notation: REFIP6533

mandat électif
type: ConceptReFip
type: Concept
alternative label: mandat électoral
broader: élection politique
definition: Charge dans une assemblée, confiée de manière temporaire par des électeurs à une personne élue
in scheme: FINANCES PUBLIQUES
in scheme: Questions Politiques Relations Internationales
in scheme: Politique
in scheme: Questions de Société
narrower: fin de mandat
notation: REFIP6534

médicament
type: ConceptReFip
type: Concept
broader: refip-REFIP6682
definition: Substance ou composition présentée comme possédant des propriétés curatives ou préventives à l’égard des maladies humaines ou animales, en vue d’établir un diagnostic médical ou de restaurer, corriger ou modifier leurs fonctions physiologiques en exerçant une action pharmacologique, immunologique ou métabolique.
in scheme: FINANCES PUBLIQUES
in scheme: Santé et Protection Sociale
in scheme: Santé
in scheme: Questions de Société
notation: REFIP6535

maître de conférence agrégé (supprimé)
type: ConceptReFip
type: Concept
broader: ZZ
in scheme: FINANCES PUBLIQUES
notation: REFIP6536

majoration
type: ConceptReFip
type: Concept
alternative label: augmentation
broader: mots outils (liste additive)
definition: Action de majorer ; hausse, relèvement, augmentation.
in scheme: FINANCES PUBLIQUES
in scheme: Mots Outils
notation: REFIP6537

majoration pour tierce personne
type: ConceptReFip
type: Concept
alternative label: majoration pour assistance d'une tierce personne
broader: refip-REFIP6626
definition: Allocation permettant à son bénéficiaire de percevoir une majoration de sa pension d'invalidité ou de sa rente liée à un accident du travail ou une maladie professionnelle (AT-MP), et est prévue sous conditions d'assistance d'une tierce personne. Son montant est revalorisé annuellement.
in scheme: FINANCES PUBLIQUES
in scheme: Gestion des ressources humaines
in scheme: Rémunération
in scheme: Fonction Publique et Gestion des Ressources Humaines
notation: REFIP6538