{"text_format":"1","workbook":"xlsx","n_sheets":9,"sheets":["1. Introduction","TEMP","2. LCC-calc.","3. Result","3.1 CO2 Emissions","3.2 Light pollution","4. Tool parameters","5. Response sheet","6. Climate impact factors"],"not_rendered":{"charts":8,"images":6,"macros":1,"external_links":2,"defined_names":21,"comments":1,"pivot_tables":0},"unopened":[{"sheet":"3.1 CO2 Emissions","index":4,"reason":"not_a_worksheet"},{"sheet":"3.2 Light pollution","index":5,"reason":"not_a_worksheet"}],"bounds":{"document_bytes":16777216,"sheet_cells":100000,"rows_first":2000,"rows_last":500,"rows_between":2000,"halvings":0,"cell_chars":16384,"cell_head_chars":4096},"cells_cut":0,"cells_raw":0,"read":"whole","date_system":"1900"}

{"sheet":"1. Introduction","index":0,"n_rows":35,"n_cols":8,"rows_kept":35,"cut":false,"hidden":false,"merged":[[9,1,11,4],[26,7,26,12],[28,7,28,20],[118,7,118,9],[119,7,119,22],[108,7,108,23],[109,7,109,23],[111,7,111,8],[113,7,113,20],[115,7,115,12],[92,7,92,9],[93,7,93,22],[95,7,95,22],[107,7,107,23],[117,7,117,20],[29,7,29,14],[5,1,5,2],[5,3,5,5],[8,1,8,4],[19,1,19,4],[45,7,47,20],[5,6,5,10],[5,11,5,14],[5,19,5,22],[5,15,5,18],[33,7,33,20],[32,7,32,9],[31,7,31,19],[37,7,37,19],[43,7,43,22],[22,7,22,8],[24,7,24,20]]}
[]
[null,null,null,null,null,null,{"$f":"'[2]1. Introduction'!G2","v":"LCC-calculation for procurement of outdoor lighting systems"}]
[null,null,null,null,null,null,"Version 2.14"]
[null,null,null,null,null,null,"Date: 2022-05-10"]
[null,null,null,null,null,null,"Customized by Alejandro Sánchez de Miguel"]
[]
[]
[]
[null,"Introduction"]
[null,"General instructions for how to use the tool."]
[]
[]
[]
[]
[]
[]
[]
[]
[]
[]
{"$rows_left_out":16}
{"sheet":"TEMP","index":1,"n_rows":30,"n_cols":3,"rows_kept":30,"cut":false,"hidden":true,"merged":[]}
[]
[]
[null,null,"MSR:S LCC-KALKYL FÖR UTOMHUSBELYSNING"]
[null,null,"Version  2.1 2011-07-04"]
[]
[null,null,"Livscykelkostnader"]
[null,null,"Livscykelkostnadsanalyser beaktar den totala kostnaden för en produkt under livscykeln. Den tar därmed inte bara hänsyn till grundinvesteringen utan också till drift- och underhållskostnader. Andra kostnader som kan vara viktiga i sammanhanget är miljöskatter samt avvecklingskostnader men även inkomster såsom subventioner och restvärde kan förändra kostnadsbilden."]
[]
[null,null,"Verktyget"]
[null,null,"Utomhusbelysning är den näst största posten i kommunernas drift- och underhållskostnader och står för ca 25 % av kostnaderna. Största posten i gatubelysningen är elförbrukningen, och belysningskostnaden har ökat med ca 9 % senaste åren på grund av ökande elpriser. Kommuner kan exempelvis spara uppåt 3,2 miljoner kr/år på en investering av 301 000 kr genom att välja mer energisnål belysning.\nMiljöstyrningsrådets LCC-verktyg för utomhusbelysning är ursprungligen framtaget av Aton Teknik Konsult på uppdrag av Ljuskultur enligt riktlinjer från Energimyndigheten. Om verktyget används i anbudsutvärderingen är de viktigt att man tydligt definierar vilka parametrar som kommer att användas samt vad leverantören ska inkomma med för information. "]
[null,null,"Verktyget är i ursprungsläget låst för redigering men kan låsas upp genom menyn Verktyg /Skydd/ Ta bort bladets skydd."]
[]
[null,null,"Miljöstyrningsrådet - Vägledning för hållbar upphandling"]
[null,null,"Miljöstyrningsrådet arbetar för att bidra till en hållbar utveckling genom att stödja företag och offentlig förvaltning i deras miljöarbete på ett strategiskt och kostnadseffektivt sätt. Med tre huvudsakliga verktyg och tjänster erbjuder Miljöstyrningsråd vägledning för hållbar upphandling, miljöledning och miljörelaterad produktinformation. På Miljöstyrningsrådets hemsida, www.msr.se, hittar du mer information om LCC och övrig verksamhet."]
[]
[null,null,"Kontakt"]
[null,null,"För frågor och synpunkter angående LCC och detta verktyg kontakta helpdesk@msr.se eller tfn 08-50 10 55 50."]
[]
[]
[]
{"$rows_left_out":11}
{"sheet":"2. LCC-calc.","index":2,"n_rows":198,"n_cols":21,"rows_kept":198,"cut":false,"hidden":false,"merged":[[61,2,61,6],[63,2,63,6],[76,2,76,6],[42,2,42,6],[43,2,43,6],[44,2,44,6],[62,2,62,6],[67,2,67,6],[70,2,70,6],[57,2,57,3],[52,2,52,6],[53,2,53,6],[55,2,55,6],[54,2,54,6],[109,2,109,6],[110,2,110,6],[50,2,50,6],[51,2,51,6],[45,2,45,6],[46,2,46,6],[47,2,47,6],[48,2,48,6],[49,2,49,6],[108,2,108,6],[106,2,106,6],[60,2,60,6],[64,2,64,6],[71,2,71,6],[68,2,68,6],[66,2,66,6],[101,2,101,6],[69,2,69,6],[104,2,104,6],[92,2,92,6],[59,2,59,6],[94,2,94,6],[91,2,91,6],[81,2,81,6],[84,2,84,6],[80,2,80,6],[83,2,83,6],[82,2,82,6],[79,2,79,6],[77,2,77,6],[78,2,78,6],[74,2,74,6],[14,2,14,6],[15,2,15,6],[16,2,16,6],[30,2,30,6],[32,2,32,6],[31,2,31,6],[17,2,17,6],[18,2,18,6],[27,2,27,6],[29,2,29,6],[28,2,28,6],[23,2,23,6],[26,2,26,6],[5,7,5,8],[5,2,5,3],[5,4,5,6],[8,2,8,7],[10,2,10,4],[10,5,10,8],[40,2,40,6],[41,2,41,6],[11,2,11,4],[11,5,11,8],[12,2,12,4],[20,2,20,6],[22,2,22,6],[19,2,19,6],[21,2,21,6],[36,2,36,6],[37,2,37,6],[38,2,38,6],[35,2,35,6],[33,2,33,6],[34,2,34,6],[12,5,12,8]]}
[]
[null,null,null,null,null,null,{"$f":"'1. Introduction'!G2","v":"LCC-calculation for procurement of outdoor lighting systems"}]
[null,null,null,null,null,null,{"$f":"'1. Introduction'!G3","v":"Version 2.14"}]
[null,null,null,null,null,null,{"$f":"'1. Introduction'!G4","v":"Date: 2022-05-10"}]
[null,null,null,null,null,null,"Customized by Alejandro Sánchez de Miguel"]
[]
[]
[]
[null,null,"Calculation conditions (specified by the CA)"]
[]
[null,null,"PROJECT:",null,null,"Scenario 1"]
[null,null,"DATE:",null,null,"05/04/2022"]
[null,null,"ADMINISTRATOR:"]
[]
[null,"1.1","Usage time",null,null,null,null,30,"year"]
[null,"1.2","Discount rate",null,null,null,null,1.7500000000000002E-2]
[null,"1.3","Electricity price",null,null,null,null,0.12,"€/kWh"]
[null,"1.4","Annual electricity price change",null,null,null,null,0.02]
[null,"1.5","Climate impact electricity usage (optional)",null,null,null,null,0.41499999999999998,"kgCO2/kWh"]
[null,"1.6","Operating hours of the lighting system (total)",null,null,null,null,4100,"h/year"]
{"$rows_left_out":179}
{"sheet":"3. Result","index":3,"n_rows":28,"n_cols":40,"rows_kept":28,"cut":false,"hidden":false,"merged":[[22,17,22,19],[5,1,5,2],[5,3,5,5],[11,1,11,2],[11,3,11,8],[11,23,11,24],[5,14,5,17],[5,6,5,10],[5,11,5,13],[5,18,5,21],[11,25,11,30],[13,1,13,3],[13,23,13,25],[9,1,9,2],[9,3,9,8],[9,23,9,24],[9,25,9,30],[10,1,10,2],[10,3,10,8],[10,23,10,24],[10,25,10,30],[15,30,15,32],[15,33,15,35],[15,36,15,38],[15,39,15,41],[16,5,16,7],[16,8,16,10],[16,11,16,13],[16,14,16,16],[16,17,16,19],[16,27,16,29],[15,5,15,7],[15,8,15,10],[15,11,15,13],[15,14,15,16],[15,17,15,19],[15,27,15,29],[16,30,16,32],[16,33,16,35],[16,36,16,38],[16,39,16,41],[19,33,19,35],[19,36,19,38],[17,39,17,41],[18,5,18,7],[18,8,18,10],[18,11,18,13],[18,14,18,16],[18,17,18,19],[18,27,18,29],[18,30,18,32],[18,33,18,35],[18,36,18,38],[18,39,18,41],[17,5,17,7],[17,8,17,10],[17,11,17,13],[17,14,17,16],[17,17,17,19],[17,27,17,29],[17,30,17,32],[17,33,17,35],[17,36,17,38],[23,14,23,16],[23,17,23,19],[23,27,23,29],[23,30,23,32],[23,33,23,35],[23,36,23,38],[19,39,19,41],[20,5,20,7],[20,8,20,10],[20,11,20,13],[20,14,20,16],[20,17,20,19],[20,27,20,29],[20,30,20,32],[20,33,20,35],[20,36,20,38],[20,39,20,41],[19,5,19,7],[19,8,19,10],[19,11,19,13],[19,14,19,16],[19,17,19,19],[19,27,19,29],[19,30,19,32],[21,39,21,41],[25,5,25,7],[25,8,25,10],[25,11,25,13],[25,14,25,16],[25,17,25,19],[25,27,25,29],[25,30,25,32],[25,33,25,35],[25,36,25,38],[25,39,25,41],[21,5,21,7],[21,8,21,10],[21,11,21,13],[21,14,21,16],[21,17,21,19],[21,27,21,29],[21,30,21,32],[21,33,21,35],[21,36,21,38],[23,39,23,41],[23,5,23,7],[23,8,23,10],[23,11,23,13],[52,30,52,32],[52,33,52,35],[52,36,52,38],[52,39,52,41],[27,30,27,32],[27,33,27,35],[27,36,27,38],[27,39,27,41],[52,5,52,7],[52,8,52,10],[52,11,52,13],[52,14,52,16],[52,17,52,19],[52,27,52,29],[26,39,26,41],[26,8,26,10],[26,11,26,13],[26,14,26,16],[26,17,26,19],[26,30,26,32],[26,33,26,35],[26,36,26,38],[27,5,27,7],[27,8,27,10],[27,11,27,13],[27,14,27,16],[27,17,27,19],[27,27,27,29],[26,5,26,7],[26,27,26,29]]}
[]
[null,null,null,null,null,null,{"$f":"'1. Introduction'!G2","v":"LCC-calculation for procurement of outdoor lighting systems"}]
[null,null,null,null,null,null,{"$f":"'1. Introduction'!G3","v":"Version 2.14"}]
[null,null,null,null,null,null,{"$f":"'1. Introduction'!G4","v":"Date: 2022-05-10"}]
[]
[]
[]
[]
[null,"Result LCC-calculation for procurement of outdoor lighting systems",null,null,null,null,null,null,null,null,null,null,null,null,null,null,null,"Page 1 of 2",null,null,null,null,null,"Result LCC-calculation for procurement of outdoor lighting systems",null,null,null,null,null,null,null,null,null,null,null,null,null,null,null,"Page 2 of 2"]
[null,"Project:",null,{"$f":"'2. LCC-calc.'!F11","v":"Scenario 1"},null,null,null,null,null,null,null,null,null,null,null,null,null,null,null,null,null,null,null,"Project:",null,{"$f":"IF(ISBLANK(D10),\"\",D10)","v":"Scenario 1"}]
[null,"Date:",null,{"$f":"'2. LCC-calc.'!F12","v":"05/04/2022"},null,null,null,null,null,null,null,null,null,null,null,null,null,null,null,null,null,null,null,"Date:",null,{"$f":"IF(ISBLANK(D11),\"\",D11)","v":"05/04/2022"}]
[null,"Administrator:",null,{"$f":"'2. LCC-calc.'!F13","v":0},null,null,null,null,null,null,null,null,null,null,null,null,null,null,null,null,null,null,null,"Administrator:",null,0]
[]
[null,"Calculation based upon",null,null,{"$f":"'2. LCC-calc.'!H15","v":30},"year",null,"Discount rate",null,{"$f":"'2. LCC-calc.'!H16","v":1.7500000000000002E-2},null,"The result is calculated according to present value method",null,null,null,null,null,null,null,null,null,null,null,"Calculation based upon",null,null,{"$f":"E14","v":30},"year",null,"Discount rate",null,{"$f":"J14","v":1.7500000000000002E-2}]
[]
[null,"LCC-costs",null,null,null,{"$f":"IF(ISNA(HLOOKUP(F17,'2. LCC-calc.'!$I$59:$XFD$108,2,FALSE)) = TRUE, \"\",HLOOKUP(F17,'2. LCC-calc.'!$I$59:$XFD$108,2,FALSE))","v":"HPS 70W standar diming"},null,null,{"$f":"IF(ISNA(HLOOKUP(I17,'2. LCC-calc.'!$I$59:$XFD$108,2,FALSE)) = TRUE, \"\",HLOOKUP(I17,'2. LCC-calc.'!$I$59:$XFD$108,2,FALSE))","v":"HPS 150W new dimming"},null,null,{"$f":"IF(ISNA(HLOOKUP(L17,'2. LCC-calc.'!$I$59:$XFD$108,2,FALSE)) = TRUE, \"\",HLOOKUP(L17,'2. LCC-calc.'!$I$59:$XFD$108,2,FALSE))","v":"NEW LED dimming"},null,null,{"$f":"IF(ISNA(HLOOKUP(O17,'2. LCC-calc.'!$I$59:$XFD$108,2,FALSE)) = TRUE, \"\",HLOOKUP(O17,'2. LCC-calc.'!$I$59:$XFD$108,2,FALSE))","v":"PC Amber"},null,null,{"$f":"IF(ISNA(HLOOKUP(R17,'2. LCC-calc.'!$I$59:$XFD$108,2,FALSE)) = TRUE, \"\",HLOOKUP(R17,'2. LCC-calc.'!$I$59:$XFD$108,2,FALSE))","v":"2200 k reduced lumens"},null,null,null,null,null,"LCC-costs",null,null,null,{"$f":"IF(ISNA(HLOOKUP(AB17,'2. LCC-calc.'!$I$59:$XFD$108,2,FALSE)) = TRUE, \"\",HLOOKUP(AB17,'2. LCC-calc.'!$I$59:$XFD$108,2,FALSE))","v":"LED diming"},null,null,{"$f":"IF(ISNA(HLOOKUP(AE17,'2. LCC-calc.'!$I$59:$XFD$108,2,FALSE)) = TRUE, \"\",HLOOKUP(AE17,'2. LCC-calc.'!$I$59:$XFD$108,2,FALSE))","v":"4000k reduced Lumens"},null,null,{"$f":"IF(ISNA(HLOOKUP(AH17,'2. LCC-calc.'!$I$59:$XFD$108,2,FALSE)) = TRUE, \"\",HLOOKUP(AH17,'2. LCC-calc.'!$I$59:$XFD$108,2,FALSE))","v":"3000k reduced lumens"},null,null,{"$f":"IF(ISNA(HLOOKUP(AK17,'2. LCC-calc.'!$I$59:$XFD$108,2,FALSE)) = TRUE, \"\",HLOOKUP(AK17,'2. LCC-calc.'!$I$59:$XFD$108,2,FALSE))","v":"HPS 150W standar diming"},null,null,{"$f":"IF(ISNA(HLOOKUP(AN17,'2. LCC-calc.'!$I$59:$XFD$108,2,FALSE)) = TRUE, \"\",HLOOKUP(AN17,'2. LCC-calc.'!$I$59:$XFD$108,2,FALSE))","v":"Current facility"}]
[null,"Top 1-5 most cost-effective alternatives",null,null,null,1,null,null,2,null,null,3,null,null,4,null,null,5,null,null,null,null,null,"Top 6-10 most cost-effective alternatives",null,null,null,6,null,null,7,null,null,8,null,null,9,null,null,10]
[]
[null,"Investment costs",null,null,null,{"$f":"IF(ISNA(HLOOKUP(F17,'2. LCC-calc.'!$I$59:$XFD$108,24,FALSE)) = TRUE, \"\",HLOOKUP(F17,'2. LCC-calc.'!$I$59:$XFD$108,24,FALSE))","v":2280500},null,null,{"$f":"IF(ISNA(HLOOKUP(I17,'2. LCC-calc.'!$I$59:$XFD$108,24,FALSE)) = TRUE, \"\",HLOOKUP(I17,'2. LCC-calc.'!$I$59:$XFD$108,24,FALSE))","v":2280500},null,null,{"$f":"IF(ISNA(HLOOKUP(L17,'2. LCC-calc.'!$I$59:$XFD$108,24,FALSE)) = TRUE, \"\",HLOOKUP(L17,'2. LCC-calc.'!$I$59:$XFD$108,24,FALSE))","v":2522000},null,null,{"$f":"IF(ISNA(HLOOKUP(O17,'2. LCC-calc.'!$I$59:$XFD$108,24,FALSE)) = TRUE, \"\",HLOOKUP(O17,'2. LCC-calc.'!$I$59:$XFD$108,24,FALSE))","v":2522000},null,null,{"$f":"IF(ISNA(HLOOKUP(R17,'2. LCC-calc.'!$I$59:$XFD$108,24,FALSE)) = TRUE, \"\",HLOOKUP(R17,'2. LCC-calc.'!$I$59:$XFD$108,24,FALSE))","v":2522500},null,null,null,null,null,"Investment costs",null,null,null,{"$f":"IF(ISNA(HLOOKUP(AB17,'2. LCC-calc.'!$I$59:$XFD$108,24,FALSE)) = TRUE, \"\",HLOOKUP(AB17,'2. LCC-calc.'!$I$59:$XFD$108,24,FALSE))","v":2522000},null,null,{"$f":"IF(ISNA(HLOOKUP(AE17,'2. LCC-calc.'!$I$59:$XFD$108,24,FALSE)) = TRUE, \"\",HLOOKUP(AE17,'2. LCC-calc.'!$I$59:$XFD$108,24,FALSE))","v":2522000},null,null,{"$f":"IF(ISNA(HLOOKUP(AH17,'2. LCC-calc.'!$I$59:$XFD$108,24,FALSE)) = TRUE, \"\",HLOOKUP(AH17,'2. LCC-calc.'!$I$59:$XFD$108,24,FALSE))","v":2522000},null,null,{"$f":"IF(ISNA(HLOOKUP(AK17,'2. LCC-calc.'!$I$59:$XFD$108,24,FALSE)) = TRUE, \"\",HLOOKUP(AK17,'2. LCC-calc.'!$I$59:$XFD$108,24,FALSE))","v":2280500},null,null,{"$f":"IF(ISNA(HLOOKUP(AN17,'2. LCC-calc.'!$I$59:$XFD$108,24,FALSE)) = TRUE, \"\",HLOOKUP(AN17,'2. LCC-calc.'!$I$59:$XFD$108,24,FALSE))","v":2280500}]
[null,"Energy costs",null,null,null,{"$f":"IF(ISNA(HLOOKUP(F17,'2. LCC-calc.'!$I$59:$XFD$108,35,FALSE)) = TRUE, \"\",HLOOKUP(F17,'2. LCC-calc.'!$I$59:$XFD$108,35,FALSE))","v":416029.35575753445},null,null,{"$f":"IF(ISNA(HLOOKUP(I17,'2. LCC-calc.'!$I$59:$XFD$108,35,FALSE)) = TRUE, \"\",HLOOKUP(I17,'2. LCC-calc.'!$I$59:$XFD$108,35,FALSE))","v":753766.71728480572},null,null,{"$f":"IF(ISNA(HLOOKUP(L17,'2. LCC-calc.'!$I$59:$XFD$108,35,FALSE)) = TRUE, \"\",HLOOKUP(L17,'2. LCC-calc.'!$I$59:$XFD$108,35,FALSE))","v":381008.81501284998},null,null,{"$f":"IF(ISNA(HLOOKUP(O17,'2. LCC-calc.'!$I$59:$XFD$108,35,FALSE)) = TRUE, \"\",HLOOKUP(O17,'2. LCC-calc.'!$I$59:$XFD$108,35,FALSE))","v":452168.35356265126},null,null,{"$f":"IF(ISNA(HLOOKUP(R17,'2. LCC-calc.'!$I$59:$XFD$108,35,FALSE)) = TRUE, \"\",HLOOKUP(R17,'2. LCC-calc.'!$I$59:$XFD$108,35,FALSE))","v":452168.35356265126},null,null,null,null,null,"Energy costs",null,null,null,{"$f":"IF(ISNA(HLOOKUP(AB17,'2. LCC-calc.'!$I$59:$XFD$108,35,FALSE)) = TRUE, \"\",HLOOKUP(AB17,'2. LCC-calc.'!$I$59:$XFD$108,35,FALSE))","v":476261.01876606251},null,null,{"$f":"IF(ISNA(HLOOKUP(AE17,'2. LCC-calc.'!$I$59:$XFD$108,35,FALSE)) = TRUE, \"\",HLOOKUP(AE17,'2. LCC-calc.'!$I$59:$XFD$108,35,FALSE))","v":478937.98156644148},null,null,{"$f":"IF(ISNA(HLOOKUP(AH17,'2. LCC-calc.'!$I$59:$XFD$108,35,FALSE)) = TRUE, \"\",HLOOKUP(AH17,'2. LCC-calc.'!$I$59:$XFD$108,35,FALSE))","v":506376.85027032648},null,null,{"$f":"IF(ISNA(HLOOKUP(AK17,'2. LCC-calc.'!$I$59:$XFD$108,35,FALSE)) = TRUE, \"\",HLOOKUP(AK17,'2. LCC-calc.'!$I$59:$XFD$108,35,FALSE))","v":962331.45601296588},null,null,{"$f":"IF(ISNA(HLOOKUP(AN17,'2. LCC-calc.'!$I$59:$XFD$108,35,FALSE)) = TRUE, \"\",HLOOKUP(AN17,'2. LCC-calc.'!$I$59:$XFD$108,35,FALSE))","v":1127624.7412555474}]
{"$rows_left_out":9}
{"sheet":"4. Tool parameters","index":6,"n_rows":54,"n_cols":9,"rows_kept":54,"cut":false,"hidden":false,"merged":[[54,8,54,10],[34,9,34,10],[45,8,45,10],[46,8,46,10],[38,8,38,10],[39,8,39,10],[40,8,40,10],[43,8,43,10],[44,8,44,10],[34,6,34,8],[35,8,35,10],[36,8,36,10],[42,8,42,10],[37,8,37,10],[48,8,48,10],[47,8,47,10],[9,6,9,10],[15,8,15,10],[52,8,52,10],[25,8,25,10],[27,8,27,10],[18,8,18,10],[32,8,32,10],[33,8,33,10],[22,6,22,8],[22,9,22,10],[17,8,17,10],[29,8,29,10],[30,6,30,8],[41,8,41,10],[30,9,30,10],[31,8,31,10],[5,15,5,18],[5,1,5,2],[5,3,5,5],[5,6,5,7],[28,8,28,10],[12,8,12,10],[11,8,11,10],[23,8,23,10],[24,8,24,10],[19,8,19,10],[20,6,20,8],[13,8,13,10],[9,1,11,4],[16,8,16,10],[26,8,26,10],[14,8,14,10]]}
[]
[null,null,null,null,null,null,{"$f":"'1. Introduction'!G2","v":"LCC-calculation for procurement of outdoor lighting systems"}]
[null,null,null,null,null,null,{"$f":"'1. Introduction'!G3","v":"Version 2.14"}]
[null,null,null,null,null,null,{"$f":"'1. Introduction'!G4","v":"Date: 2022-05-10"}]
[]
[]
[]
[]
[null,"Tool parameters"]
[null,"Gathered instructions regarding the parameters.",null,null,null,null,"CALCULATION CONDITIONS (specified by the CA)"]
[null,null,null,null,null,null,"Note ","Parameter","Instruction"]
[null,null,null,null,null,null,"1.1","Usage time","Estimated time for using the lighting system. The calculation should be based on the luminaire with the best expected technical lifespan. 25 years might be considered as a value of reference but it might also be longer.. Poles might have a lifespan of 60 years."]
[null,null,null,null,null,null,"1.2","Discount rate","The discount rate determines the calculation of future costs to present value. The discount rate shall be based on the calculation rate the organisation uses for investments, and might be nominal as well as real. Often the internal rate of return is used for LCC-calculations. A high calculation rate gives more emphasis to the use phase costs."]
[null,null,null,null,null,null,"1.3","Electricity price","The organisation’s agreed-on electricity price (SEK/kWh) shall be inserted. Alternatively, a standard amount of 1-1,5 SEK/kWh. "]
[null,null,null,null,null,null,"1.4","Annual electricity price change","Factor for calculating price changes apart from inflation."]
[null,null,null,null,null,null,"1.5","Climate impact electricity usage","In order to calculate the impact from electricity usage one can insert the electricity supplier’s data regarding the climate impact from the used mix of electricity (carbon dioxide per kWh). Alternative emission factors can be found in tab 6.  "]
[null,null,null,null,null,null,"1.6","Operating hours system","Insert the lighting system’s total operating hours per year. "]
[null,null,null,null,null,null,"1.7","Operating hours full power","Insert the operating hours per year when the lighting system is using full power."]
[null,null,null,null,null,null,"1.8","Operating hours power level 1","Control for outdoor lighting is often using a dimmer or a reduced power level. If this is requested in the tender documents, then insert the number of hours per year when the luminaire shall be on reduced power according to the first power level. The time shall be based on actual, existing operating data. A recommendation is to use reduced power between 22-05 in places where no unprotected road user resides. This is equivalent to 2555h/year (7h x 365 days = 2555h/year). The lighting may be totally turned off at places which are not used during night time. In roads with a heavy flow of traffic the level of lighting might be reduced during night time to a level equivalent to that used in roads with a low flow of traffic, road class M5 with a mean luminance of 0,5cd/m2 at the lowest. The Swedish Transport Administration has further guidelines regarding lower lighting power during night time.\nThe LCC-tool might be used to evaluate whether or not it is profitable to use control systems for a lighting system. For some light sources, for example high pressure sodium, the luminous efficacy is lower with a dimmer."]
[null,null,null,null,null,null,"1.9","Operating hours power level 2","If more than one power level is being used,operating hours for the second power level is inserted here.\n"]
{"$rows_left_out":35}
{"sheet":"5. Response sheet","index":7,"n_rows":44,"n_cols":10,"rows_kept":44,"cut":false,"hidden":false,"merged":[[5,1,5,2],[5,3,5,5],[5,7,5,11],[5,12,5,15],[5,16,5,19],[5,20,5,23],[8,3,8,7],[22,11,22,14],[12,11,12,14],[13,11,13,14],[14,11,14,14],[23,11,23,14],[30,11,30,14],[31,11,31,14],[16,11,16,14],[18,11,18,14],[19,11,19,14],[20,11,20,14],[21,11,21,14],[37,11,37,14],[38,11,38,14],[33,11,33,14],[34,11,34,14],[35,11,35,14],[36,11,36,14]]}
[]
[null,null,null,null,null,null,{"$f":"'1. Introduction'!G2","v":"LCC-calculation for procurement of outdoor lighting systems"}]
[null,null,null,null,null,null,{"$f":"'1. Introduction'!G3","v":"Version 2.14"}]
[null,null,null,null,null,null,{"$f":"'1. Introduction'!G4","v":"Date: 2022-05-10"}]
[]
[]
[]
[]
[null,null,null,"Response sheet for supplier"]
[null,null,null,"LCC-calculation for procurement of outdoor lighting."]
[null,null,null,"Attach one sheet per investment alternative"]
[]
[null,null,null,"Project name"]
[null,null,null,"Date"]
[null,null,null,"Administrator"]
[]
[null,null,null,"Name"]
[null,null,null,"Investment costs"]
[null,null,"2.1","Number of luminaires",null,null,null,null,null,"qty"]
[null,null,"2.2","Price per luminaire (incl. light source, electrical ballast, control device)",null,null,null,null,null,"€/piece"]
{"$rows_left_out":25}
{"sheet":"6. Climate impact factors","index":8,"n_rows":17,"n_cols":8,"rows_kept":17,"cut":false,"hidden":false,"merged":[[37,8,37,10],[38,8,38,10],[39,8,39,10],[29,8,29,10],[30,8,30,10],[31,8,31,10],[33,8,33,10],[35,8,35,10],[36,8,36,10],[28,8,28,10],[17,8,17,10],[18,8,18,10],[19,8,19,10],[20,8,20,10],[21,6,21,8],[22,8,22,10],[23,8,23,10],[24,8,24,10],[25,8,25,10],[26,8,26,10],[27,8,27,10],[16,8,16,10],[5,3,5,5],[5,6,5,7],[5,15,5,18],[9,6,9,7],[15,8,15,10],[11,1,16,4],[9,1,10,4],[16,6,16,7]]}
[]
[null,null,null,null,null,null,{"$f":"'1. Introduction'!G2","v":"LCC-calculation for procurement of outdoor lighting systems"}]
[null,null,null,null,null,null,{"$f":"'1. Introduction'!G3","v":"Version 2.14"}]
[null,null,null,null,null,null,{"$f":"'1. Introduction'!G4","v":"Date: 2022-05-10"}]
[]
[]
[]
[]
[null,"Climate impact"]
[null,"These factors may be used to voluntarily calculate climate impact from electricity usage. The factors shall be inserted in row 1.5 in the LCC-tool.",null,null,null,null,"Factors for calculating climate impact from electricity usage [kgCO2/kWh]"]
[null,null,null,null,null,null,"Origin-labelled electricity",0]
[null,null,null,null,null,null,"Swedish mix (normal year)",0.02]
[null,null,null,null,null,null,"Nordic mix",0.1]
[null,null,null,null,null,null,"Unknown origin (Nordic)",0.34399999999999997]
[null,null,null,null,null,null,"EU (25)",0.41499999999999998]
[]
[null,null,null,null,null,null,"Source: Svensk Energi (www.svenskenergi.se) 2016-05-25. \nThe value for the EU 25-mix is from the report \"Den svenska elens miljöpåvekan\" published in 2010."]