{"text_format":"1","workbook":"xlsx","n_sheets":8,"sheets":["About","Battery Design","Battery Recycling","Inventory Tables","RecyclingProcessData","Chem","Lists","Refs"],"not_rendered":{"charts":11,"images":3,"macros":1,"external_links":0,"defined_names":24,"comments":4,"pivot_tables":0},"unopened":[],"bounds":{"document_bytes":16777216,"sheet_cells":100000,"rows_first":2000,"rows_last":500,"rows_between":2000,"halvings":0,"cell_chars":16384,"cell_head_chars":4096},"cells_cut":0,"cells_raw":0,"read":"whole","date_system":"1900"}

{"sheet":"About","index":0,"n_rows":28,"n_cols":2,"rows_kept":28,"cut":false,"hidden":false,"merged":[]}
[]
[]
[null,"SUPPLEMENTARY INFORMATION"]
[]
[null,"On the environmental competitiveness of Sodium-Ion batteries under a full life cycle perspective – A cell-chemistry specific modelling approach"]
[null,"Jens F. Petersa,b*, Manuel Baumannc, Joachim Binderd, Marcel Weilc,e"]
{"$rows_left_out":23}
{"sheet":"Battery Design","index":1,"n_rows":118,"n_cols":66,"rows_kept":118,"cut":false,"hidden":false,"merged":[[133,1,133,5],[122,1,122,5],[123,1,123,5],[124,1,124,5],[125,1,125,5],[126,1,126,5],[128,1,128,5],[129,1,129,5],[127,1,127,5],[130,1,130,5],[131,1,131,5],[132,1,132,5],[138,1,138,5],[134,1,134,5],[135,1,135,5],[136,1,136,5],[137,1,137,5],[0,1,0,24],[121,26,121,30],[121,32,121,36],[121,38,121,42],[120,1,120,5],[121,1,121,5],[119,1,119,5],[29,27,29,29],[0,25,0,48],[4,64,4,65],[4,52,4,53],[4,54,4,55],[4,56,4,57],[4,58,4,59],[4,62,4,63],[4,60,4,61]]}
[null,"Program for Calculating Performance and Materials Requirements / Battery Design"]
[null,null,null,null,null,null,null,null,null,null,null,null,null,null,null,null,null,null,null,null,null,null,null,null,null,null,null,null,null,null,null,null,null,null,null,null,null,null,null,null,null,null,null,null,null,null,null,null,null,null,null,"(table for publication)"]
[null,"Generic parameters:","C-rate (charge):",null,2,null,"Charging time:",null,{"$f":"60/E3","v":30},"min","(applies to all battery cells equally)",null,null,null,{"$f":"1","v":1},"Restart calc.(0/1)",null,1,"OR","CTRL+ SHIFT + R if Macro Enabled to Reconverge Calculation"]
[null,"Cell layout",null,null,null,null,null,null,null,null,null,null,null,null,null,null,null,null,null,null,null,null,null,null,null,null,"Mass balance",null,null,null,null,null,null,null,null,null,null,null,null,null,null,null,null,null,null,null,null,null,null,null,null,"Mass balance"]
[null,"Positive Electrode",null,null,null,null,{"$f":"Chem!C5","v":"NaFCN-HC"},null,null,{"$f":"Chem!D5","v":"NaNMMT-HC"},null,null,{"$f":"Chem!E5","v":"NaMMO-HC"},null,null,{"$f":"Chem!F5","v":"NaMVP-HC"},null,null,{"$f":"Chem!G5","v":"NaNMC-HC"},null,null,{"$f":"Chem!H5","v":"NMC622-G"},null,null,{"$f":"Chem!I5","v":"LFP-G"},null,null,null,{"$f":"G5","v":"NaFCN-HC"},null,null,{"$f":"J5","v":"NaNMMT-HC"},null,null,{"$f":"M5","v":"NaMMO-HC"},null,null,{"$f":"P5","v":"NaMVP-HC"},null,null,{"$f":"S5","v":"NaNMC-HC"},null,null,{"$f":"V5","v":"NMC622-G"},null,null,{"$f":"Y5","v":"LFP-G"},null,null,null,null,"Composition","NMMT",null,{"$f":"AI5","v":"NaMMO-HC"},null,{"$f":"AL5","v":"NaMVP-HC"},null,"NNMC",null,{"$f":"AC5","v":"NaFCN-HC"},null,{"$f":"AU5","v":"LFP-G"},null,{"$f":"AR5","v":"NMC622-G"}]
[null,"Parameters for Finished Cell",null,null,null,null,null,null,null,null,null,null,null,null,null,null,null,null,null,null,null,null,null,null,null,null,"Anode",null,{"$f":"SUM(AC7:AC9)","v":287.01978770866026},{"$f":"AC6/AC$20","v":0.22344731315004457},null,{"$f":"SUM(AF7:AF9)","v":289.57889243165283},{"$f":"AF6/AF$20","v":0.31419936625592138},null,{"$f":"SUM(AI7:AI9)","v":330.27106009228339},{"$f":"AI6/AI$20","v":0.327745986408021},null,{"$f":"SUM(AL7:AL9)","v":239.16978600979508},{"$f":"AL6/AL$20","v":0.23010370090390098},null,{"$f":"SUM(AO7:AO9)","v":330.06830313968408},{"$f":"AO6/AO$20","v":0.28418522646301642},null,{"$f":"SUM(AR7:AR9)","v":139.08552293174955},{"$f":"AR6/AR$20","v":0.23883166769641342},null,{"$f":"SUM(AU7:AU9)","v":157.63516532027549},{"$f":"AU6/AU$20","v":0.19696593562077003},null,null,null,null,"mass (g)","mass share",{"$f":"BA6","v":"mass (g)"},{"$f":"BB6","v":"mass share"},"mass (g)","mass share","mass (g)",{"$f":"BF6","v":"mass share"},{"$f":"BM6","v":"mass (g)"},{"$f":"BN6","v":"mass share"},{"$f":"BG6","v":"mass (g)"},{"$f":"BH6","v":"mass share"},{"$f":"BK6","v":"mass (g)"},{"$f":"BL6","v":"mass share"}]
{"$rows_left_out":113}
{"sheet":"Battery Recycling","index":2,"n_rows":206,"n_cols":37,"rows_kept":206,"cut":false,"hidden":false,"merged":[[0,1,0,12]]}
[null,"Recoverable Materials per Cell at End of Battery Life"]
[null,"Battery cell composition and metal content"]
[null,"Cell chemistry",null,null,null,null,{"$f":"'Battery Design'!G5","v":"NaFCN-HC"},{"$f":"'Battery Design'!J5","v":"NaNMMT-HC"},{"$f":"'Battery Design'!M5","v":"NaMMO-HC"},{"$f":"'Battery Design'!P5","v":"NaMVP-HC"},{"$f":"'Battery Design'!S5","v":"NaNMC-HC"},{"$f":"'Battery Design'!V5","v":"NMC622-G"},{"$f":"'Battery Design'!Y5","v":"LFP-G"},null,null,{"$f":"H3","v":"NaNMMT-HC"},{"$f":"I3","v":"NaMMO-HC"},{"$f":"J3","v":"NaMVP-HC"},{"$f":"K3","v":"NaNMC-HC"},{"$f":"L3","v":"NMC622-G"},{"$f":"G3","v":"NaFCN-HC"},{"$f":"M3","v":"LFP-G"},null,{"$f":"P3","v":"NaNMMT-HC"},{"$f":"Q3","v":"NaMMO-HC"},"NaMVP-HC","NaNMC-HC","NMC622-G","NaFCN-HC",{"$f":"V3","v":"LFP-G"}]
[]
[null,"Material parameters"]
[null,"Cathode active material molweight ",null,null,"g/mol",null,{"$f":"Chem!C7","v":313.7},{"$f":"Chem!D7","v":105.99325},{"$f":"Chem!E7","v":100.58825},{"$f":"Chem!F7","v":482.79},{"$f":"Chem!G7","v":110.74568300000001},{"$f":"Chem!H7","v":94.387},{"$f":"Chem!I7","v":157.76}]
{"$rows_left_out":201}
{"sheet":"Inventory Tables","index":3,"n_rows":243,"n_cols":54,"rows_kept":243,"cut":false,"hidden":false,"merged":[[158,32,158,36],[196,32,196,36],[132,32,132,36],[196,27,196,31],[132,27,132,31],[158,27,158,31],[39,7,39,11],[62,7,62,11],[62,12,62,16],[62,17,62,21],[62,22,62,26],[110,27,110,31],[85,27,85,31],[85,12,85,16],[85,17,85,21],[110,12,110,16],[110,17,110,21],[110,22,110,26],[3,2,3,6],[39,2,39,6],[62,2,62,6],[110,2,110,6],[85,2,85,6],[39,32,39,36],[62,32,62,36],[85,32,85,36],[39,12,39,16],[39,17,39,21],[39,22,39,26],[39,27,39,31],[85,22,85,26],[62,27,62,31],[3,32,3,36],[3,7,3,11],[3,12,3,16],[3,17,3,21],[3,22,3,26],[3,27,3,31],[196,2,196,6],[196,22,196,26],[132,7,132,11],[158,7,158,11],[158,17,158,21],[196,7,196,11],[196,12,196,16],[196,17,196,21],[158,2,158,6],[158,22,158,26],[132,12,132,16],[158,12,158,16],[132,2,132,6],[132,17,132,21],[132,22,132,26]]}
["BATTERY CELL PRODUCTION"]
["I",null,null,null,"electrode area",{"$f":"'Battery Design'!G21","v":1.7328679974211267},"m2",null,null,"electrode area",{"$f":"'Battery Design'!J21","v":0.60985071258198686},"m2",null,null,"electrode area",{"$f":"'Battery Design'!M21","v":0.68085142170695601},"m2",null,null,"electrode area",{"$f":"'Battery Design'!P21","v":0.99725336006877974},"m2",null,null,"electrode area",{"$f":"'Battery Design'!S21","v":0.74212988514888389},"m2",null,null,"electrode area",{"$f":"'Battery Design'!V21","v":0.45024918383117174},"m2",null,null,"electrode area",{"$f":"'Battery Design'!Y21","v":0.81679192435291925},"m2"]
[]
["Battery cells",null,{"$f":"'Battery Design'!AC5","v":"NaFCN-HC"},null,null,null,null,{"$f":"'Battery Design'!AF5","v":"NaNMMT-HC"},null,null,null,null,{"$f":"'Battery Design'!AI5","v":"NaMMO-HC"},null,null,null,null,{"$f":"'Battery Design'!AL5","v":"NaMVP-HC"},null,null,null,null,{"$f":"'Battery Design'!AO5","v":"NaNMC-HC"},null,null,null,null,{"$f":"'Battery Design'!AR5","v":"NMC622-G"},null,null,null,null,{"$f":"'Battery Design'!AU5","v":"LFP-G"}]
[null,"Item","Flow","Provider","mass","unit","Source","Flow","Provider","mass","unit","Source","Flow","Provider","mass","unit","Source","Flow","Provider","mass","unit","Source","Flow","Provider","mass","unit","Source","Flow","Provider","mass","unit","Source","Flow","Provider","mass","unit","Source"]
[null,null,null,null,null,null,null,"Inputs"]
{"$rows_left_out":238}
{"sheet":"RecyclingProcessData","index":4,"n_rows":66,"n_cols":49,"rows_kept":66,"cut":false,"hidden":false,"merged":[]}
[]
[]
[null,null,null,null,null,"cathode act mat ",0.4,"kg/kg cell"]
[null,"Hydrometallurgical processing of LIB",null,null,null,null,null,null,null,null,null,null,null,null,null,null,"Pyrometallurgical processing of LIB",null,null,null,null,null,null,"Advanced hydrometallurgical treatment ",null,null,"(Mohr et al 2020) - "]
[null," (Mohr et al 2020, Fisher et al. 2006)",null,null,null,"molweight ",null,null,null,null,null,null,null,null,null,null," (Mohr et al 2020, Fisher et al. 2006)",null,null,null,null,null,null,"mechanical recycling stage",null,null,"(Mohr et al 2020) - "]
[null,"Item","Amount","Unit",null,"NMC",93.88,"g/mol",null,null,null,null,null,null,null,null,"Item","Amount","Unit",null,null,null,null,"Item","Ecoinvent dataset","Amount","Unit"]
{"$rows_left_out":61}
{"sheet":"Chem","index":5,"n_rows":111,"n_cols":104,"rows_kept":111,"cut":false,"hidden":false,"merged":[[3,67,3,68],[3,92,3,93],[3,61,3,62],[3,72,3,73],[2,0,3,0],[3,40,3,41],[3,45,3,46],[3,50,3,51],[3,55,3,56],[3,35,3,36],[3,19,3,20],[3,25,3,26],[3,30,3,31],[2,6,3,6],[3,102,3,103],[3,97,3,98],[3,77,3,78],[3,82,3,83],[3,87,3,88]]}
["Default input values (may be changed)","Selected Chemistry - Choose a Chemistry in Dashboard",null,null,null,null,"Automatic input (Change using overrides)",null,null,null,null,null,null,null,null,null,null,"Chemistry","NCA-G","ID #",{"$f":"SUM(IF($A$1:T1 =\"Chemistry\", 1, 0))","v":1},null,null,"Chemistry","NMC622-G","ID #",{"$f":"SUM(IF($A$1:Z1 =\"Chemistry\", 1, 0))","v":2},null,"Chemistry","NMC333-G","ID #",{"$f":"SUM(IF($A$1:AE1 =\"Chemistry\", 1, 0))","v":3},null,"Chemistry","LFP-G","ID #",{"$f":"SUM(IF($A$1:AJ1 =\"Chemistry\", 1, 0))","v":4},null,"Chemistry","LMO-G","ID #",{"$f":"SUM(IF($A$1:AO1 =\"Chemistry\", 1, 0))","v":5},null,"Chemistry",{"$f":"AU7& \"/\" & 100*AU8 & \"%/\" & AU9 & \"  - G\"","v":"NMC532/50%/LMO  - G"},"ID #",{"$f":"SUM(IF($A$1:AT1 =\"Chemistry\", 1, 0))","v":6},null,"Chemistry","NMC811-G","ID #",{"$f":"SUM(IF($A$1:AY1 =\"Chemistry\", 1, 0))","v":7},null,"Chemistry","NMC532-G","ID #",{"$f":"SUM(IF($A$1:BD1 =\"Chemistry\", 1, 0))","v":8},null,null,"Chemistry","LMO-LTO","ID #",{"$f":"SUM(IF($A$1:BJ1 =\"Chemistry\", 1, 0))","v":9},null,null,"Chemistry","NMO","ID #",{"$f":"SUM(IF($A$1:BP1 =\"Chemistry\", 1, 0))","v":10},null,"Chemistry","NMO-aqu","ID #",{"$f":"SUM(IF($A$1:BU1 =\"Chemistry\", 1, 0))","v":11},null,"Chemistry","NMMT","ID #",{"$f":"SUM(IF($A$1:BZ1 =\"Chemistry\", 1, 0))","v":12},null,"Chemistry","Na-NMC","ID #",{"$f":"SUM(IF($A$1:CE1 =\"Chemistry\", 1, 0))","v":13},null,"Chemistry","NTO-NMO-aqu","ID #",{"$f":"SUM(IF($A$1:CJ1 =\"Chemistry\", 1, 0))","v":14},null,"Chemistry","Na-FCN","ID #",{"$f":"SUM(IF($A$1:CO1 =\"Chemistry\", 1, 0))","v":15},null,"Chemistry","NTP-MTO-aqu","ID #",{"$f":"SUM(IF($A$1:CT1 =\"Chemistry\", 1, 0))","v":16},null,"Chemistry","NaMVP-C","ID #",{"$f":"SUM(IF($A$1:CY1 =\"Chemistry\", 1, 0))","v":17}]
["Optional override input","System ID","Default",null,null,null,null,null,null,null,null,null,null,null,null,null,null,"Notes","This is a supplied set of data from BatPaC",null,null,null,null,"Notes","This is a supplied set of data from BatPaC",null,null,null,"Notes","This is a supplied set of data from BatPaC",null,null,null,"Notes","This is a supplied set of data from BatPaC",null,null,null,"Notes","This is a supplied set of data from BatPaC",null,null,null,"Notes","Default is 50/50 NMC 532 and LMO","% is mass based",null,null,"Notes","This is a supplied set of data from BatPaC",null,null,null,"Notes","This is a supplied set of data from BatPaC",null,null,null,null,"Notes","This is a supplied set of data from BatPaC",null,null,null,null,"Notes",null,null,null,null,"Notes",null,null,null,null,"Notes",null,null,null,null,"Notes",null,null,null,null,"Notes",null,null,null,null,"Notes","Prussian blue (PB, Fe4[Fe(CN)6]3)",null,null,null,"Notes",null,null,null,null,"Notes"]
["Add X to add to Summary of Results Worksheet","Description",{"$f":"IF(INDEX($3:$3, E2) = \"\", \"\", INDEX($3:$3, E2))","v":""},null,null,null,null,null,null,null,null,null,null,null,null,null,null,"Description",null,null,null,null,null,"Description",null,null,null,null,"Description",null,null,null,null,"Description",null,null,null,null,"Description",null,null,null,null,"Description","This data set considers a mix of two Positive electrodes. Change values in Chem!AY7:AY9",null,null,null,"Description",null,null,null,null,"Description",null,null,null,null,null,"Description",null,null,null,null,null,"Description",null,null,null,null,"Description",null,null,null,null,"Description",null,null,null,null,"Description",null,null,null,null,"Description",null,null,null,null,"Description",null,null,null,null,"Description",null,null,null,null,"Description"]
[null,"Property","Applied Value",null,null,null,null,null,null,null,null,null,null,null,null,null,null,"Property","Default Value","Notes",null,null,null,"Property","Default Value","Notes",null,null,"Property","Default Value","Notes",null,null,"Property","Default Value","Notes",null,null,"Property","Default Value","Notes",null,null,"Property","Default Value","Notes",null,null,"Property","Default Value","Notes",null,null,"Property","Default Value","Notes",null,null,null,"Property","Default Value","Notes",null,null,null,"Property","Default Value","Notes",null,null,"Property","Default Value","Notes",null,null,"Property","Default Value","Notes",null,null,"Property","Default Value","Notes",null,null,"Property","Default Value","Notes",null,null,"Property","Default Value","Notes",null,null,"Property","Default Value","Notes",null,null,"Property","Default Value","Notes"]
["X","Couple Name",{"$f":"CN6&\"-\"&CN29","v":"NaFCN-HC"},{"$f":"BY6&\"-\"&BY29","v":"NaNMMT-HC"},{"$f":"BO6&\"-\"&BO29","v":"NaMMO-HC"},{"$f":"CX6&\"-\"&CX29","v":"NaMVP-HC"},{"$f":"CD6&\"-\"&CD29","v":"NaNMC-HC"},{"$f":"Y6&\"-\"&Y29","v":"NMC622-G"},{"$f":"AI6&\"-\"&AI29","v":"LFP-G"}]
[null,"Positive electrode active material",{"$f":"CN6","v":"NaFCN"},{"$f":"BY6","v":"NaNMMT"},{"$f":"BO6","v":"NaMMO"},{"$f":"CX6","v":"NaMVP"},{"$f":"CD6","v":"NaNMC"},{"$f":"Y6","v":"NMC622"},{"$f":"AI6","v":"LFP"},null,null,null,null,null,null,null,null,"Positive Electrode","NCA",null,null,null,null,"Positive Electrode","NMC622",null,null,null,"Positive Electrode","NMC333",null,null,null,"Positive Electrode","LFP",null,null,null,"Positive Electrode","LMO",null,null,null,"Positive Electrode",{"$f":"AU7&\"/\"&100*AU8&\"%/\"&AU9&\"/\"&(1-AU8)*100& \"%\"","v":"NMC532/50%/LMO/50%"},"Mixing Values",null,null,"Positive Electrode","NMC811",null,null,null,"Positive Electrode","NMC532",null,null,null,null,"Positive Electrode","LMO",null,null,null,null,"Positive Electrode","NaMMO",null,null,null,"Positive Electrode","NaMO",null,null,null,"Positive Electrode","NaNMMT",null,null,null,"Positive Electrode","NaNMC",null,null,null,"Positive Electrode","NMO-044",null,null,null,"Positive Electrode","NaFCN",null,null,null,"Positive Electrode","NaMTOaq",null,null,null,"Positive Electrode","NaMVP"]
{"$rows_left_out":106}
{"sheet":"Lists","index":6,"n_rows":127,"n_cols":49,"rows_kept":127,"cut":false,"hidden":false,"merged":[[0,5,2,15],[76,1,76,8],[15,5,15,8],[15,10,15,13],[16,12,17,12],[16,13,17,13],[16,11,17,11],[16,10,17,10],[55,13,57,47]]}
[null,null,"Vehicle Type","Coolant Type",null,"This sheet provides the series of lists that are in the document and where they are pulled from. "]
[null,null,"Column1","Column1"]
[null,null,"microHEV","EG-W"]
["# of Chemistries in Library",{"$f":"MAX(IF(ISNUMBER(Chem!1:1),Chem!1:1, 0))","v":17},"HEV-HP","CA"]
["List of Chemistries Couples in Library",null,"PHEV","CoolA"]
[1,{"$f":"IFERROR(INDEX(Chem!$1:$1, MATCH(A6, Chem!$1:$1, 0) - 2), \"\")","v":"NCA-G"},"EV"]
{"$rows_left_out":122}
{"sheet":"Refs","index":7,"n_rows":15,"n_cols":3,"rows_kept":15,"cut":false,"hidden":false,"merged":[]}
[]
[]
[null,"Mohr et al. 2020","Mohr, M., Peters, J.F., Baumann, M., Weil, M. (2020). Toward a cell-chemistry specific life cycle assessment of lithium-ion battery recycling processes. Journal of Industrial Ecology 24(6), 1310-1322. DOI: 10.1111/jiec.13021"]
[null,"Dai et al. 2019","Dai, Q., Kelly, J. C., Gaines, L., & Wang, M. (2019). Life cycle analysis of lithium-ion batteries for automotive applications. Batteries, 5(2), 48."]
[null,"Dai et al. 2017","Dai, Q., Dunn, J., Kelly, J. C., & Elgowainy, A. (2017). Update of Life Cycle Analysis of Lithium-Ion Batteries in the GREET Model. 2017. Argonne National Laboratory."]
[null,"Deng et al. 2017","Deng, Y.; Li, J.; Li, T.; Gao, X.; Yuan, Ch. (2017). Life cycle assessment of lithium sulfur battery for electric vehicles. Journal of Power Sources 343, pp. 284-295- doi: 10.1016/j.jpowsour.2017.01.036"]
{"$rows_left_out":9}