{"text_format":"1","workbook":"xlsx","n_sheets":5,"sheets":["Start","Inputs","Outputs","Templates","Concurrency"],"not_rendered":{"charts":0,"images":0,"macros":1,"external_links":0,"defined_names":1,"comments":0,"pivot_tables":0},"unopened":[],"bounds":{"document_bytes":16777216,"sheet_cells":100000,"rows_first":2000,"rows_last":500,"rows_between":2000,"halvings":0,"cell_chars":16384,"cell_head_chars":4096},"cells_cut":0,"cells_raw":0,"read":"whole","date_system":"1900"}

{"sheet":"Start","index":0,"n_rows":242,"n_cols":26,"rows_kept":242,"cut":false,"hidden":false,"merged":[[68,1,68,2],[68,3,68,4],[68,5,68,6],[15,9,15,10],[18,11,18,12],[18,13,18,14],[75,1,75,2],[75,3,75,4],[75,5,75,6],[18,9,19,10],[19,11,19,12],[19,13,19,14],[24,1,24,2],[24,3,24,4],[24,5,24,6],[31,1,31,2],[31,3,31,4],[31,5,31,6],[65,1,65,2],[65,3,65,4],[65,5,65,6],[42,14,42,15],[43,10,43,11],[43,12,43,13],[76,1,76,2],[76,3,76,4],[76,5,76,6],[0,0,2,6],[4,0,4,5],[4,6,4,7],[35,1,35,2],[35,3,35,4],[35,5,35,6],[15,0,15,1],[18,2,18,3],[18,4,18,5],[9,0,10,1],[9,4,9,7],[10,4,10,5],[46,1,46,2],[46,3,46,4],[46,5,46,6],[21,0,21,3],[21,5,21,7],[57,1,57,2],[11,0,11,1],[12,0,12,1],[13,0,13,1],[86,1,86,2],[86,3,86,4],[86,5,86,6],[87,1,87,2],[87,3,87,4],[87,5,87,6],[79,1,79,2],[79,3,79,4],[79,5,79,6],[97,1,97,2],[97,3,97,4],[97,5,97,6],[98,1,98,2],[98,3,98,4],[98,5,98,6],[90,1,90,2],[90,3,90,4],[90,5,90,6],[108,1,108,2],[108,3,108,4],[108,5,108,6],[109,1,109,2],[109,3,109,4],[109,5,109,6],[101,1,101,2],[101,3,101,4],[101,5,101,6],[119,1,119,2],[119,3,119,4],[119,5,119,6],[120,1,120,2],[120,3,120,4],[120,5,120,6],[112,1,112,2],[112,3,112,4],[112,5,112,6],[130,1,130,2],[130,3,130,4],[130,5,130,6],[131,1,131,2],[131,3,131,4],[131,5,131,6],[123,1,123,2],[123,3,123,4],[123,5,123,6],[141,1,141,2],[141,3,141,4],[141,5,141,6],[142,1,142,2],[142,3,142,4],[142,5,142,6],[134,1,134,2],[134,3,134,4],[134,5,134,6],[152,1,152,2],[152,3,152,4],[152,5,152,6],[153,1,153,2],[153,3,153,4],[153,5,153,6],[145,1,145,2],[145,3,145,4],[145,5,145,6],[163,1,163,2],[163,3,163,4],[163,5,163,6],[164,1,164,2],[164,3,164,4],[164,5,164,6],[156,1,156,2],[156,3,156,4],[156,5,156,6],[174,1,174,2],[174,3,174,4],[174,5,174,6],[175,1,175,2],[175,3,175,4],[175,5,175,6],[167,1,167,2],[167,3,167,4],[167,5,167,6],[185,1,185,2],[185,3,185,4],[185,5,185,6],[186,1,186,2],[186,3,186,4],[186,5,186,6],[178,1,178,2],[178,3,178,4],[178,5,178,6],[196,1,196,2],[196,3,196,4],[196,5,196,6],[197,1,197,2],[197,3,197,4],[197,5,197,6],[189,1,189,2],[189,3,189,4],[189,5,189,6],[207,1,207,2],[207,3,207,4],[207,5,207,6],[208,1,208,2],[208,3,208,4],[208,5,208,6],[200,1,200,2],[200,3,200,4],[200,5,200,6],[218,1,218,2],[218,3,218,4],[218,5,218,6],[219,1,219,2],[219,3,219,4],[219,5,219,6],[211,1,211,2],[211,3,211,4],[211,5,211,6],[229,1,229,2],[229,3,229,4],[229,5,229,6],[230,1,230,2],[230,3,230,4],[230,5,230,6],[222,1,222,2],[222,3,222,4],[222,5,222,6],[240,1,240,2],[240,3,240,4],[240,5,240,6],[241,1,241,2],[241,3,241,4],[241,5,241,6],[233,1,233,2],[233,3,233,4],[233,5,233,6],[10,13,10,14],[11,9,11,10],[12,9,12,10],[13,9,13,10],[13,15,13,16],[14,9,14,16],[15,11,15,12],[15,13,15,14],[15,15,15,16],[13,6,13,7],[14,0,14,7],[15,2,15,3],[15,4,15,5],[15,6,15,7],[18,0,19,1],[19,2,19,3],[19,4,19,5],[64,1,64,2],[64,3,64,4],[64,5,64,6],[32,1,32,2],[32,3,32,4],[32,5,32,6],[42,1,42,2],[42,3,42,4],[42,5,42,6],[43,1,43,2],[43,3,43,4],[43,5,43,6],[57,3,57,4],[57,5,57,6],[6,10,6,18],[5,10,5,18],[9,9,10,10],[9,13,9,16],[53,1,53,2],[53,3,53,4],[53,5,53,6],[54,1,54,2],[54,3,54,4],[54,5,54,6],[10,6,10,7],[10,15,10,16],[21,9,21,12],[21,14,21,16],[9,18,10,19],[18,18,19,19],[32,10,32,11],[32,12,32,13],[32,14,32,15],[35,10,35,11],[35,12,35,13],[35,14,35,15],[42,10,42,11],[42,12,42,13],[9,22,9,25],[10,22,10,23],[10,24,10,25],[11,18,11,19],[12,18,12,19],[13,18,13,19],[13,24,13,25],[14,18,14,25],[15,18,15,19],[15,20,15,21],[15,22,15,23],[15,24,15,25],[18,20,18,21],[18,22,18,23],[19,20,19,21],[19,22,19,23],[24,10,24,11],[24,12,24,13],[24,14,24,15],[31,10,31,11],[31,12,31,13],[31,14,31,15],[43,14,43,15],[46,10,46,11],[46,12,46,13],[46,14,46,15],[53,10,53,11],[53,12,53,13],[53,14,53,15],[54,10,54,11],[54,12,54,13],[54,14,54,15],[57,10,57,11],[57,12,57,13],[57,14,57,15],[64,10,64,11],[64,12,64,13],[64,14,64,15],[65,10,65,11],[65,12,65,13],[65,14,65,15],[68,10,68,11],[68,12,68,13],[68,14,68,15],[75,10,75,11],[75,12,75,13],[75,14,75,15],[76,10,76,11],[76,12,76,13],[76,14,76,15],[79,10,79,11],[79,12,79,13],[79,14,79,15],[86,10,86,11],[86,12,86,13],[86,14,86,15],[87,10,87,11],[87,12,87,13],[87,14,87,15],[90,10,90,11],[90,12,90,13],[90,14,90,15],[97,10,97,11],[97,12,97,13],[97,14,97,15],[98,10,98,11],[98,12,98,13],[98,14,98,15],[101,10,101,11],[101,12,101,13],[101,14,101,15],[108,10,108,11],[108,12,108,13],[108,14,108,15],[109,10,109,11],[109,12,109,13],[109,14,109,15],[112,10,112,11],[112,12,112,13],[112,14,112,15],[119,10,119,11],[119,12,119,13],[119,14,119,15],[120,10,120,11],[120,12,120,13],[120,14,120,15],[123,10,123,11],[123,12,123,13],[123,14,123,15],[130,10,130,11],[130,12,130,13],[130,14,130,15],[131,10,131,11],[131,12,131,13],[131,14,131,15],[134,10,134,11],[134,12,134,13],[134,14,134,15],[141,10,141,11],[141,12,141,13],[141,14,141,15],[142,10,142,11],[142,12,142,13],[142,14,142,15],[145,10,145,11],[145,12,145,13],[145,14,145,15],[152,10,152,11],[152,12,152,13],[152,14,152,15],[153,10,153,11],[153,12,153,13],[153,14,153,15],[156,10,156,11],[156,12,156,13],[156,14,156,15],[163,10,163,11],[163,12,163,13],[163,14,163,15],[164,10,164,11],[164,12,164,13],[164,14,164,15],[167,10,167,11],[167,12,167,13],[167,14,167,15],[174,10,174,11],[174,12,174,13],[174,14,174,15],[175,10,175,11],[175,12,175,13],[175,14,175,15],[178,10,178,11],[178,12,178,13],[178,14,178,15],[185,10,185,11],[185,12,185,13],[185,14,185,15],[186,10,186,11],[186,12,186,13],[186,14,186,15],[189,10,189,11],[189,12,189,13],[189,14,189,15],[196,10,196,11],[196,12,196,13],[196,14,196,15],[197,10,197,11],[197,12,197,13],[197,14,197,15],[200,10,200,11],[200,12,200,13],[200,14,200,15],[207,10,207,11],[207,12,207,13],[207,14,207,15],[208,10,208,11],[208,12,208,13],[208,14,208,15],[211,10,211,11],[211,12,211,13],[211,14,211,15],[218,10,218,11],[218,12,218,13],[218,14,218,15],[219,10,219,11],[219,12,219,13],[219,14,219,15],[222,10,222,11],[222,12,222,13],[222,14,222,15],[229,10,229,11],[229,12,229,13],[229,14,229,15],[230,10,230,11],[230,12,230,13],[230,14,230,15],[233,10,233,11],[233,12,233,13],[233,14,233,15],[240,10,240,11],[240,12,240,13],[240,14,240,15],[241,10,241,11],[241,12,241,13],[241,14,241,15]]}
["Three-phase Power Flow Calculation Tool"]
[]
[]
["Feeder detailed",2,"Feeder overall",5]
["Transformer",null,null,null,null,null,"Voltage Borders",null,null,"Input data"]
["Power","Primary Voltage","Load ","Workload","uk","Pk","Upper","Lower",null,null,"Input data in grey coloured fields has to be adapted with respect to the regarded low voltage grid"]
[1200,20,616.51873075429137,{"$f":"C7/A7","v":0.51376560896190948},0.06,150,0.1,0.1,null,null,"Input data in light blue coloured fields is prefilled using input data from grey fields, but can be adapted for more detailed analysis"]
[]
[]
[1,null,"Low voltage knots","Feeder length","Lines(Typ, Number parallel lines)",null,null,null,null,2,null,"Low voltage knots","Feeder length","Lines(Typ, Number parallel lines)",null,null,null,null,"3-5",null,"Low voltage knots","Feeder length","Lines(Typ, Number parallel lines)"]
[null,null,20,500,"N(A)YY 4x150",null,1,null,null,null,null,20,500,"N(A)YY 4x150",null,1,null,null,null,null,20,500,"N(A)YY 4x150",null,1]
["Charging power of EV",null,3.7,11,22,"Number households","Peak Power [kVA]","Concurrency",null,"Charging power of EV",null,3.7,11,22,"Number households","Peak Power [kVA]","Concurrency",null,"Charging power of EV",null,3.7,11,22,"Number households","Peak Power [kVA]","Concurrency"]
["Number EV",null,3,2,1,10,30,{"$f":"Concurrency!$D$9+(1-Concurrency!$D$9)*POWER(F13,-3/4)","v":0.23126912483863926},null,"Number EV",null,3,2,1,10,30,{"$f":"Concurrency!$D$9+(1-Concurrency!$D$9)*POWER(O13,-3/4)","v":0.23126912483863926},null,"Number EV",null,3,2,1,10,30,{"$f":"Concurrency!$D$9+(1-Concurrency!$D$9)*POWER(X13,-3/4)","v":0.23126912483863926}]
["Concurrency",null,{"$f":"IF(C13>Concurrency!$J$8+1,Concurrency!$H$8+(1-Concurrency!$H$8)/(C13-Concurrency!$J$8)^Concurrency!$I$8,1)","v":1},{"$f":"IF(D13>Concurrency!$J$12+1,Concurrency!$H$12+(1-Concurrency!$H$12)/(D13-Concurrency!$J$12)^Concurrency!$I$12,1)","v":1},{"$f":"IF(E13>Concurrency!$J$16+1,Concurrency!$H$16+(1-Concurrency!$H$16)/(E13-Concurrency!$J$16)^Concurrency!$I$16,1)","v":1},"Power per household",{"$f":"H13*G13","v":6.9380737451591781},null,null,"Concurrency",null,{"$f":"IF(L13>Concurrency!$J$8+1,Concurrency!$H$8+(1-Concurrency!$H$8)/(L13-Concurrency!$J$8)^Concurrency!$I$8,1)","v":1},{"$f":"IF(M13>Concurrency!$J$12+1,Concurrency!$H$12+(1-Concurrency!$H$12)/(M13-Concurrency!$J$12)^Concurrency!$I$12,1)","v":1},{"$f":"IF(N13>Concurrency!$J$16+1,Concurrency!$H$16+(1-Concurrency!$H$16)/(N13-Concurrency!$J$16)^Concurrency!$I$16,1)","v":1},"Power per household",{"$f":"Q13*P13","v":6.9380737451591781},null,null,"Concurrency",null,{"$f":"IF(U13>Concurrency!$J$8+1,Concurrency!$H$8+(1-Concurrency!$H$8)/(U13-Concurrency!$J$8)^Concurrency!$I$8,1)","v":1},{"$f":"IF(V13>Concurrency!$J$12+1,Concurrency!$H$12+(1-Concurrency!$H$12)/(V13-Concurrency!$J$12)^Concurrency!$I$12,1)","v":1},{"$f":"IF(W13>Concurrency!$J$16+1,Concurrency!$H$16+(1-Concurrency!$H$16)/(W13-Concurrency!$J$16)^Concurrency!$I$16,1)","v":1},"Power per household",{"$f":"Z13*Y13","v":6.9380737451591781}]
["Power",null,null,null,null,null,null,null,null,"Power",null,null,null,null,null,null,null,null,"Power"]
["Households",null,"E-Mobility",null,"PV",null,"Additional",null,null,"Households",null,"E-Mobility",null,"PV",null,"Additional",null,null,"Households",null,"E-Mobility",null,"PV",null,"Additional"]
["S ","cos(ϕ)","S ","cos(ϕ)","S","cos(ϕ)","S ","cos(ϕ)",null,"S ","cos(ϕ)","S ","cos(ϕ)","S","cos(ϕ)","S ","cos(ϕ)",null,"S ","cos(ϕ)","S ","cos(ϕ)","S","cos(ϕ)","S ","cos(ϕ)"]
[{"$f":"F13*G14","v":69.380737451591784},0.95,{"$f":"C13*C14*C12+D12*D13*D14+E12*E13*E14","v":55.1},1,0,0.95,0,0.95,null,{"$f":"O13*P14","v":69.380737451591784},0.95,{"$f":"L13*L14*L12+M12*M13*M14+N12*N13*N14","v":55.1},1,0,0.95,0,0.95,null,{"$f":"X13*Y14","v":69.380737451591784},0.95,{"$f":"U13*U14*U12+V12*V13*V14+W12*W13*W14","v":55.1},1,0,0.95,0,0.95]
[null,null,"Max ΔU",null,"Current ",null,null,null,null,null,null,"Max ΔU",null,"Current ",null,null,null,null,null,null,"Max ΔU",null,"Current "]
[null,null,-3.2019245109764172E-2,null,{"$f":"MAX($F$24,$F$35,$F$46,$F$57,$F$68,$F$79,$F$90,$F$101,$F$112,$F$123,$F$134,$F$145,$F$156,$F$167,$F$178,$F$189,$F$200,$F$211,$F$222,$F$233)","v":177.9736275807166},null,null,null,null,null,null,-3.2019245109764172E-2,null,{"$f":"MAX($O$24,$O$35,$O$46,$O$57,$O$68,$O$79,$O$90,$O$101,$O$112,$O$123,$O$134,$O$145,$O$156,$O$167,$O$178,$O$189,$O$200,$O$211,$O$222,$O$233)","v":177.97362758071642},null,null,null,null,null,null,-3.2019245109764172E-2,null,177.97362758071642]
[]
["Knoten",null,null,null,null,"Lines",null,null,null,"Knoten",null,null,null,null,"Lines"]
["Nr.","S","cos(ϕ)","Max ΔU","Unbalanced","Max Current","Length","Linetype",null,"Nr.","S","cos(ϕ)","Max ΔU","Unbalanced","Max Current","Length","Linetype"]
[1,6.1467808918843554,0.98435020466391532,-7.4074343153930355E-3,{"$f":"IF(AND(B27=D27,C27=E27,F27=D27,G27=E27,B28=D28,C28=E28,F28=D28,G28=E28,B29=D29,C29=E29,F29=D29,G29=E29,B30=D30,C30=E30,F30=D30,G30=E30),\"No\",\"Yes\")","v":"No"},177.9736275807166,25,"N(A)YY 4x150",null,1,6.1467808918843554,0.98435020466391532,-7.4074343153930355E-3,{"$f":"IF(AND(K27=M27,L27=N27,O27=M27,P27=N27,K28=M28,L28=N28,O28=M28,P28=N28,K29=M29,L29=N29,O29=M29,P29=N29,K30=M30,L30=N30,O30=M30,P30=N30),\"No\",\"Yes\")","v":"No"},177.97362758071642,25,"N(A)YY 4x150"]
[null,"L1",null,"L2",null,"L3",null,"N",null,null,"L1",null,"L2",null,"L3",null,"N"]
[null,"S","cos(ϕ)","S","cos(ϕ)","S","cos(ϕ)",null,null,null,"S","cos(ϕ)","S","cos(ϕ)","S","cos(ϕ)"]
["Households",1.1563456241931964,0.95,1.1563456241931964,0.95,1.1563456241931964,0.95,null,null,"Households",1.1563456241931964,0.95,1.1563456241931964,0.95,1.1563456241931964,0.95]
["E-Mobility ",0.91833333333333333,1,0.91833333333333333,1,0.91833333333333333,1,null,null,"E-Mobility ",0.91833333333333333,1,0.91833333333333333,1,0.91833333333333333,1]
["PV ",0,0.95,0,0.95,0,0.95,null,null,"PV ",0,0.95,0,0.95,0,0.95]
["Additional",0,0.95,0,0.95,0,0.95,null,null,"Additional",0,0.95,0,0.95,0,0.95]
["Sum",0.91833333333333333,1,0.91833333333333333,1,0.91833333333333333,1,null,null,"Sum",0.91833333333333333,1,0.91833333333333333,1,0.91833333333333333,1]
["ΔU",-7.4074343153929245E-3,null,-7.4074343153929245E-3,null,-7.4074343153930355E-3,null,null,null,"ΔU",-7.4074343153929245E-3,null,-7.4074343153929245E-3,null,-7.4074343153930355E-3]
["I",177.9736275807166,null,177.9736275807166,null,177.97362758071657,null,8.0388733884609289E-14,null,"I",177.97362758071642,null,177.97362758071642,null,177.9736275807164,null,7.5531728873092518E-14]
[]
[2,6.1467808918843554,0.98435020466391532,-9.8758298128325261E-3,{"$f":"IF(AND(B38=D38,C38=E38,F38=D38,G38=E38,B39=D39,C39=E39,F39=D39,G39=E39,B40=D40,C40=E40,F40=D40,G40=E40,B41=D41,C41=E41,F41=D41,G41=E41),\"No\",\"Yes\")","v":"No"},169.06895609633764,25,"N(A)YY 4x150",null,2,6.1467808918843554,0.98435020466391532,-9.8758298128325261E-3,{"$f":"IF(AND(K38=M38,L38=N38,O38=M38,P38=N38,K39=M39,L39=N39,O39=M39,P39=N39,K40=M40,L40=N40,O40=M40,P40=N40,K41=M41,L41=N41,O41=M41,P41=N41),\"No\",\"Yes\")","v":"No"},169.06895609633801,25,"N(A)YY 4x150"]
[null,"L1",null,"L2",null,"L3",null,"N",null,null,"L1",null,"L2",null,"L3",null,"N"]
[null,"S","cos(ϕ)","S","cos(ϕ)","S","cos(ϕ)",null,null,null,"S","cos(ϕ)","S","cos(ϕ)","S","cos(ϕ)"]
["Households",1.1563456241931964,0.95,1.1563456241931964,0.95,1.1563456241931964,0.95,null,null,"Households",1.1563456241931964,0.95,1.1563456241931964,0.95,1.1563456241931964,0.95]
["E-Mobility ",0.91833333333333333,1,0.91833333333333333,1,0.91833333333333333,1,null,null,"E-Mobility ",0.91833333333333333,1,0.91833333333333333,1,0.91833333333333333,1]
["PV ",0,0.95,0,0.95,0,0.95,null,null,"PV ",0,0.95,0,0.95,0,0.95]
["Additional",0,0.95,0,0.95,0,0.95,null,null,"Additional",0,0.95,0,0.95,0,0.95]
["Sum",0.91833333333333333,1,0.91833333333333333,1,0.91833333333333333,1,null,null,"Sum",0.91833333333333333,1,0.91833333333333333,1,0.91833333333333333,1]
["ΔU",-9.8758298128324151E-3,null,-9.8758298128324151E-3,null,-9.8758298128325261E-3,null,null,null,"ΔU",-9.8758298128324151E-3,null,-9.8758298128324151E-3,null,-9.8758298128325261E-3]
["I",169.06895609633764,null,169.06895609633764,null,169.06895609633762,null,8.2938935931968787E-14,null,"I",169.06895609633801,null,169.06895609633798,null,169.06895609633796,null,7.3241068776355802E-14]
[]
[3,6.1467808918843554,0.98435020466391532,-1.2212849795083525E-2,{"$f":"IF(AND(B49=D49,C49=E49,F49=D49,G49=E49,B50=D50,C50=E50,F50=D50,G50=E50,B51=D51,C51=E51,F51=D51,G51=E51,B52=D52,C52=E52,F52=D52,G52=E52),\"No\",\"Yes\")","v":"No"},160.16537031930829,25,"N(A)YY 4x150",null,3,6.1467808918843554,0.98435020466391532,-1.2212849795083525E-2,{"$f":"IF(AND(K49=M49,L49=N49,O49=M49,P49=N49,K50=M50,L50=N50,O50=M50,P50=N50,K51=M51,L51=N51,O51=M51,P51=N51,K52=M52,L52=N52,O52=M52,P52=N52),\"No\",\"Yes\")","v":"No"},160.16537031930829,25,"N(A)YY 4x150"]
[null,"L1",null,"L2",null,"L3",null,"N",null,null,"L1",null,"L2",null,"L3",null,"N"]
[null,"S","cos(ϕ)","S","cos(ϕ)","S","cos(ϕ)",null,null,null,"S","cos(ϕ)","S","cos(ϕ)","S","cos(ϕ)"]
["Households",1.1563456241931964,0.95,1.1563456241931964,0.95,1.1563456241931964,0.95,null,null,"Households",1.1563456241931964,0.95,1.1563456241931964,0.95,1.1563456241931964,0.95]
["E-Mobility ",0.91833333333333333,1,0.91833333333333333,1,0.91833333333333333,1,null,null,"E-Mobility ",0.91833333333333333,1,0.91833333333333333,1,0.91833333333333333,1]
["PV ",0,0.95,0,0.95,0,0.95,null,null,"PV ",0,0.95,0,0.95,0,0.95]
["Additional",0,0.95,0,0.95,0,0.95,null,null,"Additional",0,0.95,0,0.95,0,0.95]
["Sum",0.91833333333333333,1,0.91833333333333333,1,0.91833333333333333,1,null,null,"Sum",0.91833333333333333,1,0.91833333333333333,1,0.91833333333333333,1]
["ΔU",-1.2212849795083414E-2,null,-1.2212849795083525E-2,null,-1.2212849795083525E-2,null,null,null,"ΔU",-1.2212849795083414E-2,null,-1.2212849795083525E-2,null,-1.2212849795083525E-2]
["I",160.16537031930829,null,160.16537031930829,null,160.16537031930827,null,8.5560675549290691E-14,null,"I",160.16537031930829,null,160.16537031930829,null,160.16537031930827,null,7.5531728873092518E-14]
[]
[4,6.1467808918843554,0.98435020466391532,-1.4418725173626301E-2,{"$f":"IF(AND(B60=D60,C60=E60,F60=D60,G60=E60,B61=D61,C61=E61,F61=D61,G61=E61,B62=D62,C62=E62,F62=D62,G62=E62,B63=D63,C63=E63,F63=D63,G63=E63),\"No\",\"Yes\")","v":"No"},151.26277020275913,25,"N(A)YY 4x150",null,4,6.1467808918843554,0.98435020466391532,-1.4418725173626301E-2,{"$f":"IF(AND(K60=M60,L60=N60,O60=M60,P60=N60,K61=M61,L61=N61,O61=M61,P61=N61,K62=M62,L62=N62,O62=M62,P62=N62,K63=M63,L63=N63,O63=M63,P63=N63),\"No\",\"Yes\")","v":"No"},151.26277020275811,25,"N(A)YY 4x150"]
[null,"L1",null,"L2",null,"L3",null,"N",null,null,"L1",null,"L2",null,"L3",null,"N"]
[null,"S","cos(ϕ)","S","cos(ϕ)","S","cos(ϕ)",null,null,null,"S","cos(ϕ)","S","cos(ϕ)","S","cos(ϕ)"]
["Households",1.1563456241931964,0.95,1.1563456241931964,0.95,1.1563456241931964,0.95,null,null,"Households",1.1563456241931964,0.95,1.1563456241931964,0.95,1.1563456241931964,0.95]
["E-Mobility ",0.91833333333333333,1,0.91833333333333333,1,0.91833333333333333,1,null,null,"E-Mobility ",0.91833333333333333,1,0.91833333333333333,1,0.91833333333333333,1]
["PV ",0,0.95,0,0.95,0,0.95,null,null,"PV ",0,0.95,0,0.95,0,0.95]
["Additional",0,0.95,0,0.95,0,0.95,null,null,"Additional",0,0.95,0,0.95,0,0.95]
["Sum",0.91833333333333333,1,0.91833333333333333,1,0.91833333333333333,1,null,null,"Sum",0.91833333333333333,1,0.91833333333333333,1,0.91833333333333333,1]
["ΔU",-1.441872517362619E-2,null,-1.4418725173626301E-2,null,-1.4418725173626301E-2,null,null,null,"ΔU",-1.441872517362619E-2,null,-1.441872517362619E-2,null,-1.4418725173626301E-2]
["I",151.2627702027591,null,151.26277020275913,null,151.26277020275907,null,9.099386826154683E-14,null,"I",151.26277020275811,null,151.26277020275811,null,151.26277020275808,null,4.832213032818602E-14]
[]
[5,6.1467808918843554,0.98435020466391532,-1.6493675603334257E-2,{"$f":"IF(AND(B71=D71,C71=E71,F71=D71,G71=E71,B72=D72,C72=E72,F72=D72,G72=E72,B73=D73,C73=E73,F73=D73,G73=E73,B74=D74,C74=E74,F74=D74,G74=E74),\"No\",\"Yes\")","v":"No"},142.36106254544438,25,"N(A)YY 4x150",null,5,6.1467808918843554,0.98435020466391532,-1.6493675603334146E-2,{"$f":"IF(AND(K71=M71,L71=N71,O71=M71,P71=N71,K72=M72,L72=N72,O72=M72,P72=N72,K73=M73,L73=N73,O73=M73,P73=N73,K74=M74,L74=N74,O74=M74,P74=N74),\"No\",\"Yes\")","v":"No"},142.36106254543859,25,"N(A)YY 4x150"]
[null,"L1",null,"L2",null,"L3",null,"N",null,null,"L1",null,"L2",null,"L3",null,"N"]
[null,"S","cos(ϕ)","S","cos(ϕ)","S","cos(ϕ)",null,null,null,"S","cos(ϕ)","S","cos(ϕ)","S","cos(ϕ)"]
["Households",1.1563456241931964,0.95,1.1563456241931964,0.95,1.1563456241931964,0.95,null,null,"Households",1.1563456241931964,0.95,1.1563456241931964,0.95,1.1563456241931964,0.95]
["E-Mobility ",0.91833333333333333,1,0.91833333333333333,1,0.91833333333333333,1,null,null,"E-Mobility ",0.91833333333333333,1,0.91833333333333333,1,0.91833333333333333,1]
["PV ",0,0.95,0,0.95,0,0.95,null,null,"PV ",0,0.95,0,0.95,0,0.95]
["Additional",0,0.95,0,0.95,0,0.95,null,null,"Additional",0,0.95,0,0.95,0,0.95]
["Sum",0.91833333333333333,1,0.91833333333333333,1,0.91833333333333333,1,null,null,"Sum",0.91833333333333333,1,0.91833333333333333,1,0.91833333333333333,1]
["ΔU",-1.6493675603334146E-2,null,-1.6493675603334257E-2,null,-1.6493675603334257E-2,null,null,null,"ΔU",-1.6493675603334035E-2,null,-1.6493675603334035E-2,null,-1.6493675603334146E-2]
["I",142.36106254544438,null,142.36106254544438,null,142.36106254544436,null,7.5531728873092518E-14,null,"I",142.36106254543859,null,142.36106254543859,null,142.36106254543856,null,4.5496934130773415E-14]
[]
[6,6.1467808918843554,0.98435020466391532,-1.843790923270372E-2,{"$f":"IF(AND(B82=D82,C82=E82,F82=D82,G82=E82,B83=D83,C83=E83,F83=D83,G83=E83,B84=D84,C84=E84,F84=D84,G84=E84,B85=D85,C85=E85,F85=D85,G85=E85),\"No\",\"Yes\")","v":"No"},133.46016064288023,25,"N(A)YY 4x150",null,6,6.1467808918843554,0.98435020466391532,-1.843790923270372E-2,{"$f":"IF(AND(K82=M82,L82=N82,O82=M82,P82=N82,K83=M83,L83=N83,O83=M83,P83=N83,K84=M84,L84=N84,O84=M84,P84=N84,K85=M85,L85=N85,O85=M85,P85=N85),\"No\",\"Yes\")","v":"No"},133.46016064288673,25,"N(A)YY 4x150"]
[null,"L1",null,"L2",null,"L3",null,"N",null,null,"L1",null,"L2",null,"L3",null,"N"]
[null,"S","cos(ϕ)","S","cos(ϕ)","S","cos(ϕ)",null,null,null,"S","cos(ϕ)","S","cos(ϕ)","S","cos(ϕ)"]
["Households",1.1563456241931964,0.95,1.1563456241931964,0.95,1.1563456241931964,0.95,null,null,"Households",1.1563456241931964,0.95,1.1563456241931964,0.95,1.1563456241931964,0.95]
["E-Mobility ",0.91833333333333333,1,0.91833333333333333,1,0.91833333333333333,1,null,null,"E-Mobility ",0.91833333333333333,1,0.91833333333333333,1,0.91833333333333333,1]
["PV ",0,0.95,0,0.95,0,0.95,null,null,"PV ",0,0.95,0,0.95,0,0.95]
["Additional",0,0.95,0,0.95,0,0.95,null,null,"Additional",0,0.95,0,0.95,0,0.95]
["Sum",0.91833333333333333,1,0.91833333333333333,1,0.91833333333333333,1,null,null,"Sum",0.91833333333333333,1,0.91833333333333333,1,0.91833333333333333,1]
["ΔU",-1.8437909232703609E-2,null,-1.843790923270372E-2,null,-1.843790923270372E-2,null,null,null,"ΔU",-1.8437909232703609E-2,null,-1.843790923270372E-2,null,-1.843790923270372E-2]
["I",133.46016064288023,null,133.46016064288023,null,133.4601606428802,null,4.832213032818602E-14,null,"I",133.46016064288673,null,133.46016064288673,null,133.46016064288673,null,4.5496934130773415E-14]
[]
[7,6.1467808918843554,0.98435020466391532,-2.0251622463194563E-2,{"$f":"IF(AND(B93=D93,C93=E93,F93=D93,G93=E93,B94=D94,C94=E94,F94=D94,G94=E94,B95=D95,C95=E95,F95=D95,G95=E95,B96=D96,C96=E96,F96=D96,G96=E96),\"No\",\"Yes\")","v":"No"},124.55998393289181,25,"N(A)YY 4x150",null,7,6.1467808918843554,0.98435020466391532,-2.0251622463194563E-2,{"$f":"IF(AND(K93=M93,L93=N93,O93=M93,P93=N93,K94=M94,L94=N94,O94=M94,P94=N94,K95=M95,L95=N95,O95=M95,P95=N95,K96=M96,L96=N96,O96=M96,P96=N96),\"No\",\"Yes\")","v":"No"},124.55998393289163,25,"N(A)YY 4x150"]
[null,"L1",null,"L2",null,"L3",null,"N",null,null,"L1",null,"L2",null,"L3",null,"N"]
[null,"S","cos(ϕ)","S","cos(ϕ)","S","cos(ϕ)",null,null,null,"S","cos(ϕ)","S","cos(ϕ)","S","cos(ϕ)"]
["Households",1.1563456241931964,0.95,1.1563456241931964,0.95,1.1563456241931964,0.95,null,null,"Households",1.1563456241931964,0.95,1.1563456241931964,0.95,1.1563456241931964,0.95]
["E-Mobility ",0.91833333333333333,1,0.91833333333333333,1,0.91833333333333333,1,null,null,"E-Mobility ",0.91833333333333333,1,0.91833333333333333,1,0.91833333333333333,1]
["PV ",0,0.95,0,0.95,0,0.95,null,null,"PV ",0,0.95,0,0.95,0,0.95]
["Additional",0,0.95,0,0.95,0,0.95,null,null,"Additional",0,0.95,0,0.95,0,0.95]
["Sum",0.91833333333333333,1,0.91833333333333333,1,0.91833333333333333,1,null,null,"Sum",0.91833333333333333,1,0.91833333333333333,1,0.91833333333333333,1]
["ΔU",-2.0251622463194563E-2,null,-2.0251622463194563E-2,null,-2.0251622463194563E-2,null,null,null,"ΔU",-2.0251622463194563E-2,null,-2.0251622463194563E-2,null,-2.0251622463194563E-2]
["I",124.55998393289178,null,124.55998393289181,null,124.55998393289178,null,3.8263897345803626E-14,null,"I",124.55998393289161,null,124.55998393289163,null,124.5599839328916,null,6.0291550413456957E-14]
[]
[8,6.1467808918843554,0.98435020466391532,-2.1934999718609016E-2,{"$f":"IF(AND(B104=D104,C104=E104,F104=D104,G104=E104,B105=D105,C105=E105,F105=D105,G105=E105,B106=D106,C106=E106,F106=D106,G106=E106,B107=D107,C107=E107,F107=D107,G107=E107),\"No\",\"Yes\")","v":"No"},115.66045763599746,25,"N(A)YY 4x150",null,8,6.1467808918843554,0.98435020466391532,-2.1934999718609016E-2,{"$f":"IF(AND(K104=M104,L104=N104,O104=M104,P104=N104,K105=M105,L105=N105,O105=M105,P105=N105,K106=M106,L106=N106,O106=M106,P106=N106,K107=M107,L107=N107,O107=M107,P107=N107),\"No\",\"Yes\")","v":"No"},115.66045763599782,25,"N(A)YY 4x150"]
[null,"L1",null,"L2",null,"L3",null,"N",null,null,"L1",null,"L2",null,"L3",null,"N"]
[null,"S","cos(ϕ)","S","cos(ϕ)","S","cos(ϕ)",null,null,null,"S","cos(ϕ)","S","cos(ϕ)","S","cos(ϕ)"]
["Households",1.1563456241931964,0.95,1.1563456241931964,0.95,1.1563456241931964,0.95,null,null,"Households",1.1563456241931964,0.95,1.1563456241931964,0.95,1.1563456241931964,0.95]
["E-Mobility ",0.91833333333333333,1,0.91833333333333333,1,0.91833333333333333,1,null,null,"E-Mobility ",0.91833333333333333,1,0.91833333333333333,1,0.91833333333333333,1]
["PV ",0,0.95,0,0.95,0,0.95,null,null,"PV ",0,0.95,0,0.95,0,0.95]
["Additional",0,0.95,0,0.95,0,0.95,null,null,"Additional",0,0.95,0,0.95,0,0.95]
["Sum",0.91833333333333333,1,0.91833333333333333,1,0.91833333333333333,1,null,null,"Sum",0.91833333333333333,1,0.91833333333333333,1,0.91833333333333333,1]
["ΔU",-2.1934999718608905E-2,null,-2.1934999718608905E-2,null,-2.1934999718609016E-2,null,null,null,"ΔU",-2.1934999718608905E-2,null,-2.1934999718608905E-2,null,-2.1934999718609016E-2]
["I",115.66045763599743,null,115.66045763599746,null,115.66045763599743,null,4.832213032818602E-14,null,"I",115.66045763599779,null,115.66045763599782,null,115.66045763599779,null,3.8263897345803626E-14]
[]
[9,6.1467808918843554,0.98435020466391532,-2.3488213225406951E-2,{"$f":"IF(AND(B115=D115,C115=E115,F115=D115,G115=E115,B116=D116,C116=E116,F116=D116,G116=E116,B117=D117,C117=E117,F117=D117,G117=E117,B118=D118,C118=E118,F118=D118,G118=E118),\"No\",\"Yes\")","v":"No"},106.76151239105002,25,"N(A)YY 4x150",null,9,6.1467808918843554,0.98435020466391532,-2.3488213225406951E-2,{"$f":"IF(AND(K115=M115,L115=N115,O115=M115,P115=N115,K116=M116,L116=N116,O116=M116,P116=N116,K117=M117,L117=N117,O117=M117,P117=N117,K118=M118,L118=N118,O118=M118,P118=N118),\"No\",\"Yes\")","v":"No"},106.76151239105019,25,"N(A)YY 4x150"]
[null,"L1",null,"L2",null,"L3",null,"N",null,null,"L1",null,"L2",null,"L3",null,"N"]
[null,"S","cos(ϕ)","S","cos(ϕ)","S","cos(ϕ)",null,null,null,"S","cos(ϕ)","S","cos(ϕ)","S","cos(ϕ)"]
["Households",1.1563456241931964,0.95,1.1563456241931964,0.95,1.1563456241931964,0.95,null,null,"Households",1.1563456241931964,0.95,1.1563456241931964,0.95,1.1563456241931964,0.95]
["E-Mobility ",0.91833333333333333,1,0.91833333333333333,1,0.91833333333333333,1,null,null,"E-Mobility ",0.91833333333333333,1,0.91833333333333333,1,0.91833333333333333,1]
["PV ",0,0.95,0,0.95,0,0.95,null,null,"PV ",0,0.95,0,0.95,0,0.95]
["Additional",0,0.95,0,0.95,0,0.95,null,null,"Additional",0,0.95,0,0.95,0,0.95]
["Sum",0.91833333333333333,1,0.91833333333333333,1,0.91833333333333333,1,null,null,"Sum",0.91833333333333333,1,0.91833333333333333,1,0.91833333333333333,1]
["ΔU",-2.348821322540684E-2,null,-2.348821322540684E-2,null,-2.3488213225406951E-2,null,null,null,"ΔU",-2.348821322540684E-2,null,-2.348821322540684E-2,null,-2.3488213225406951E-2]
["I",106.76151239105,null,106.76151239105002,null,106.76151239105,null,3.8263897345803626E-14,null,"I",106.76151239105018,null,106.76151239105019,null,106.76151239105016,null,4.4938668397781776E-14]
[]
[10,6.1467808918843554,0.98435020466391532,-2.4911422804819061E-2,{"$f":"IF(AND(B126=D126,C126=E126,F126=D126,G126=E126,B127=D127,C127=E127,F127=D127,G127=E127,B128=D128,C128=E128,F128=D128,G128=E128,B129=D129,C129=E129,F129=D129,G129=E129),\"No\",\"Yes\")","v":"No"},97.863083886472651,25,"N(A)YY 4x150",null,10,6.1467808918843554,0.98435020466391532,-2.4911422804819172E-2,{"$f":"IF(AND(K126=M126,L126=N126,O126=M126,P126=N126,K127=M127,L127=N127,O127=M127,P127=N127,K128=M128,L128=N128,O128=M128,P128=N128,K129=M129,L129=N129,O129=M129,P129=N129),\"No\",\"Yes\")","v":"No"},97.863083886471813,25,"N(A)YY 4x150"]
[null,"L1",null,"L2",null,"L3",null,"N",null,null,"L1",null,"L2",null,"L3",null,"N"]
[null,"S","cos(ϕ)","S","cos(ϕ)","S","cos(ϕ)",null,null,null,"S","cos(ϕ)","S","cos(ϕ)","S","cos(ϕ)"]
["Households",1.1563456241931964,0.95,1.1563456241931964,0.95,1.1563456241931964,0.95,null,null,"Households",1.1563456241931964,0.95,1.1563456241931964,0.95,1.1563456241931964,0.95]
["E-Mobility ",0.91833333333333333,1,0.91833333333333333,1,0.91833333333333333,1,null,null,"E-Mobility ",0.91833333333333333,1,0.91833333333333333,1,0.91833333333333333,1]
["PV ",0,0.95,0,0.95,0,0.95,null,null,"PV ",0,0.95,0,0.95,0,0.95]
["Additional",0,0.95,0,0.95,0,0.95,null,null,"Additional",0,0.95,0,0.95,0,0.95]
["Sum",0.91833333333333333,1,0.91833333333333333,1,0.91833333333333333,1,null,null,"Sum",0.91833333333333333,1,0.91833333333333333,1,0.91833333333333333,1]
["ΔU",-2.4911422804819061E-2,null,-2.4911422804819061E-2,null,-2.4911422804819061E-2,null,null,null,"ΔU",-2.4911422804819061E-2,null,-2.4911422804819061E-2,null,-2.4911422804819172E-2]
["I",97.863083886472651,null,97.863083886472651,null,97.863083886472637,null,4.0194366942304644E-14,null,"I",97.863083886471799,null,97.863083886471813,null,97.86308388647177,null,5.1237965343830028E-14]
[]
[11,6.1467808918843554,0.98435020466391532,-2.6204775677572401E-2,{"$f":"IF(AND(B137=D137,C137=E137,F137=D137,G137=E137,B138=D138,C138=E138,F138=D138,G138=E138,B139=D139,C139=E139,F139=D139,G139=E139,B140=D140,C140=E140,F140=D140,G140=E140),\"No\",\"Yes\")","v":"No"},88.965112487217539,25,"N(A)YY 4x150",null,11,6.1467808918843554,0.98435020466391532,-2.6204775677572401E-2,{"$f":"IF(AND(K137=M137,L137=N137,O137=M137,P137=N137,K138=M138,L138=N138,O138=M138,P138=N138,K139=M139,L139=N139,O139=M139,P139=N139,K140=M140,L140=N140,O140=M140,P140=N140),\"No\",\"Yes\")","v":"No"},88.965112487217539,25,"N(A)YY 4x150"]
[null,"L1",null,"L2",null,"L3",null,"N",null,null,"L1",null,"L2",null,"L3",null,"N"]
[null,"S","cos(ϕ)","S","cos(ϕ)","S","cos(ϕ)",null,null,null,"S","cos(ϕ)","S","cos(ϕ)","S","cos(ϕ)"]
["Households",1.1563456241931964,0.95,1.1563456241931964,0.95,1.1563456241931964,0.95,null,null,"Households",1.1563456241931964,0.95,1.1563456241931964,0.95,1.1563456241931964,0.95]
["E-Mobility ",0.91833333333333333,1,0.91833333333333333,1,0.91833333333333333,1,null,null,"E-Mobility ",0.91833333333333333,1,0.91833333333333333,1,0.91833333333333333,1]
["PV ",0,0.95,0,0.95,0,0.95,null,null,"PV ",0,0.95,0,0.95,0,0.95]
["Additional",0,0.95,0,0.95,0,0.95,null,null,"Additional",0,0.95,0,0.95,0,0.95]
["Sum",0.91833333333333333,1,0.91833333333333333,1,0.91833333333333333,1,null,null,"Sum",0.91833333333333333,1,0.91833333333333333,1,0.91833333333333333,1]
["ΔU",-2.620477567757229E-2,null,-2.620477567757229E-2,null,-2.6204775677572401E-2,null,null,null,"ΔU",-2.620477567757229E-2,null,-2.620477567757229E-2,null,-2.6204775677572401E-2]
["I",88.965112487217539,null,88.965112487217539,null,88.965112487217496,null,6.3552874323130192E-14,null,"I",88.965112487217539,null,88.965112487217539,null,88.96511248721751,null,3.8958546965271006E-14]
[]
[12,6.1467808918843554,0.98435020466391532,-2.7368406282005209E-2,{"$f":"IF(AND(B148=D148,C148=E148,F148=D148,G148=E148,B149=D149,C149=E149,F149=D149,G149=E149,B150=D150,C150=E150,F150=D150,G150=E150,B151=D151,C151=E151,F151=D151,G151=E151),\"No\",\"Yes\")","v":"No"},80.067542858193391,25,"N(A)YY 4x150",null,12,6.1467808918843554,0.98435020466391532,-2.7368406282005098E-2,{"$f":"IF(AND(K148=M148,L148=N148,O148=M148,P148=N148,K149=M149,L149=N149,O149=M149,P149=N149,K150=M150,L150=N150,O150=M150,P150=N150,K151=M151,L151=N151,O151=M151,P151=N151),\"No\",\"Yes\")","v":"No"},80.067542858186059,25,"N(A)YY 4x150"]
[null,"L1",null,"L2",null,"L3",null,"N",null,null,"L1",null,"L2",null,"L3",null,"N"]
[null,"S","cos(ϕ)","S","cos(ϕ)","S","cos(ϕ)",null,null,null,"S","cos(ϕ)","S","cos(ϕ)","S","cos(ϕ)"]
["Households",1.1563456241931964,0.95,1.1563456241931964,0.95,1.1563456241931964,0.95,null,null,"Households",1.1563456241931964,0.95,1.1563456241931964,0.95,1.1563456241931964,0.95]
["E-Mobility ",0.91833333333333333,1,0.91833333333333333,1,0.91833333333333333,1,null,null,"E-Mobility ",0.91833333333333333,1,0.91833333333333333,1,0.91833333333333333,1]
["PV ",0,0.95,0,0.95,0,0.95,null,null,"PV ",0,0.95,0,0.95,0,0.95]
["Additional",0,0.95,0,0.95,0,0.95,null,null,"Additional",0,0.95,0,0.95,0,0.95]
["Sum",0.91833333333333333,1,0.91833333333333333,1,0.91833333333333333,1,null,null,"Sum",0.91833333333333333,1,0.91833333333333333,1,0.91833333333333333,1]
["ΔU",-2.7368406282005209E-2,null,-2.7368406282005209E-2,null,-2.7368406282005209E-2,null,null,null,"ΔU",-2.7368406282005098E-2,null,-2.7368406282005098E-2,null,-2.7368406282005098E-2]
["I",80.067542858193391,null,80.067542858193391,null,80.067542858193391,null,3.5527136788005009E-14,null,"I",80.067542858186044,null,80.067542858186059,null,80.06754285818603,null,4.1469467965984394E-14]
[]
[13,6.1467808918843554,0.98435020466391532,-2.8402436106294227E-2,{"$f":"IF(AND(B159=D159,C159=E159,F159=D159,G159=E159,B160=D160,C160=E160,F160=D160,G160=E160,B161=D161,C161=E161,F161=D161,G161=E161,B162=D162,C162=E162,F162=D162,G162=E162),\"No\",\"Yes\")","v":"No"},71.170323584021347,25,"N(A)YY 4x150",null,13,6.1467808918843554,0.98435020466391532,-2.8402436106294227E-2,{"$f":"IF(AND(K159=M159,L159=N159,O159=M159,P159=N159,K160=M160,L160=N160,O160=M160,P160=N160,K161=M161,L161=N161,O161=M161,P161=N161,K162=M162,L162=N162,O162=M162,P162=N162),\"No\",\"Yes\")","v":"No"},71.17032358402939,25,"N(A)YY 4x150"]
[null,"L1",null,"L2",null,"L3",null,"N",null,null,"L1",null,"L2",null,"L3",null,"N"]
[null,"S","cos(ϕ)","S","cos(ϕ)","S","cos(ϕ)",null,null,null,"S","cos(ϕ)","S","cos(ϕ)","S","cos(ϕ)"]
["Households",1.1563456241931964,0.95,1.1563456241931964,0.95,1.1563456241931964,0.95,null,null,"Households",1.1563456241931964,0.95,1.1563456241931964,0.95,1.1563456241931964,0.95]
["E-Mobility ",0.91833333333333333,1,0.91833333333333333,1,0.91833333333333333,1,null,null,"E-Mobility ",0.91833333333333333,1,0.91833333333333333,1,0.91833333333333333,1]
["PV ",0,0.95,0,0.95,0,0.95,null,null,"PV ",0,0.95,0,0.95,0,0.95]
["Additional",0,0.95,0,0.95,0,0.95,null,null,"Additional",0,0.95,0,0.95,0,0.95]
["Sum",0.91833333333333333,1,0.91833333333333333,1,0.91833333333333333,1,null,null,"Sum",0.91833333333333333,1,0.91833333333333333,1,0.91833333333333333,1]
["ΔU",-2.8402436106294116E-2,null,-2.8402436106294227E-2,null,-2.8402436106294116E-2,null,null,null,"ΔU",-2.8402436106294116E-2,null,-2.8402436106294227E-2,null,-2.8402436106294116E-2]
["I",71.170323584021347,null,71.170323584021347,null,71.170323584021332,null,4.1469467965984394E-14,null,"I",71.17032358402939,null,71.17032358402939,null,71.170323584029376,null,3.0198066269804258E-14]
[]
[14,6.1467808918843554,0.98435020466391532,-2.9306973535463854E-2,{"$f":"IF(AND(B170=D170,C170=E170,F170=D170,G170=E170,B171=D171,C171=E171,F171=D171,G171=E171,B172=D172,C172=E172,F172=D172,G172=E172,B173=D173,C173=E173,F173=D173,G173=E173),\"No\",\"Yes\")","v":"No"},62.27340678589951,25,"N(A)YY 4x150",null,14,6.1467808918843554,0.98435020466391532,-2.9306973535463965E-2,{"$f":"IF(AND(K170=M170,L170=N170,O170=M170,P170=N170,K171=M171,L171=N171,O171=M171,P171=N171,K172=M172,L172=N172,O172=M172,P172=N172,K173=M173,L173=N173,O173=M173,P173=N173),\"No\",\"Yes\")","v":"No"},62.273406785898487,25,"N(A)YY 4x150"]
[null,"L1",null,"L2",null,"L3",null,"N",null,null,"L1",null,"L2",null,"L3",null,"N"]
[null,"S","cos(ϕ)","S","cos(ϕ)","S","cos(ϕ)",null,null,null,"S","cos(ϕ)","S","cos(ϕ)","S","cos(ϕ)"]
["Households",1.1563456241931964,0.95,1.1563456241931964,0.95,1.1563456241931964,0.95,null,null,"Households",1.1563456241931964,0.95,1.1563456241931964,0.95,1.1563456241931964,0.95]
["E-Mobility ",0.91833333333333333,1,0.91833333333333333,1,0.91833333333333333,1,null,null,"E-Mobility ",0.91833333333333333,1,0.91833333333333333,1,0.91833333333333333,1]
["PV ",0,0.95,0,0.95,0,0.95,null,null,"PV ",0,0.95,0,0.95,0,0.95]
["Additional",0,0.95,0,0.95,0,0.95,null,null,"Additional",0,0.95,0,0.95,0,0.95]
["Sum",0.91833333333333333,1,0.91833333333333333,1,0.91833333333333333,1,null,null,"Sum",0.91833333333333333,1,0.91833333333333333,1,0.91833333333333333,1]
["ΔU",-2.9306973535463854E-2,null,-2.9306973535463854E-2,null,-2.9306973535463854E-2,null,null,null,"ΔU",-2.9306973535463854E-2,null,-2.9306973535463854E-2,null,-2.9306973535463965E-2]
["I",62.273406785899496,null,62.27340678589951,null,62.273406785899489,null,2.5864145986817697E-14,null,"I",62.27340678589848,null,62.273406785898487,null,62.27340678589848,null,1.888293221827313E-14]
[]
[15,6.1467808918843554,0.98435020466391532,-3.0082113713793657E-2,{"$f":"IF(AND(B181=D181,C181=E181,F181=D181,G181=E181,B182=D182,C182=E182,F182=D182,G182=E182,B183=D183,C183=E183,F183=D183,G183=E183,B184=D184,C184=E184,F184=D184,G184=E184),\"No\",\"Yes\")","v":"No"},53.376747735440745,25,"N(A)YY 4x150",null,15,6.1467808918843554,0.98435020466391532,-3.0082113713793657E-2,{"$f":"IF(AND(K181=M181,L181=N181,O181=M181,P181=N181,K182=M182,L182=N182,O182=M182,P182=N182,K183=M183,L183=N183,O183=M183,P183=N183,K184=M184,L184=N184,O184=M184,P184=N184),\"No\",\"Yes\")","v":"No"},53.376747735441761,25,"N(A)YY 4x150"]
[null,"L1",null,"L2",null,"L3",null,"N",null,null,"L1",null,"L2",null,"L3",null,"N"]
[null,"S","cos(ϕ)","S","cos(ϕ)","S","cos(ϕ)",null,null,null,"S","cos(ϕ)","S","cos(ϕ)","S","cos(ϕ)"]
["Households",1.1563456241931964,0.95,1.1563456241931964,0.95,1.1563456241931964,0.95,null,null,"Households",1.1563456241931964,0.95,1.1563456241931964,0.95,1.1563456241931964,0.95]
["E-Mobility ",0.91833333333333333,1,0.91833333333333333,1,0.91833333333333333,1,null,null,"E-Mobility ",0.91833333333333333,1,0.91833333333333333,1,0.91833333333333333,1]
["PV ",0,0.95,0,0.95,0,0.95,null,null,"PV ",0,0.95,0,0.95,0,0.95]
["Additional",0,0.95,0,0.95,0,0.95,null,null,"Additional",0,0.95,0,0.95,0,0.95]
["Sum",0.91833333333333333,1,0.91833333333333333,1,0.91833333333333333,1,null,null,"Sum",0.91833333333333333,1,0.91833333333333333,1,0.91833333333333333,1]
["ΔU",-3.0082113713793657E-2,null,-3.0082113713793657E-2,null,-3.0082113713793657E-2,null,null,null,"ΔU",-3.0082113713793657E-2,null,-3.0082113713793657E-2,null,-3.0082113713793657E-2]
["I",53.37674773544073,null,53.376747735440745,null,53.376747735440738,null,1.9131948672901813E-14,null,"I",53.376747735441747,null,53.376747735441761,null,53.376747735441747,null,2.2469334198890888E-14]
[]
[16,6.1467808918843554,0.98435020466391532,-3.0727938423177448E-2,{"$f":"IF(AND(B192=D192,C192=E192,F192=D192,G192=E192,B193=D193,C193=E193,F193=D193,G193=E193,B194=D194,C194=E194,F194=D194,G194=E194,B195=D195,C195=E195,F195=D195,G195=E195),\"No\",\"Yes\")","v":"No"},44.480304466368509,25,"N(A)YY 4x150",null,16,6.1467808918843554,0.98435020466391532,-3.0727938423177448E-2,{"$f":"IF(AND(K192=M192,L192=N192,O192=M192,P192=N192,K193=M193,L193=N193,O193=M193,P193=N193,K194=M194,L194=N194,O194=M194,P194=N194,K195=M195,L195=N195,O195=M195,P195=N195),\"No\",\"Yes\")","v":"No"},44.480304466368501,25,"N(A)YY 4x150"]
[null,"L1",null,"L2",null,"L3",null,"N",null,null,"L1",null,"L2",null,"L3",null,"N"]
[null,"S","cos(ϕ)","S","cos(ϕ)","S","cos(ϕ)",null,null,null,"S","cos(ϕ)","S","cos(ϕ)","S","cos(ϕ)"]
["Households",1.1563456241931964,0.95,1.1563456241931964,0.95,1.1563456241931964,0.95,null,null,"Households",1.1563456241931964,0.95,1.1563456241931964,0.95,1.1563456241931964,0.95]
["E-Mobility ",0.91833333333333333,1,0.91833333333333333,1,0.91833333333333333,1,null,null,"E-Mobility ",0.91833333333333333,1,0.91833333333333333,1,0.91833333333333333,1]
["PV ",0,0.95,0,0.95,0,0.95,null,null,"PV ",0,0.95,0,0.95,0,0.95]
["Additional",0,0.95,0,0.95,0,0.95,null,null,"Additional",0,0.95,0,0.95,0,0.95]
["Sum",0.91833333333333333,1,0.91833333333333333,1,0.91833333333333333,1,null,null,"Sum",0.91833333333333333,1,0.91833333333333333,1,0.91833333333333333,1]
["ΔU",-3.0727938423177448E-2,null,-3.0727938423177448E-2,null,-3.0727938423177448E-2,null,null,null,"ΔU",-3.0727938423177448E-2,null,-3.0727938423177448E-2,null,-3.0727938423177448E-2]
["I",44.480304466368501,null,44.480304466368509,null,44.480304466368494,null,2.4884851026246757E-14,null,"I",44.480304466368501,null,44.480304466368501,null,44.480304466368501,null,1.551136925266137E-14]
[]
[17,6.1467808918843554,0.98435020466391532,-3.1244515977926435E-2,{"$f":"IF(AND(B203=D203,C203=E203,F203=D203,G203=E203,B204=D204,C204=E204,F204=D204,G204=E204,B205=D205,C205=E205,F205=D205,G205=E205,B206=D206,C206=E206,F206=D206,G206=E206),\"No\",\"Yes\")","v":"No"},35.584037383740153,25,"N(A)YY 4x150",null,17,6.1467808918843554,0.98435020466391532,-3.1244515977926435E-2,{"$f":"IF(AND(K203=M203,L203=N203,O203=M203,P203=N203,K204=M204,L204=N204,O204=M204,P204=N204,K205=M205,L205=N205,O205=M205,P205=N205,K206=M206,L206=N206,O206=M206,P206=N206),\"No\",\"Yes\")","v":"No"},35.584037383737943,25,"N(A)YY 4x150"]
[null,"L1",null,"L2",null,"L3",null,"N",null,null,"L1",null,"L2",null,"L3",null,"N"]
[null,"S","cos(ϕ)","S","cos(ϕ)","S","cos(ϕ)",null,null,null,"S","cos(ϕ)","S","cos(ϕ)","S","cos(ϕ)"]
["Households",1.1563456241931964,0.95,1.1563456241931964,0.95,1.1563456241931964,0.95,null,null,"Households",1.1563456241931964,0.95,1.1563456241931964,0.95,1.1563456241931964,0.95]
["E-Mobility ",0.91833333333333333,1,0.91833333333333333,1,0.91833333333333333,1,null,null,"E-Mobility ",0.91833333333333333,1,0.91833333333333333,1,0.91833333333333333,1]
["PV ",0,0.95,0,0.95,0,0.95,null,null,"PV ",0,0.95,0,0.95,0,0.95]
["Additional",0,0.95,0,0.95,0,0.95,null,null,"Additional",0,0.95,0,0.95,0,0.95]
["Sum",0.91833333333333333,1,0.91833333333333333,1,0.91833333333333333,1,null,null,"Sum",0.91833333333333333,1,0.91833333333333333,1,0.91833333333333333,1]
["ΔU",-3.1244515977926324E-2,null,-3.1244515977926324E-2,null,-3.1244515977926435E-2,null,null,null,"ΔU",-3.1244515977926324E-2,null,-3.1244515977926435E-2,null,-3.1244515977926324E-2]
["I",35.584037383740153,null,35.584037383740153,null,35.584037383740146,null,1.5099033134902129E-14,null,"I",35.584037383737943,null,35.584037383737943,null,35.584037383737936,null,1.6687357476335705E-14]
[]
[18,6.1467808918843554,0.98435020466391532,-3.1631901136441654E-2,{"$f":"IF(AND(B214=D214,C214=E214,F214=D214,G214=E214,B215=D215,C215=E215,F215=D215,G215=E215,B216=D216,C216=E216,F216=D216,G216=E216,B217=D217,C217=E217,F217=D217,G217=E217),\"No\",\"Yes\")","v":"No"},26.687908871535381,25,"N(A)YY 4x150",null,18,6.1467808918843554,0.98435020466391532,-3.1631901136441654E-2,{"$f":"IF(AND(K214=M214,L214=N214,O214=M214,P214=N214,K215=M215,L215=N215,O215=M215,P215=N215,K216=M216,L216=N216,O216=M216,P216=N216,K217=M217,L217=N217,O217=M217,P217=N217),\"No\",\"Yes\")","v":"No"},26.687908871537587,25,"N(A)YY 4x150"]
[null,"L1",null,"L2",null,"L3",null,"N",null,null,"L1",null,"L2",null,"L3",null,"N"]
[null,"S","cos(ϕ)","S","cos(ϕ)","S","cos(ϕ)",null,null,null,"S","cos(ϕ)","S","cos(ϕ)","S","cos(ϕ)"]
["Households",1.1563456241931964,0.95,1.1563456241931964,0.95,1.1563456241931964,0.95,null,null,"Households",1.1563456241931964,0.95,1.1563456241931964,0.95,1.1563456241931964,0.95]
["E-Mobility ",0.91833333333333333,1,0.91833333333333333,1,0.91833333333333333,1,null,null,"E-Mobility ",0.91833333333333333,1,0.91833333333333333,1,0.91833333333333333,1]
["PV ",0,0.95,0,0.95,0,0.95,null,null,"PV ",0,0.95,0,0.95,0,0.95]
["Additional",0,0.95,0,0.95,0,0.95,null,null,"Additional",0,0.95,0,0.95,0,0.95]
["Sum",0.91833333333333333,1,0.91833333333333333,1,0.91833333333333333,1,null,null,"Sum",0.91833333333333333,1,0.91833333333333333,1,0.91833333333333333,1]
["ΔU",-3.1631901136441543E-2,null,-3.1631901136441654E-2,null,-3.1631901136441654E-2,null,null,null,"ΔU",-3.1631901136441543E-2,null,-3.1631901136441654E-2,null,-3.1631901136441654E-2]
["I",26.687908871535374,null,26.687908871535381,null,26.687908871535374,null,8.7475429582505128E-15,null,"I",26.687908871537584,null,26.687908871537587,null,26.687908871537584,null,1.0658141036401503E-14]
[]
[19,6.1467808918843554,0.98435020466391532,-3.1890135030117728E-2,{"$f":"IF(AND(B225=D225,C225=E225,F225=D225,G225=E225,B226=D226,C226=E226,F226=D226,G226=E226,B227=D227,C227=E227,F227=D227,G227=E227,B228=D228,C228=E228,F228=D228,G228=E228),\"No\",\"Yes\")","v":"No"},17.791882898727504,25,"N(A)YY 4x150",null,19,6.1467808918843554,0.98435020466391532,-3.1890135030117728E-2,{"$f":"IF(AND(K225=M225,L225=N225,O225=M225,P225=N225,K226=M226,L226=N226,O226=M226,P226=N226,K227=M227,L227=N227,O227=M227,P227=N227,K228=M228,L228=N228,O228=M228,P228=N228),\"No\",\"Yes\")","v":"No"},17.791882898728009,25,"N(A)YY 4x150"]
[null,"L1",null,"L2",null,"L3",null,"N",null,null,"L1",null,"L2",null,"L3",null,"N"]
[null,"S","cos(ϕ)","S","cos(ϕ)","S","cos(ϕ)",null,null,null,"S","cos(ϕ)","S","cos(ϕ)","S","cos(ϕ)"]
["Households",1.1563456241931964,0.95,1.1563456241931964,0.95,1.1563456241931964,0.95,null,null,"Households",1.1563456241931964,0.95,1.1563456241931964,0.95,1.1563456241931964,0.95]
["E-Mobility ",0.91833333333333333,1,0.91833333333333333,1,0.91833333333333333,1,null,null,"E-Mobility ",0.91833333333333333,1,0.91833333333333333,1,0.91833333333333333,1]
["PV ",0,0.95,0,0.95,0,0.95,null,null,"PV ",0,0.95,0,0.95,0,0.95]
["Additional",0,0.95,0,0.95,0,0.95,null,null,"Additional",0,0.95,0,0.95,0,0.95]
["Sum",0.91833333333333333,1,0.91833333333333333,1,0.91833333333333333,1,null,null,"Sum",0.91833333333333333,1,0.91833333333333333,1,0.91833333333333333,1]
["ΔU",-3.1890135030117617E-2,null,-3.1890135030117728E-2,null,-3.1890135030117728E-2,null,null,null,"ΔU",-3.1890135030117617E-2,null,-3.1890135030117728E-2,null,-3.1890135030117617E-2]
["I",17.791882898727497,null,17.791882898727504,null,17.791882898727497,null,8.8817841970012523E-15,null,"I",17.791882898728005,null,17.791882898728009,null,17.791882898728005,null,9.5659743364509064E-15]
[]
[20,6.1467808918843554,0.98435020466391532,-3.2019245109764172E-2,{"$f":"IF(AND(B236=D236,C236=E236,F236=D236,G236=E236,B237=D237,C237=E237,F237=D237,G237=E237,B238=D238,C238=E238,F238=D238,G238=E238,B239=D239,C239=E239,F239=D239,G239=E239),\"No\",\"Yes\")","v":"No"},8.8959246240830581,25,"N(A)YY 4x150",null,20,6.1467808918843554,0.98435020466391532,-3.2019245109764172E-2,{"$f":"IF(AND(K236=M236,L236=N236,O236=M236,P236=N236,K237=M237,L237=N237,O237=M237,P237=N237,K238=M238,L238=N238,O238=M238,P238=N238,K239=M239,L239=N239,O239=M239,P239=N239),\"No\",\"Yes\")","v":"No"},8.89592462408255,25,"N(A)YY 4x150"]
[null,"L1",null,"L2",null,"L3",null,"N",null,null,"L1",null,"L2",null,"L3",null,"N"]
[null,"S","cos(ϕ)","S","cos(ϕ)","S","cos(ϕ)",null,null,null,"S","cos(ϕ)","S","cos(ϕ)","S","cos(ϕ)"]
["Households",1.1563456241931964,0.95,1.1563456241931964,0.95,1.1563456241931964,0.95,null,null,"Households",1.1563456241931964,0.95,1.1563456241931964,0.95,1.1563456241931964,0.95]
["E-Mobility ",0.91833333333333333,1,0.91833333333333333,1,0.91833333333333333,1,null,null,"E-Mobility ",0.91833333333333333,1,0.91833333333333333,1,0.91833333333333333,1]
["PV ",0,0.95,0,0.95,0,0.95,null,null,"PV ",0,0.95,0,0.95,0,0.95]
["Additional",0,0.95,0,0.95,0,0.95,null,null,"Additional",0,0.95,0,0.95,0,0.95]
["Sum",0.91833333333333333,1,0.91833333333333333,1,0.91833333333333333,1,null,null,"Sum",0.91833333333333333,1,0.91833333333333333,1,0.91833333333333333,1]
["ΔU",-3.2019245109764172E-2,null,-3.2019245109764172E-2,null,-3.2019245109764172E-2,null,null,null,"ΔU",-3.2019245109764172E-2,null,-3.2019245109764172E-2,null,-3.2019245109764172E-2]
["I",8.8959246240830563,null,8.8959246240830581,null,8.8959246240830563,null,2.886579864025407E-15,null,"I",8.8959246240825482,null,8.89592462408255,null,8.8959246240825482,null,3.5527136788005009E-15]

{"sheet":"Inputs","index":1,"n_rows":106,"n_cols":47,"rows_kept":106,"cut":false,"hidden":true,"merged":[[2,0,2,14],[2,16,2,21],[1,1,1,2],[1,3,1,4],[1,5,1,6],[1,7,1,8],[0,0,0,14],[0,16,0,21],[0,31,1,36],[0,38,0,45],[1,9,1,10],[1,11,1,12],[1,13,1,14],[1,16,1,21]]}
["Knot Information",null,null,null,null,null,null,null,null,null,null,null,null,null,null,null,"Lines",null,null,null,null,null,null,null,null,null,null,null,null,null,null,"References",null,null,null,null,null,null,"Linetypes"]
[null,"L1 in W",null,"L2 in W",null,"L3 in W",null,"L1 in W",null,"L2 in W",null,"L3 in W",null,null,null,null,null,null,null,null,null,null,null,null,null,null,null,null,null,null,null,null,null,null,null,null,null,"Boolean"]
[null,null,null,null,null,null,null,null,null,null,null,null,null,null,null,null,null,null,null,null,null,null,null,null,null,null,null,null,null,null,null,"Voltage","Power","Delta Newton Raphson","Delta CurrentInjection","Max Iterations","Newton Raphson",1,"Number","Type","R12 in Ohm/km","X12 in Ohm/km","R0 in Ohm/km","X0 in Ohm/km","X0/XL","R0/RL","Ground"]
["Knot Nr.","P","Q","P2","Q2","P3","Q3","P_Imp","Q_Imp","P2_Imp","Q2_Imp","P3_Imp","Q3_Imp","Slack","Init. Voltage",null,"Startknot","Endknot","R12 in Ohm","X12 in Ohm","R0 in Ohm","X0 in Ohm",null,null,null,null,null,null,null,null,null,400,1000,1.0000000000000001E-5,1.0000000000000001E-5,100,1,0,1,"N(A)YY 4x10",1.83,9.4200000000000006E-2,{"$f":"Leitungstypen[[#This Row],[R12 in Ohm/km]]*Leitungstypen[[#This Row],[R0/RL]]","v":7.32},{"$f":"Leitungstypen[[#This Row],[X12 in Ohm/km]]*Leitungstypen[[#This Row],[X0/XL]]","v":0.37680000000000002},4,4,1]
[1,0,0,0,0,0,0,0,0,0,0,0,0,1,1,null,1,2,1.6666666666666667E-5,7.9999826388700498E-3,1.4166666666666668E-5,6.7999852430395422E-3,null,null,null,null,null,null,null,null,null,null,null,null,null,null,null,null,2,"N(A)YY 4x16",1.1499999999999999,8.9499999999999996E-2,{"$f":"Leitungstypen[[#This Row],[R12 in Ohm/km]]*Leitungstypen[[#This Row],[R0/RL]]","v":4.5999999999999996},{"$f":"Leitungstypen[[#This Row],[X12 in Ohm/km]]*Leitungstypen[[#This Row],[X0/XL]]","v":0.35799999999999998},4,4,1]
[2,0,0,0,0,0,0,0,0,0,0,0,0,0,1,null,2,3,3.1250000000000002E-3,2.0175000000000002E-3,1.0562500000000001E-2,7.9489499999999998E-3,null,null,null,null,null,null,null,null,null,null,null,null,null,null,null,null,3,"N(A)YY 4x25",0.72699999999999998,8.7999999999999995E-2,{"$f":"Leitungstypen[[#This Row],[R12 in Ohm/km]]*Leitungstypen[[#This Row],[R0/RL]]","v":1.7157199999999999},{"$f":"Leitungstypen[[#This Row],[X12 in Ohm/km]]*Leitungstypen[[#This Row],[X0/XL]]","v":1.1413599999999999},12.97,2.36,1]
[3,918.33333333333337,0,918.33333333333337,0,918.33333333333337,0,1098.5283429835367,361.068805427163,1098.5283429835367,361.068805427163,1098.5283429835367,361.068805427163,0,1,null,3,4,3.1250000000000002E-3,2.0175000000000002E-3,1.0562500000000001E-2,7.9489499999999998E-3,null,null,null,null,null,null,null,null,null,null,null,null,null,null,null,null,4,"N(A)YY 4x35",0.52400000000000002,8.5099999999999995E-2,{"$f":"Leitungstypen[[#This Row],[R12 in Ohm/km]]*Leitungstypen[[#This Row],[R0/RL]]","v":1.42004},{"$f":"Leitungstypen[[#This Row],[X12 in Ohm/km]]*Leitungstypen[[#This Row],[X0/XL]]","v":0.85270199999999996},10.02,2.71,1]
[4,918.33333333333337,0,918.33333333333337,0,918.33333333333337,0,1098.5283429835367,361.068805427163,1098.5283429835367,361.068805427163,1098.5283429835367,361.068805427163,0,1,null,4,5,3.1250000000000002E-3,2.0175000000000002E-3,1.0562500000000001E-2,7.9489499999999998E-3,null,null,null,null,null,null,null,null,null,null,null,null,null,null,null,null,5,"N(A)YY 4x50",0.38700000000000001,8.48E-2,{"$f":"Leitungstypen[[#This Row],[R12 in Ohm/km]]*Leitungstypen[[#This Row],[R0/RL]]","v":1.1416500000000001},{"$f":"Leitungstypen[[#This Row],[X12 in Ohm/km]]*Leitungstypen[[#This Row],[X0/XL]]","v":0.64532800000000001},7.61,2.95,1]
[5,918.33333333333337,0,918.33333333333337,0,918.33333333333337,0,1098.5283429835367,361.068805427163,1098.5283429835367,361.068805427163,1098.5283429835367,361.068805427163,0,1,null,5,6,3.1250000000000002E-3,2.0175000000000002E-3,1.0562500000000001E-2,7.9489499999999998E-3,null,null,null,null,null,null,null,null,null,null,null,null,null,null,null,null,6,"N(A)YY 4x70",0.26900000000000002,8.2299999999999998E-2,{"$f":"Leitungstypen[[#This Row],[R12 in Ohm/km]]*Leitungstypen[[#This Row],[R0/RL]]","v":0.85542000000000007},{"$f":"Leitungstypen[[#This Row],[X12 in Ohm/km]]*Leitungstypen[[#This Row],[X0/XL]]","v":0.46746399999999999},5.68,3.18,1]
[6,918.33333333333337,0,918.33333333333337,0,918.33333333333337,0,1098.5283429835367,361.068805427163,1098.5283429835367,361.068805427163,1098.5283429835367,361.068805427163,0,1,null,6,7,3.1250000000000002E-3,2.0175000000000002E-3,1.0562500000000001E-2,7.9489499999999998E-3,null,null,null,null,null,null,null,null,null,null,null,null,null,null,null,null,7,"N(A)YY 4x95",0.19400000000000001,8.2000000000000003E-2,{"$f":"Leitungstypen[[#This Row],[R12 in Ohm/km]]*Leitungstypen[[#This Row],[R0/RL]]","v":0.63826000000000005},{"$f":"Leitungstypen[[#This Row],[X12 in Ohm/km]]*Leitungstypen[[#This Row],[X0/XL]]","v":0.37966},4.63,3.29,1]
[7,918.33333333333337,0,918.33333333333337,0,918.33333333333337,0,1098.5283429835367,361.068805427163,1098.5283429835367,361.068805427163,1098.5283429835367,361.068805427163,0,1,null,7,8,3.1250000000000002E-3,2.0175000000000002E-3,1.0562500000000001E-2,7.9489499999999998E-3,null,null,null,null,null,null,null,null,null,null,null,null,null,null,null,null,8,"N(A)YY 4x120",0.154,8.0399999999999999E-2,{"$f":"Leitungstypen[[#This Row],[R12 in Ohm/km]]*Leitungstypen[[#This Row],[R0/RL]]","v":0.51590000000000003},{"$f":"Leitungstypen[[#This Row],[X12 in Ohm/km]]*Leitungstypen[[#This Row],[X0/XL]]","v":0.33848400000000001},4.21,3.35,1]
[8,918.33333333333337,0,918.33333333333337,0,918.33333333333337,0,1098.5283429835367,361.068805427163,1098.5283429835367,361.068805427163,1098.5283429835367,361.068805427163,0,1,null,8,9,3.1250000000000002E-3,2.0175000000000002E-3,1.0562500000000001E-2,7.9489499999999998E-3,null,null,null,null,null,null,null,null,null,null,null,null,null,null,null,null,9,"N(A)YY 4x150",0.125,8.0699999999999994E-2,{"$f":"Leitungstypen[[#This Row],[R12 in Ohm/km]]*Leitungstypen[[#This Row],[R0/RL]]","v":0.42249999999999999},{"$f":"Leitungstypen[[#This Row],[X12 in Ohm/km]]*Leitungstypen[[#This Row],[X0/XL]]","v":0.31795799999999996},3.94,3.38,1]
[9,918.33333333333337,0,918.33333333333337,0,918.33333333333337,0,1098.5283429835367,361.068805427163,1098.5283429835367,361.068805427163,1098.5283429835367,361.068805427163,0,1,null,9,10,3.1250000000000002E-3,2.0175000000000002E-3,1.0562500000000001E-2,7.9489499999999998E-3,null,null,null,null,null,null,null,null,null,null,null,null,null,null,null,null,10,"N(A)YY 4x185",0.10100000000000001,8.0399999999999999E-2,{"$f":"Leitungstypen[[#This Row],[R12 in Ohm/km]]*Leitungstypen[[#This Row],[R0/RL]]","v":0.34441000000000005},{"$f":"Leitungstypen[[#This Row],[X12 in Ohm/km]]*Leitungstypen[[#This Row],[X0/XL]]","v":0.30069600000000002},3.74,3.41,1]
[10,918.33333333333337,0,918.33333333333337,0,918.33333333333337,0,1098.5283429835367,361.068805427163,1098.5283429835367,361.068805427163,1098.5283429835367,361.068805427163,0,1,null,10,11,3.1250000000000002E-3,2.0175000000000002E-3,1.0562500000000001E-2,7.9489499999999998E-3,null,null,null,null,null,null,null,null,null,null,null,null,null,null,null,null,11,"N(A)YY 4x240",7.7700000000000005E-2,8.0100000000000005E-2,{"$f":"Leitungstypen[[#This Row],[R12 in Ohm/km]]*Leitungstypen[[#This Row],[R0/RL]]","v":0.26573400000000003},{"$f":"Leitungstypen[[#This Row],[X12 in Ohm/km]]*Leitungstypen[[#This Row],[X0/XL]]","v":0.289962},3.62,3.42,1]
[11,918.33333333333337,0,918.33333333333337,0,918.33333333333337,0,1098.5283429835367,361.068805427163,1098.5283429835367,361.068805427163,1098.5283429835367,361.068805427163,0,1,null,11,12,3.1250000000000002E-3,2.0175000000000002E-3,1.0562500000000001E-2,7.9489499999999998E-3,null,null,null,null,null,null,null,null,null,null,null,null,null,null,null,null,12,"N(A)YY 4x300",6.2899999999999998E-2,7.9200000000000007E-2,{"$f":"Leitungstypen[[#This Row],[R12 in Ohm/km]]*Leitungstypen[[#This Row],[R0/RL]]","v":0.21637599999999999},{"$f":"Leitungstypen[[#This Row],[X12 in Ohm/km]]*Leitungstypen[[#This Row],[X0/XL]]","v":0.27878400000000003},3.52,3.44,1]
[12,918.33333333333337,0,918.33333333333337,0,918.33333333333337,0,1098.5283429835367,361.068805427163,1098.5283429835367,361.068805427163,1098.5283429835367,361.068805427163,0,1,null,12,13,3.1250000000000002E-3,2.0175000000000002E-3,1.0562500000000001E-2,7.9489499999999998E-3,null,null,null,null,null,null,null,null,null,null,null,null,null,null,null,null,13,"NYY 4x25",0.72699999999999998,8.6099999999999996E-2,{"$f":"Leitungstypen[[#This Row],[R12 in Ohm/km]]*Leitungstypen[[#This Row],[R0/RL]]","v":1.6866399999999999},{"$f":"Leitungstypen[[#This Row],[X12 in Ohm/km]]*Leitungstypen[[#This Row],[X0/XL]]","v":1.5420509999999998},17.91,2.3199999999999998,0]
[13,918.33333333333337,0,918.33333333333337,0,918.33333333333337,0,1098.5283429835367,361.068805427163,1098.5283429835367,361.068805427163,1098.5283429835367,361.068805427163,0,1,null,13,14,3.1250000000000002E-3,2.0175000000000002E-3,1.0562500000000001E-2,7.9489499999999998E-3,null,null,null,null,null,null,null,null,null,null,null,null,null,null,null,null,14,"NYY 4x35",0.52400000000000002,8.5099999999999995E-2,{"$f":"Leitungstypen[[#This Row],[R12 in Ohm/km]]*Leitungstypen[[#This Row],[R0/RL]]","v":1.4776799999999999},{"$f":"Leitungstypen[[#This Row],[X12 in Ohm/km]]*Leitungstypen[[#This Row],[X0/XL]]","v":1.5692440000000001},18.440000000000001,2.82,0]
[14,918.33333333333337,0,918.33333333333337,0,918.33333333333337,0,1098.5283429835367,361.068805427163,1098.5283429835367,361.068805427163,1098.5283429835367,361.068805427163,0,1,null,14,15,3.1250000000000002E-3,2.0175000000000002E-3,1.0562500000000001E-2,7.9489499999999998E-3,null,null,null,null,null,null,null,null,null,null,null,null,null,null,null,null,15,"NYY 4x50",0.38700000000000001,8.5099999999999995E-2,{"$f":"Leitungstypen[[#This Row],[R12 in Ohm/km]]*Leitungstypen[[#This Row],[R0/RL]]","v":1.33128},{"$f":"Leitungstypen[[#This Row],[X12 in Ohm/km]]*Leitungstypen[[#This Row],[X0/XL]]","v":1.1462969999999999},13.47,3.44,0]
[15,918.33333333333337,0,918.33333333333337,0,918.33333333333337,0,1098.5283429835367,361.068805427163,1098.5283429835367,361.068805427163,1098.5283429835367,361.068805427163,0,1,null,15,16,3.1250000000000002E-3,2.0175000000000002E-3,1.0562500000000001E-2,7.9489499999999998E-3,null,null,null,null,null,null,null,null,null,null,null,null,null,null,null,null,16,"NYY 4x70",0.26900000000000002,8.2299999999999998E-2,{"$f":"Leitungstypen[[#This Row],[R12 in Ohm/km]]*Leitungstypen[[#This Row],[R0/RL]]","v":1.2696799999999999},{"$f":"Leitungstypen[[#This Row],[X12 in Ohm/km]]*Leitungstypen[[#This Row],[X0/XL]]","v":0.8657959999999999},10.52,4.72,0]
[16,918.33333333333337,0,918.33333333333337,0,918.33333333333337,0,1098.5283429835367,361.068805427163,1098.5283429835367,361.068805427163,1098.5283429835367,361.068805427163,0,1,null,16,17,3.1250000000000002E-3,2.0175000000000002E-3,1.0562500000000001E-2,7.9489499999999998E-3,null,null,null,null,null,null,null,null,null,null,null,null,null,null,null,null,17,"NYY 4x95",0.19400000000000001,8.2900000000000001E-2,{"$f":"Leitungstypen[[#This Row],[R12 in Ohm/km]]*Leitungstypen[[#This Row],[R0/RL]]","v":0.90210000000000012},{"$f":"Leitungstypen[[#This Row],[X12 in Ohm/km]]*Leitungstypen[[#This Row],[X0/XL]]","v":0.68226700000000007},8.23,4.6500000000000004,0]
[17,918.33333333333337,0,918.33333333333337,0,918.33333333333337,0,1098.5283429835367,361.068805427163,1098.5283429835367,361.068805427163,1098.5283429835367,361.068805427163,0,1,null,17,18,3.1250000000000002E-3,2.0175000000000002E-3,1.0562500000000001E-2,7.9489499999999998E-3,null,null,null,null,null,null,null,null,null,null,null,null,null,null,null,null,18,"NYY 4x120",0.154,8.0399999999999999E-2,{"$f":"Leitungstypen[[#This Row],[R12 in Ohm/km]]*Leitungstypen[[#This Row],[R0/RL]]","v":0.83313999999999999},{"$f":"Leitungstypen[[#This Row],[X12 in Ohm/km]]*Leitungstypen[[#This Row],[X0/XL]]","v":0.51053999999999999},6.35,5.41,0]
[18,918.33333333333337,0,918.33333333333337,0,918.33333333333337,0,1098.5283429835367,361.068805427163,1098.5283429835367,361.068805427163,1098.5283429835367,361.068805427163,0,1,null,18,19,3.1250000000000002E-3,2.0175000000000002E-3,1.0562500000000001E-2,7.9489499999999998E-3,null,null,null,null,null,null,null,null,null,null,null,null,null,null,null,null,19,"NYY 4x150",0.126,8.0699999999999994E-2,{"$f":"Leitungstypen[[#This Row],[R12 in Ohm/km]]*Leitungstypen[[#This Row],[R0/RL]]","v":0.65142},{"$f":"Leitungstypen[[#This Row],[X12 in Ohm/km]]*Leitungstypen[[#This Row],[X0/XL]]","v":0.52535699999999996},6.51,5.17,0]
[19,918.33333333333337,0,918.33333333333337,0,918.33333333333337,0,1098.5283429835367,361.068805427163,1098.5283429835367,361.068805427163,1098.5283429835367,361.068805427163,0,1,null,19,20,3.1250000000000002E-3,2.0175000000000002E-3,1.0562500000000001E-2,7.9489499999999998E-3,null,null,null,null,null,null,null,null,null,null,null,null,null,null,null,null,20,"NYY 4x185",0.10100000000000001,8.0399999999999999E-2,{"$f":"Leitungstypen[[#This Row],[R12 in Ohm/km]]*Leitungstypen[[#This Row],[R0/RL]]","v":0.54237000000000002},{"$f":"Leitungstypen[[#This Row],[X12 in Ohm/km]]*Leitungstypen[[#This Row],[X0/XL]]","v":0.43416000000000005},5.4,5.37,0]
[20,918.33333333333337,0,918.33333333333337,0,918.33333333333337,0,1098.5283429835367,361.068805427163,1098.5283429835367,361.068805427163,1098.5283429835367,361.068805427163,0,1,null,20,21,3.1250000000000002E-3,2.0175000000000002E-3,1.0562500000000001E-2,7.9489499999999998E-3,null,null,null,null,null,null,null,null,null,null,null,null,null,null,null,null,21,"NYY 4x240",7.7799999999999994E-2,8.0399999999999999E-2,{"$f":"Leitungstypen[[#This Row],[R12 in Ohm/km]]*Leitungstypen[[#This Row],[R0/RL]]","v":0.42478799999999994},{"$f":"Leitungstypen[[#This Row],[X12 in Ohm/km]]*Leitungstypen[[#This Row],[X0/XL]]","v":0.39798},4.95,5.46,0]
[21,918.33333333333337,0,918.33333333333337,0,918.33333333333337,0,1098.5283429835367,361.068805427163,1098.5283429835367,361.068805427163,1098.5283429835367,361.068805427163,0,1,null,21,22,3.1250000000000002E-3,2.0175000000000002E-3,1.0562500000000001E-2,7.9489499999999998E-3,null,null,null,null,null,null,null,null,null,null,null,null,null,null,null,null,22,"NYY 4x300",6.3100000000000003E-2,8.0399999999999999E-2,{"$f":"Leitungstypen[[#This Row],[R12 in Ohm/km]]*Leitungstypen[[#This Row],[R0/RL]]","v":0.344526},{"$f":"Leitungstypen[[#This Row],[X12 in Ohm/km]]*Leitungstypen[[#This Row],[X0/XL]]","v":0.37546799999999997},4.67,5.46,0]
[22,918.33333333333337,0,918.33333333333337,0,918.33333333333337,0,1098.5283429835367,361.068805427163,1098.5283429835367,361.068805427163,1098.5283429835367,361.068805427163,0,1,null,2,23,3.1250000000000002E-3,2.0175000000000002E-3,1.0562500000000001E-2,7.9489499999999998E-3]
[23,918.33333333333337,0,918.33333333333337,0,918.33333333333337,0,1098.5283429835367,361.068805427163,1098.5283429835367,361.068805427163,1098.5283429835367,361.068805427163,0,1,null,23,24,3.1250000000000002E-3,2.0175000000000002E-3,1.0562500000000001E-2,7.9489499999999998E-3]
[24,918.33333333333337,0,918.33333333333337,0,918.33333333333337,0,1098.5283429835367,361.068805427163,1098.5283429835367,361.068805427163,1098.5283429835367,361.068805427163,0,1,null,24,25,3.1250000000000002E-3,2.0175000000000002E-3,1.0562500000000001E-2,7.9489499999999998E-3]
[25,918.33333333333337,0,918.33333333333337,0,918.33333333333337,0,1098.5283429835367,361.068805427163,1098.5283429835367,361.068805427163,1098.5283429835367,361.068805427163,0,1,null,25,26,3.1250000000000002E-3,2.0175000000000002E-3,1.0562500000000001E-2,7.9489499999999998E-3]
[26,918.33333333333337,0,918.33333333333337,0,918.33333333333337,0,1098.5283429835367,361.068805427163,1098.5283429835367,361.068805427163,1098.5283429835367,361.068805427163,0,1,null,26,27,3.1250000000000002E-3,2.0175000000000002E-3,1.0562500000000001E-2,7.9489499999999998E-3]
[27,918.33333333333337,0,918.33333333333337,0,918.33333333333337,0,1098.5283429835367,361.068805427163,1098.5283429835367,361.068805427163,1098.5283429835367,361.068805427163,0,1,null,27,28,3.1250000000000002E-3,2.0175000000000002E-3,1.0562500000000001E-2,7.9489499999999998E-3]
[28,918.33333333333337,0,918.33333333333337,0,918.33333333333337,0,1098.5283429835367,361.068805427163,1098.5283429835367,361.068805427163,1098.5283429835367,361.068805427163,0,1,null,28,29,3.1250000000000002E-3,2.0175000000000002E-3,1.0562500000000001E-2,7.9489499999999998E-3]
[29,918.33333333333337,0,918.33333333333337,0,918.33333333333337,0,1098.5283429835367,361.068805427163,1098.5283429835367,361.068805427163,1098.5283429835367,361.068805427163,0,1,null,29,30,3.1250000000000002E-3,2.0175000000000002E-3,1.0562500000000001E-2,7.9489499999999998E-3]
[30,918.33333333333337,0,918.33333333333337,0,918.33333333333337,0,1098.5283429835367,361.068805427163,1098.5283429835367,361.068805427163,1098.5283429835367,361.068805427163,0,1,null,30,31,3.1250000000000002E-3,2.0175000000000002E-3,1.0562500000000001E-2,7.9489499999999998E-3]
[31,918.33333333333337,0,918.33333333333337,0,918.33333333333337,0,1098.5283429835367,361.068805427163,1098.5283429835367,361.068805427163,1098.5283429835367,361.068805427163,0,1,null,31,32,3.1250000000000002E-3,2.0175000000000002E-3,1.0562500000000001E-2,7.9489499999999998E-3]
[32,918.33333333333337,0,918.33333333333337,0,918.33333333333337,0,1098.5283429835367,361.068805427163,1098.5283429835367,361.068805427163,1098.5283429835367,361.068805427163,0,1,null,32,33,3.1250000000000002E-3,2.0175000000000002E-3,1.0562500000000001E-2,7.9489499999999998E-3]
[33,918.33333333333337,0,918.33333333333337,0,918.33333333333337,0,1098.5283429835367,361.068805427163,1098.5283429835367,361.068805427163,1098.5283429835367,361.068805427163,0,1,null,33,34,3.1250000000000002E-3,2.0175000000000002E-3,1.0562500000000001E-2,7.9489499999999998E-3]
[34,918.33333333333337,0,918.33333333333337,0,918.33333333333337,0,1098.5283429835367,361.068805427163,1098.5283429835367,361.068805427163,1098.5283429835367,361.068805427163,0,1,null,34,35,3.1250000000000002E-3,2.0175000000000002E-3,1.0562500000000001E-2,7.9489499999999998E-3]
[35,918.33333333333337,0,918.33333333333337,0,918.33333333333337,0,1098.5283429835367,361.068805427163,1098.5283429835367,361.068805427163,1098.5283429835367,361.068805427163,0,1,null,35,36,3.1250000000000002E-3,2.0175000000000002E-3,1.0562500000000001E-2,7.9489499999999998E-3]
[36,918.33333333333337,0,918.33333333333337,0,918.33333333333337,0,1098.5283429835367,361.068805427163,1098.5283429835367,361.068805427163,1098.5283429835367,361.068805427163,0,1,null,36,37,3.1250000000000002E-3,2.0175000000000002E-3,1.0562500000000001E-2,7.9489499999999998E-3]
[37,918.33333333333337,0,918.33333333333337,0,918.33333333333337,0,1098.5283429835367,361.068805427163,1098.5283429835367,361.068805427163,1098.5283429835367,361.068805427163,0,1,null,37,38,3.1250000000000002E-3,2.0175000000000002E-3,1.0562500000000001E-2,7.9489499999999998E-3]
[38,918.33333333333337,0,918.33333333333337,0,918.33333333333337,0,1098.5283429835367,361.068805427163,1098.5283429835367,361.068805427163,1098.5283429835367,361.068805427163,0,1,null,38,39,3.1250000000000002E-3,2.0175000000000002E-3,1.0562500000000001E-2,7.9489499999999998E-3]
[39,918.33333333333337,0,918.33333333333337,0,918.33333333333337,0,1098.5283429835367,361.068805427163,1098.5283429835367,361.068805427163,1098.5283429835367,361.068805427163,0,1,null,39,40,3.1250000000000002E-3,2.0175000000000002E-3,1.0562500000000001E-2,7.9489499999999998E-3]
[40,918.33333333333337,0,918.33333333333337,0,918.33333333333337,0,1098.5283429835367,361.068805427163,1098.5283429835367,361.068805427163,1098.5283429835367,361.068805427163,0,1,null,40,41,3.1250000000000002E-3,2.0175000000000002E-3,1.0562500000000001E-2,7.9489499999999998E-3]
[41,918.33333333333337,0,918.33333333333337,0,918.33333333333337,0,1098.5283429835367,361.068805427163,1098.5283429835367,361.068805427163,1098.5283429835367,361.068805427163,0,1,null,41,42,3.1250000000000002E-3,2.0175000000000002E-3,1.0562500000000001E-2,7.9489499999999998E-3]
[42,918.33333333333337,0,918.33333333333337,0,918.33333333333337,0,1098.5283429835367,361.068805427163,1098.5283429835367,361.068805427163,1098.5283429835367,361.068805427163,0,1,null,2,43,3.1250000000000002E-3,2.0175000000000002E-3,1.0562500000000001E-2,7.9489499999999998E-3]
[43,918.33333333333314,0,918.33333333333314,0,918.33333333333314,0,1098.5283429835365,361.068805427163,1098.5283429835365,361.068805427163,1098.5283429835365,361.068805427163,0,1,null,43,44,3.1250000000000002E-3,2.0175000000000002E-3,1.0562500000000001E-2,7.9489499999999998E-3]
[44,918.33333333333314,0,918.33333333333314,0,918.33333333333314,0,1098.5283429835365,361.068805427163,1098.5283429835365,361.068805427163,1098.5283429835365,361.068805427163,0,1,null,44,45,3.1250000000000002E-3,2.0175000000000002E-3,1.0562500000000001E-2,7.9489499999999998E-3]
[45,918.33333333333314,0,918.33333333333314,0,918.33333333333314,0,1098.5283429835365,361.068805427163,1098.5283429835365,361.068805427163,1098.5283429835365,361.068805427163,0,1,null,45,46,3.1250000000000002E-3,2.0175000000000002E-3,1.0562500000000001E-2,7.9489499999999998E-3]
[46,918.33333333333314,0,918.33333333333314,0,918.33333333333314,0,1098.5283429835365,361.068805427163,1098.5283429835365,361.068805427163,1098.5283429835365,361.068805427163,0,1,null,46,47,3.1250000000000002E-3,2.0175000000000002E-3,1.0562500000000001E-2,7.9489499999999998E-3]
[47,918.33333333333314,0,918.33333333333314,0,918.33333333333314,0,1098.5283429835365,361.068805427163,1098.5283429835365,361.068805427163,1098.5283429835365,361.068805427163,0,1,null,47,48,3.1250000000000002E-3,2.0175000000000002E-3,1.0562500000000001E-2,7.9489499999999998E-3]
[48,918.33333333333314,0,918.33333333333314,0,918.33333333333314,0,1098.5283429835365,361.068805427163,1098.5283429835365,361.068805427163,1098.5283429835365,361.068805427163,0,1,null,48,49,3.1250000000000002E-3,2.0175000000000002E-3,1.0562500000000001E-2,7.9489499999999998E-3]
[49,918.33333333333314,0,918.33333333333314,0,918.33333333333314,0,1098.5283429835365,361.068805427163,1098.5283429835365,361.068805427163,1098.5283429835365,361.068805427163,0,1,null,49,50,3.1250000000000002E-3,2.0175000000000002E-3,1.0562500000000001E-2,7.9489499999999998E-3]
[50,918.33333333333314,0,918.33333333333314,0,918.33333333333314,0,1098.5283429835365,361.068805427163,1098.5283429835365,361.068805427163,1098.5283429835365,361.068805427163,0,1,null,50,51,3.1250000000000002E-3,2.0175000000000002E-3,1.0562500000000001E-2,7.9489499999999998E-3]
[51,918.33333333333314,0,918.33333333333314,0,918.33333333333314,0,1098.5283429835365,361.068805427163,1098.5283429835365,361.068805427163,1098.5283429835365,361.068805427163,0,1,null,51,52,3.1250000000000002E-3,2.0175000000000002E-3,1.0562500000000001E-2,7.9489499999999998E-3]
[52,918.33333333333314,0,918.33333333333314,0,918.33333333333314,0,1098.5283429835365,361.068805427163,1098.5283429835365,361.068805427163,1098.5283429835365,361.068805427163,0,1,null,52,53,3.1250000000000002E-3,2.0175000000000002E-3,1.0562500000000001E-2,7.9489499999999998E-3]
[53,918.33333333333314,0,918.33333333333314,0,918.33333333333314,0,1098.5283429835365,361.068805427163,1098.5283429835365,361.068805427163,1098.5283429835365,361.068805427163,0,1,null,53,54,3.1250000000000002E-3,2.0175000000000002E-3,1.0562500000000001E-2,7.9489499999999998E-3]
[54,918.33333333333314,0,918.33333333333314,0,918.33333333333314,0,1098.5283429835365,361.068805427163,1098.5283429835365,361.068805427163,1098.5283429835365,361.068805427163,0,1,null,54,55,3.1250000000000002E-3,2.0175000000000002E-3,1.0562500000000001E-2,7.9489499999999998E-3]
[55,918.33333333333314,0,918.33333333333314,0,918.33333333333314,0,1098.5283429835365,361.068805427163,1098.5283429835365,361.068805427163,1098.5283429835365,361.068805427163,0,1,null,55,56,3.1250000000000002E-3,2.0175000000000002E-3,1.0562500000000001E-2,7.9489499999999998E-3]
[56,918.33333333333314,0,918.33333333333314,0,918.33333333333314,0,1098.5283429835365,361.068805427163,1098.5283429835365,361.068805427163,1098.5283429835365,361.068805427163,0,1,null,56,57,3.1250000000000002E-3,2.0175000000000002E-3,1.0562500000000001E-2,7.9489499999999998E-3]
[57,918.33333333333314,0,918.33333333333314,0,918.33333333333314,0,1098.5283429835365,361.068805427163,1098.5283429835365,361.068805427163,1098.5283429835365,361.068805427163,0,1,null,57,58,3.1250000000000002E-3,2.0175000000000002E-3,1.0562500000000001E-2,7.9489499999999998E-3]
[58,918.33333333333314,0,918.33333333333314,0,918.33333333333314,0,1098.5283429835365,361.068805427163,1098.5283429835365,361.068805427163,1098.5283429835365,361.068805427163,0,1,null,58,59,3.1250000000000002E-3,2.0175000000000002E-3,1.0562500000000001E-2,7.9489499999999998E-3]
[59,918.33333333333314,0,918.33333333333314,0,918.33333333333314,0,1098.5283429835365,361.068805427163,1098.5283429835365,361.068805427163,1098.5283429835365,361.068805427163,0,1,null,59,60,3.1250000000000002E-3,2.0175000000000002E-3,1.0562500000000001E-2,7.9489499999999998E-3]
[60,918.33333333333314,0,918.33333333333314,0,918.33333333333314,0,1098.5283429835365,361.068805427163,1098.5283429835365,361.068805427163,1098.5283429835365,361.068805427163,0,1,null,60,61,3.1250000000000002E-3,2.0175000000000002E-3,1.0562500000000001E-2,7.9489499999999998E-3]
[61,918.33333333333314,0,918.33333333333314,0,918.33333333333314,0,1098.5283429835365,361.068805427163,1098.5283429835365,361.068805427163,1098.5283429835365,361.068805427163,0,1,null,61,62,3.1250000000000002E-3,2.0175000000000002E-3,1.0562500000000001E-2,7.9489499999999998E-3]
[62,918.33333333333314,0,918.33333333333314,0,918.33333333333314,0,1098.5283429835365,361.068805427163,1098.5283429835365,361.068805427163,1098.5283429835365,361.068805427163,0,1,null,2,63,3.1250000000000002E-3,2.0175000000000002E-3,1.0562500000000001E-2,7.9489499999999998E-3]
[63,918.33333333333314,0,918.33333333333314,0,918.33333333333314,0,1098.5283429835365,361.068805427163,1098.5283429835365,361.068805427163,1098.5283429835365,361.068805427163,0,1,null,63,64,3.1250000000000002E-3,2.0175000000000002E-3,1.0562500000000001E-2,7.9489499999999998E-3]
[64,918.33333333333314,0,918.33333333333314,0,918.33333333333314,0,1098.5283429835365,361.068805427163,1098.5283429835365,361.068805427163,1098.5283429835365,361.068805427163,0,1,null,64,65,3.1250000000000002E-3,2.0175000000000002E-3,1.0562500000000001E-2,7.9489499999999998E-3]
[65,918.33333333333314,0,918.33333333333314,0,918.33333333333314,0,1098.5283429835365,361.068805427163,1098.5283429835365,361.068805427163,1098.5283429835365,361.068805427163,0,1,null,65,66,3.1250000000000002E-3,2.0175000000000002E-3,1.0562500000000001E-2,7.9489499999999998E-3]
[66,918.33333333333314,0,918.33333333333314,0,918.33333333333314,0,1098.5283429835365,361.068805427163,1098.5283429835365,361.068805427163,1098.5283429835365,361.068805427163,0,1,null,66,67,3.1250000000000002E-3,2.0175000000000002E-3,1.0562500000000001E-2,7.9489499999999998E-3]
[67,918.33333333333314,0,918.33333333333314,0,918.33333333333314,0,1098.5283429835365,361.068805427163,1098.5283429835365,361.068805427163,1098.5283429835365,361.068805427163,0,1,null,67,68,3.1250000000000002E-3,2.0175000000000002E-3,1.0562500000000001E-2,7.9489499999999998E-3]
[68,918.33333333333314,0,918.33333333333314,0,918.33333333333314,0,1098.5283429835365,361.068805427163,1098.5283429835365,361.068805427163,1098.5283429835365,361.068805427163,0,1,null,68,69,3.1250000000000002E-3,2.0175000000000002E-3,1.0562500000000001E-2,7.9489499999999998E-3]
[69,918.33333333333314,0,918.33333333333314,0,918.33333333333314,0,1098.5283429835365,361.068805427163,1098.5283429835365,361.068805427163,1098.5283429835365,361.068805427163,0,1,null,69,70,3.1250000000000002E-3,2.0175000000000002E-3,1.0562500000000001E-2,7.9489499999999998E-3]
[70,918.33333333333314,0,918.33333333333314,0,918.33333333333314,0,1098.5283429835365,361.068805427163,1098.5283429835365,361.068805427163,1098.5283429835365,361.068805427163,0,1,null,70,71,3.1250000000000002E-3,2.0175000000000002E-3,1.0562500000000001E-2,7.9489499999999998E-3]
[71,918.33333333333314,0,918.33333333333314,0,918.33333333333314,0,1098.5283429835365,361.068805427163,1098.5283429835365,361.068805427163,1098.5283429835365,361.068805427163,0,1,null,71,72,3.1250000000000002E-3,2.0175000000000002E-3,1.0562500000000001E-2,7.9489499999999998E-3]
[72,918.33333333333314,0,918.33333333333314,0,918.33333333333314,0,1098.5283429835365,361.068805427163,1098.5283429835365,361.068805427163,1098.5283429835365,361.068805427163,0,1,null,72,73,3.1250000000000002E-3,2.0175000000000002E-3,1.0562500000000001E-2,7.9489499999999998E-3]
[73,918.33333333333314,0,918.33333333333314,0,918.33333333333314,0,1098.5283429835365,361.068805427163,1098.5283429835365,361.068805427163,1098.5283429835365,361.068805427163,0,1,null,73,74,3.1250000000000002E-3,2.0175000000000002E-3,1.0562500000000001E-2,7.9489499999999998E-3]
[74,918.33333333333314,0,918.33333333333314,0,918.33333333333314,0,1098.5283429835365,361.068805427163,1098.5283429835365,361.068805427163,1098.5283429835365,361.068805427163,0,1,null,74,75,3.1250000000000002E-3,2.0175000000000002E-3,1.0562500000000001E-2,7.9489499999999998E-3]
[75,918.33333333333314,0,918.33333333333314,0,918.33333333333314,0,1098.5283429835365,361.068805427163,1098.5283429835365,361.068805427163,1098.5283429835365,361.068805427163,0,1,null,75,76,3.1250000000000002E-3,2.0175000000000002E-3,1.0562500000000001E-2,7.9489499999999998E-3]
[76,918.33333333333314,0,918.33333333333314,0,918.33333333333314,0,1098.5283429835365,361.068805427163,1098.5283429835365,361.068805427163,1098.5283429835365,361.068805427163,0,1,null,76,77,3.1250000000000002E-3,2.0175000000000002E-3,1.0562500000000001E-2,7.9489499999999998E-3]
[77,918.33333333333314,0,918.33333333333314,0,918.33333333333314,0,1098.5283429835365,361.068805427163,1098.5283429835365,361.068805427163,1098.5283429835365,361.068805427163,0,1,null,77,78,3.1250000000000002E-3,2.0175000000000002E-3,1.0562500000000001E-2,7.9489499999999998E-3]
[78,918.33333333333314,0,918.33333333333314,0,918.33333333333314,0,1098.5283429835365,361.068805427163,1098.5283429835365,361.068805427163,1098.5283429835365,361.068805427163,0,1,null,78,79,3.1250000000000002E-3,2.0175000000000002E-3,1.0562500000000001E-2,7.9489499999999998E-3]
[79,918.33333333333314,0,918.33333333333314,0,918.33333333333314,0,1098.5283429835365,361.068805427163,1098.5283429835365,361.068805427163,1098.5283429835365,361.068805427163,0,1,null,79,80,3.1250000000000002E-3,2.0175000000000002E-3,1.0562500000000001E-2,7.9489499999999998E-3]
[80,918.33333333333314,0,918.33333333333314,0,918.33333333333314,0,1098.5283429835365,361.068805427163,1098.5283429835365,361.068805427163,1098.5283429835365,361.068805427163,0,1,null,80,81,3.1250000000000002E-3,2.0175000000000002E-3,1.0562500000000001E-2,7.9489499999999998E-3]
[81,918.33333333333314,0,918.33333333333314,0,918.33333333333314,0,1098.5283429835365,361.068805427163,1098.5283429835365,361.068805427163,1098.5283429835365,361.068805427163,0,1,null,81,82,3.1250000000000002E-3,2.0175000000000002E-3,1.0562500000000001E-2,7.9489499999999998E-3]
[82,918.33333333333314,0,918.33333333333314,0,918.33333333333314,0,1098.5283429835365,361.068805427163,1098.5283429835365,361.068805427163,1098.5283429835365,361.068805427163,0,1,null,2,83,3.1250000000000002E-3,2.0175000000000002E-3,1.0562500000000001E-2,7.9489499999999998E-3]
[83,918.33333333333314,0,918.33333333333314,0,918.33333333333314,0,1098.5283429835365,361.068805427163,1098.5283429835365,361.068805427163,1098.5283429835365,361.068805427163,0,1,null,83,84,3.1250000000000002E-3,2.0175000000000002E-3,1.0562500000000001E-2,7.9489499999999998E-3]
[84,918.33333333333314,0,918.33333333333314,0,918.33333333333314,0,1098.5283429835365,361.068805427163,1098.5283429835365,361.068805427163,1098.5283429835365,361.068805427163,0,1,null,84,85,3.1250000000000002E-3,2.0175000000000002E-3,1.0562500000000001E-2,7.9489499999999998E-3]
[85,918.33333333333314,0,918.33333333333314,0,918.33333333333314,0,1098.5283429835365,361.068805427163,1098.5283429835365,361.068805427163,1098.5283429835365,361.068805427163,0,1,null,85,86,3.1250000000000002E-3,2.0175000000000002E-3,1.0562500000000001E-2,7.9489499999999998E-3]
[86,918.33333333333314,0,918.33333333333314,0,918.33333333333314,0,1098.5283429835365,361.068805427163,1098.5283429835365,361.068805427163,1098.5283429835365,361.068805427163,0,1,null,86,87,3.1250000000000002E-3,2.0175000000000002E-3,1.0562500000000001E-2,7.9489499999999998E-3]
[87,918.33333333333314,0,918.33333333333314,0,918.33333333333314,0,1098.5283429835365,361.068805427163,1098.5283429835365,361.068805427163,1098.5283429835365,361.068805427163,0,1,null,87,88,3.1250000000000002E-3,2.0175000000000002E-3,1.0562500000000001E-2,7.9489499999999998E-3]
[88,918.33333333333314,0,918.33333333333314,0,918.33333333333314,0,1098.5283429835365,361.068805427163,1098.5283429835365,361.068805427163,1098.5283429835365,361.068805427163,0,1,null,88,89,3.1250000000000002E-3,2.0175000000000002E-3,1.0562500000000001E-2,7.9489499999999998E-3]
[89,918.33333333333314,0,918.33333333333314,0,918.33333333333314,0,1098.5283429835365,361.068805427163,1098.5283429835365,361.068805427163,1098.5283429835365,361.068805427163,0,1,null,89,90,3.1250000000000002E-3,2.0175000000000002E-3,1.0562500000000001E-2,7.9489499999999998E-3]
[90,918.33333333333314,0,918.33333333333314,0,918.33333333333314,0,1098.5283429835365,361.068805427163,1098.5283429835365,361.068805427163,1098.5283429835365,361.068805427163,0,1,null,90,91,3.1250000000000002E-3,2.0175000000000002E-3,1.0562500000000001E-2,7.9489499999999998E-3]
[91,918.33333333333314,0,918.33333333333314,0,918.33333333333314,0,1098.5283429835365,361.068805427163,1098.5283429835365,361.068805427163,1098.5283429835365,361.068805427163,0,1,null,91,92,3.1250000000000002E-3,2.0175000000000002E-3,1.0562500000000001E-2,7.9489499999999998E-3]
[92,918.33333333333314,0,918.33333333333314,0,918.33333333333314,0,1098.5283429835365,361.068805427163,1098.5283429835365,361.068805427163,1098.5283429835365,361.068805427163,0,1,null,92,93,3.1250000000000002E-3,2.0175000000000002E-3,1.0562500000000001E-2,7.9489499999999998E-3]
[93,918.33333333333314,0,918.33333333333314,0,918.33333333333314,0,1098.5283429835365,361.068805427163,1098.5283429835365,361.068805427163,1098.5283429835365,361.068805427163,0,1,null,93,94,3.1250000000000002E-3,2.0175000000000002E-3,1.0562500000000001E-2,7.9489499999999998E-3]
[94,918.33333333333314,0,918.33333333333314,0,918.33333333333314,0,1098.5283429835365,361.068805427163,1098.5283429835365,361.068805427163,1098.5283429835365,361.068805427163,0,1,null,94,95,3.1250000000000002E-3,2.0175000000000002E-3,1.0562500000000001E-2,7.9489499999999998E-3]
[95,918.33333333333314,0,918.33333333333314,0,918.33333333333314,0,1098.5283429835365,361.068805427163,1098.5283429835365,361.068805427163,1098.5283429835365,361.068805427163,0,1,null,95,96,3.1250000000000002E-3,2.0175000000000002E-3,1.0562500000000001E-2,7.9489499999999998E-3]
[96,918.33333333333314,0,918.33333333333314,0,918.33333333333314,0,1098.5283429835365,361.068805427163,1098.5283429835365,361.068805427163,1098.5283429835365,361.068805427163,0,1,null,96,97,3.1250000000000002E-3,2.0175000000000002E-3,1.0562500000000001E-2,7.9489499999999998E-3]
[97,918.33333333333314,0,918.33333333333314,0,918.33333333333314,0,1098.5283429835365,361.068805427163,1098.5283429835365,361.068805427163,1098.5283429835365,361.068805427163,0,1,null,97,98,3.1250000000000002E-3,2.0175000000000002E-3,1.0562500000000001E-2,7.9489499999999998E-3]
[98,918.33333333333314,0,918.33333333333314,0,918.33333333333314,0,1098.5283429835365,361.068805427163,1098.5283429835365,361.068805427163,1098.5283429835365,361.068805427163,0,1,null,98,99,3.1250000000000002E-3,2.0175000000000002E-3,1.0562500000000001E-2,7.9489499999999998E-3]
[99,918.33333333333314,0,918.33333333333314,0,918.33333333333314,0,1098.5283429835365,361.068805427163,1098.5283429835365,361.068805427163,1098.5283429835365,361.068805427163,0,1,null,99,100,3.1250000000000002E-3,2.0175000000000002E-3,1.0562500000000001E-2,7.9489499999999998E-3]
[100,918.33333333333314,0,918.33333333333314,0,918.33333333333314,0,1098.5283429835365,361.068805427163,1098.5283429835365,361.068805427163,1098.5283429835365,361.068805427163,0,1,null,100,101,3.1250000000000002E-3,2.0175000000000002E-3,1.0562500000000001E-2,7.9489499999999998E-3]
[101,918.33333333333314,0,918.33333333333314,0,918.33333333333314,0,1098.5283429835365,361.068805427163,1098.5283429835365,361.068805427163,1098.5283429835365,361.068805427163,0,1,null,101,102,3.1250000000000002E-3,2.0175000000000002E-3,1.0562500000000001E-2,7.9489499999999998E-3]
[102,918.33333333333314,0,918.33333333333314,0,918.33333333333314,0,1098.5283429835365,361.068805427163,1098.5283429835365,361.068805427163,1098.5283429835365,361.068805427163,0,1]

{"sheet":"Outputs","index":2,"n_rows":108,"n_cols":37,"rows_kept":108,"cut":false,"hidden":true,"merged":[[2,11,2,16],[0,0,1,16],[3,1,3,3],[3,5,3,7],[3,8,3,10],[3,11,3,13],[3,14,3,16],[2,1,2,10],[3,19,3,22],[2,19,2,26],[3,23,3,26],[0,18,1,32],[2,27,2,32],[3,27,3,29],[3,30,3,32]]}
["Knot Results",null,null,null,null,null,null,null,null,null,null,null,null,null,null,null,null,null,"Line Results"]
[]
[null,"Phase Values",null,null,null,null,null,null,null,null,null,"Sequence Components",null,null,null,null,null,null,null,"PhaseValues",null,null,null,null,null,null,null,"Sequence Components"]
[null,"Voltage in p.u.",null,null,null,"Voltage",null,null,"Angle",null,null,"Voltage in p.u",null,null,"Angle",null,null,null,null,"Current",null,null,null,"Angle",null,null,null,"Current",null,null,"Angle"]
[null,null,null,null,null,null,null,null,null,null,null,null,null,null,null,null,null,null,null,null,null,null,null,null,null,null,null,null,null,null,null,null,null,null,"Iterations Newton Raphson","Iterations CurrentInjection","Calculation Times"]
["Knot Nr.","U1 in p.u.","U2 in p.u.","U3 in p.u.","Un in p.u.","U1","U2","U3","Phi1","Phi2","Phi3","U_Zero","U_Pos","U_Neg","Phi_Zero","Phi_Pos","Phi_Neg",null,"Line Nr.","I1","I2","I3","In","Phi1","Phi2","Phi3","PhiN","I_Zero","I_Pos","I_Neg","Phi_Zero","Phi_Pos","Phi_Neg",null,5,0,0.6328125]
[1,1,1.0000000000000002,0.99999999999999978,2.7755575615628914E-16,230.94010767585033,230.94010767585038,230.94010767585027,-1.6974041659805604E-15,-120,120,2.7755575615628914E-16,1,2.7755575615628914E-17,0,1.4205369241337024E-14,0,null,1,889.86813790358212,889.86813790359668,889.86813790359508,2.808388500841377E-11,-9.7261279149994699,-129.72612791499975,110.27387208500129,0.86980836922165139,9.3194467334685438E-12,889.86813790359133,8.9557791232834863E-13,-178.62892228386971,-9.7261279149992976,-102.79376350283371]
[2,0.99519257860739652,0.99519257860739652,0.99519257860739652,6.8004466012143532E-18,229.8298812617993,229.8298812617993,229.8298812617993,-1.748862061710349,-121.74886206171038,118.25113793828965,6.8004466012143532E-18,0.99519257860739652,7.3643947812062494E-18,-151.82062990451354,-1.7488620617103492,109.70876747764157,null,2,177.9736275807166,177.9736275807166,177.97362758071657,8.0388733884609289E-14,-9.7261279149978979,-129.72612791499787,110.2738720850021,135,4.7904457103797979E-14,177.9736275807166,4.1442104530383553E-14,-62.020525611519254,-9.7261279149978819,-163.14160123226156]
[3,0.99259256568460708,0.99259256568460708,0.99259256568460696,8.7228059555581801E-18,229.22943399745171,229.22943399745171,229.22943399745168,-1.8184485657879852,-121.818448565788,118.181551434212,8.7228059555581801E-18,0.99259256568460708,7.7197753670627641E-18,-166.40699896491233,-1.8184485657879856,105.41419604964101,null,3,169.06895609633764,169.06895609633764,169.06895609633762,8.2938935931968787E-14,-9.7178533586144376,-129.71785335861443,110.28214664138555,133.2642954110716,4.567811192492323E-14,169.06895609633764,3.9147908670145228E-14,-60.872183853477978,-9.7178533586144198,-162.12130340415911]
[4,0.99012417018716758,0.99012417018716758,0.99012417018716747,1.0913842705681605E-17,228.65938247548644,228.65938247548644,228.65938247548641,-1.8849124241799022,-121.88491242417993,118.11508757582008,1.0913842705681605E-17,0.99012417018716758,8.1005932104762248E-18,-174.79344515968862,-1.8849124241799027,101.77238714326796,null,4,160.16537031930829,160.16537031930829,160.16537031930827,8.5560675549290691E-14,-9.7100551091642711,-129.71005510916424,110.28994489083573,131.63353933657018,4.3648400475403579E-14,160.16537031930829,3.671376567689859E-14,-60.470368228187887,-9.7100551091642551,-161.68367580988675]
[5,0.98778715020491659,0.98778715020491648,0.98778715020491648,1.3159978900002171E-17,228.11967082914478,228.11967082914475,228.11967082914475,-1.9482008945080407,-121.94820089450808,118.05179910549194,1.3159978900002171E-17,0.98778715020491659,8.4881655206055198E-18,179.97323654555896,-1.9482008945080409,98.686050865943457,null,5,151.2627702027591,151.26277020275913,151.26277020275907,9.099386826154683E-14,-9.7027253659646782,-129.70272536596465,110.29727463403532,128.65980825409008,4.1861030547509519E-14,151.2627702027591,3.4587445481793826E-14,-60.785620019730835,-9.7027253659646586,-162.19464978548817]
[6,0.98558127482637381,0.9855812748263737,0.9855812748263737,1.5382892678668225E-17,227.61024573170459,227.61024573170457,227.61024573170457,-2.0082634636850298,-122.00826346368505,117.99173653631496,1.5382892678668225E-17,0.98558127482637381,8.8703577452432909E-18,176.36993547976277,-2.0082634636850303,96.009527914790155,null,6,142.36106254544438,142.36106254544438,142.36106254544436,7.5531728873092518E-14,-9.6958566430957287,-129.69585664309571,110.30414335690426,138.81407483429035,3.9772575287470091E-14,142.36106254544436,3.2234728532992469E-14,-60.49134434156268,-9.6958566430957092,-162.64597536373921]
[7,0.98350632439666585,0.98350632439666574,0.98350632439666574,1.7540752282399475E-17,227.1310564560458,227.13105645604577,227.13105645604577,-2.0650519312524249,-122.06505193125246,117.93494806874756,1.7540752282399475E-17,0.98350632439666585,9.239763680060815E-18,173.83817501255987,-2.0650519312524254,93.700436539236847,null,7,133.46016064288023,133.46016064288023,133.4601606428802,4.832213032818602E-14,-9.6894417862294322,-129.68944178622942,110.31055821377055,126.0273733851036,3.7868818790538817E-14,133.46016064288023,3.0114479776562815E-14,-61.157339864587087,-9.6894417862294144,-163.30075576600638]
[8,0.98156209076729639,0.98156209076729628,0.98156209076729628,1.961344116971598E-17,226.68205493233219,226.68205493233216,226.68205493233216,-2.1185204895149155,-122.11852048951494,117.88147951048508,1.961344116971598E-17,0.98156209076729639,9.5937139244155552E-18,171.87766355341955,-2.1185204895149159,91.682117760562463,null,8,124.55998393289178,124.55998393289181,124.55998393289178,3.8263897345803626E-14,-9.6834739887488332,-129.68347398874883,110.31652601125116,111.80140948635182,3.5242135959827445E-14,124.5599839328918,2.8278014656434577E-14,-60.812547362379952,-9.6834739887488137,-162.18111108547703]
[9,0.97974837753680544,0.97974837753680544,0.97974837753680544,2.1562177659301969E-17,226.2631958035895,226.2631958035895,226.2631958035895,-2.1686258002446808,-122.16862580024471,117.8313741997553,2.1562177659301969E-17,0.97974837753680544,9.9418629343157361E-18,170.42457704575301,-2.1686258002446817,89.959199540814311,null,9,115.66045763599743,115.66045763599746,115.66045763599743,4.832213032818602E-14,-9.6779468071325585,-129.67794680713254,110.32205319286743,126.0273733851036,3.261693489554162E-14,115.66045763599745,2.6529089309235445E-14,-60.412236534580515,-9.677946807132539,-162.05755291084108]
[10,0.97806500028139109,0.97806500028139109,0.97806500028139098,2.3379047643169246E-17,225.87443647896504,225.87443647896504,225.87443647896501,-2.2153270677380474,-122.21532706773807,117.78467293226194,2.3379047643169246E-17,0.97806500028139109,1.027667615798199E-17,169.32740560576744,-2.2153270677380483,88.454292568480369,null,10,106.76151239105,106.76151239105002,106.76151239105,3.8263897345803626E-14,-9.6728541755974664,-129.67285417559745,110.32714582440252,111.80140948635182,3.053010809611019E-14,106.76151239105002,2.4323767777951865E-14,-60.00333223031047,-9.6728541755974469,-161.56505117707769]
[11,0.97651178677459316,0.97651178677459316,0.97651178677459305,2.5088881507357346E-17,225.51573718446153,225.51573718446153,225.51573718446153,-2.2585861080154084,-122.25858610801544,117.74141389198458,2.5088881507357346E-17,0.97651178677459316,1.0591492938777645E-17,168.47261318976015,-2.2585861080154093,87.173627348347978,null,11,97.863083886472651,97.863083886472651,97.863083886472637,4.0194366942304644E-14,-9.6681904199113955,-129.66819041991138,110.33180958008859,135,2.8323949553945516E-14,97.863083886472637,2.2347978726911092E-14,-59.953564753188864,-9.668190419911376,-161.17528998175965]
[12,0.97508857719518094,0.97508857719518094,0.97508857719518094,2.667979954599494E-17,225.18706101094679,225.18706101094679,225.18706101094679,-2.2983674139652517,-122.29836741396528,117.70163258603473,2.667979954599494E-17,0.97508857719518094,1.08865319412088E-17,167.78067297889953,-2.298367413965253,86.073393902245954,null,12,88.965112487217539,88.965112487217539,88.965112487217496,6.3552874323130192E-14,-9.6639502703472981,-129.66395027034727,110.3360497296527,116.56505117707799,2.5461391630374321E-14,88.965112487217525,2.1136194309762292E-14,-60.288664237580186,-9.6639502703472804,-162.80145877993451]
[13,0.97379522432242771,0.97379522432242771,0.9737952243224276,2.8111360555303144E-17,224.88837395925029,224.88837395925029,224.88837395925026,-2.3346382162435373,-122.33463821624356,117.66536178375644,2.8111360555303144E-17,0.97379522432242771,1.1163644163703393E-17,167.20848707591406,-2.3346382162435382,85.045642414666418,null,13,80.067542858193391,80.067542858193391,80.067542858193391,3.5527136788005009E-14,-9.6601288737536617,-129.66012887375365,110.33987112624632,143.13010235415598,2.2599925248802685E-14,80.067542858193391,1.8787367588564125E-14,-60.708637829014904,-9.6601288737536457,-163.65182845264874]
[14,0.97263159371799479,0.97263159371799479,0.97263159371799479,2.9382477723763391E-17,224.61964498216761,224.61964498216761,224.61964498216761,-2.3673685397511592,-122.36736853975118,117.63263146024883,2.9382477723763391E-17,0.97263159371799479,1.1410291355196004E-17,166.72915781304968,-2.3673685397511601,84.155671124073407,null,14,71.170323584021347,71.170323584021347,71.170323584021332,4.1469467965984394E-14,-9.6567218047026664,-129.65672180470264,110.34327819529732,133.2642954110716,1.9569157113732392E-14,71.170323584021347,1.7499224587322496E-14,-62.175903615745739,-9.6567218047026486,-164.05460409907715]
[15,0.97159756389370588,0.97159756389370577,0.97159756389370588,3.0479289067785057E-17,224.38084602320632,224.38084602320629,224.38084602320632,-2.3965312555241249,-122.39653125552415,117.60346874447586,3.0479289067785057E-17,0.97159756389370588,1.1641283665874663E-17,166.29345950215486,-2.3965312555241263,83.352765178858732,null,15,62.273406785899496,62.27340678589951,62.273406785899489,2.5864145986817697E-14,-9.6537250756804109,-129.6537250756804,110.34627492431957,105.94539590092285,1.7308333335402763E-14,62.273406785899503,1.4926204338903854E-14,-62.723236616885551,-9.653725075680395,-165.06858282186226]
[16,0.97069302646453615,0.97069302646453615,0.97069302646453615,3.1448885655676054E-17,224.171952051917,224.171952051917,224.171952051917,-2.4221021278839925,-122.42210212788402,117.57789787211598,3.1448885655676054E-17,0.97069302646453615,1.1837649159878683E-17,165.9165392344018,-2.4221021278839938,82.675791060299744,null,16,53.37674773544073,53.376747735440745,53.376747735440738,1.9131948672901813E-14,-9.6511351462718356,-129.65113514627183,110.34886485372816,111.80140948635182,1.4621156719869278E-14,53.376747735440738,1.2712386936902168E-14,-62.592424562180284,-9.6511351462718178,-164.64986350757621]
[17,0.96991788628620634,0.96991788628620634,0.96991788628620634,3.2269325578345567E-17,223.99294109566964,223.99294109566964,223.99294109566964,-2.4440598567093512,-122.44405985670939,117.55594014329064,3.2269325578345567E-17,0.96991788628620634,1.2006993380548941E-17,165.61912358590638,-2.4440598567093521,82.122660779782848,null,17,44.480304466368501,44.480304466368509,44.480304466368494,2.4884851026246757E-14,-9.6489489313431829,-129.64894893134317,110.35105106865682,124.82448915695679,1.21053374444313E-14,44.480304466368501,1.0962573991985427E-14,-65.979753202735253,-9.6489489313431651,-164.7448812969422]
[18,0.96927206157682255,0.96927206157682255,0.96927206157682255,3.2940237683997442E-17,223.84379426774484,223.84379426774484,223.84379426774484,-2.4623861147032531,-122.46238611470328,117.53761388529672,3.2940237683997442E-17,0.96927206157682255,1.215374157501877E-17,165.31459575381041,-2.4623861147032544,81.656929720092236,null,18,35.584037383740153,35.584037383740153,35.584037383740146,1.5099033134902129E-14,-9.6471638082004567,-129.64716380820045,110.35283619179953,118.07248693585295,9.9107228376008986E-15,35.584037383740146,9.2128026489850591E-15,-67.166345822081894,-9.647163808200439,-164.87599269168797]
[19,0.96875548402207368,0.96875548402207368,0.96875548402207357,3.3487209417670053E-17,223.72449579162819,223.72449579162819,223.72449579162816,-2.4770655795457666,-122.47706557954579,117.52293442045422,3.3487209417670053E-17,0.96875548402207368,1.2277488029960414E-17,165.05492073851931,-2.4770655795457674,81.272840371732926,null,19,26.687908871535374,26.687908871535381,26.687908871535374,8.7475429582505128E-15,-9.6457776226432728,-129.64577762264324,110.35422237735673,113.96248897457818,7.6400341484520716E-15,26.687908871535377,7.1183717827061481E-15,-70.709953780810622,-9.6457776226432514,-168.31063082456174]
[20,0.96836809886355846,0.96836809886355835,0.96836809886355835,3.3901495923314076E-17,223.63503302140867,223.63503302140865,223.63503302140865,-2.4880859608359787,-122.488085960836,117.51191403916401,3.3901495923314076E-17,0.96836809886355846,1.2369559650981164E-17,164.8167157713531,-2.48808596083598,80.955180131554641,null,20,17.791882898727497,17.791882898727504,17.791882898727497,8.8817841970012523E-15,-9.6447886939558298,-129.6447886939558,110.35521130604417,90,4.9858741216738634E-15,17.791882898727497,4.6671477018647202E-15,-74.623748751173807,-9.6447886939558085,-168.11134196037003]
[21,0.96810986496988238,0.96810986496988227,0.96810986496988227,3.4165389372099353E-17,223.57539645819756,223.57539645819753,223.57539645819753,-2.4954380217430203,-122.49543802174306,117.50456197825697,3.4165389372099353E-17,0.96810986496988238,1.2430284189152648E-17,164.63373599444759,-2.4954380217430217,80.750438585743083,null,21,8.8959246240830563,8.8959246240830581,8.8959246240830563,2.886579864025407E-15,-9.6441958188448531,-129.64419581884482,110.35580418115514,90,2.0146705333121713E-15,8.8959246240830581,1.9821445675202523E-15,-72.64597536373833,-9.6441958188448353,-165.96375653207343]
[22,0.96798075489023583,0.96798075489023583,0.96798075489023583,3.4273561814539118E-17,223.54557976250194,223.54557976250194,223.54557976250194,-2.4991155953013231,-122.49911559530135,117.50088440469867,3.4273561814539118E-17,0.96798075489023583,1.2456805570809544E-17,164.56680075725126,-2.4991155953013244,80.668605333845392,null,22,177.97362758071642,177.97362758071642,177.9736275807164,7.5531728873092518E-14,-9.7261279149980258,-129.72612791499802,110.27387208500197,138.81407483429035,4.5496872750805457E-14,177.9736275807164,4.1502707201604163E-14,-60.048614494137659,-9.726127914998008,-161.77492488864544]
[23,0.99259256568460708,0.99259256568460708,0.99259256568460696,8.6713622071065421E-18,229.22943399745171,229.22943399745171,229.22943399745168,-1.818448565787985,-121.818448565788,118.181551434212,8.6713622071065421E-18,0.99259256568460708,7.7333950228021294E-18,-165.36942296460498,-1.8184485657879852,105.47593452000307,null,23,169.06895609633801,169.06895609633798,169.06895609633796,7.3241068776355802E-14,-9.7178533586141675,-129.71785335861415,110.28214664138582,140.9061411137705,4.2814437365722295E-14,169.06895609633798,3.9680767196881679E-14,-59.836180706113026,-9.7178533586141498,-160.90650799951462]
[24,0.99012417018716758,0.99012417018716758,0.99012417018716747,1.0719950294232251E-17,228.65938247548644,228.65938247548644,228.65938247548641,-1.8849124241799027,-121.88491242417993,118.11508757582008,1.0719950294232251E-17,0.99012417018716758,8.1295017803943069E-18,-173.36999246507611,-1.8849124241799031,101.85087819085471,null,24,160.16537031930829,160.16537031930829,160.16537031930827,7.5531728873092518E-14,-9.7100551091642711,-129.71005510916424,110.28994489083573,138.81407483429035,4.0790959300173344E-14,160.16537031930829,3.7253524906045677E-14,-59.354710918213435,-9.7100551091642551,-160.39591184917052]
[25,0.98778715020491659,0.98778715020491648,0.98778715020491648,1.2811895277463211E-17,228.11967082914478,228.11967082914475,228.11967082914475,-1.9482008945080409,-121.94820089450808,118.05179910549194,1.2811895277463211E-17,0.98778715020491659,8.53215326926119E-18,-178.4423523517946,-1.9482008945080413,98.790021197233756,null,25,151.26277020275811,151.26277020275811,151.26277020275808,4.832213032818602E-14,-9.702725365965577,-129.70272536596556,110.29727463403441,126.0273733851036,3.8341894125741573E-14,151.26277020275811,3.5120401102255195E-14,-59.898695434399542,-9.702725365965561,-160.8209919741893]
[26,0.98558127482637381,0.98558127482637381,0.9855812748263737,1.4837079033565744E-17,227.61024573170459,227.61024573170459,227.61024573170457,-2.0082634636850281,-122.00826346368505,117.99173653631496,1.4837079033565744E-17,0.98558127482637381,8.9291514270907573E-18,178.04175465375764,-2.0082634636850281,96.144637567174087,null,26,142.36106254543859,142.36106254543859,142.36106254543856,4.5496934130773415E-14,-9.6958566430941548,-129.69585664309415,110.30414335690584,128.65980825409008,3.6257098440380635E-14,142.36106254543856,3.2761868342730164E-14,-59.524825537854689,-9.6958566430941389,-161.16624708734111]
[27,0.98350632439666597,0.98350632439666597,0.98350632439666585,1.6795640964674485E-17,227.13105645604583,227.13105645604583,227.1310564560458,-2.065051931252424,-122.06505193125246,117.93494806874756,1.6795640964674485E-17,0.98350632439666597,9.3130882567881975E-18,175.54961833552645,-2.0650519312524245,93.870037468933674,null,27,133.46016064288673,133.46016064288673,133.46016064288673,4.5496934130773415E-14,-9.689441786230427,-129.68944178623042,110.31055821376955,128.65980825409008,3.4587445481793769E-14,133.46016064288673,3.1014294308023433E-14,-59.514266293667738,-9.689441786230411,-161.00334584451156]
[28,0.98156209076729639,0.98156209076729628,0.98156209076729628,1.8687635966042974E-17,226.68205493233219,226.68205493233216,226.68205493233216,-2.118520489514915,-122.11852048951494,117.88147951048508,1.8687635966042974E-17,0.98156209076729639,9.6899305320780004E-18,173.66341728819296,-2.1185204895149155,91.892185174151209,null,28,124.55998393289161,124.55998393289163,124.5599839328916,6.0291550413456957E-14,-9.6834739887490144,-129.683473988749,110.31652601125099,135,3.1968576918032782E-14,124.55998393289163,2.9202770063379538E-14,-58.999302287026708,-9.6834739887489949,-159.77514056883186]
[29,0.97974837753680544,0.97974837753680544,0.97974837753680544,2.0455300620339178E-17,226.2631958035895,226.2631958035895,226.2631958035895,-2.1686258002446808,-122.16862580024471,117.8313741997553,2.0455300620339178E-17,0.97974837753680544,1.0060712325968189E-17,172.27635979799601,-2.1686258002446808,90.212699595019203,null,29,115.66045763599779,115.66045763599782,115.66045763599779,3.8263897345803626E-14,-9.6779468071321624,-129.67794680713214,110.32205319286783,111.80140948635182,2.9701302937777916E-14,115.6604576359978,2.6681107273571335E-14,-59.076004585424293,-9.6779468071321446,-161.07535558394866]
[30,0.97806500028139109,0.97806500028139109,0.97806500028139098,2.2106159881904575E-17,225.87443647896504,225.87443647896504,225.87443647896501,-2.2153270677380479,-122.21532706773807,117.78467293226194,2.2106159881904575E-17,0.97806500028139109,1.0400736604130073E-17,171.18128366574692,-2.2153270677380483,88.740695291360254,null,30,106.76151239105018,106.76151239105019,106.76151239105016,4.4938668397781776E-14,-9.672854175597255,-129.67285417559722,110.32714582440273,108.43494882292201,2.7620633040729484E-14,106.76151239105018,2.4480040063192267E-14,-58.523160650414894,-9.6728541755972355,-160.49755149333751]
[31,0.97651178677459316,0.97651178677459316,0.97651178677459305,2.36508521142452E-17,225.51573718446153,225.51573718446153,225.51573718446153,-2.2585861080154084,-122.25858610801544,117.74141389198456,2.36508521142452E-17,0.97651178677459316,1.0720684528773747E-17,170.3365462717984,-2.2585861080154097,87.490349213098241,null,31,97.863083886471799,97.863083886471813,97.86308388647177,5.1237965343830028E-14,-9.6681904199125537,-129.66819041991252,110.33180958008744,123.69006752597979,2.5415966395595043E-14,97.863083886471799,2.2507701183630468E-14,-58.33924890336263,-9.6681904199125359,-160.01689347809995]
[32,0.97508857719518094,0.97508857719518094,0.97508857719518083,2.5077152794281865E-17,225.18706101094679,225.18706101094679,225.18706101094676,-2.2983674139652499,-122.29836741396528,117.70163258603473,2.5077152794281865E-17,0.97508857719518094,1.1020800190599955E-17,169.66177987107397,-2.2983674139652512,86.418413699728475,null,32,88.965112487217539,88.965112487217539,88.96511248721751,3.8958546965271006E-14,-9.6639502703472964,-129.66395027034727,110.3360497296527,136.8476102659946,2.3085565494715502E-14,88.965112487217525,2.10553986877112E-14,-58.626994859890679,-9.6639502703472804,-161.35820810630071]
[33,0.97379522432242771,0.97379522432242771,0.9737952243224276,2.6374154848379345E-17,224.88837395925029,224.88837395925029,224.88837395925026,-2.3346382162435355,-122.33463821624356,117.66536178375644,2.6374154848379345E-17,0.97379522432242771,1.1300505318212815E-17,169.09802866563331,-2.3346382162435368,85.433834552247916,null,33,80.067542858186044,80.067542858186059,80.06754285818603,4.1469467965984394E-14,-9.6601288737534183,-129.66012887375339,110.33987112624658,133.2642954110716,2.0633031754493037E-14,80.067542858186044,1.8928305459135661E-14,-59.551376456158415,-9.6601288737534023,-162.25532837494265]
[34,0.9726315937179949,0.9726315937179949,0.9726315937179949,2.7531783193771147E-17,224.61964498216764,224.61964498216764,224.61964498216764,-2.3673685397511548,-122.36736853975118,117.63263146024883,2.7531783193771147E-17,0.9726315937179949,1.1552033114180537E-17,168.60019626914305,-2.3673685397511561,84.569896377812512,null,34,71.17032358402939,71.17032358402939,71.170323584029376,3.0198066269804258E-14,-9.656721804701661,-129.65672180470165,110.34327819529832,118.07248693585295,1.8724216594459495E-14,71.170323584029376,1.7037492809038001E-14,-60.802513953934536,-9.656721804701645,-163.61045966596566]
[35,0.97159756389370588,0.97159756389370577,0.97159756389370588,2.8579360927951922E-17,224.38084602320632,224.38084602320629,224.38084602320632,-2.3965312555241249,-122.39653125552415,117.60346874447586,2.8579360927951922E-17,0.97159756389370588,1.1776969977425046E-17,168.13735290976567,-2.3965312555241263,83.79775278398715,null,35,62.27340678589848,62.273406785898487,62.27340678589848,1.888293221827313E-14,-9.6537250756825959,-129.65372507568259,110.34627492431738,138.81407483429035,1.6459664798438087E-14,62.273406785898487,1.4597427480449939E-14,-61.1892062570262,-9.6537250756825799,-162.75854060105999]
[36,0.97069302646453615,0.97069302646453615,0.97069302646453604,2.95003809826426E-17,224.171952051917,224.171952051917,224.17195205191697,-2.4221021278839903,-122.42210212788402,117.577897872116,2.95003809826426E-17,0.97069302646453615,1.1973263509306127E-17,167.74556613524601,-2.4221021278839916,83.173321309773058,null,36,53.376747735441747,53.376747735441761,53.376747735441747,2.2469334198890888E-14,-9.6511351462692865,-129.65113514626927,110.3488648537307,108.43494882292201,1.4196101907941889E-14,53.376747735441754,1.2480753739339309E-14,-61.699244233992893,-9.6511351462692687,-164.3577535427915]
[37,0.96991788628620634,0.96991788628620634,0.96991788628620634,3.0294294130456347E-17,223.99294109566964,223.99294109566964,223.99294109566964,-2.4440598567093512,-122.44405985670939,117.55594014329064,3.0294294130456347E-17,0.96991788628620634,1.2139102726384276E-17,167.41341703823775,-2.4440598567093521,82.633379304102561,null,37,44.480304466368501,44.480304466368501,44.480304466368501,1.551136925266137E-14,-9.6489489313431829,-129.64894893134317,110.3510510686568,156.37062226934319,1.1667869254661042E-14,44.480304466368501,1.0730859768672096E-14,-65.018760393783595,-9.6489489313431651,-164.40718906073377]
[38,0.96927206157682255,0.96927206157682255,0.96927206157682255,3.0938502326383593E-17,223.84379426774484,223.84379426774484,223.84379426774484,-2.4623861147032531,-122.46238611470328,117.53761388529672,3.0938502326383593E-17,0.96927206157682255,1.2282447514159954E-17,167.08353133655376,-2.4623861147032544,82.180253755013027,null,38,35.584037383737943,35.584037383737943,35.584037383737936,1.6687357476335705E-14,-9.647163808208747,-129.64716380820872,110.35283619179125,115.20112364547508,9.4694930281753452E-15,35.584037383737943,8.9809768995883195E-15,-66.037511025421878,-9.6471638082087292,-164.47588900324553]
[39,0.96875548402207368,0.96875548402207357,0.96875548402207368,3.1459503011959203E-17,223.72449579162819,223.72449579162816,223.72449579162819,-2.4770655795457612,-122.47706557954579,117.52293442045423,3.1459503011959203E-17,0.96875548402207368,1.2402899516108419E-17,166.80881467530736,-2.4770655795457626,81.808420627252232,null,39,26.687908871537584,26.687908871537587,26.687908871537584,1.0658141036401503E-14,-9.645777622632222,-129.64577762263221,110.35422237736778,90,7.6400341484522057E-15,26.687908871537584,7.1183717827061655E-15,-70.709953780810693,-9.6457776226322025,-168.3106308245608]
[40,0.96836809886355846,0.96836809886355835,0.96836809886355835,3.186935870147722E-17,223.63503302140867,223.63503302140865,223.63503302140865,-2.4880859608359787,-122.488085960836,117.51191403916401,3.186935870147722E-17,0.96836809886355846,1.2494328907537866E-17,166.53275892983496,-2.48808596083598,81.490007753114611,null,40,17.791882898728005,17.791882898728009,17.791882898728005,9.5659743364509064E-15,-9.6447886939520053,-129.64478869395197,110.35521130604799,111.80140948635182,4.9858741216739486E-15,17.791882898728009,4.6671477018645687E-15,-74.623748751173068,-9.644788693951984,-168.1113419603715]
[41,0.96810986496988238,0.96810986496988227,0.96810986496988238,3.2129905091603535E-17,223.57539645819756,223.57539645819753,223.57539645819756,-2.4954380217430217,-122.49543802174306,117.50456197825697,3.2129905091603535E-17,0.96810986496988238,1.2554637407989412E-17,166.32419119053284,-2.4954380217430225,81.28471954107448,null,41,8.8959246240825482,8.89592462408255,8.8959246240825482,3.5527136788005009E-15,-9.6441958188525039,-129.64419581885249,110.35580418114749,90,2.0146705333120684E-15,8.89592462408255,1.9821445675202357E-15,-72.64597536373951,-9.6441958188524879,-165.96375653207292]
[42,0.96798075489023583,0.96798075489023583,0.96798075489023583,3.223685487940435E-17,223.54557976250194,223.54557976250194,223.54557976250194,-2.4991155953013231,-122.49911559530135,117.50088440469867,3.223685487940435E-17,0.96798075489023583,1.2580991959500957E-17,166.24738762505055,-2.4991155953013244,81.202571847572017,null,42,177.97362758071642,177.97362758071642,177.9736275807164,7.7917093930542012E-14,-9.7261279149980275,-129.72612791499802,110.27387208500197,136.8476102659946,4.6577916488973285E-14,177.9736275807164,4.2939588861078486E-14,-61.318746573297936,-9.726127914998008,-158.31770838675504]
[43,0.99259256568460708,0.99259256568460708,0.99259256568460696,8.6840501122779344E-18,229.22943399745171,229.22943399745171,229.22943399745168,-1.818448565787985,-121.818448565788,118.181551434212,8.6840501122779344E-18,0.99259256568460708,7.7800493426554123E-18,-165.92500240593321,-1.8184485657879852,105.52365698049753,null,43,169.06895609633801,169.06895609633798,169.06895609633796,7.5531728873092518E-14,-9.7178533586141675,-129.71785335861415,110.28214664138582,138.81407483429035,4.4067330386581498E-14,169.06895609633798,4.0797863855073554E-14,-60.778441784139225,-9.7178533586141498,-158.57470620191268]
[44,0.99012417018716758,0.99012417018716758,0.99012417018716747,1.0786607852478356E-17,228.65938247548644,228.65938247548644,228.65938247548641,-1.8849124241799027,-121.88491242417993,118.11508757582008,1.0786607852478356E-17,0.99012417018716758,8.2073515699475428E-18,-174.18234417598862,-1.8849124241799031,101.94362097937309,null,44,160.16537031930744,160.1653703193075,160.16537031930744,6.3552874323130192E-14,-9.7100551091649816,-129.71005510916495,110.28994489083502,116.56505117707799,4.186103054750933E-14,160.16537031930744,3.8609941140255478E-14,-60.785620019730885,-9.7100551091649656,-158.06611495893648]
[45,0.98778715020491659,0.98778715020491648,0.98778715020491648,1.292371318312681E-17,228.11967082914478,228.11967082914475,228.11967082914475,-1.9482008945080391,-121.94820089450808,118.05179910549195,1.292371318312681E-17,0.98778715020491659,8.6422106517564715E-18,-179.44336611824841,-1.9482008945080393,98.918916299013716,null,45,151.26277020275927,151.26277020275927,151.26277020275924,6.8981221939692714E-14,-9.7027253659645307,-129.70272536596451,110.29727463403546,145.49147701233159,3.9537997695061982E-14,151.26277020275927,3.651730950513243E-14,-61.097642963797526,-9.7027253659645094,-159.17910714668923]
[46,0.98558127482637381,0.9855812748263737,0.9855812748263737,1.5009825033973081E-17,227.61024573170459,227.61024573170457,227.61024573170457,-2.0082634636850285,-122.00826346368505,117.99173653631496,1.5009825033973081E-17,0.98558127482637381,9.0659077011462441E-18,176.94550681298341,-2.0082634636850289,96.278006868298107,null,46,142.36106254543941,142.36106254543938,142.36106254543938,3.7765864436546259E-14,-9.6958566430933626,-129.69585664309335,110.30414335690664,138.81407483429035,3.7389951491093172E-14,142.36106254543938,3.4102104592220109E-14,-60.963284061287844,-9.6958566430933431,-158.49856567595177]
[47,0.98350632439666597,0.98350632439666597,0.98350632439666585,1.702586540284454E-17,227.13105645604583,227.13105645604583,227.1310564560458,-2.0650519312524267,-122.06505193125246,117.93494806874756,1.702586540284454E-17,0.98350632439666597,9.4816485730349943E-18,174.36996610233658,-2.0650519312524271,94.059521252049649,null,47,133.46016064288557,133.46016064288557,133.46016064288554,6.3552874323130192E-14,-9.6894417862316171,-129.68944178623161,110.31055821376837,153.43494882292202,3.5010209649207188E-14,133.46016064288557,3.1737077710699811E-14,-61.49942251619332,-9.6894417862315994,-158.68208772453869]
[48,0.98156209076729639,0.98156209076729628,0.98156209076729628,1.8932934119281991E-17,226.68205493233219,226.68205493233216,226.68205493233216,-2.118520489514915,-122.11852048951494,117.88147951048508,1.8932934119281991E-17,0.98156209076729639,9.8792748155669945E-18,172.40454736683893,-2.1185204895149155,92.157702013934653,null,48,124.55998393289161,124.55998393289163,124.5599839328916,6.0291550413456957E-14,-9.6834739887490144,-129.683473988749,110.31652601125099,135,3.2324448300063568E-14,124.55998393289163,2.9771979079417435E-14,-61.338535202539958,-9.6834739887489949,-158.19859051364855]
[49,0.97974837753680544,0.97974837753680544,0.97974837753680544,2.071134854795173E-17,226.2631958035895,226.2631958035895,226.2631958035895,-2.1686258002446808,-122.16862580024471,117.8313741997553,2.071134854795173E-17,0.97974837753680544,1.0263811715030763E-17,170.92669433743649,-2.1686258002446808,90.527538988830344,null,49,115.66045763599196,115.66045763599197,115.66045763599196,5.1237965343830028E-14,-9.6779468071302297,-129.67794680713021,110.32205319286976,123.69006752597979,3.011831674921977E-14,115.66045763599197,2.7406434979963717E-14,-61.389540334033896,-9.6779468071302119,-158.38522105721324]
[50,0.97806500028139121,0.97806500028139121,0.97806500028139109,2.2378504500345114E-17,225.87443647896507,225.87443647896507,225.87443647896504,-2.2153270677380479,-122.21532706773809,117.78467293226194,2.2378504500345114E-17,0.97806500028139121,1.062381016376709E-17,169.75797493352425,-2.2153270677380492,89.125841247853231,null,50,106.76151239105583,106.76151239105586,106.76151239105583,4.832213032818602E-14,-9.6728541755995625,-129.67285417559953,110.32714582440043,107.10272896905236,2.8086324891688968E-14,106.76151239105585,2.4776807094001858E-14,-60.802513953934742,-9.6728541755995412,-157.16634582208232]
[51,0.97651178677459316,0.97651178677459316,0.97651178677459305,2.3944137751088446E-17,225.51573718446153,225.51573718446153,225.51573718446153,-2.2585861080154084,-122.25858610801544,117.74141389198458,2.3944137751088446E-17,0.97651178677459316,1.095900504595303E-17,168.85354330322346,-2.2585861080154093,87.97583512460038,null,51,97.863083886472651,97.863083886472651,97.863083886472637,4.0194366942304644E-14,-9.6681904199113955,-129.66819041991138,110.33180958008859,135,2.5763674825384692E-14,97.863083886472637,2.2599925248802773E-14,-61.282884129020914,-9.668190419911376,-156.1612598168276]
[52,0.97508857719518094,0.97508857719518094,0.97508857719518094,2.5382313407659014E-17,225.18706101094679,225.18706101094679,225.18706101094679,-2.2983674139652517,-122.29836741396528,117.70163258603473,2.5382313407659014E-17,0.97508857719518094,1.1271651542368731E-17,168.09489275766776,-2.298367413965253,87.014766951690106,null,52,88.965112487217183,88.965112487217198,88.965112487217183,4.0194366942304644E-14,-9.663950270347808,-129.66395027034778,110.33604972965219,135,2.322032185889372E-14,88.965112487217183,2.1115682357551906E-14,-62.904447506247358,-9.6639502703477884,-157.22962109123901]
[53,0.97379522432242771,0.97379522432242771,0.9737952243224276,2.6673748521743544E-17,224.88837395925029,224.88837395925029,224.88837395925026,-2.3346382162435364,-122.33463821624356,117.66536178375644,2.6673748521743544E-17,0.97379522432242771,1.1563309879414407E-17,167.4024493562753,-2.3346382162435373,86.136776908434086,null,53,80.067542858186386,80.0675428581864,80.067542858186371,3.6620534388177901E-14,-9.6601288737528535,-129.66012887375283,110.33987112624713,112.83365417791755,2.101591538147774E-14,80.067542858186386,1.9379276022480459E-14,-63.141878337894561,-9.6601288737528339,-156.61477894278602]
[54,0.9726315937179949,0.9726315937179949,0.9726315937179949,2.7844532043778132E-17,224.61964498216764,224.61964498216764,224.61964498216764,-2.3673685397511566,-122.36736853975118,117.63263146024883,2.7844532043778132E-17,0.9726315937179949,1.1834907522658612E-17,166.82118855361531,-2.3673685397511575,85.383357870219953,null,54,71.170323584028523,71.170323584028523,71.170323584028509,2.2748467065386707E-14,-9.6567218047032579,-129.65672180470324,110.34327819529673,128.65980825409008,1.8328533639508181E-14,71.170323584028523,1.7207897284372829E-14,-63.098907048458393,-9.6567218047032402,-155.22485943116772]
[55,0.97159756389370588,0.97159756389370588,0.97159756389370588,2.8867935396665841E-17,224.38084602320632,224.38084602320632,224.38084602320632,-2.3965312555241245,-122.39653125552415,117.60346874447586,2.8867935396665841E-17,0.97159756389370588,1.2080854835003006E-17,166.35431121119646,-2.3965312555241258,84.771057919004264,null,55,62.273406785893343,62.27340678589335,62.273406785893343,2.1390168887322673E-14,-9.6537250756775475,-129.65372507567753,110.34627492432246,131.63353933657018,1.5815199078024798E-14,62.273406785893343,1.4644847510539225E-14,-65.772254682044732,-9.6537250756775297,-156.8014094863513]
[56,0.97069302646453626,0.97069302646453626,0.97069302646453615,2.9742649555668001E-17,224.17195205191703,224.17195205191703,224.171952051917,-2.4221021278839925,-122.42210212788402,117.577897872116,2.9742649555668001E-17,0.97069302646453626,1.2288226584013729E-17,165.89815929861763,-2.4221021278839938,84.242448439144738,null,56,53.376747735447069,53.376747735447076,53.376747735447069,2.0791723739534308E-14,-9.6511351462747506,-129.65113514627473,110.34886485372525,109.98310652189997,1.317933256502049E-14,53.376747735447076,1.2721473704993622E-14,-65.772254682045613,-9.6511351462747292,-157.79652146794342]
[57,0.96991788628620634,0.96991788628620634,0.96991788628620634,3.047294226642565E-17,223.99294109566964,223.99294109566964,223.99294109566964,-2.4440598567093512,-122.44405985670939,117.55594014329064,3.047294226642565E-17,0.96991788628620634,1.2467501770792255E-17,165.53805536841963,-2.4440598567093521,83.783159740376462,null,57,44.480304466368501,44.480304466368501,44.480304466368509,7.1054273576010019E-15,-9.6489489313431847,-129.64894893134317,110.3510510686568,180,1.1520235781776174E-14,44.480304466368501,1.0803302950017575E-14,-66.644435140712929,-9.6489489313431651,-159.14554196042118]
[58,0.96927206157682255,0.96927206157682255,0.96927206157682255,3.110973500530965E-17,223.84379426774484,223.84379426774484,223.84379426774484,-2.4623861147032531,-122.46238611470328,117.53761388529672,3.110973500530965E-17,0.96927206157682255,1.2618370538465259E-17,165.2192406125009,-2.4623861147032544,83.387123969689469,null,58,35.584037383739975,35.584037383739982,35.584037383739975,1.5099033134902129E-14,-9.6471638082010962,-129.64716380820107,110.3528361917989,118.07248693585295,9.6933640786771255E-15,35.584037383739975,8.6666757081997735E-15,-70.4417484630019,-9.6471638082010767,-160.55996517182371]
[59,0.96875548402207368,0.96875548402207368,0.96875548402207357,3.1635816528548656E-17,223.72449579162819,223.72449579162819,223.72449579162816,-2.4770655795457661,-122.47706557954579,117.52293442045422,3.1635816528548656E-17,0.96875548402207368,1.2738100776884485E-17,164.89709586590945,-2.4770655795457674,83.062794747182679,null,59,26.687908871534866,26.687908871534869,26.687908871534862,1.2080532582046505E-14,-9.6457776226458254,-129.6457776226458,110.35422237735418,107.10272896905236,7.4949690895234189E-15,26.687908871534866,6.4138805423947852E-15,-74.180806052499321,-9.6457776226458058,-167.00538320808212]
[60,0.96836809886355846,0.96836809886355835,0.96836809886355846,3.2033687105863837E-17,223.63503302140867,223.63503302140865,223.63503302140867,-2.4880859608359769,-122.488085960836,117.51191403916401,3.2033687105863837E-17,0.96836809886355846,1.2820515552930742E-17,164.60822100882766,-2.4880859608359782,82.783520692868933,null,60,17.791882898728684,17.791882898728687,17.791882898728684,8.8817841970012523E-15,-9.6447886939469054,-129.64478869394688,110.35521130605309,90,5.4230019593201262E-15,17.791882898728684,4.4322099942068811E-15,-77.195733934714795,-9.6447886939468823,-167.47119229085123]
[61,0.96810986496988238,0.96810986496988227,0.96810986496988238,3.231565245577538E-17,223.57539645819756,223.57539645819753,223.57539645819756,-2.4954380217430217,-122.49543802174306,117.50456197825697,3.231565245577538E-17,0.96810986496988238,1.2877293866077682E-17,164.3770126863574,-2.4954380217430225,82.590561690209967,null,61,8.8959246240828875,8.8959246240828893,8.8959246240828875,3.7747582837255322E-15,-9.644195818847404,-129.64419581884738,110.35580418115259,90,2.5466780494842283E-15,8.8959246240828893,1.7499224587323187E-15,-70.709953780808775,-9.6441958188473844,-164.0546040990769]
[62,0.96798075489023583,0.96798075489023583,0.96798075489023583,3.2454228171816256E-17,223.54557976250194,223.54557976250194,223.54557976250194,-2.499115595301324,-122.49911559530135,117.50088440469867,3.2454228171816256E-17,0.96798075489023583,1.2900725299842491E-17,164.29695865122889,-2.4991155953013253,82.520927072894096,null,62,177.9736275807166,177.9736275807166,177.97362758071657,8.2938935931968787E-14,-9.7261279149978979,-129.72612791499787,110.2738720850021,133.2642954110716,4.6386025679550155E-14,177.9736275807166,4.304441477936702E-14,-63.03660683194633,-9.7261279149978819,-159.74353782547701]
[63,0.99259256568460708,0.99259256568460708,0.99259256568460696,8.625210230450507E-18,229.22943399745171,229.22943399745171,229.22943399745168,-1.8184485657879852,-121.818448565788,118.181551434212,8.625210230450507E-18,0.99259256568460708,7.7675803191321099E-18,-166.28893305055672,-1.8184485657879856,105.43511980072429,null,63,169.06895609633867,169.06895609633867,169.06895609633864,7.7917093930542012E-14,-9.7178533586136329,-129.71785335861361,110.28214664138636,136.8476102659946,4.3549506457998109E-14,169.06895609633867,4.0849522417224174E-14,-62.020525611519183,-9.7178533586136133,-159.32557523912635]
[64,0.99012417018716758,0.99012417018716758,0.99012417018716747,1.068350269115167E-17,228.65938247548644,228.65938247548644,228.65938247548641,-1.8849124241799051,-121.88491242417993,118.11508757582008,1.068350269115167E-17,0.99012417018716758,8.1898172589064482E-18,-174.69032078888824,-1.8849124241799056,101.80973123633852,null,64,160.16537031930662,160.16537031930665,160.16537031930659,6.3552874323130192E-14,-9.7100551091656868,-129.71005510916567,110.28994489083431,116.56505117707799,4.0806537152663288E-14,160.16537031930659,3.8881341410073153E-14,-62.076410284860856,-9.7100551091656708,-158.98791985595878]
[65,0.98778715020491659,0.98778715020491648,0.98778715020491648,1.2752699525754353E-17,228.11967082914478,228.11967082914475,228.11967082914475,-1.9482008945080391,-121.94820089450808,118.05179910549195,1.2752699525754353E-17,0.98778715020491659,8.6218041418201064E-18,179.98792897461922,-1.9482008945080393,98.717851498454124,null,65,151.26277020275975,151.26277020275975,151.26277020275973,8.5560675549290691E-14,-9.7027253659640813,-129.70272536596406,110.29727463403592,131.63353933657018,3.8489288291972514E-14,151.26277020275975,3.6801004563639376E-14,-62.474774256254889,-9.7027253659640618,-160.14478563067902]
[66,0.98558127482637381,0.9855812748263737,0.9855812748263737,1.4771764393586753E-17,227.61024573170459,227.61024573170457,227.61024573170457,-2.0082634636850298,-122.00826346368505,117.99173653631496,1.4771764393586753E-17,0.98558127482637381,9.0434971467283868E-18,176.30656920297369,-2.0082634636850303,96.01472984791495,null,66,142.36106254543787,142.36106254543787,142.36106254543785,4.832213032818602E-14,-9.6958566430947961,-129.69585664309477,110.3041433569052,126.0273733851036,3.6766448147277219E-14,142.36106254543787,3.3987549504839994E-14,-62.764853300696672,-9.6958566430947801,-160.15537243386834]
[67,0.98350632439666597,0.98350632439666597,0.98350632439666585,1.6740352331464129E-17,227.13105645604583,227.13105645604583,227.1310564560458,-2.0650519312524245,-122.06505193125246,117.93494806874756,1.6740352331464129E-17,0.98350632439666597,9.4492099862651045E-18,173.59467119183634,-2.0650519312524249,93.736661058875242,null,67,133.46016064288639,133.46016064288639,133.46016064288636,4.5496934130773415E-14,-9.689441786230768,-129.68944178623076,110.31055821376923,128.65980825409008,3.4896152076005089E-14,133.46016064288639,3.1790737607305687E-14,-61.846258974251434,-9.6894417862307503,-159.64677085193134]
[68,0.98156209076729639,0.98156209076729628,0.98156209076729628,1.8645643463339626E-17,226.68205493233219,226.68205493233216,226.68205493233216,-2.1185204895149146,-122.11852048951494,117.88147951048508,1.8645643463339626E-17,0.98156209076729639,9.8439810399812882E-18,171.64896713311578,-2.118520489514915,91.799285029942823,null,68,124.55998393289161,124.55998393289163,124.5599839328916,6.0291550413456957E-14,-9.6834739887490144,-129.683473988749,110.31652601125099,135,3.2209849222202867E-14,124.55998393289163,2.9821425370364208E-14,-61.713723834269004,-9.6834739887489949,-159.22774531795395]
[69,0.97974837753680544,0.97974837753680544,0.97974837753680544,2.0421018173736448E-17,226.2631958035895,226.2631958035895,226.2631958035895,-2.1686258002446799,-122.16862580024471,117.8313741997553,2.0421018173736448E-17,0.97974837753680544,1.0225857155091732E-17,170.18833909849158,-2.1686258002446808,90.135462465515531,null,69,115.66045763599145,115.66045763599145,115.66045763599143,4.832213032818602E-14,-9.6779468071308212,-129.67794680713081,110.32205319286918,126.0273733851036,3.011831674921977E-14,115.66045763599145,2.7630044709619827E-14,-61.389540334033896,-9.6779468071308035,-158.56883272376686]
[70,0.97806500028139121,0.97806500028139109,0.97806500028139109,2.2093545012587954E-17,225.87443647896507,225.87443647896504,225.87443647896504,-2.2153270677380466,-122.21532706773807,117.78467293226194,2.2093545012587954E-17,0.97806500028139121,1.0589747908819953E-17,169.06021159877463,-2.2153270677380474,88.72487262575315,null,70,106.76151239105617,106.7615123910562,106.76151239105617,4.9737991503207013E-14,-9.672854175599138,-129.67285417559913,110.32714582440086,90,2.8027892360846529E-14,106.76151239105619,2.5220564679101211E-14,-61.016985758934986,-9.6728541755991184,-157.59016262850665]
[71,0.97651178677459316,0.97651178677459316,0.97651178677459305,2.3658870261862521E-17,225.51573718446153,225.51573718446153,225.51573718446153,-2.2585861080154075,-122.25858610801544,117.74141389198458,2.3658870261862521E-17,0.97651178677459316,1.0930905792536689E-17,168.17866897497348,-2.2585861080154084,87.550548668701055,null,71,97.863083886472296,97.86308388647231,97.863083886472282,4.832213032818602E-14,-9.6681904199118591,-129.66819041991184,110.33180958008813,126.0273733851036,2.5998082605411287E-14,97.863083886472282,2.2819995566669792E-14,-60.353677859593141,-9.6681904199118414,-156.40517943011801]
[72,0.97508857719518094,0.97508857719518094,0.97508857719518083,2.5118584182607177E-17,225.18706101094679,225.18706101094679,225.18706101094676,-2.2983674139652499,-122.29836741396528,117.70163258603473,2.5118584182607177E-17,0.97508857719518094,1.1247201702974687E-17,167.49791033542863,-2.2983674139652512,86.583081725649095,null,72,88.965112487216686,88.965112487216686,88.965112487216672,3.3516233813403329E-14,-9.6639502703485718,-129.66395027034855,110.33604972965141,147.99461679191651,2.3500119079020624E-14,88.965112487216672,2.026537197638126E-14,-61.600013679390649,-9.663950270348554,-157.69379494509269]
[73,0.97379522432242771,0.97379522432242771,0.97379522432242771,2.6435227601205915E-17,224.88837395925029,224.88837395925029,224.88837395925029,-2.3346382162435337,-122.33463821624356,117.66536178375644,2.6435227601205915E-17,0.97379522432242771,1.1526972539074776E-17,166.8850447676775,-2.3346382162435346,85.737008496576905,null,73,80.067542858194756,80.06754285819477,80.067542858194741,4.2780337774645346E-14,-9.6601288737513951,-129.66012887375138,110.3398711262486,131.63353933657018,2.0989437219195524E-14,80.067542858194756,1.8500709978713549E-14,-60.499275376499874,-9.6601288737513755,-155.43282867939837]
[74,0.97263159371799479,0.97263159371799479,0.97263159371799468,2.7617735921175572E-17,224.61964498216761,224.61964498216761,224.61964498216761,-2.3673685397511588,-122.36736853975118,117.63263146024883,2.7617735921175572E-17,0.97263159371799479,1.1790130470150785E-17,166.43420455294179,-2.3673685397511601,85.049942943410642,null,74,71.170323584021347,71.170323584021347,71.170323584021332,2.7114910356960115E-14,-9.6567218047026664,-129.65672180470264,110.34327819529733,121.6075022462489,1.8328533639508118E-14,71.170323584021347,1.7207897284372495E-14,-63.098907048458358,-9.6567218047026486,-155.22485943116831]
[75,0.97159756389370588,0.97159756389370588,0.97159756389370588,2.8642656325216659E-17,224.38084602320632,224.38084602320632,224.38084602320632,-2.3965312555241245,-122.39653125552415,117.60346874447586,2.8642656325216659E-17,0.97159756389370588,1.2036812168520419E-17,165.97748015020656,-2.3965312555241258,84.442206790833893,null,75,62.273406785893343,62.27340678589335,62.273406785893343,2.1390168887322673E-14,-9.6537250756775475,-129.65372507567753,110.34627492432246,131.63353933657018,1.5815199078024694E-14,62.273406785893343,1.46448475105392E-14,-65.772254682044846,-9.6537250756775297,-156.80140948635184]
[76,0.97069302646453626,0.97069302646453626,0.97069302646453615,2.9518870490058369E-17,224.17195205191703,224.17195205191703,224.171952051917,-2.4221021278839925,-122.42210212788402,117.577897872116,2.9518870490058369E-17,0.97069302646453626,1.2244822095869397E-17,165.52903470595717,-2.4221021278839938,83.917287628361407,null,76,53.376747735446891,53.376747735446898,53.376747735446898,1.5888218580782548E-14,-9.6511351462751804,-129.65113514627515,110.34886485372481,116.56505117707799,1.3179332565020452E-14,53.376747735446898,1.2721473704994015E-14,-65.772254682045315,-9.6511351462751609,-157.7965214679422]
[77,0.96991788628620634,0.96991788628620634,0.96991788628620634,3.0250356918937416E-17,223.99294109566964,223.99294109566964,223.99294109566964,-2.4440598567093508,-122.44405985670939,117.55594014329064,3.0250356918937416E-17,0.96991788628620634,1.2424654813839425E-17,165.17519262073799,-2.4440598567093517,83.461103823416096,null,77,44.480304466368501,44.480304466368501,44.480304466368509,7.1054273576010019E-15,-9.6489489313431847,-129.64894893134317,110.3510510686568,180,1.1520235781776322E-14,44.480304466368501,1.0803302950017064E-14,-66.644435140713128,-9.6489489313431651,-159.14554196042349]
[78,0.96927206157682255,0.96927206157682255,0.96927206157682255,3.0888214303602963E-17,223.84379426774484,223.84379426774484,223.84379426774484,-2.4623861147032531,-122.46238611470328,117.53761388529674,3.0888214303602963E-17,0.96927206157682255,1.2576006618104556E-17,164.86157304061231,-2.462386114703254,83.067596124661819,null,78,35.584037383740146,35.584037383740153,35.584037383740146,1.3322676295501878E-14,-9.6471638082004567,-129.64716380820045,110.35283619179953,90,9.6933640786769172E-15,35.584037383740146,8.6666757081996978E-15,-70.441748463002341,-9.647163808200439,-160.55996517182408]
[79,0.96875548402207368,0.96875548402207368,0.96875548402207357,3.1415381019074325E-17,223.72449579162819,223.72449579162819,223.72449579162816,-2.4770655795457661,-122.47706557954579,117.52293442045422,3.1415381019074325E-17,0.96875548402207368,1.2696134012322E-17,164.54315802322228,-2.4770655795457674,82.745208075620653,null,79,26.687908871534866,26.687908871534869,26.687908871534862,1.2080532582046505E-14,-9.6457776226458254,-129.6457776226458,110.35422237735418,107.10272896905236,7.4949690895234347E-15,26.687908871534866,6.4138805423946724E-15,-74.180806052499491,-9.6457776226458058,-167.00538320808354]
[80,0.96836809886355846,0.96836809886355835,0.96836809886355846,3.1814232122005583E-17,223.63503302140867,223.63503302140865,223.63503302140867,-2.4880859608359769,-122.488085960836,117.51191403916401,3.1814232122005583E-17,0.96836809886355846,1.2778892171481687E-17,164.25671790138921,-2.4880859608359782,82.467073104671002,null,80,17.791882898728684,17.791882898728687,17.791882898728684,8.8817841970012523E-15,-9.6447886939469054,-129.64478869394688,110.35521130605309,90,5.4230019593203084E-15,17.791882898728684,4.4322099942068464E-15,-77.195733934713559,-9.6447886939468823,-167.47119229085254]
[81,0.96810986496988238,0.96810986496988227,0.96810986496988238,3.2096986990313E-17,223.57539645819756,223.57539645819753,223.57539645819756,-2.4954380217430217,-122.49543802174306,117.50456197825697,3.2096986990313E-17,0.96810986496988238,1.2835908319428117E-17,164.02702381602867,-2.4954380217430225,82.274892887239091,null,81,8.8959246240825482,8.8959246240825518,8.8959246240825482,3.9968028886505635E-15,-9.6441958188525057,-129.64419581885249,110.35580418114749,90,2.5466780494840488E-15,8.89592462408255,1.7499224587323266E-15,-70.70995378081146,-9.6441958188524879,-164.05460409907718]
[82,0.96798075489023583,0.96798075489023583,0.96798075489023583,3.2235836143505736E-17,223.54557976250194,223.54557976250194,223.54557976250194,-2.4991155953013231,-122.49911559530135,117.50088440469867,3.2235836143505736E-17,0.96798075489023583,1.2859425653374277E-17,163.94793311603959,-2.4991155953013244,82.20561064030214,null,82,177.97362758071642,177.97362758071642,177.97362758071642,6.2045477010645481E-14,-9.7261279149980275,-129.72612791499802,110.27387208500195,156.37062226934319,4.4624155633457919E-14,177.9736275807164,4.37876644288617E-14,-62.054594749476848,-9.726127914998008,-158.08177970808021]
[83,0.99259256568460708,0.99259256568460708,0.99259256568460696,8.5759985440399839E-18,229.22943399745171,229.22943399745171,229.22943399745168,-1.818448565787985,-121.818448565788,118.181551434212,8.5759985440399839E-18,0.99259256568460708,7.7909044963983423E-18,-165.63140303098058,-1.8184485657879852,105.45906997518536,null,83,169.06895609633784,169.06895609633784,169.06895609633781,6.8981221939692714E-14,-9.7178533586143008,-129.71785335861429,110.28214664138569,145.49147701233159,4.2108224712936427E-14,169.06895609633784,4.1645157872434835E-14,-61.533105768118688,-9.7178533586142866,-158.3214108603857]
[84,0.99012417018716758,0.99012417018716758,0.99012417018716747,1.0560047336445282E-17,228.65938247548644,228.65938247548644,228.65938247548641,-1.8849124241799022,-121.88491242417993,118.11508757582008,1.0560047336445282E-17,0.99012417018716758,8.2301223129395564E-18,-173.87898543703167,-1.8849124241799027,101.83101254881407,null,84,160.16537031930829,160.16537031930829,160.16537031930827,7.5531728873092518E-14,-9.7100551091642711,-129.71005510916424,110.28994489083573,138.81407483429035,3.9480050193634867E-14,160.16537031930829,3.9458824161907194E-14,-61.250338033789724,-9.7100551091642551,-157.80971110387745]
[85,0.98778715020491659,0.98778715020491648,0.98778715020491648,1.2561281092753904E-17,228.11967082914478,228.11967082914475,228.11967082914475,-1.9482008945080407,-121.94820089450808,118.05179910549194,1.2561281092753904E-17,0.98778715020491659,8.6776046343160515E-18,-179.10364219158146,-1.9482008945080409,98.770828946519842,null,85,151.26277020275842,151.26277020275842,151.26277020275839,6.3552874323130192E-14,-9.7027253659652803,-129.70272536596525,110.29727463403472,116.56505117707799,3.7639262308009836E-14,151.26277020275842,3.7138578176503712E-14,-61.798371781304432,-9.7027253659652608,-158.74949449286657]
[86,0.98558127482637381,0.98558127482637381,0.9855812748263737,1.4532310372328982E-17,227.61024573170459,227.61024573170459,227.61024573170457,-2.0082634636850281,-122.00826346368505,117.99173653631496,1.4532310372328982E-17,0.98558127482637381,9.1126894530617305E-18,177.20592765553732,-2.0082634636850285,96.125616293217831,null,86,142.36106254543907,142.36106254543907,142.36106254543904,6.9980343666004102E-14,-9.6958566430936788,-129.69585664309366,110.30414335690632,113.96248897457818,3.5490254769854343E-14,142.36106254543904,3.4726651061935405E-14,-61.699244233992843,-9.695856643093661,-158.05130091647325]
[87,0.98350632439666597,0.98350632439666597,0.98350632439666585,1.6434220871052518E-17,227.13105645604583,227.13105645604583,227.1310564560458,-2.0650519312524254,-122.06505193125246,117.93494806874756,1.6434220871052518E-17,0.98350632439666597,9.5398501815998504E-18,174.55850383965773,-2.0650519312524258,93.906568981704879,null,87,133.46016064288605,133.46016064288605,133.46016064288605,4.5496934130773415E-14,-9.6894417862311073,-129.6894417862311,110.31055821376889,128.65980825409008,3.3514426565900609E-14,133.46016064288605,3.2320649774340113E-14,-61.045179463421107,-9.6894417862310895,-157.24902365721238]
[88,0.98156209076729639,0.98156209076729628,0.98156209076729628,1.8262308959274981E-17,226.68205493233219,226.68205493233216,226.68205493233216,-2.118520489514915,-122.11852048951494,117.88147951048508,1.8262308959274981E-17,0.98156209076729639,9.9535669682355603E-18,172.63441371141005,-2.1185204895149155,92.048631485493758,null,88,124.55998393289231,124.55998393289231,124.55998393289231,3.4990171833002051E-14,-9.6834739887482861,-129.68347398874826,110.31652601125171,113.96248897457818,3.0829545439879979E-14,124.55998393289231,3.0362874465030818E-14,-60.836922385097871,-9.6834739887482684,-156.68229161324484]
[89,0.97974837753680544,0.97974837753680544,0.97974837753680544,1.9960603320486636E-17,226.2631958035895,226.2631958035895,226.2631958035895,-2.1686258002446821,-122.16862580024471,117.8313741997553,1.9960603320486636E-17,0.97974837753680544,1.0353758606015945E-17,171.19492273612821,-2.1686258002446825,90.462130380460636,null,89,115.66045763599126,115.66045763599128,115.66045763599126,3.4990171833002051E-14,-9.6779468071310184,-129.67794680713101,110.32205319286898,113.96248897457818,2.8741096229042555E-14,115.66045763599128,2.7995663786885151E-14,-60.433424495221836,-9.6779468071310006,-156.73681449735724]
[90,0.97806500028139121,0.97806500028139121,0.97806500028139109,2.1556221638237468E-17,225.87443647896507,225.87443647896507,225.87443647896504,-2.2153270677380479,-122.21532706773809,117.78467293226194,2.1556221638237468E-17,0.97806500028139121,1.0729043392917426E-17,170.0878223109176,-2.2153270677380492,89.103202249024022,null,90,106.76151239105549,106.76151239105552,106.76151239105549,4.6185277824406512E-14,-9.6728541755999888,-129.67285417559998,110.32714582440001,90,2.7130986431472659E-14,106.7615123910555,2.5383835844768268E-14,-60.255118703056858,-9.6728541755999675,-155.37643521383649]
[91,0.97651178677459316,0.97651178677459316,0.97651178677459305,2.3069893649359559E-17,225.51573718446153,225.51573718446153,225.51573718446153,-2.2585861080154075,-122.25858610801544,117.74141389198458,2.3069893649359559E-17,0.97651178677459316,1.107922097936929E-17,169.19528884680042,-2.2585861080154084,87.994198901456244,null,91,97.863083886471287,97.863083886471287,97.863083886471259,4.832213032818602E-14,-9.6681904199132518,-129.66819041991323,110.33180958008676,126.0273733851036,2.5105758162213796E-14,97.863083886471287,2.3005337396299379E-14,-59.506641597523519,-9.668190419913234,-153.97040780848619]
[92,0.97508857719518094,0.97508857719518105,0.97508857719518094,2.4478680937829916E-17,225.18706101094679,225.18706101094682,225.18706101094679,-2.2983674139652477,-122.29836741396528,117.70163258603475,2.4478680937829916E-17,0.97508857719518094,1.1404355156954212E-17,168.51095951164783,-2.298367413965249,87.088281312721008,null,92,88.965112487219216,88.965112487219216,88.965112487219216,3.3516233813403329E-14,-9.6639502703447491,-129.66395027034474,110.33604972965524,147.99461679191651,2.2905918334556831E-14,88.965112487219216,2.0673246333339724E-14,-61.821409890040009,-9.6639502703447295,-156.71393508177655]
[93,0.97379522432242771,0.97379522432242771,0.9737952243224276,2.5756108108343331E-17,224.88837395925029,224.88837395925029,224.88837395925026,-2.3346382162435373,-122.33463821624356,117.66536178375644,2.5756108108343331E-17,0.97379522432242771,1.1691158171181387E-17,167.83654421647455,-2.3346382162435382,86.24886569174528,null,93,80.067542858193235,80.067542858193235,80.067542858193221,4.5496934130773415E-14,-9.6601288737539441,-129.66012887375393,110.33987112624604,128.65980825409008,2.070012894891786E-14,80.067542858193221,1.8938986056350785E-14,-61.947081294093245,-9.6601288737539281,-156.03751102542151]
[94,0.97263159371799479,0.97263159371799479,0.97263159371799468,2.691276468441304E-17,224.61964498216761,224.61964498216761,224.61964498216761,-2.3673685397511588,-122.36736853975118,117.63263146024883,2.691276468441304E-17,0.97263159371799479,1.1957751312502365E-17,167.27680370680608,-2.3673685397511601,85.530440987079899,null,94,71.170323584021347,71.170323584021347,71.170323584021332,2.7114910356960115E-14,-9.6567218047026664,-129.65672180470264,110.34327819529733,121.6075022462489,1.8064594370672897E-14,71.170323584021347,1.7645540346191357E-14,-64.79887635452431,-9.6567218047026486,-155.87901688055743]
[95,0.97159756389370588,0.97159756389370588,0.97159756389370577,2.79123544337065E-17,224.38084602320632,224.38084602320632,224.38084602320629,-2.3965312555241245,-122.39653125552415,117.60346874447586,2.79123544337065E-17,0.97159756389370588,1.2208126819039406E-17,166.72342480703159,-2.3965312555241258,84.892668178371309,null,95,62.273406785893343,62.27340678589335,62.273406785893336,2.1390168887322673E-14,-9.6537250756775475,-129.65372507567753,110.34627492432246,131.63353933657018,1.5578241796408186E-14,62.273406785893343,1.5087906396400829E-14,-67.788169313552814,-9.6537250756775297,-157.52056560289668]
[96,0.97069302646453626,0.97069302646453626,0.97069302646453615,2.8763839101558565E-17,224.17195205191703,224.17195205191703,224.171952051917,-2.4221021278839925,-122.42210212788402,117.577897872116,2.8763839101558565E-17,0.97069302646453626,1.2420075583220933E-17,166.18787212906119,-2.4221021278839938,84.339479260734009,null,96,53.376747735447069,53.376747735447076,53.376747735447069,2.0791723739534308E-14,-9.6511351462747506,-129.65113514627473,110.34886485372525,109.98310652189997,1.2944338730181355E-14,53.376747735447076,1.3167819595254336E-14,-68.1985905136479,-9.6511351462747292,-158.58703052512908]
[97,0.96991788628620634,0.96991788628620634,0.96991788628620634,2.9471635531232106E-17,223.99294109566964,223.99294109566964,223.99294109566964,-2.4440598567093512,-122.44405985670939,117.55594014329064,2.9471635531232106E-17,0.96991788628620634,1.2604049900617368E-17,165.75655857657469,-2.4440598567093521,83.856244800510026,null,97,44.480304466368338,44.480304466368338,44.480304466368338,7.1054273576010019E-15,-9.6489489313436945,-129.64894893134368,110.35105106865629,180,1.1295487771264575E-14,44.480304466368331,1.1253850591815114E-14,-69.443954780415979,-9.6489489313436767,-160.01689347809995]
[98,0.96927206157682255,0.96927206157682255,0.96927206157682255,3.008641176722571E-17,223.84379426774484,223.84379426774484,223.84379426774484,-2.4623861147032531,-122.46238611470328,117.53761388529674,3.008641176722571E-17,0.96927206157682255,1.2759719769572832E-17,165.37122306302075,-2.462386114703254,83.436708791206286,null,98,35.584037383740309,35.584037383740323,35.584037383740309,1.7763568394002505E-14,-9.6471638081998226,-129.64716380819979,110.35283619180018,90,9.5090699276519829E-15,35.584037383740309,9.1214129167317851E-15,-73.855661219716012,-9.647163808199803,-161.56505117707869]
[99,0.96875548402207368,0.96875548402207368,0.96875548402207357,3.0590844945539055E-17,223.72449579162819,223.72449579162819,223.72449579162816,-2.4770655795457666,-122.47706557954579,117.52293442045422,3.0590844945539055E-17,0.96875548402207368,1.2884336534294882E-17,164.98497740388723,-2.4770655795457674,83.088996407905299,null,99,26.687908871528013,26.687908871528023,26.687908871528016,1.2080532582046505E-14,-9.6457776226425462,-129.64577762264253,110.35422237735746,72.897271030947635,7.3539181963352028E-15,26.68790887152802,6.883158913749279E-15,-78.690067525979842,-9.6457776226425249,-167.90524292298736]
[100,0.96836809886355857,0.96836809886355846,0.96836809886355857,3.0967450719017241E-17,223.6350330214087,223.63503302140867,223.6350330214087,-2.488085960835976,-122.488085960836,117.51191403916401,3.0967450719017241E-17,0.96836809886355857,1.2971703197555018E-17,164.63489102755514,-2.4880859608359769,82.78651837000433,null,100,17.791882898735356,17.791882898735363,17.791882898735356,9.3258734068513149E-15,-9.6447886939531013,-129.64478869395307,110.3552113060469,90,5.4230019593201451E-15,17.791882898735359,4.4322099942066429E-15,-77.195733934715008,-9.64478869395308,-167.47119229085339]
[101,0.96810986496988238,0.96810986496988227,0.96810986496988238,3.1249364863215481E-17,223.57539645819756,223.57539645819753,223.57539645819756,-2.4954380217430217,-122.49543802174306,117.50456197825697,3.1249364863215481E-17,0.96810986496988238,1.3028478404118744E-17,164.39555299640762,-2.4954380217430225,82.59578545572451,null,101,8.8959246240828875,8.8959246240828893,8.8959246240828875,3.7747582837255322E-15,-9.644195818847404,-129.64419581884738,110.35580418115259,90,2.5466780494842429E-15,8.8959246240828893,1.7499224587324064E-15,-70.709953780809272,-9.6441958188473844,-164.05460409907542]
[102,0.96798075489023583,0.96798075489023583,0.96798075489023583,3.1387927039723815E-17,223.54557976250194,223.54557976250194,223.54557976250194,-2.499115595301324,-122.49911559530135,117.50088440469867,3.1387927039723815E-17,0.96798075489023583,1.3051908300511331E-17,164.31269755669405,-2.4991155953013253,82.526948057355526]

{"sheet":"Templates","index":3,"n_rows":36,"n_cols":9,"rows_kept":36,"cut":false,"hidden":true,"merged":[[35,2,35,3],[35,4,35,5],[35,6,35,7],[27,2,27,3],[27,4,27,5],[27,6,27,7],[34,2,34,3],[34,4,34,5],[34,6,34,7],[17,6,17,8],[11,1,11,2],[11,3,11,4],[11,5,11,6],[14,3,14,4],[17,1,17,4],[11,7,11,8],[14,5,14,6],[15,3,15,4],[15,5,15,6],[14,1,15,2],[5,1,6,2],[5,5,5,8],[6,5,6,6],[10,1,10,8],[7,1,7,2],[9,1,9,2],[8,1,8,2],[9,7,9,8],[6,7,6,8]]}
[]
[]
[]
[]
[]
[null,null,null,"Low voltage knots","Feeder length","Lines(Typ, Number parallel lines)"]
[null,null,null,20,500,"N(A)YY 4x150",null,1]
[null,"Charging power of EV",null,3.7,11,22,"Number households","Peak Power [kVA]","Concurrency"]
[null,"Number EV",null,3,2,1,10,30,{"$f":"Concurrency!$D$9+(1-Concurrency!$D$9)*POWER(G9,-3/4)","v":0.23126912483863926}]
[null,"Concurrency",null,{"$f":"IF(D9>Concurrency!$J$8+1,Concurrency!$H$8+(1-Concurrency!$H$8)/(D9-Concurrency!$J$8)^Concurrency!$I$8,1)","v":1},{"$f":"IF(E9>Concurrency!$J$12+1,Concurrency!$H$12+(1-Concurrency!$H$12)/(E9-Concurrency!$J$12)^Concurrency!$I$12,1)","v":1},{"$f":"IF(F9>Concurrency!$J$16+1,Concurrency!$H$16+(1-Concurrency!$H$16)/(F9-Concurrency!$J$16)^Concurrency!$I$16,1)","v":1},"Power per household",{"$f":"I9*H9","v":6.9380737451591781}]
[null,"Power"]
[null,"Households",null,"E-Mobility",null,"PV",null,"Additional"]
[null,"S ","cos(ϕ)","S ","cos(ϕ)","S","cos(ϕ)","S ","cos(ϕ)"]
[null,{"$f":"G9*H10","v":69.380737451591784},0.95,{"$f":"D9*D10*D8+E8*E9*E10+F8*F9*F10","v":55.1},1,0,0.95,0,0.95]
[null,null,null,"Max ΔU",null,"Current "]
[]
[]
[null,"Knoten",null,null,null,null,"Lines"]
[null,"Nr.","S","cos(ϕ)","Max ΔU","Unbalanced","Max Current","Length","Linetype"]
[null,null,null,null,null,{"$f":"IF(AND(C23=E23,D23=F23,G23=E23,H23=F23,C24=E24,D24=F24,G24=E24,H24=F24,C25=E25,D25=F25,G25=E25,H25=F25,C26=E26,D26=F26,G26=E26,H26=F26),\"No\",\"Yes\")","v":"Yes"},null,null,{"$f":"F7","v":"N(A)YY 4x150"}]
[]
[]
[]
[]
[]
[null,null,null,null,null,{"$f":"IF(AND(C29=E29,D29=F29,G29=E29,H29=F29,C30=E30,D30=F30,G30=E30,H30=F30,C31=E31,D31=F31,G31=E31,H31=F31,C32=E32,D32=F32,G32=E32,H32=F32),\"No\",\"Yes\")","v":"No"},null,null,"N(A)YY CU 4x300"]
[]
[null,null,"L1",null,"L2",null,"L3",null,"N"]
[null,null,"S","cos(ϕ)","S","cos(ϕ)","S","cos(ϕ)"]
[null,"Households"]
[null,"E-Mobility "]
[null,"PV "]
[null,"Additional"]
[null,"Sum"]
[null,"ΔU"]
[null,"I"]

{"sheet":"Concurrency","index":4,"n_rows":16,"n_cols":10,"rows_kept":16,"cut":false,"hidden":true,"merged":[]}
["Concurrency factors"]
[]
["Households",null,null,null,null,null,null,"Electric vehicle"]
["Source: Wolfgang Kaufmann, Planung öffentlicher Elektrizitätsverteilungs-Systeme, Tabelle 2.1",null,null,null,null,null,null,"Source: Johannes Rolink, Modellierung und Systemintegration von Elektrofahrzeugen aus Sicht der elektrischen Energieversorgung, Tabelle 4.1"]
[]
["EG","PeakPower","PeakPower/Appartment","gunlimited",null,null,null,"3,7 kW"]
[1,5,0.8,0.17499999999999999,null,null,null,"g_infinite","q","Delta nEV"]
[2,8,1.1000000000000001,0.13500000000000001,null,null,null,5.6000000000000001E-2,0.27929999999999999,2]
[3,30,1.9,6.5000000000000002E-2]
[4,16,11,0.7,null,null,null,"11 kW"]
[null,null,null,null,null,null,null,"g_infinite","q","Delta nEV"]
[null,null,null,null,null,null,null,5.8500000000000003E-2,0.49530000000000002,1]
[]
[null,null,null,null,null,null,null,"22 kW"]
[null,null,null,null,null,null,null,"g_infinite","q","Delta nEV"]
[null,null,null,null,null,null,null,3.2000000000000001E-2,0.58750000000000002,0]