{"text_format":"1","workbook":"xlsx","n_sheets":11,"sheets":["Instructions","Raw data","Initial analysis","Summary","Soil 1","Soil 2","Soil 3","Soil 4","Soil 5","Statistics","Additional instructions"],"not_rendered":{"charts":17,"images":6,"macros":1,"external_links":0,"defined_names":7,"comments":0,"pivot_tables":0},"unopened":[],"bounds":{"document_bytes":16777216,"sheet_cells":100000,"rows_first":2000,"rows_last":500,"rows_between":2000,"halvings":0,"cell_chars":16384,"cell_head_chars":4096},"cells_cut":0,"cells_raw":0,"read":"whole","date_system":"1900"}

{"sheet":"Instructions","index":0,"n_rows":0,"n_cols":0,"rows_kept":0,"cut":false,"hidden":false,"merged":[]}

{"sheet":"Raw data","index":1,"n_rows":121,"n_cols":27,"rows_kept":121,"cut":false,"hidden":false,"merged":[[17,1,18,1],[17,2,18,2],[17,11,18,11],[17,12,18,12]]}
[]
[null,"Soils",null,null,null,null,"Volume and mass",null,null,"Mass balance"]
[]
[]
[null,"Soil ","Soil name","Organic carbon (%)","pH                            (H2O, CaCl2,     or KCl)",null,"Volume of aqueous phase (mL)","Mass of soil                 (g)",null,"Soil","f (%)                                        (i.e. losses)"]
[null,null,null,null,null,"pH (H2O)"]
{"$rows_left_out":116}
{"sheet":"Initial analysis","index":2,"n_rows":82,"n_cols":29,"rows_kept":82,"cut":false,"hidden":false,"merged":[]}
[]
[null,"Initial analysis"]
[]
[]
[null,"Soil","Concentration of test solution (µg/mL)","Aqueous phase (µg/mL)","Soil                    (µg/g)","Kd                         (mL/g)","Koc                        (mL/g)",null,"Kd x soil/solution ratio","δ (delta, %)                          (decrease in concentration in aqueous phase, equivalent to % adsorbed)","KfE/Kf               (-)",null,null,"Aqueous phase (µg/mL)",null,"Koc                        (mL/g)","Kd x soil/solution ratio","δ (delta, %) ","KfE/Kf               (-)",null,"Koc                        (mL/g)","Kd x soil/solution ratio","δ (delta, %) ","KfE/Kf               (-)",null,"Koc                        (mL/g)","Kd x soil/solution ratio","δ (delta, %) ","KfE/Kf               (-)"]
[]
{"$rows_left_out":77}
{"sheet":"Summary","index":3,"n_rows":43,"n_cols":50,"rows_kept":43,"cut":false,"hidden":false,"merged":[]}
[]
[null,"Summary and assessment of pH correlation"]
[]
[]
[null,"Soil","Organic carbon (%)","pH","KF,ads","KFoc,ads","1/n","r2",null,null,null,null,null,null,null,null,null,null,null,null,null,null,null,null,null,null,null,null,null,null,null,null,null,null,null,null,null,null,null,null,null,null,null,null,null,null,"Organic carbon (%)","pH","KF,ads","KFOC,ads"]
[]
{"$rows_left_out":38}
{"sheet":"Soil 1","index":4,"n_rows":31,"n_cols":43,"rows_kept":31,"cut":false,"hidden":false,"merged":[]}
[]
[null,"Freundlich adsorption plots for:",null,null,{"$f":"IF('Raw data'!C7=\"\",\"\",'Raw data'!C7)","v":""}]
[]
[]
[null,"Concentration of test solution (µg/mL)","Aqueous phase (µg/mL)","Soil              (µg/g)","Log Caq","Log CS",null,"Log Cs       (fitted curve)","Residuals","RMS of residuals","Cs (fitted)",null,null,null,null,null,null,null,null,null,null,null,null,null,null,null,null,null,null,null,null,null,null,null,null,null,"Aqueous phase (µg/mL)","Soil              (µg/g)","Log Caq","Log CS",null,"Log Cs       (fitted curve)","Residuals"]
[]
{"$rows_left_out":26}
{"sheet":"Soil 2","index":5,"n_rows":31,"n_cols":43,"rows_kept":31,"cut":false,"hidden":false,"merged":[]}
[]
[null,"Freundlich adsorption plots for:",null,null,{"$f":"IF('Raw data'!C8=\"\",\"\",'Raw data'!C8)","v":""}]
[]
[]
[null,"Concentration of test solution (µg/mL)","Aqueous phase (µg/mL)","Soil              (µg/g)","Log Caq","Log CS",null,"Log Cs       (fitted curve)","Residuals","RMS of residuals","Cs (fitted)",null,null,null,null,null,null,null,null,null,null,null,null,null,null,null,null,null,null,null,null,null,null,null,null,null,"Aqueous phase (µg/mL)","Soil              (µg/g)","Log Caq","Log CS",null,"Log Cs       (fitted curve)","Residuals"]
[]
{"$rows_left_out":26}
{"sheet":"Soil 3","index":6,"n_rows":31,"n_cols":43,"rows_kept":31,"cut":false,"hidden":false,"merged":[]}
[]
[null,"Freundlich adsorption plots for:",null,null,{"$f":"IF('Raw data'!C9=\"\",\"\",'Raw data'!C9)","v":""}]
[]
[]
[null,"Concentration of test solution (µg/mL)","Aqueous phase (µg/mL)","Soil              (µg/g)","Log Caq","Log CS",null,"Log Cs       (fitted curve)","Residuals","RMS of residuals","Cs (fitted)",null,null,null,null,null,null,null,null,null,null,null,null,null,null,null,null,null,null,null,null,null,null,null,null,null,"Aqueous phase (µg/mL)","Soil              (µg/g)","Log Caq","Log CS",null,"Log Cs       (fitted curve)","Residuals"]
[]
{"$rows_left_out":26}
{"sheet":"Soil 4","index":7,"n_rows":31,"n_cols":43,"rows_kept":31,"cut":false,"hidden":false,"merged":[]}
[]
[null,"Freundlich adsorption plots for:",null,null,{"$f":"IF('Raw data'!C10=\"\",\"\",'Raw data'!C10)","v":""}]
[]
[]
[null,"Concentration of test solution (µg/mL)","Aqueous phase (µg/mL)","Soil              (µg/g)","Log Caq","Log CS",null,"Log Cs       (fitted curve)","Residuals","RMS of residuals","Cs (fitted)",null,null,null,null,null,null,null,null,null,null,null,null,null,null,null,null,null,null,null,null,null,null,null,null,null,"Aqueous phase (µg/mL)","Soil              (µg/g)","Log Caq","Log CS",null,"Log Cs       (fitted curve)","Residuals"]
[]
{"$rows_left_out":26}
{"sheet":"Soil 5","index":8,"n_rows":31,"n_cols":43,"rows_kept":31,"cut":false,"hidden":false,"merged":[]}
[]
[null,"Freundlich adsorption plots for:",null,null,{"$f":"IF('Raw data'!C11=\"\",\"\",'Raw data'!C11)","v":""}]
[]
[]
[null,"Concentration of test solution (µg/mL)","Aqueous phase (µg/mL)","Soil              (µg/g)","Log Caq","Log CS",null,"Log Cs       (fitted curve)","Residuals","RMS of residuals","Cs (fitted)",null,null,null,null,null,null,null,null,null,null,null,null,null,null,null,null,null,null,null,null,null,null,null,null,null,"Aqueous phase (µg/mL)","Soil              (µg/g)","Log Caq","Log CS",null,"Log Cs       (fitted curve)","Residuals"]
[]
{"$rows_left_out":26}
{"sheet":"Statistics","index":9,"n_rows":19,"n_cols":33,"rows_kept":19,"cut":false,"hidden":false,"merged":[]}
[]
[]
[null,{"$f":"'Raw data'!C21","v":""},null,{"$f":"'Raw data'!C22","v":""},null,{"$f":"'Raw data'!C23","v":""},null,{"$f":"'Raw data'!C24","v":""},null,{"$f":"'Raw data'!C25","v":""},null,null,{"$f":"'Raw data'!C21","v":""},null,{"$f":"'Raw data'!C22","v":""},null,{"$f":"'Raw data'!C23","v":""},null,{"$f":"'Raw data'!C24","v":""},null,{"$f":"'Raw data'!C25","v":""},null,null,{"$f":"'Raw data'!C21","v":""},null,{"$f":"'Raw data'!C22","v":""},null,{"$f":"'Raw data'!C23","v":""},null,{"$f":"'Raw data'!C24","v":""},null,{"$f":"'Raw data'!C25","v":""}]
[null,"Log Caq","Log CS","Log Caq","Log CS","Log Caq","Log CS","Log Caq","Log CS","Log Caq","Log CS",null,"Log Caq","Log CS","Log Caq","Log CS","Log Caq","Log CS","Log Caq","Log CS","Log Caq","Log CS",null,"Log Caq","Log CS","Log Caq","Log CS","Log Caq","Log CS","Log Caq","Log CS","Log Caq","Log CS"]
[null,{"$f":"IF('Soil 1'!E7=\"\",0,'Soil 1'!E7)","v":0},{"$f":"IF('Soil 1'!F7=\"\",0,'Soil 1'!F7)","v":0},{"$f":"IF('Soil 2'!E7=\"\",0,'Soil 2'!E7)","v":0},{"$f":"IF('Soil 2'!F7=\"\",0,'Soil 2'!F7)","v":0},{"$f":"IF('Soil 3'!E7=\"\",0,'Soil 3'!E7)","v":0},{"$f":"IF('Soil 3'!F7=\"\",0,'Soil 3'!F7)","v":0},{"$f":"IF('Soil 4'!E7=\"\",0,'Soil 4'!E7)","v":0},{"$f":"IF('Soil 4'!F7=\"\",0,'Soil 4'!F7)","v":0},{"$f":"IF('Soil 5'!E7=\"\",0,'Soil 5'!E7)","v":0},{"$f":"IF('Soil 5'!F7=\"\",0,'Soil 5'!F7)","v":0},null,{"$f":"IF('Soil 1'!E7=\"\",0,'Soil 1'!E7)","v":0},{"$f":"IF('Soil 1'!F7=\"\",0,'Soil 1'!F7)","v":0},{"$f":"IF('Soil 2'!E7=\"\",0,'Soil 2'!E7)","v":0},{"$f":"IF('Soil 2'!F7=\"\",0,'Soil 2'!F7)","v":0},{"$f":"IF('Soil 3'!E7=\"\",0,'Soil 3'!E7)","v":0},{"$f":"IF('Soil 3'!F7=\"\",0,'Soil 3'!F7)","v":0},{"$f":"IF('Soil 4'!E7=\"\",0,'Soil 4'!E7)","v":0},{"$f":"IF('Soil 4'!F7=\"\",0,'Soil 4'!F7)","v":0},{"$f":"IF('Soil 5'!E7=\"\",0,'Soil 5'!E7)","v":0},{"$f":"IF('Soil 5'!F7=\"\",0,'Soil 5'!F7)","v":0},null,{"$f":"IF('Soil 1'!E7=\"\",0,'Soil 1'!E7)","v":0},{"$f":"IF('Soil 1'!F7=\"\",0,'Soil 1'!F7)","v":0},{"$f":"IF('Soil 2'!E7=\"\",0,'Soil 2'!E7)","v":0},{"$f":"IF('Soil 2'!F7=\"\",0,'Soil 2'!F7)","v":0},{"$f":"IF('Soil 3'!E7=\"\",0,'Soil 3'!E7)","v":0},{"$f":"IF('Soil 3'!F7=\"\",0,'Soil 3'!F7)","v":0},{"$f":"IF('Soil 4'!E7=\"\",0,'Soil 4'!E7)","v":0},{"$f":"IF('Soil 4'!F7=\"\",0,'Soil 4'!F7)","v":0},{"$f":"IF('Soil 5'!E7=\"\",0,'Soil 5'!E7)","v":0},{"$f":"IF('Soil 5'!F7=\"\",0,'Soil 5'!F7)","v":0}]
[null,{"$f":"IF('Soil 1'!E8=\"\",0,'Soil 1'!E8)","v":0},{"$f":"IF('Soil 1'!F8=\"\",0,'Soil 1'!F8)","v":0},{"$f":"IF('Soil 2'!E8=\"\",0,'Soil 2'!E8)","v":0},{"$f":"IF('Soil 2'!F8=\"\",0,'Soil 2'!F8)","v":0},{"$f":"IF('Soil 3'!E8=\"\",0,'Soil 3'!E8)","v":0},{"$f":"IF('Soil 3'!F8=\"\",0,'Soil 3'!F8)","v":0},{"$f":"IF('Soil 4'!E8=\"\",0,'Soil 4'!E8)","v":0},{"$f":"IF('Soil 4'!F8=\"\",0,'Soil 4'!F8)","v":0},{"$f":"IF('Soil 5'!E8=\"\",0,'Soil 5'!E8)","v":0},{"$f":"IF('Soil 5'!F8=\"\",0,'Soil 5'!F8)","v":0},null,{"$f":"IF('Soil 1'!E8=\"\",0,'Soil 1'!E8)","v":0},{"$f":"IF('Soil 1'!F8=\"\",0,'Soil 1'!F8)","v":0},{"$f":"IF('Soil 2'!E8=\"\",0,'Soil 2'!E8)","v":0},{"$f":"IF('Soil 2'!F8=\"\",0,'Soil 2'!F8)","v":0},{"$f":"IF('Soil 3'!E8=\"\",0,'Soil 3'!E8)","v":0},{"$f":"IF('Soil 3'!F8=\"\",0,'Soil 3'!F8)","v":0},{"$f":"IF('Soil 4'!E8=\"\",0,'Soil 4'!E8)","v":0},{"$f":"IF('Soil 4'!F8=\"\",0,'Soil 4'!F8)","v":0},{"$f":"IF('Soil 5'!E8=\"\",0,'Soil 5'!E8)","v":0},{"$f":"IF('Soil 5'!F8=\"\",0,'Soil 5'!F8)","v":0},null,{"$f":"IF('Soil 1'!E8=\"\",0,'Soil 1'!E8)","v":0},{"$f":"IF('Soil 1'!F8=\"\",0,'Soil 1'!F8)","v":0},{"$f":"IF('Soil 2'!E8=\"\",0,'Soil 2'!E8)","v":0},{"$f":"IF('Soil 2'!F8=\"\",0,'Soil 2'!F8)","v":0},{"$f":"IF('Soil 3'!E8=\"\",0,'Soil 3'!E8)","v":0},{"$f":"IF('Soil 3'!F8=\"\",0,'Soil 3'!F8)","v":0},{"$f":"IF('Soil 4'!E8=\"\",0,'Soil 4'!E8)","v":0},{"$f":"IF('Soil 4'!F8=\"\",0,'Soil 4'!F8)","v":0},{"$f":"IF('Soil 5'!E8=\"\",0,'Soil 5'!E8)","v":0},{"$f":"IF('Soil 5'!F8=\"\",0,'Soil 5'!F8)","v":0}]
{"$rows_left_out":14}
{"sheet":"Additional instructions","index":10,"n_rows":59,"n_cols":2,"rows_kept":59,"cut":false,"hidden":false,"merged":[]}
[]
[]
[]
[null,"Instructions for performing statistical analysis outside of the automated tool"]
[]
[null,"If you need to perform statistical analysis to generate confidence intervals outside of the automated tool functions, first arrange data in adjacent columns of log "]
{"$rows_left_out":53}