音楽神殿 - 高橋 勇太

指揮者 阪 哲朗 公式ホームページ

下野竜也 - Wikipedia

大友直人 - Wikipedia

大町陽一郎 - Wikipedia

尾高忠明 - Wikipedia

山下一史 - Wikipedia

山田一雄 - Wikipedia

川本貢司 - Wikipedia

工藤俊幸 - Wikipedia

朝比奈隆 - Wikipedia

田部井剛 - Wikipedia

金聖響 - Wikipedia

飯守泰次郎 - Wikipedia

指揮者・栗田博文のダイアリー

神崎正英
type: Person
knows: 下野竜也
knows: 佐伯正則
knows: 川本貢司
knows: 新田ユリ
knows: 曽我大介
knows: 森口真司
knows: 橘直貴
knows: 金子建志
knows: 金山隆夫
knows: 金聖響
knows: 長田雅人
knows: 高橋勇太
knows: 齊藤栄一
name: Masahide Kanzaki
olb: A bass player, pure tone enthusiast, and a man of the semantic web
nearest airport: Haneda, Tokyo, Japan
account: masaka at identi.ca
account: M.Kanzaki at ORCiD
account: _masaka at twitter
account: masaka at Flickr
account: masaka at plurk
account: mkanzaki at Google+
based near: somewhere in Tokyo
current project: Promotion of accessible web design
current project: FoaF i18n and intorducing it to Japan
current project: Geo metadata and its applications
current project: Database on major symphonies and their perfomances
current project: Image Annotator: 画像部分の注釈と表示
family name: Kanzaki
gender: male
given name: Masahide
interest: RDFWeb: semantic web vapourware for the masses
interest: ロジャー・ノリントンの話
interest: W3C Universal Access
knows: Dan Brickley
  description: RDF Interest Group chair and FOAF project leader
  type: Person
knows: Libby Miller
  description: Charming driving force of RDF projects, e.g RDFical, FOAF etc.
  type: Person
knows: Yoichi Tsutsui
  description: Professor of Humanities, Kyoto Seika University
  type: Person
  name: 筒井洋一
knows: Takahira Yamaguchi
  description: Professor of School of Science and Technology, Keio University
  type: Person
  name: 山口高平
knows: Hideaki Takeda
  description: Professor of National Institute of Informatics
  type: Person
  name: 武田英明
knows: Ikki Ohmukai
  description: The project leader of Semblog
  type: Person
  name: 大向一輝
  nick: i2k
  weblog: http://d.hatena.ne.jp/i2k/
knows: Miki Ofuji
  description: Webmaster of ZSPC
  type: Person
  name: 大藤幹
knows: Chieko Ichimura
  description: bassist co-player
  type: Person
  name: 一村智恵子
knows: Yasumichi Kurotaki
  description: Cellist and close friend
  type: Person
  name: 黒滝泰道
  weblog: http://www.claviassist.com/blog/
knows: Yuji Taki
  description: A bassist friend
  type: Person
  name: 滝雄司
knows: Ichiro Nakagawa
  description: CU GSB alumni/class friend
  type: Person
  name: 中川一郎
knows: Seikyo Kim
  description: A promising conductor
  type: Person
  name: 金聖響
  weblog: 金 聖響 Official Blog 棒振り日記
knows: Martin Duerst
  description: W3C i18n Activity leader
  type: Person
knows: Kohei Kubota
  description: A junior to high school friend, Associate Professor of Biology, University of Tokyo
  type: Person
  name: 久保田耕平
made: Online version of ical2rdf
made: RDFical generator
made: The Web KANZAKI - Japan, music and computer
made: Some RDF/OWL vocabularies, including Music Description, Whois and Exif
made: Exif to RDF -- metadata extractor
made: Web based RSS Feed Reader
made: Tokyo Landscape with geo metadata
made: Linked Data Browser
made: Image Annotator: 画像部分の注釈と表示
mbox: mkanzaki@gmail.com
mbox sha1sum: c608c06ce564b0a00846eab72659d8f1375b880b
myers briggs: ENTJ
nick: masaka
openid: The Web KANZAKI
past project: Conducting and playing saxophone at a school concert band
past project: A day-dream online publishing project -- honya
past project: Japanese web ontology
past project: RDF Calendar
past project: Experiments with Hypercard
plan: preparing a new project with SKOS
publications: Universal HTML/XHTML
publications: E-Mail Expert Manual
publications: An Introduction to RDF/OWL
publications: Semantic HTML/XHTML
publications: A list of articles contributed to magazines
school homepage: Kyoto University, Faculty of Letters
school homepage: Columbia Business School
title: Mr
workplace homepage: Hosei University
workplace homepage: Keio University
workplace homepage: Tokyo Woman'ss Christian University

キューちゃん通信

Riverside Symphony - George Rothman

品川区民管弦楽団 - 大井先生のプロフィール

CDJournal.com - アーティスト - 時任康文

東京室内歌劇場 - 千葉 芳裕

指揮者協会・荒谷俊治

オーケストラ・ダスビダーニャ - 常任指揮者・長田雅人

水星交響楽団 常任指揮者 斉藤栄一

アンサンブル・エテルナ - 千葉芳裕

指揮者紹介（湘南弦楽合奏団）

手塚幸紀 - AMMHL

GeorgeRothman
type: Conductor
name: George Rothman @en

ゲルハルト・ボッセ
type: Conductor
name: Gerhard Bosse @en

三河正典
type: Conductor
name: Masanori Mikawa @en

下野竜也
type: Conductor
name: Tatsuya Shimono @en

佐伯正則
type: Conductor
name: Masanori Saeki @en

北原幸男
type: Conductor
name: Yukio Kitahara @en

千葉芳裕
type: Conductor
name: Yoshihiro Chiba @en

吉田行地
type: Conductor
name: Gyochi Yoshida @en

土田政昭
type: Conductor
name: Masaaki Tsuchida @en

堀俊輔
type: Conductor
name: Shunsuke Hori @en

外山雄三
type: Conductor
name: Yuzo Toyama @en

大井剛史
type: Conductor
name: Takeshi Ohi @en

大友直人
type: Conductor
name: Naoto Otomo @en

大町陽一郎
type: Conductor
name: Yoichiro Omachi @en

尾高忠明
type: Conductor
name: Tadaaki Otaka @en

山下一史
type: Conductor
name: Kazufumi Yamashita @en

山元富雄
type: Conductor
name: Tomio Yamamoto @en

山岡重信
type: Conductor
name: Shigenobu Yamaoka @en

山田一雄
type: Conductor
name: Kazuo Yamada @en

川合良一
type: Conductor
name: Ryoichi Kawai @en

川本貢司
type: Conductor
name: Koji Kawamoto @en

工藤俊幸
type: Conductor
name: Toshiyuki Kudo @en

手塚幸紀
type: Conductor
name: Yukinori Tezuka @en

新田ユリ
type: Conductor
name: Yuri Nitta @en

時任康文
type: Conductor
name: Yasuhumi Tokito @en

曽我大介
type: Conductor
name: Daisuke Soga @en

朝比奈隆
type: Conductor
name: Takashi Asahina @en

松岡究
type: Conductor
name: Hakaru Matsuoka @en

柳澤寿男
type: Conductor
name: Toshio Yanagisawa @en
weblog: 指揮者柳澤寿男のブログ

栗田博文
type: Conductor
name: Hirohumi Kurita @en

桑原鎮男
type: Conductor
name: Shizuo Kuwahara @en

森口真司
type: Conductor
name: Shinji Moriguchi @en

橘直貴
type: Conductor
name: Naotaka Tachibana @en

汐澤安彦
type: Conductor
name: Yasuhiko Shiozawa @en

田部井剛
type: Conductor
name: Tabei Ban @en

石丸寛
type: Conductor
name: Hiroshi Ishimaru @en

芥川也寸志
type: Conductor
name: Yasushi Akutagawa @en

荒谷俊治
type: Conductor
name: Shunji Aratani @en

金子建志
type: Conductor
name: Kenji Kaneko @en

金山隆夫
type: Conductor
name: Takao Kanayama @en

金洪才
type: Conductor
name: Kim Hong Je @en

金聖響
type: Conductor
mbox sha1sum: b623a2bdf31eabea9495b5ef9916d980b615d022
name: Seikyo Kim @en
weblog: 金 聖響 Official Blog 棒振り日記

長田雅人
type: Conductor
name: Masato Osada @en

長野力哉
type: Conductor
name: Rikikya Nagano @en

阪哲朗
type: Conductor
name: Tetsuro Ban @en

飯守泰次郎
type: Conductor
name: Taijiro Iimori @en

駒井みどり
type: Conductor
name: Midori Komai @en

高橋勇太
type: Conductor
name: Yuta Takahashi @en

齊藤栄一
type: Conductor
name: Eiichi Saito @en

Some Conductors
topic: 神崎正英

北原幸男ファンクラブ Arioso

川本貢司～オフィシャルサイト

指揮者紹介（名古屋シンフォニエッタ）

ゲルハルト・ボッセ プロフィール（新日本フィル）

オーケストラ・ディマンシュ - 指揮者控室

Shizuo "Z" Kuwahara

Daisuke SOGA's web-site

指揮者『金洪才』公式ホームページ

東邦音楽大学 - 佐伯正則

常葉学園短期大学 教授紹介

新田ユリ公式ホームページ

Tachibana Naotaka Official Page

東京楽友協会交響楽団 - 森口真司

ル・スコアール管弦楽団第33回演奏会
date: 2012-12-24T14:00+09:00
description: 指揮: 大井剛史; ドビュッシー: 交響詩「海」; マーラー: 大地の歌;
link: http://www.kanzaki.com/bass/upcoming.html#c20121224
Conductor: 大井剛史
type: item
type: Vevent
categories: MUSIC
dtend: 2012-12-24T07:00:00Z
dtstart: 2012-12-24T05:00:00Z
summary: ル・スコアール管弦楽団第33回演奏会

The Web KANZAKI - Upcoming concerts
date: 2012-12-17T10:02:47+09:00
description: 神崎正英がこれから出演する演奏会のRSS+FOAF+iCal and more
link: http://www.kanzaki.com/bass/upcoming.html
type: channel
type: Vcalendar
component: ル・スコアール管弦楽団第33回演奏会
method: PUBLISH
prodid: -//kanzaki.com//RDFCal 1.1//EN
version: 2.0
wr calname: これから出演する演奏会
primary topic: upcoming.html
language: ja
title: Experimental RDFical/FOAF/RSS of my upcoming concerts

Notation 3 (N3) Community Group https://www.w3.org/community ...
creator: KANZAKI Masahide
date: 2018-11-28T23:27:11+09:00
description: Notation 3 (N3) Community Group www.w3.org/community/n3-dev RDFに標準的な推論言語がないという論点については、N3があるじゃないかということで、その実装や標準化を進めるCG設立。cf.先のスレッドから分岐したN3スレッド lists.w3.org...semantic-web/2018Nov/0063...
type: item
maker: 神崎正英

Bibframe2Schema-org Community Group https://www.w3.org/commu ...
creator: KANZAKI Masahide
date: 2018-12-04T23:47:24+09:00
description: Bibframe2Schema-org Community Group www.w3.org/community/bibframe2schema その名の通り、BIBFRAME2.0からSOへのマッピング、BFデータをSOで補完するようなツール構築、さらにSOにBFタームの追加を目指すというCG設立
type: item
maker: 神崎正英

identi.ca as RSS1.0
item: HTTP/3 https://daniel.haxx.se/blog/2018/11/11/http-3/ HTTP-o ...
item: Scholarly Linked Open Data http://www.scholarlydata.org/ EVE ...
item: A new release of EVENTSKG (2018-11) ...

plurk as RSS1.0
item: またまた細かいことの連続だが、こういうのも大切
item: 少し手直しすればというのがそれほど単純ではなくて、まったく細かなことがた ...
item: ガーディアンからHow to Build a Museum in Out ...
item: まぁそれにしても、ようやく次の段階に進んだ感じだ、ありがたいことに
item: いろいろ外部的に残念だったりするが、挫けてはいけない
item: イベント明けは疲れが残っているのでほどほどにすればいいものを、時間を取り ...
item: 水道の水栓をリニューアルして、上下の働きが逆になったので、しばらく毎日何 ...
item: では一人打ち上げ。 さすがに連日八王子往復はこたえるが、なかなか充実した ...
item: 疲れたな。高速運転するとやはり神経休まらないのかな
item: 作曲家の個展II 2018金子仁美×斉木由美。金子作品は良くも悪くもはっ ...
item: まぁいろいろよく頑張ったと思う
item: むむ、大きな抜けがあった
item: たぶんよくやったとおもう
item: 手を加えたら思わぬエラーに見舞われているが、これは隠れていたバグが顕在化 ...
item: 千葉雅也『動きすぎてはいけない』。隙間時間に少しずつ読んだので2ヶ月ほど ...
item: うーむ、いろいろ一挙に大変になりそう。それはさておき、とりあえず、一つの ...
item: ノーノの「プロメテオ」を、ヒルシュ＋ライアン＋アンサンブル・ルシェルシュ ...
item: 面白いものになってきたが、まだちょっと告知は控えておこう。そしてさっさと ...
item: 寒さと眠さで調子を崩しかけたが、なんとか持ち直した
item: 結局いまごろ猛烈に眠くなる。そして寒いぞ
item: 脳が興奮状態なのか、寝付けないまま朝になってしまった…
item: 今日は久々のJSプログラマ。ほんの数ヶ月でいろいろ忘れそうになっている

twitter as RSS1.0
item: Bibframe2Schema-org Community Group https://www.w3.org/commu ...
item: Notation 3 (N3) Community Group https://www.w3.org/community ...

Planet masaka
creator: KANZAKI Masahide
date: 2018-12-12T01:00+09:00
description: The WebKANZAKIの周辺でなされた雑談集
items: identi.ca as RSS1.0
items: mastodon
items: plurk as RSS1.0
items: twitter as RSS1.0
link: http://www.kanzaki.com/info/planet
type: channel
maker: 神崎正英

手を加えたら思わぬエラーに見舞われているが、これは隠れていたバグが顕在化 ...
creator: KANZAKI Masahide
date: 2018-11-29T23:51:39+09:00
description: 手を加えたら思わぬエラーに見舞われているが、これは隠れていたバグが顕在化したものなので、手間がかかっても見通しよくする修正は重要
type: item
maker: 神崎正英

たぶんよくやったとおもう
creator: KANZAKI Masahide
date: 2018-11-30T02:16:38+09:00
description: たぶんよくやったとおもう
type: item
maker: 神崎正英

むむ、大きな抜けがあった
creator: KANZAKI Masahide
date: 2018-11-30T15:00:35+09:00
description: むむ、大きな抜けがあった
type: item
maker: 神崎正英

作曲家の個展II 2018金子仁美×斉木由美。金子作品は良くも悪くもはっ ...
creator: KANZAKI Masahide
date: 2018-11-30T22:08:31+09:00
description: 作曲家の個展II 2018金子仁美×斉木由美。金子作品は良くも悪くもはっきり分節されて、音としてはやや在り来りな感じ。斉木作品は音の扱いは遥かに多様で要素も絡み合っているが、前半の面白さに比べて途中からどう進みたいのか分かりにくくなり、新作はどうするのかと思っているうちに終わり。7つの言葉の第1だから、続きがあるということなのかいな
type: item
maker: 神崎正英

疲れたな。高速運転するとやはり神経休まらないのかな
creator: KANZAKI Masahide
date: 2018-12-01T23:43:06+09:00
description: 疲れたな。高速運転するとやはり神経休まらないのかな
type: item
maker: 神崎正英

では一人打ち上げ。 さすがに連日八王子往復はこたえるが、なかなか充実した ...
creator: KANZAKI Masahide
date: 2018-12-02T22:27:30+09:00
description: では一人打ち上げ。 さすがに連日八王子往復はこたえるが、なかなか充実した時間だった
type: item
maker: 神崎正英

水道の水栓をリニューアルして、上下の働きが逆になったので、しばらく毎日何 ...
creator: KANZAKI Masahide
date: 2018-12-03T23:41:18+09:00
description: 水道の水栓をリニューアルして、上下の働きが逆になったので、しばらく毎日何度も間違えそう
type: item
maker: 神崎正英

イベント明けは疲れが残っているのでほどほどにすればいいものを、時間を取り ...
creator: KANZAKI Masahide
date: 2018-12-04T01:22:20+09:00
description: イベント明けは疲れが残っているのでほどほどにすればいいものを、時間を取り戻そうと欲張って無理してしまいがち。この追加修正をしなければとっくに寝られていたものを…
type: item
maker: 神崎正英

いろいろ外部的に残念だったりするが、挫けてはいけない
creator: KANZAKI Masahide
date: 2018-12-04T23:15:26+09:00
description: いろいろ外部的に残念だったりするが、挫けてはいけない
type: item
maker: 神崎正英

まぁそれにしても、ようやく次の段階に進んだ感じだ、ありがたいことに
creator: KANZAKI Masahide
date: 2018-12-05T01:21:58+09:00
description: まぁそれにしても、ようやく次の段階に進んだ感じだ、ありがたいことに
type: item
maker: 神崎正英

ガーディアンからHow to Build a Museum in Out ...
creator: KANZAKI Masahide
date: 2018-12-05T21:44:11+09:00
description: ガーディアンからHow to Build a Museum in Outer Space 役目を終えると宇宙空間の漂積物となってしまう人工衛星などを、開発の歴史を語るものとして収集する宇宙博物館という構想。今はとても無理な話でも、そう遠くない将来に現実的なプロジェクトになるのかも
type: item
maker: 神崎正英

少し手直しすればというのがそれほど単純ではなくて、まったく細かなことがた ...
creator: KANZAKI Masahide
date: 2018-12-07T01:27:41+09:00
description: 少し手直しすればというのがそれほど単純ではなくて、まったく細かなことがたくさんある
type: item
maker: 神崎正英

またまた細かいことの連続だが、こういうのも大切
creator: KANZAKI Masahide
date: 2018-12-08T02:19:41+09:00
description: またまた細かいことの連続だが、こういうのも大切
type: item
maker: 神崎正英

今日は久々のJSプログラマ。ほんの数ヶ月でいろいろ忘れそうになっている
creator: KANZAKI Masahide
date: 2018-12-08T23:28:12+09:00
description: 今日は久々のJSプログラマ。ほんの数ヶ月でいろいろ忘れそうになっている
type: item
maker: 神崎正英

脳が興奮状態なのか、寝付けないまま朝になってしまった…
creator: KANZAKI Masahide
date: 2018-12-09T06:59:39+09:00
description: 脳が興奮状態なのか、寝付けないまま朝になってしまった…
type: item
maker: 神崎正英

結局いまごろ猛烈に眠くなる。そして寒いぞ
creator: KANZAKI Masahide
date: 2018-12-09T11:34:42+09:00
description: 結局いまごろ猛烈に眠くなる。そして寒いぞ
type: item
maker: 神崎正英

寒さと眠さで調子を崩しかけたが、なんとか持ち直した
creator: KANZAKI Masahide
date: 2018-12-09T23:55:32+09:00
description: 寒さと眠さで調子を崩しかけたが、なんとか持ち直した
type: item
maker: 神崎正英

面白いものになってきたが、まだちょっと告知は控えておこう。そしてさっさと ...
creator: KANZAKI Masahide
date: 2018-12-10T01:28:37+09:00
description: 面白いものになってきたが、まだちょっと告知は控えておこう。そしてさっさと寝なければ
type: item
maker: 神崎正英

ノーノの「プロメテオ」を、ヒルシュ＋ライアン＋アンサンブル・ルシェルシュ ...
creator: KANZAKI Masahide
date: 2018-12-10T21:03:18+09:00
description: ノーノの「プロメテオ」を、ヒルシュ＋ライアン＋アンサンブル・ルシェルシュ＋フライブルク・フィルほかの演奏で。4群に分かれたオーケストラ、独奏、合唱、独唱、語り＋電子音響を2人の指揮者で束ねるという壮大な作品。ほとんど何もない宇宙空間にどこからか音が湧いてくるような、別次元の世界という感じ。実演だともっといろいろあるんだろうな。col legno WWE2SACD20605 #nml
type: item
maker: 神崎正英

うーむ、いろいろ一挙に大変になりそう。それはさておき、とりあえず、一つの ...
creator: KANZAKI Masahide
date: 2018-12-11T02:47:19+09:00
description: うーむ、いろいろ一挙に大変になりそう。それはさておき、とりあえず、一つのアイデアは成功はしなかったが完全失敗でもないのでまた明日
type: item
maker: 神崎正英

千葉雅也『動きすぎてはいけない』。隙間時間に少しずつ読んだので2ヶ月ほど ...
creator: KANZAKI Masahide
date: 2018-12-11T15:10:00+09:00
description: 千葉雅也『動きすぎてはいけない』。隙間時間に少しずつ読んだので2ヶ月ほどもかかってしまったが、ヒューム的分離・連合とベルクソン的ホーリズムの両面やら、ニーチェからスピノザに至るあたり、割としっくり来た。ダニと動物への生成変化とか、無人島のロビンソン・クルーソーとか。どこだったか忘れたがメタデータ論として考えても面白いところもあった
type: item
maker: 神崎正英

まぁいろいろよく頑張ったと思う
creator: KANZAKI Masahide
date: 2018-12-12T00:53:14+09:00
description: まぁいろいろよく頑張ったと思う
type: item
maker: 神崎正英

HTTP/3 https://daniel.haxx.se/blog/2018/11/11/http-3/ HTTP-o ...
creator: KANZAKI Masahide
date: 2018-12-07T19:22:34+09:00
description: HTTP/3 daniel.haxx.se/blog/2018/11/11/http-3 HTTP-over-QUICと呼ばれていた規格を、転送プロトコルとしてのQUICとHTTPとの組み合わせとの混乱を避けるため、こう呼ぶことになったという話。mnotからの提案メール mailarchive.ietf.org/arch/msg/quic/RLRs4... （先月identicaがダウンしていたので今頃）
type: item
maker: 神崎正英

Scholarly Linked Open Data http://www.scholarlydata.org/ EVE ...
creator: KANZAKI Masahide
date: 2018-12-07T19:19:46+09:00
description: Scholarly Linked Open Data www.scholarlydata.org EVENTSKGで使われている会議オントロジーを辿ってみたらこういうプロジェクト、よく見たら以前のSemantic Web Dog Foodが発展したものらしい。エンドポイントあり www.scholarlydata.org/sparql
type: item
maker: 神崎正英

A new release of EVENTSKG (2018-11) ...
creator: KANZAKI Masahide
date: 2018-12-07T19:14:11+09:00
description: A new release of EVENTSKG (2018-11) dataset lists.w3.org...public-lod/2018Nov/0048.h... 73シリーズの国際会議／カンファレンスのイベントメタデータセット。3万トリプルほどのRDF。見つけにくいがSPARQLエンドポイントもある kddste.sda.tech/sparql
type: item
maker: 神崎正英

4K/8K放送が始まっても別に関係ないやと考えていたが、アーカイブという ...
creator: KANZAKI Masahide
date: 2018-12-04T10:54:17+09:00
description: 4K/8K放送が始まっても別に関係ないやと考えていたが、アーカイブという観点ではこれは大きな出来事だと今更ながら。現在のHD1080pの画素数2Mが8K4320pでは33Mになり、フルスペックだと非圧縮144.3Gbpsだというから、そのまま保存すれば1時間で65TBにもなる。アーカイブに必要なストレージが桁違いに膨れ上がるわけで、当然それに対応する機材も出てはくるだろうけれど、必要な場所をシークして探すというのもどんどん困難になり、ますます詳細なメタデータが重要になるというわけだ
type: item
maker: 神崎正英

確かにシンタックスハイライトを入れると広い利用者向けにはよさそう
creator: KANZAKI Masahide
date: 2018-12-09T02:10:36+09:00
description: 確かにシンタックスハイライトを入れると広い利用者向けにはよさそう
type: item
maker: 神崎正英

The Web KANZAKI - Japan, music and computer
creator: 神崎正英
date: 2018-01-26T03:24:15Z
language: ja
rights: disclaimer
description: このRSSデータは、The Web KANZAKIの最近の更新分15点です。
image: The Web KANZAKI
items:
  item: Image Annotator: 画像部分の注釈と表示
  item: Linked First Folio
  item: 映画のメタデータとリンクするデータ
  item: オルフ：「カルミナ・ブラーナ」の音楽
  item: ショスタコーヴィチ：交響曲第5番の音楽
  item: シベリウス：クレルヴォの歌詞と音楽
  item: IIIFマニフェストの賞味法
  item: IIIFマニフェストの調理法
  item: IIIF：活用したい機能、拡張の可能性
  item: ロジャー・ノリントンの話
  item: 連携するデータ：Linked Data Hub
  item: 映画を語るLinked Data
  item: メタデータからデータのウェブへ
  item: 文字情報基盤ブラウザ MJ Browser
  item: 日本十進分類とリンクするデータ
link: The Web KANZAKI
title: The Web KANZAKI - Updates
type: channel
maker: 神崎正英
title: The Web KANZAKI updates - RSS
title: The Web KANZAKI最新情報

ショスタコーヴィチ：交響曲第5番の音楽
date: 2015-05-30
description: ショスタコーヴィチの「交響曲第5番」を演奏する機会に、主題の調性、旋法的な構造やそれぞれの関係について調べたことをまとめたものです。「自伝層」の話題ではなく、楽譜を読み演奏しつつ考察し、文献で確認したことを整理しています。
type: item
maker: 神崎正英

オルフ：「カルミナ・ブラーナ」の音楽
date: 2016-01-17
description: オルフの「カルミナ・ブラーナ」を演奏した機会に、楽曲の構造について調べたことをまとめたものです。歌詞は、別途用意した原詩紹介ページ「カルミナ・ブラーナ」についてへの参照としています。オルフの曲だけでもとても面白いですが、原詩の構成と比べてみるとさらに興味深いです。
type: item
maker: 神崎正英

シベリウス：クレルヴォの歌詞と音楽
date: 2015-03-11
description: シベリウスの「クレルヴォ」を演奏する機会に、曲の構成や歌詞について調べたことをまとめたものです。フィンランド語のどの単語が曲のどこで歌われるのか、また各主題はどのように関連するのかなどを、文献を踏まえて考察しています。
type: item
maker: 神崎正英

ロジャー・ノリントンの話
date: 2017-04-29
description: 素晴らしい音楽を次々に生み出しているロジャー・ノリントンに関する情報ページ。最新の記事はです。
type: item
maker: 神崎正英
title: Sir Roger Norrington - A great conductor
alternative: ロジャー・ノリントンの研究 :-)

The Web KANZAKI
link: The Web KANZAKI
type: image

映画のメタデータとリンクするデータ
date: 2016-02-26
description: 東京国立近代美術館フィルムセンター「デジタル映画の保存と活用に関する講演会」でお話したスライドです。FRBR的なデータモデルのGLAM分野での適用と、映画のメタデータ標準でそれがどのように取り入れられており、具体的な作品情報にどんな応用可能性があるのかを検討・報告しました。
type: item
maker: 神崎正英

日本十進分類とリンクするデータ
date: 2016-07-04
description: NDCのLD化共同研究成果報告会でお話したスライドです。NDCの分類をRDFグラフとして表現するためのURIの設計、語彙選定、階層モデル構築、ラベル設計などについて検討した成果を報告しました。本来の意味と違う使われ方が散見されるLinked Dataについても改めて確認しています。
type: item
maker: 神崎正英

連携するデータ：Linked Data Hub
date: 2017-02-04
description: 2016年10月11日の知的財産戦略本部「メタデータのオープン化等検討WG」で発表したときの資料です。アーカイブはリンクするデータのハブとして機能することが重要という観点から、映画を題材に要件やモデルを検討します。議事録などが公開されたようなので、こちらも合わせて。
type: item
maker: 神崎正英

メタデータからデータのウェブへ
date: 2016-11-17
description: 慶應義塾メディアセンター研修会でお話したスライドです。利用者タスクの観点から見た目録の4つの機能を切り口に、広い領域で共有・利用可能な（メタ）データのあり方を検討します。
type: item
maker: 神崎正英

Image Annotator: 画像部分の注釈と表示
date: 2016-05-25
description: Displays image(s) and annotations described with Web Annotation JSON-LD, or images listed in a IIIF presentation API manifest JSON-LD. Annotations can be edited or added.Web Annotation JSON-LDの画像アノテーション、もしくはIIIFプレゼンテーションAPIによるマニフェストJSON-LDを読み込んで画像と注釈を表示します。画像の直接表示、また注釈の追加、編集も可能です。
type: item
maker: 神崎正英
title: Image Annotator w/ IIIF viewer
title: Image metadata and description
alternative: 画像のメタデータと注釈

文字情報基盤ブラウザ MJ Browser
date: 2016-08-31
description: Retrieves Kanji character information from Moji-Joho Kiban (MJ) SPARQL Endpoint, and displays the results in a readable format. MJ database provides RDF graph that describes relationship between Kanji characters in several standard sets.文字情報基盤SPARQLエンドポイントから文字情報と関連情報を取得し、LDブラウザの機能を用いて表示します。MJデータベースは、各文字のコードポイントにURIを付与し、行政漢字コードや各漢和辞典に記載される「文字」間の関係を記述しています。
type: item
maker: 神崎正英

映画を語るLinked Data
date: 2017-01-27
description: 東京国立近代美術館フィルムセンター「映画におけるデジタル保存と活用のためのシンポジウム」でお話したスライドです。映画を主語にして／目的語にして語る、それぞれをグラフで表現し、互いにつなぐための識別子の共有を考えます。実体種別の違いに加え、場面の識別もテーマです。
type: item
maker: 神崎正英

IIIF：活用したい機能、拡張の可能性
date: 2017-07-27
description: 第4回CODHセミナーでお話したときの資料です。短時間のコンパクトな発表ですが、IIIFでもっと活用されてよい機能や、表現APIv3でのA/V拡張などについて、具体例（へのリンク）とともに紹介しています。
type: item
maker: 神崎正英

IIIFマニフェストの調理法
date: 2017-10-18
description: IIIF Japanシンポジウムでお話したときの資料です。IIIF採用の熱気の中、かつてのHTMLのように見よう見まねで不正確なものが蔓延してしまう危惧も。押さえておきたい基本的な点について、カンバスを中心に簡単にまとめています。
type: item
maker: 神崎正英

IIIFマニフェストの賞味法
date: 2018-01-25
description: 慶応大学IIIFセミナーでお話したときの資料です。今回は時間がたっぷりあったので、IIIFの背景からIIIF CollectionとSearch APIの応用まで、実例を交えてご紹介しました。
type: item
maker: 神崎正英

Linked First Folio
date: 2016-05-08
description: An experimant to search TEI/XML at The Bodleian First Folio, and connect the result to the corresponding digital image. The associations between text page and digitized image are described with Web Annotation JSON-LD so that they are parts of Lined Data.ボドリアン図書館のファースト・フォリオ・プロジェクトが提供するTEI/XMLのデータを検索し、デジタル画像と当該ページのテキストを結びつけて表示する試みです。関連付けやリンクをWeb AnnotationのJSON-LDとして記述しています。
type: item
maker: 神崎正英

はてなキーワード：神崎正英
language: ja

Conducting and playing saxophone at a school concert band
language: ja
alternative: 吹奏楽

masaka at identi.ca
feed: identi.ca as RSS1.0
type: OnlineAccount
account name: masaka
account service homepage: http://identi.ca/

神崎正英 - Wikipedia
language: ja

M.Kanzaki at ORCiD
type: OnlineAccount
account: http://orcid.org/0000-0003-2953-7963/
account name: Masahide Kanzaki
account service homepage: http://orcid.org/

FOAF from Flickr contacts

RDFWeb: semantic web vapourware for the masses
alternative: RDFWeb - FOAFなどRDF応用の実験

_masaka at twitter
feed: twitter as RSS1.0
type: OnlineAccount
account name: _masaka
account service homepage: http://twitter.com/

A day-dream online publishing project -- honya
language: ja
alternative: honyaプロジェクト

masaka at Flickr
feed: Flickr as RSS1.0
owner of: masaka
type: OnlineAccount
account name: masaka
account service homepage: http://www.flickr.com/

Universal HTML/XHTML
language: ja
alternative: ユニバーサルHTML/XHTML

E-Mail Expert Manual
language: ja
alternative: プロフェッショナル電子メール

An Introduction to RDF/OWL
language: ja
alternative: セマンティック・ウェブのためのRDF/OWL入門

Semantic HTML/XHTML
language: ja
alternative: セマンティックHTML/XHTML

Promotion of accessible web design
language: ja
alternative: ハンディがあっても利用できるページづくり

FoaF i18n and intorducing it to Japan
language: ja
alternative: FOAFの紹介

Geo metadata and its applications
alternative: 位置メタデータとその応用

Japanese web ontology
language: ja
alternative: 日本語によるウェブ・オントロジーの試作

RDF Calendar
alternative: RDFカレンダー

Experiments with Hypercard
language: ja
alternative: ハイパーカードを使った工夫や実験

FOAF metadata of Masahide KANZAKI
description: This is a description of myself, Masahide Kanzaki, and my friends with FoaF and some other interesting vocabularies.
created: 2002-09-10
modified: 2014-06-17
type: PersonalProfileDocument
maker: 神崎正英
primary topic: 神崎正英

Database on major symphonies and their perfomances
language: ja
alternative: 交響曲についての情報整理

somewhere in Tokyo
type: Place
lat: 35.7
long: 139.7

Haneda, Tokyo, Japan
elevation: 35
iata code: HND
icao code: RJTT
latitude: 35.55
longitude: 139.78
name: Haneda, Tokyo International Airport, Japan
type: Airport

Tokyo Landscape with geo metadata
date: 2004-12-26T20:23:35+09:00
description: 位置データ付き画像のメタデータで地図連動型フォトアルバムを構成する実験
title: The Web KANZAKI - Tokyo Landscape
description: A collection of landscape photo in Tokyo. As a test of RSS photo album with geo metadata. 東京のいろいろな場所の景色を、位置データ付き画像のメタデータの実験として集めています。リンク先は、各写真と合わせてExifデータを解析表示するページです。GPS携帯デジカメの写真なので、質は問わないでください ;-)
link: http://www.kanzaki.com/docs/sw/image-rdf.html
title: Tokyo Landscape
type: channel
maker: 神崎正英
topic: Katsushika Symphony Hills
topic: Ikebukuro
topic: At Mita, Tokyo
topic: Kayabacho cross
topic: Kita Ikebukuro
topic: Akasaka hill
topic: Daimon Tokyo
topic: Kioicho Garden Tower
topic: Shimizudani-sakashita
topic: Year end Shibuya illumination
topic: Nerima-Kasuga-cho
topic: Nakano-sakaue
topic: Yotsuya station
topic: Yotsuya cross
topic: West end of Ohtemachi
topic: Hitotsubashi
topic: A view from Tamachi station platform
topic: West entrance of Osaki station
topic: A small shrine
topic: Tokyo tower view from Mita
topic: Buildings view from Tamachi
topic: Ichigaya cross
topic: Hosei Boissonade Tower
topic: Ushigome bridge
topic: An object at Igusamori park
topic: Iogi station
topic: A cross at Nerima
topic: Sukiyabashi cross
topic: Central cross at Ginza
topic: Ginza namiki-dori
topic: Subway Hongo-sanchome station
topic: Construction of a new building
topic: Jinbocho
topic: Suzuran dori
topic: Izakaya Yagura
topic: Hotels at Akasakamitsuke
topic: Skyscrapers in Shiodome
topic: Meguro Persimmon Hall
topic: Gaienmae at night
topic: Ikebukuro west
topic: Takadobashi cross
topic: Asakusabashi cross
topic: Hoku-topia at night
topic: Ginza 3-chome
topic: South Shinjuku Times Square
topic: Shibuya Hachiko gate squares
topic: Roppongi cross
topic: Entrance of Roppongi hills
topic: Waseda on Mejiro street
topic: Suidobashi Cross
topic: Juntendo-mae Cross
topic: Wall of Ushima-Seido
topic: Morishita Bunka Center
topic: A view from Ryogoku-bashi bridge
topic: Shinjuku-dori at Kojimachi
topic: Grand Hill Ichigaya
topic: On the road
topic: An avenue in Musashino-shi
topic: Mitaka City Arts Center
topic: In Chuo-rinkan
topic: Chidorigafuchi
topic: Viewing Kudan from Kitanomaru Park
topic: Cherry blossom at Tesugakudo
topic: Cherry blossom on Kandagawa-river
topic: Bakurocho cross
topic: Nihonbashi-Hamacho
topic: Mansebashi cross
topic: Edogawabashi cross
topic: Akabane-basi cross
topic: Cherry blossom and Tokyo Tower
topic: 芝公園から愛宕グリーンヒルズ方面を眺める

A list of articles contributed to magazines
language: ja
alternative: 雑誌などに発表した原稿（目録）

masaka at plurk
feed: plurk as RSS1.0
type: OnlineAccount
account name: masaka
account service homepage: http://www.plurk.com/

FOAF based on Twitter followers

W3C Universal Access
alternative: ユニバーサルアクセス

mkanzaki at Google+
type: OnlineAccount
account name: mkanzaki
account service homepage: https://plus.google.com/

mkanzaki@gmail.com
comment: use this mbox for mailing list or public discussion

Example
type: Class
comment: A class represents one example.
comment: ひとつの例を表すクラス

Code
type: AnnotationProperty
comment: Has an example code of an RDF/XML statements that use the schema. Content may be CDATA section or rdf:parseType="Literal".
comment: スキーマを使ったRDF/XMLのサンプルを記述する。CDATAセクションもしくはrdf:parseType="Literal"にすると、タグをそのまま記述できて便利。

Example
type: AnnotationProperty
comment: The subject has an Example. Use to include example(s) in a term definition.
comment: 主語となる語彙定義が例を持つ。

Example of
type: AnnotationProperty
comment: The subject is an example of the object vocabulary.
comment: 主語は目的語語彙の用例である。

Image
type: AnnotationProperty
comment: A pointer to an image that helps to understand the vocabulary.
comment: 語彙の理解を助ける画像へのポインタ。

Prefix
type: AnnotationProperty
comment: A prefix used in the example to represent the schema namespace. A rendaring application may use this value to distinguish target terms in the example.
comment: 例の中でスキーマを表すために用いている名前空間接頭辞。例をレンダリングする場合、この値を使ってスキーマの語彙を他の語彙と区別することができる。

Trial
type: AnnotationProperty
comment: A pointer to a real example or a trial page.
comment: 語彙が使われている実例、あるいはトライアルページへのポインタ。

created
type: AnnotationProperty
type: Property
sub property of: created

creator
type: AnnotationProperty
type: Property
sub property of: creator

deprecated by
type: AnnotationProperty
type: Property
sub property of: see other

description
type: AnnotationProperty
type: Property
sub property of: description

modified
type: AnnotationProperty
type: Property
sub property of: modified

relation
type: AnnotationProperty
type: Property
sub property of: relation

see other
type: AnnotationProperty
type: Property
sub property of: seeAlso

title
type: AnnotationProperty
type: Property
sub property of: title

dliser.rdf
type: Ontology
comment: An OWL DLiser. Declarations of Classes and Properties that would be used in some ontologies for documentation purpose. With owl:imports this file, the parent ontology will be valid OWL DL/Lite.
version info: Version 0.22, as of 2007-12-13 .

Example
Code: <owl:Ontology rdf:about=""> <owl:imports rdf:resource="http://www.kanzaki.com/ns/dliser.rdf"/> <rdfs:label>Music Vocabulary</rdfs:label> ... <ont:creator> <foaf:Person> <foaf:name>Masahide Kanzaki</foaf:name> <foaf:mbox rdf:resource="mailto:webmaster@kanzaki.com"/> <rdfs:seeAlso rdf:resource="http://www.kanzaki.com/info/webwho.rdf"/> </foaf:Person> </ont:creator> </owl:Ontology>
comment: Import this file to make an ontology OWL DL. Note that owl:Ontology can only have annotation properties. The ont: terms are defiend as substitutions for dc:/dcterms: properties.

GeoOnion
type: Document

Generation Event
type: Class
comment: An event on which a state of the picture/document was generated. Can have properties describing spatial and temporal attributes.
comment: 画像/文書が作成されたり編集されたりする状況（イベント）。場所、時間に関するプロパティを持つことができる。

Place
type: Class
comment: A place (or an area), described using a pair of geo:lat and geo:long, with varied granularity. This is a place with (some ambiguous) spatial extent, not a point.
comment: ある緯度、経度を用いて、ある粒度で表現される場所。点ではなく、（粒度に応じた）広がりある場所で、一定の曖昧さを含む。
subclass of: SpatialThing

Accuracy
type: DatatypeProperty
type: DeprecatedProperty
comment: Level of granularity to indicate the subject location. This corresponds to Flickr's accuracy value for a photo's geocode. This property is deprecated; use dpd:granularity instead. (accuracy is roughly 19 - GeoOnion's power. ie, if accuracy = 9, it seems almost go:within_3_power_10_metres. Thus, granularity is given by: round(5 - log(3^(19 - accuracy))) , which leads accuracy 9 = granularity 0, accuracy 16 = granularity 4, etc.)
domain: Place

Developed
type: ObjectProperty
comment: Describes an event when/where the photograph was developed.
comment: 写真の現像に関する状況（イベント）を記述する。
domain: Image
range: Generation Event

Digitized
type: ObjectProperty
comment: Describes an event when/where the image/document was digitized (e.g. scanned from the origial picture, or digitized with OCR). Has the same GenerationEvent as 'exposed' (and thus 'generated') if the picture was tekan with DSC.
comment: 画像/文書がデジタル化された状況（イベント）を記述する。デジカメの場合は撮影イベントと同じイベントを示す。
sub property of: generated

Edited
type: ObjectProperty
comment: Describes an event when/where the image/document file was edited, retouched, resized etc.
comment: 画像/文書が編集、レタッチされた状況（イベント）を記述する。
domain: Document
range: Generation Event

Exposed
type: ObjectProperty
comment: Describes an event when/where the photograph was taken.
comment: 写真が撮影された状況（イベント）を記述する。
sub property of: generated

generated
type: ObjectProperty
comment: Describes an event when/where the picture/document was generated. Super property of 'exposed' and 'digitized'.
comment: 画像/文書が作成された状況（イベント）を記述する。
domain: Document
range: Generation Event

Granularity
Example: Example
  Code: <dpd:Place> <geo:lat>35.571331</geo:lat> <geo:long>139.86557</geo:long> <dpd:granularity>2</dpd:granularity> </dpd:Place>
relation: GeoOnion
type: DatatypeProperty
comment: Level of granularity to indicate the subject location. This is expressed as number of digits after decimal point of the geo code (geo:lat/geo:long), but can also be used to indicate lower granularity against heigh precision values, such as GPS data, for privacy concern. If the levels of precision of geo:lat and geo:long are different, use the lower number. Roughly, granularity 2 corresponds to accuracy of 1km square, 4 corresponds to 10m square, etc.
comment: 位置の粒度を、緯度経度の精細度（小数点以下の桁数）で表す。また、GPSデータのような精細な値を、プライバシーなどの観点から、より低い粒度のものとして示すためにも用いることができる。緯度と経度の精細度が異なる場合は、低い方にあわせる。granularity 2 はおよそ1km四方レベル、granularity 4はおよそ10m四方レベルの粒度に相当する。
domain: Place

Location
type: ObjectProperty
comment: The subject thing is located at the object place.
comment: 主語が目的語の場所に位置していることを表す。

Near
Example: Example
  Code: <foaf:Image rdf:about="..."> <dpd:generated rdf:parseType="Resource"> <dc:date>2007-02-01T10:00:00+09:00</dc:date> <dpd:near rdf:parseType="Resource"> <geo:lat>35.571331</geo:lat> <geo:long>139.86557</geo:long> </dpd:near> </dpd:generated> </foaf:Image>
type: ObjectProperty
comment: The subject generation event occured at some location near the object place (e.g. for privacy).
comment: 生成イベントが目的語の場所の近くで起こったことを表す。プライバシーに配慮する場合などに用いる。
domain: Generation Event
range: Place

Pulished
type: ObjectProperty
comment: Describes an event when/where the image/document file was published (on the net).
comment: 画像/文書が（ネットワーク上に）公開された状況（イベント）を記述する。
domain: Document
range: Generation Event

Digital Picture/Document Description vocabulary
created: 2004-02-20
creator: 神崎正英
modified: 2008-11-22
type: Ontology
comment: An experimental vocabulary to describe a digital document (originally aimed at picture, such as DSC photograph and digitally scanned image), especially to distinguish the attributes of its original form (when generated), those of published digital file and those of what is depicted.
comment: デジタル文書を（もともとは画像を、特に撮影に関するデータ、被写体のデータ、デジタルファイルのデータなどをきちんと区別して）記述するための実験ボキャブラリ。
imports: dliser.rdf
version info: Version 0.5.2. OWL DL version, added dpd:granularity. Expanded target from pictuire to any digital document.

神崎正英
type: Person
mbox: webmaster@kanzaki.com
made: Tokyo Landscape with geo metadata

Example
Code: <foaf:Image> <dc:title>Viewing Mt. Fuji from a highway parking area</dc:title> <img:width>640</img:width> <img:height>480</img:height> ... <dpd:generated rdf:parseType='Resource'> <rdfs:label>Fujigawa service area, Tomei Highway</rdfs:label> <geo:lat>35.647488888889</geo:lat> <geo:long>139.73964166667</geo:long> <dc:date>2003-12-29T16:39:39+09:00</dc:date> </dpd:generated> <foaf:depicts> <wn:Mountain> <rdfs:label>Mt. Fuji</rdfs:label> <geo:lat>35.54139</geo:lat> <geo:long>138.99799</geo:long> </wn:Mountain> </foaf:depicts> </foaf:Image>
Example of: Digital Picture/Document Description vocabulary
Prefix: dpd:
comment: A picture, taken at a highway parking area, depicting a mountain.
comment: 高速道路のパーキングエリアから富士山を撮影した写真を記述する例。

Example
Code: <foaf:Image> <dc:title>Viewing Mt. Fuji from a highway parking area</dc:title> <dc:creator>Masahide Kanzaki</dc:creator> <img:width>128</img:width> <img:height>96</img:height> <dpd:generated rdf:parseType='Resource'> <rdfs:label>Fujigawa service area, Tomei Highway</rdfs:label> <geo:lat>35.647488888889</geo:lat> <geo:long>139.73964166667</geo:long> <dc:date>2003-12-29T16:39:39+09:00</dc:date> </dpd:generated> <dc:source> <foaf:Image> <exif:exposureTime>0.0388</exif:exposureTime> <exif:exposureMode>Auto exposure</exif:exposureMode> <exif:pixelXDimension>640</exif:pixelXDimension> <exif:pixelYDimension>480</exif:pixelYDimension> </foaf:Image> </dc:source> <dpd:edited rdf:parseType='Resource'> <dc:date>2004-01-06T21:48+09:00</dc:date> </dpd:edited> <foaf:depicts> <wn:Mountain> <rdfs:label>Mt. Fuji</rdfs:label> <geo:lat>35.54139</geo:lat> <geo:long>138.99799</geo:long> </wn:Mountain> </foaf:depicts> </foaf:Image>
Example of: Digital Picture/Document Description vocabulary
Prefix: dpd:
comment: If a picture was edited, the original information may be described with 'dc:source'. This photo was taken as 640x480 pixels image, and then resized to 128x96.
comment: 写真が編集されてオリジナルデータとは異なってくる場合、もとの情報はdc:sourceで記述できる。写真は640x480のサイズで撮影され、128x96にリサイズされている。

Example vocabulary
created: 2003-07-04
creator: 神崎正英
modified: 2007-12-13
type: Ontology
comment: Vocabulary to include sample codes in a schema. Can work with XSLT (http://purl.org/net/ns/ns-schema.xsl) to present schema as XHTML list with examples.
comment: スキーマにサンプルコードを埋め込むための語彙。XSLTを使って、XHTMLの中で例を表示させることができる。
imports: dliser.rdf
version info: Version 0.35

Example
Code: <ex:Example> <rdfs:comment>An example to use Dublin Core vocabulary.</rdfs:comment> <rdfs:comment xml:lang="ja">ダブリンコア語彙を使う例</rdfs:comment> <ex:pfx>dc:</ex:pfx> <ex:code rdf:parseType="Literal"> <rdf:Description rdf:about="http://www.kanzaki.com/"> <dc:title>The Web KANZAKI</dc:title> <dc:creator>Masahide Kanzaki</dc:creator> </rdf:Description> </ex:code> <ex:exampleOf rdf:resource=""/> </ex:Example>
Example of: Example vocabulary
Prefix: ex:
comment: An example included in a schema definition.
comment: スキーマに例を埋め込む例。

Alto
type: Class
comment: An Alto singer
subclass of: Singer
subclass of: Alto

Artist
type: Class
comment: A person or group (or any agent) who creates or performs art works
subclass of: Agent
narrower: Artist

Baritone
type: Class
comment: A Baritone singer
subclass of: Singer
subclass of: Baritone

Bass
type: Class
comment: A Bass singer
subclass of: Singer
subclass of: Bass-6

Bass_Clarinettist
type: Class
comment: A Bass Clarinet player
subclass of: Clarinettist
subclass of: Player
related: Bass Clarinet

Bassoonist
type: Class
comment: A Fagotto player
subclass of: Player
subclass of: Bassoonist

CelestaPlayer
type: Class
comment: A Celesta player
subclass of: Player
related: Celesta

Cellist
type: Class
comment: A Cello player
subclass of: Player
subclass of: Cellist

Chamber Music
type: Class
comment: A genre of music composed for performance by small ensemble
subclass of: Oeuvre
subclass of: Chamber Music

Choral Music
type: Class
comment: A genre of music composed for performance by a chorus or choir
subclass of: Oeuvre

Choreographer
type: Class
comment: someone who creates new dances, or directs an opera
subclass of: Director
subclass of: Choreographer

Chorus
type: Class
comment: A musical group of singers.
subclass of: Musical Group
subclass of: Chorus-2

Clarinettist
type: Class
comment: A Clarinet player
subclass of: Player
subclass of: Clarinettist

Composer
type: Class
comment: A person (or any agent) who composed art works
subclass of: Artist
narrower: Composer

Concert
type: Class
comment: An event of musical performance by players or singers not involving theatrical staging
subclass of: Musical Event
subclass of: Concert

Concerto
type: Class
comment: A composition for orchestra and a soloist
subclass of: Orchestral Work
subclass of: Concerto

Conductor
type: Class
comment: A Conductor
subclass of: Director
subclass of: Musician
subclass of: Conductor

Contrabassist
type: Class
comment: A Contrabass player
subclass of: Player
related: Contrabass

ContrafagottoPlayer
type: Class
comment: A Contrafagotto player
subclass of: Bassoonist
subclass of: Player
related: Contrafagotto

Director
type: Class
comment: An artist who directs a musical group
subclass of: Artist
subclass of: Class
  union of: Director-3
  union of: Director-4

English Horn player
type: Class
comment: An English Horn player
subclass of: Oboist
subclass of: Player
related: English Horn

Ensemble
type: Class
comment: A musical group which perfroms in relatively small size, particularly chamber music
subclass of: Musical Group
subclass of: Ensemble

Flutist
type: Class
comment: A Flute player
subclass of: Player
subclass of: Flutist

Full Score
type: Class
comment: A full score of the work, either pulished or manuscript.

Harpist
type: Class
comment: A Harp player
subclass of: Player
subclass of: Harpist

Hornist
type: Class
comment: A Horn player
subclass of: Player
subclass of: Hornist

Movement
type: Class
comment: A subsection of a musical work. Typically a movement of a symphony, but also a piece of suit, etc.
subclass of: Musical Unit
subclass of: Movement
subclass of: Musical Composition

Music Director
type: Class
comment: The person who leads a musical group
subclass of: Director
subclass of: Musician
subclass of: Music Director

Musical Group
type: Class
comment: A group that performs art works
subclass of: Artist
subclass of: Group

Musical Event
type: Class
comment: An event of musical performance by players or singers, including theatrical staging
subclass of: Event

Musical Unit
type: Class
comment: A unit of musical work e.g. a composition, its movement, phrase, theme etc.
narrower: Movement
narrower: Oeuvre

Musician
type: Class
comment: An artist who performs, composes or conducts music
subclass of: Artist
subclass of: Class
  union of: Musician
  union of: Musician-2
  related: Artist

Oboist
type: Class
comment: An Oboe player
subclass of: Player
subclass of: Oboist

Oeuvre
type: Class
comment: A musical work by a composer
subclass of: Musical Unit
subclass of: Musical Composition
subclass of: Oeuvre

Opera (Work)
type: Class
comment: A musical work with drama, song, chorus and orchestral music. Note 'Opera_Performance' in this vocabulary describes the performance of opera.
subclass of: Oeuvre
subclass of: Opera

Opera Performance
type: Class
comment: An event of opera performance (not an opera as a musical work, which is defined here as 'Opera')
subclass of: Musical Event
subclass of: Theatrical Performance
related: Opera

Orchestra
type: Class
comment: A musical group which perfroms large scale symphonic works
subclass of: Musical Group
subclass of: Orchestra

Orchestral Work
type: Class
comment: A composition for orchestra (and a soloist or soloists, optionally with chorus)
subclass of: Oeuvre

Overture
type: Class
comment: An orchestral music composed for the opening of an opera or oratorio, often played as an independend work in concerts
subclass of: Orchestral Work
subclass of: Overture

Percussionist
type: Class
comment: A Percussion player
subclass of: Player
subclass of: Percussionist

Pianist
type: Class
comment: A Piano player
subclass of: Player
subclass of: Pianist

Piccolo player
type: Class
comment: A Piccolo flute player
subclass of: Flutist
subclass of: Player
related: Piccolo

Player
type: Class
comment: An artist who performs a musical instrument
subclass of: Musician
subclass of: Player-2

Recital
type: Class
comment: An event of musical performance especially by soloists
subclass of: Musical Event
subclass of: Recital-2

Religious Music
type: Class
comment: A genre of music composed for performance as part of religious ceremonies
subclass of: Oeuvre
subclass of: Religious Music

Singer
type: Class
comment: An artist who sings a song
subclass of: Musician
subclass of: Singer

Sketch
type: Class
comment: A sketch of the work.

Soprano
type: Class
comment: A Soprano singer
subclass of: Singer
subclass of: Soprano

Qtring Quartet
type: Class
comment: A musical group of four string players. Note 'String_Quartette' is SQ as musical work in this vocabulary.
subclass of: Musical Group
subclass of: String Quartet

String Quartette
type: Class
comment: A music composed for instrumental quartet with 2 violins and a viola and a cello. Note 'StringQuartetEnsemble' is SQ ensemble in this vocabulary.
subclass of: Oeuvre
subclass of: Quartette-4
related: String Quartette

Suite
type: Class
comment: A musical composition of several movements only loosely connected
subclass of: Oeuvre
subclass of: Suite

Symphonic Poem
type: Class
comment: An orchestral composition based on a thematic subject
subclass of: Orchestral Work
subclass of: Symphonic Poem

Symphony
type: Class
comment: A large and complex work for symphony orchestra
subclass of: Orchestral Work
subclass of: Symphony

Tenor
type: Class
comment: A Tenor singer
subclass of: Singer
subclass of: Tenor

Text
type: Class
comment: Text of a musical work
subclass of: Oeuvre

Timpanist
type: Class
comment: A Timpani player
subclass of: Player
subclass of: Timpanist

Trombonist
type: Class
comment: A Trombone player
subclass of: Player
subclass of: Trombonist

Trumpeter
type: Class
comment: A Trumpet player
subclass of: Player
subclass of: Trumpeter

TubaPlayer
type: Class
comment: A Tuba player
subclass of: Player
related: Tuba

Venue
type: Class
comment: A venue for musical performance, e.g. concert hall, opera house, recital hall, etc.
subclass of: Venue
narrower: Concert Hall
narrower: Opera House

Violinist
type: Class
comment: A Violin player
subclass of: Player
subclass of: Violinist

Violist
type: Class
comment: A Viola player
subclass of: Player
subclass of: Violist

Composer
type: Property
comment: The subject musical work is composed by a person, a group, a software program etc.
domain: Oeuvre
range: Agent
sub property of: creator

Conductor
type: Property
comment: The subject musical event has a conductor. If the object agent does not have 'performs' property, the agent is assumed to conduct all programs of the subject musical event.
sub property of: Performer

Conductor Name
type: Property
comment: The subject musical event has a conductor. Literal version of #conductor.
sub property of: PerformerName

Form
type: Property
comment: The subject musical work or its movement has a form, such as sonata, minuet, etc
domain: Musical Unit
range: Literal

Key
type: Property
comment: The subject musical work or its movement has a key, such as C major, d minor, etc
domain: Musical Unit
range: Literal

Marks
type: Property
comment: The subject musical work or its movement has instruction mark(s) of tempo and/or expression
domain: Musical Unit
range: Literal

Meter
type: Property
comment: The subject musical work or its movement has a time measure such as 3/4, 4/4, 6/8 etc
domain: Musical Unit
range: Literal

Opus
type: Property
comment: The subject musical composition has an identifier assigned by a composer (e.g. 'op.131') or other editor (e.g. 'KV.551)
domain: Oeuvre
range: Literal
sub property of: identifier

Performer
type: Property
comment: The subject musical event has a performer (an artist, a group, a machine etc.). If the object agent does not have 'performs' property, the agent is assumed to perform all programs of the subject musical event.
domain: Musical Event
range: Agent

PerformerName
type: Property
comment: The subject musical event has a performer. Literal version of #performer.
domain: Musical Event
range: Literal

Performs
type: Property
comment: The subject artist (or group, machine, etc) performs a musical work.
domain: Agent
range: Musical Event
inverse of: Performer

Plays
type: Property
comment: The subject artist (or group, machine, etc) plays an musical instrument. If :me :plays wn:Violin, then :me a wn:Violininst.
domain: Agent
range: Musical Instrument

Premiere
Example:
  Code: <music:Symphony> <music:composer foaf:name="Shubert"/> <dc:title>Symohony No.7 'Unfinished'</dc:title> <music:opus>D.759</music:opus> <dcterm:created>1822-01</dcterm:created> <music:premiere rdf:parseType="Resource"> <dc:date>1865-12-17</dc:date> <ical:location>Wien Musikfereinsall</ical:location> </music:premiere> </music:Symphony>
type: Property
comment: The subject musical work was first performed at an concert
domain: Oeuvre
range: Musical Event

Program
type: Property
comment: The subject musical event presents a musical work as its program
domain: Musical Event
range: Oeuvre
sub property of: item

Program Line
type: Property
comment: The subject musical event presents a musical work as its program. Literal version of #program.
domain: Musical Event
range: Literal

Published
Example:
  Code: <music:Symphony> <music:composer foaf:name="Beethoven"/> <dc:title>Symphony No.9</dc:title> <music:opus>Op.125</music:opus> <music:published rdf:parseType="Resource"> <dc:date>1826-08</dc:date> <dc:description>The first published edition</dc:description> <dc:publisher>Schott</dc:publisher> </music:published> </music:Symphony>
type: Property
comment: The subject musical work is published as a score or sheet music (still not sure what kind of class is appropriate as the range)
domain: Oeuvre
range: Resource

Sections
type: Property
comment: The subject musical work has subsections such as movements
domain: Oeuvre
range: Seq

Soloist
type: Property
comment: The subject musical event has a soloist (an artist, a group, a machine etc.)
sub property of: Performer

Source
type: Property
comment: The subject musical work has a source, such as sketch, autograph score or published score.
domain: Oeuvre

Music Vocabulary
description: OLD RDF Schema version. A vocabulary to describe classical music and performances. Classes (categories) for musical work and performers, as well as related properties are defined. Make sure to distinguish musical works (e.g. Opera) from performance (Opera_Performance), or works (String_Quartette) from performer (StringQuartetEnsemble in this vocab), whose natural language terms are used interchangeblly. If desirable for interoperability, wordnet classes can be used instead of classes defined here for some categories (e.g. Vaiolinist), although not all classes are available in wordnet.
description: 音楽作品、演奏情報を記述するためのボキャブラリ。Opera_Performance（演奏）とOpera（作品）や、String_Quartette（作品）とStringQuartetEnsemble（団体）のように、日常語では両方の意味に使われるクラスの区別に注意。相互運用性のためにVaiolinistなどwordnetでも定義されているクラスはwordnetクラスを利用してもよいが、ここではContrabassistなどwordnetでは提供されないクラスも定義されている。
created: 2003-07-04
modified: 2006-06-17
type: Ontology
version info: Old version (0.6).
maker: 神崎正英

Example
description: A description of a symphony with its composition data and descriptions of movements.
description: 交響曲の楽曲情報と楽章データの記述例
Code: <music:Symphony> <music:composer rdf:parseType="Resource"> <foaf:name>シューベルト</foaf:name> <foaf:homepage rdf:resource="http://www.kanzaki.com/music/mw/sym/schubert"/> </music:composer> <dc:title>Symohony No.7 'Unfinished'</dc:title> <music:opus>D.759</music:opus> <music:key>b minor</music:key> <dcterm:created>1822-01</dcterm:created> <music:premiere rdf:parseType="Resource"> <dc:date>1865-12-17</dc:date> <ical:location>Wien Musikfereinsall</ical:location> </music:premiere> <music:sections> <rdf:Seq> <rdf:li rdf:parseType="Resource"> <music:mark>Allegro moderato</music:mark> <music:key>b minor</music:key> <music:meter>3/4</music:meter> </rdf:li> <rdf:li rdf:parseType="Resource"> <music:mark>Andante con moto</music:mark> <music:key>E flat major</music:key> <music:meter>3/8</music:meter> </rdf:li> </rdf:Seq> </music:sections> </music:Symphony>
Prefix: music:

Example
description: A description of a concert with its title, date, program and venue.
description: ある演奏会の名称、日時、プログラム、会場の記述例。
Code: <music:Concert> <dc:title>Tokyo Green Symphony Orchestra 12th Concert</dc:title> <dc:date>2003-11-02T14:00+09:00</dc:date> <music:conductor foaf:name="Yuri Nitta"/> <music:performer> <music:Violinist> <foaf:name>Tomoko Kawada</foaf:name> <music:performs rdf:nodeID="p1"/> </music:Violinist> </music:performer> <music:performer> <music:Orchestra foaf:name="Tokyo Green Symphony Orchestra"/> </music:performer> <music:program> <music:Concerto rdf:nodeID="p1"> <music:composer foaf:name="Bruch"/> <dc:title>Violin Concerto No.1 g minor</dc:title> <music:opus>op.26</music:opus> </music:Concerto> </music:program> <music:program> <music:Symphony> <music:composer foaf:name="Brahms"/> <dc:title>Symphony No.2 D major</dc:title> <music:opus>op.73</music:opus> </music:Symphony> </music:program> <ev:location> <music:Venue geo:lat="35.69" geo:long="139.81"> <dc:title>Sumida Triphony</dc:title> </music:Venue> </ev:location> </music:Concert>
Prefix: music:

Example
description: A simplified description of a concert with its title, date, program and venue. All property values are literal string here.
description: ある演奏会の名称、日時、プログラム、会場を、文字列だけで記述する例。
Code: <music:Concert> <dc:title>Tokyo Green Symphony Orchestra 12th Concert</dc:title> <dc:date>2003-11-02T14:00+09:00</dc:date> <music:conductorName>Yuri Nitta</music:conductorName> <music:performerName>Violin: Tomoko Kawada</music:performerName> <music:performerName>Orchestra: Tokyo Green Symphony Orchestra</music:performerName> <music:programLine>Bruch: Violin Concerto No.1 g minor</music:programLine> <music:programLine>Brahms: Symphony No.2 D major</music:programLine> <i:location>Sumida Triphony</i:location> </music:Concert>
Prefix: music:

A dur
alternative: A major
description: A major
type: Key
comment: Major key based on A, whose key signature has 3 sharps.

Alto
type: Class
comment: An Alto singer
subclass of: Singer

Artist
type: Class
comment: A person or group (or any agent) who creates or performs art works
subclass of: Agent

As dur
alternative: A-Flat major
description: A flat major
type: Key
comment: Major key based on A flat, whose key signature has 4 flats.

B dur
alternative: B-Flat major
description: B flat major
type: Key
comment: Major key based on B flat, whose key signature has 2 flats.

Ballet (Work)
type: Class
comment: A musical work for a dance form featuring a staged presentation of group or solo dancing. Note 'Ballet_Event' in this vocabulary describes the performance of a ballet.
subclass of: Oeuvre

Ballet Company
type: Class
comment: A musical group that performs ballet works.
subclass of: Musical Group

Ballet Event
type: Class
comment: An event of ballet performance
subclass of: Musical Event

Baritone
type: Class
comment: A Baritone singer
subclass of: Singer

Bass
type: Class
comment: A Bass singer
subclass of: Singer

Bass Clarinet
type: Class
comment: A larger member of the clarinet family, usually in key B-flat.
subclass of: Clarinet

Bass_Clarinettist
type: Class
comment: A Bass Clarinet player
subclass of: Clarinettist
subclass of: Restriction
  on property: Plays
  some values from: Bass Clarinet

Basset Horn
type: Class
comment: A larger member of the clarinet family, typically in lower F, and has darker and less brilliant timbre.
subclass of: Clarinet

Bassoon
type: Class
comment: A low-pitched woodwind instrument with a double reed, having a long wooden body attached to a U-shaped lateral tube that leads to the mouthpiece. A Fagotto.
subclass of: Woodwind Instrument

Bassoonist
type: Class
comment: A Fagotto player
subclass of: Player
subclass of: Restriction
  on property: Plays
  some values from: Bassoon

Brass Instrument
type: Class
comment: A wind musical instrument, that consists of a brass tube blown by means of a cup-shaped or funnel-shaped mouthpiece.
subclass of: Musical Instrument

C dur
alternative: C major
description: C major
type: Key
comment: Major key based on C, whose key signature has no sharp or flat.

Cantata
type: Class
comment: A vocal composition accompanied by instruments and generally containing more than one movement.
subclass of: Choral Music

Celesta
type: Class
comment: A musical instrument with a keyboard and metal plates struck by hammers that produce bell-like tones.
subclass of: Keyboard Instrument

CelestaPlayer
type: Class
comment: A Celesta player
subclass of: Player
subclass of: Restriction
  on property: Plays
  some values from: Celesta

Cellist
type: Class
comment: A Cello player
subclass of: Player
subclass of: Restriction
  on property: Plays
  some values from: Cello

Cello
type: Class
comment: A stringed instrument of the violin family, with bass to tenor tone. Usually played in sitting position.
subclass of: String Instrument

Ces dur
alternative: C-Flat major
description: C flat major
type: Key
comment: Major key based on C flat, whose key signature has 7 flats.

Chamber Music
type: Class
comment: A genre of music composed for performance by small ensemble
subclass of: Oeuvre

Choral Music
type: Class
comment: A genre of music composed for performance by a chorus or choir
subclass of: Oeuvre

Choreographer
type: Class
comment: someone who creates new dances, or directs an opera
subclass of: Director

Chorus
type: Class
comment: A musical group of singers.
subclass of: Musical Group

Cis dur
alternative: C-Sharp major
description: C sharp major
type: Key
comment: Major key based on C sharp, whose key signature has 7 sharps.

Clarinet
type: Class
comment: A woodwind instrument having a straight cylindrical tube with a flaring bell and a single-reed mouthpiece.
subclass of: Woodwind Instrument

Clarinettist
type: Class
comment: A Clarinet player
subclass of: Player
subclass of: Restriction
  on property: Plays
  some values from: Clarinet

Composer
type: Class
comment: A person (or any agent) who composed art works
subclass of: Artist

Concert
type: Class
comment: An event of musical performance by players or singers not involving theatrical staging
subclass of: Musical Event

Concerto
type: Class
comment: A composition for orchestra and a soloist
subclass of: Orchestral Work

Conductor
type: Class
comment: A Conductor
subclass of: Director
subclass of: Musician

Contrabass
type: Class
comment: The largest member of string insrtument, usually with four or five strings.
subclass of: String Instrument

Contrabassist
type: Class
comment: A Contrabass player
subclass of: Player
subclass of: Restriction
  on property: Plays
  some values from: Contrabass

Contrafagotto
type: Class
comment: A larger mebmer of the basoon family, producing the lowest tone in the woodwind section.
subclass of: Bassoon

ContrafagottoPlayer
type: Class
comment: A Contrafagotto player
subclass of: Bassoonist
subclass of: Restriction
  on property: Plays
  some values from: Contrafagotto

Countertenor
type: Class
comment: A Countertenor singer
subclass of: Singer

D dur
alternative: D major
description: D major
type: Key
comment: Major key based on D, whose key signature has 2 sharps.

Des dur
alternative: D-Flat major
description: D flat major
type: Key
comment: Major key based on D flat, whose key signature has 5 flats.

Director
type: Class
comment: An artist who directs a musical group
subclass of: Artist

E dur
alternative: E major
description: E major
type: Key
comment: Major key based on E, whose key signature has 4 sharps.

English Horn
type: Class
comment: A double-reed woodwind instrument, larger member of the oboe family.
subclass of: Oboe

English Horn player
type: Class
comment: An English Horn player
subclass of: Oboist
subclass of: Restriction
  on property: Plays
  some values from: English Horn

Ensemble
type: Class
comment: A musical group which perfroms in relatively small size, particularly chamber music
subclass of: Musical Group

Es dur
alternative: E-Flat major
description: E flat major
type: Key
comment: Major key based on E flat, whose key signature has 3 flats.

F dur
alternative: F major
description: F major
type: Key
comment: Major key based on F, whose key signature has 1 flat.

Fis dur
alternative: F-Sharp major
description: F sharp major
type: Key
comment: Major key based on F sharp, whose key signature has 6 sharps.

Flute
type: Class
comment: A high-pitched woodwind instrument; a slender tube closed at one end with finger holes on one end and an opening near the closed end across which the breath is blown
subclass of: Woodwind Instrument

Flutist
type: Class
comment: A Flute player
subclass of: Player
subclass of: Restriction
  on property: Plays
  some values from: Flute

G dur
alternative: G major
description: G major
type: Key
comment: Major key based on G, whose key signature has 1 sharp.

Ges dur
alternative: G-Flat major
description: G flat major
type: Key
comment: Major key based on G flat, whose key signature has 6 flats.

Guitar
type: Class
comment: A musical instrument having a large flat-backed sound box, a long fretted neck, and usually six strings, played by strumming or plucking.
subclass of: String Instrument

Guitarist
type: Class
comment: A Guitar player
subclass of: Player
subclass of: Restriction
  on property: Plays
  some values from: Guitar

H dur
alternative: B major
description: B major
type: Key
comment: Major key based on B, whose key signature has 5 sharps.

Harp
type: Class
comment: An instrument with usually 46 or 47 strings that are played by plucking with the fingers.
subclass of: String Instrument

Harpist
type: Class
comment: A Harp player
subclass of: Player
subclass of: Restriction
  on property: Plays
  some values from: Harp

Harpsichord
type: Class
comment: A keyboard instrument whose strings are plucked by means of quills or plectrums. Cembalo.
subclass of: Keyboard Instrument

Horn
type: Class
comment: A brass instrument with a long narrow tube that is coiled in a circle before ending in a flaring bell, usually being equipped with valves. A French Horn.
subclass of: Brass Instrument

Hornist
type: Class
comment: A Horn player
subclass of: Player
subclass of: Restriction
  on property: Plays
  some values from: Horn

Key
type: Class
comment: A key of a musical work (e.g. C-dur, b-moll)

Keyboard Instrument
type: Class
comment: A musical instrument that has a set of keys that consist of scale.
subclass of: Musical Instrument

Mandolin
type: Class
comment: A pear-shaped small stringed instrument descended from the lute, played with a pick.
subclass of: String Instrument

Mezzo Soprano
type: Class
comment: A Mezzo Soprano singer
subclass of: Singer

Movement
type: Class
comment: A subsection of a musical work. Typically a movement of a symphony, but also a piece of suit, etc.
subclass of: Musical Work

Music Director
type: Class
comment: The person who leads a musical group
subclass of: Director
subclass of: Musician

Musical Group
type: Class
comment: A group that performs art works
subclass of: Artist

Musical Event
type: Class
comment: An event of musical performance by players or singers, including theatrical staging. Typically the event has date and location. Note this is different from Performance, which is a 'representation' of a musical work realized at a musical event or recording, etc.

Musical Instrument
type: Class
comment: An instrument to play music

Musical Representation
type: Class
comment: Representation of a musical work, such as a score, sheet music, perfornamce, recoding, etc.

Musical Work
type: Class
comment: A musical work in any form, e.g. a composition, its movement, phrase, theme etc.

Musician
type: Class
comment: An artist who performs, composes or conducts music
subclass of: Artist

Oboe
type: Class
comment: A woodwind instrument with a conical bore and a double-reed mouthpiece.
subclass of: Woodwind Instrument

Oboist
type: Class
comment: An Oboe player
subclass of: Player
subclass of: Restriction
  on property: Plays
  some values from: Oboe

Oeuvre
type: Class
comment: A (complete) musical work by a composer.
subclass of: Musical Work

Opera (Work)
type: Class
comment: A musical work with drama, song, chorus and orchestral music. Note 'Opera_Event' in this vocabulary describes the performance of an opera.
subclass of: Oeuvre

Opera Company
type: Class
comment: A musical group that performs opera works.
subclass of: Musical Group

Opera Event
type: Class
comment: An event of opera performance (not an opera as a musical work, which is defined here as 'Opera')
subclass of: Musical Event

Oratorio
type: Class
comment: A large musical composition for orchestra, vocal soloists and chorus
subclass of: Choral Music

Orchestra
type: Class
comment: A musical group which perfroms large scale symphonic works
subclass of: Musical Group

Orchestral Work
type: Class
comment: A composition for orchestra (and a soloist or soloists, optionally with chorus)
subclass of: Oeuvre

Overture
type: Class
comment: An orchestral music composed for the opening of an opera or oratorio, often played as an independend work in concerts
subclass of: Orchestral Work

Part
type: Class
comment: A music for a particular instrument or voice taken from a full score (Note: in this ontology, Part is not a division of an orchestra).
subclass of: Written Representation

Percussion
type: Class
comment: A musical instrument that produces sound by striking the body.
subclass of: Musical Instrument

Percussionist
type: Class
comment: A Percussion player
subclass of: Player
subclass of: Restriction
  on property: Plays
  some values from: Percussion

Peroformance
type: Class
comment: Representation of a musical work in the form of performace, e.g. playing instruments, singing etc. Note a concert is a Musical_Event where a Performance is presented.
subclass of: Musical Representation

Pianist
type: Class
comment: A Piano player
subclass of: Player
subclass of: Restriction
  on property: Plays
  some values from: Pian

Pian
type: Class
comment: A musical instrument with a manual keyboard actuating hammers that strike wire strings. A pianoforte.
subclass of: Keyboard Instrument

Piccolo
type: Class
comment: A piccolo flute, smaller member of the flute family.
subclass of: Flute

Piccolo player
type: Class
comment: A Piccolo flute player
subclass of: Flutist
subclass of: Restriction
  on property: Plays
  some values from: Piccolo

Player
type: Class
comment: An artist who performs a musical instrument
subclass of: Musician

Recital
type: Class
comment: An event of musical performance especially by soloists
subclass of: Musical Event

Religious Music
type: Class
comment: A genre of music composed for performance as part of religious ceremonies
subclass of: Oeuvre

Saxophone
type: Class
comment: A woodwind instrument with a single-reed mouthpiece and a (usually curved) conical metal tube, including soprano, alto, tenor, and baritone sizes.
subclass of: Woodwind Instrument

Score
type: Class
comment: A full score or piano-vocal score of a work, either published or manuscript.
subclass of: Written Representation

Singer
type: Class
comment: An artist who sings a song
subclass of: Musician

Sketch
type: Class
comment: A sketch, or a brief prelimary composition of a work.
subclass of: Written Representation

Soprano
type: Class
comment: A Soprano singer
subclass of: Singer

Soprano Clarinet
type: Class
comment: A smaller member of the clarinet family, commonly in key E-flat.
subclass of: Clarinet

Qtring Quartet
type: Class
comment: A musical group of four string players. Note 'String_Quartette' is SQ as musical work in this vocabulary.
subclass of: Musical Group

String Instrument
type: Class
comment: A stringed musical instrument, in which sound is produced by plucking, striking, or bowing taut strings.
subclass of: Musical Instrument

String Quartet
type: Class
comment: A music composed for instrumental quartet with 2 violins and a viola and a cello. Note 'StringQuartetEnsemble' is SQ ensemble in this vocabulary.
subclass of: Chamber Music

Suite
type: Class
comment: A musical composition of several movements only loosely connected
subclass of: Oeuvre

Symphonic Poem
type: Class
comment: An orchestral composition based on a thematic subject
subclass of: Orchestral Work

Symphony
type: Class
comment: A large and complex work for symphony orchestra
subclass of: Orchestral Work

Tenor
type: Class
comment: A Tenor singer
subclass of: Singer

Text
type: Class
comment: Text of a musical work (e.g. lyric or verse)
subclass of: Oeuvre

Timpani
type: Class
comment: A set of large copper or brass hemispherical drums with a parchment head that can be tuned by adjusting the tension.
subclass of: Percussion

Timpanist
type: Class
comment: A Timpani player
subclass of: Player
subclass of: Restriction
  on property: Plays
  some values from: Timpani

Trombone
type: Class
comment: A brass instrument consisting of a long cylindrical tube, and having a movable U-shaped slide for producing different pitches.
subclass of: Brass Instrument

Trombonist
type: Class
comment: A Trombone player
subclass of: Player
subclass of: Restriction
  on property: Plays
  some values from: Trombone

Trumpet
type: Class
comment: A A soprano brass instrument consisting of a long metal tube looped once and ending in a flared bell, usually being equipped with valves or pistons.
subclass of: Brass Instrument

Trumpeter
type: Class
comment: A Trumpet player
subclass of: Player
subclass of: Restriction
  on property: Plays
  some values from: Trumpet

Tuba
type: Class
comment: A large, valved, brass instrument with a bass pitch.
subclass of: Brass Instrument

TubaPlayer
type: Class
comment: A Tuba player
subclass of: Player
subclass of: Restriction
  on property: Plays
  some values from: Tuba

Venue
type: Class
comment: A venue for musical performance, e.g. concert hall, opera house, recital hall, etc.

Viola
type: Class
comment: A stringed instrument of the violin family, slightly larger than a violin, tuned a fifth lower, and having a deeper, more sonorous tone.
subclass of: String Instrument

Violin
type: Class
comment: A musical instrument played with a bow, having four strings. Usually plays the highest part of the string section.
subclass of: String Instrument

Violinist
type: Class
comment: A Violn player
subclass of: Player
subclass of: Restriction
  on property: Plays
  some values from: Violin

Violist
type: Class
comment: A Viola player
subclass of: Player
subclass of: Restriction
  on property: Plays
  some values from: Viola

Woodwind Instrument
type: Class
comment: A wind musical instrument, in which sound is produced by the vibration of reeds in the mouthpiece, or by the passing of air across the mouthpiece.
subclass of: Musical Instrument

Written Representation
type: Class
comment: Representation of a musical work in the form of a written expression, e.g. score, parts, autograph, printed music, sketch, etc.
subclass of: Musical Representation

a moll
alternative: A minor
description: A minor
type: Key

ais moll
alternative: A-Sharp minor
description: A sharp minor
type: Key
comment: Minor key based on A sharp, whose key signature has 7 sharps.

Artist Description
type: ObjectProperty
comment: A description of the subject artist or agent. Super-property of #plays, #performs.
domain: Agent
range: Thing

as moll
alternative: A-Flat minor
description: A flat minor
type: Key
comment: Minor key based on A flat, whose key signature has 7 flats.

b moll
alternative: B-Flat minor
description: B flat minor
type: Key
comment: Minor key based on B flat, whose key signature has 5 flats.

c moll
alternative: C minor
description: C minor
type: Key
comment: Minor key based on C, whose key signature has 3 flats.

cis moll
alternative: C-Sharp minor
description: C sharp minor
type: Key
comment: Minor key based on C sharp, whose key signature has 4 sharps.

Composer
type: ObjectProperty
comment: The subject musical work is composed by a person, a group, a software program etc.
domain: Oeuvre
range: Agent
sub property of: creator
sub property of: Description

Composition
type: ObjectProperty
comment: Describes the composition process of the subject. Composition period or completion date, place, revision etc. can be described as properties of the object composition process.
sub property of: Description

Conductor
type: ObjectProperty
comment: The subject performance is coducted by the object (or the subject musical event has a conductor). See comment of #performer.
sub property of: Performer

Conductor Name
type: DatatypeProperty
comment: The subject musical event has a conductor. Literal version of #conductor.
sub property of: PerformerName

d moll
alternative: D minor
description: D minor
type: Key
comment: Minor key based on D, whose key signature has 1 flat.

Derived From
Example: Example
  Code: <dc:title>Autograph score</dc:title> <dc:title>A copyist's socore used as engraver's copy</dc:title> <m:derivedFrom rdf:resource="urn:musicalsource:lvb/125/autograph"/>
type: ObjectProperty
comment: The subject is (was) derived from the object, e.g a copy score is derived from the composer manuscript (or, possibly, a CD recording is derived from a performance at a concert).
domain: Musical Representation
range: Musical Representation
sub property of: source

Description
type: ObjectProperty
comment: A description of the subject musical work. Super-property of some properties in this vocabulary, as well as description of a general descriptive resource such as time-line of composing process.
domain: Musical Work
range: Thing

dis moll
alternative: D-Sharp minor
description: D sharp minor
type: Key
comment: Minor key based on D sharp, whose key signature has 6 sharps.

e moll
alternative: E minor
description: E minor
type: Key
comment: Minor key based on E, whose key signature has 1 sharp.

es moll
alternative: E-Flat minor
description: E flat minor
type: Key
comment: Minor key based on E flat, whose key signature has 6 flats.

Event Description
type: ObjectProperty
comment: A description of the subject musical event. Super-property of #program, #presents, #venue.
domain: Musical Event
range: Thing

f moll
alternative: F minor
description: F minor
type: Key
comment: Minor key based on F, whose key signature has 4 flats.

fis moll
alternative: F-Sharp minor
description: F sharp minor
type: Key
comment: Minor key based on F sharp, whose key signature has 3 sharps.

Form
type: DatatypeProperty
comment: The subject musical work or its movement has a form, such as sonata, minuet, etc. Would be better defined as ObjectProperty.
domain: Musical Work
range: Literal
sub property of: description

g moll
alternative: G minor
description: G minor
type: Key
comment: Minor key based on G, whose key signature has 2 flats.

gis moll
alternative: G-Sharp minor
description: G sharp minor
type: Key
comment: Minor key based on G sharp, whose key signature has 5 sharps.

h moll
alternative: B minor
description: B minor
type: Key
comment: Minor key based on B, whose key signature has 2 sharps.

Key
type: ObjectProperty
comment: The subject musical work or its movement has a key, such as C major, d minor, etc.
domain: Musical Work
range: Key
sub property of: Description

Key Name
type: DatatypeProperty
comment: The subject musical work or its movement has a key. Textual version of #key.
domain: Musical Work
range: Literal
sub property of: description

Marks
type: DatatypeProperty
comment: The subject musical work or its movement has instruction mark(s) of tempo and/or expression
domain: Musical Work
range: Literal
sub property of: description

Meter
type: DatatypeProperty
comment: The subject musical work or its movement has a time measure such as 3/4, 4/4, 6/8 etc
domain: Musical Work
range: Literal
sub property of: description

Opus
type: DatatypeProperty
comment: The subject musical composition has an identifier assigned by a composer (e.g. 'op.131') or other editor (e.g. 'KV.551')
domain: Oeuvre
range: Literal
sub property of: identifier

Performer
Example: Example
  Code: <m:conductor foaf:name="Sir Roger Norrington"/> <m:performer foaf:name="R.S.O. Stuttgart"/> <m:composer foaf:name="Brahms"/> <dc:title>Symphony No.2 D major</dc:title>
Example: Example
  Code: <m:conductor foaf:name="Sir Roger Norrington"/> <m:performer foaf:name="R.S.O. Stuttgart"/> <m:composer foaf:name="Brahms"/> <dc:title>Symphony No.2 D major</dc:title> <!-- An application may infer that: {X a m:Concert; m:performer Y; m:program Z.} => {X m:presents [a m:Performance; m:performer Y; m:represents Z] .} -->
type: ObjectProperty
comment: The subject has a performer (an artist, a group, a machine etc.). The preferred domain of this property is #Performance, so as to model that "a concert presents a performance (of a musical work) that is realized by this performer". However, in natural language, we often say that "a concert has performers who play these musical works", i.e. the domain of 'performer' is #Musical_Event in this case, and it would be more intuitive model. Hence, the domain is leave unrestricted here for a moment.
range: Agent

PerformerName
type: DatatypeProperty
comment: The subject musical event has a performer. Literal version of #performer.
domain: Musical Event
range: Literal
sub property of: description

Performs
type: ObjectProperty
comment: The subject artist (or group, machine, etc) performs a musical work.
domain: Agent
sub property of: Artist Description
inverse of: Performer

Plays
type: ObjectProperty
comment: The subject artist (or group, machine, etc) plays an musical instrument. If :me :plays :Violin, then :me a :Violininst.
range: Musical Instrument
sub property of: Artist Description

Premiere
Example: Example
  Code: <m:composer foaf:name="Shubert"/> <dc:title>Symohony No.7 'Unfinished'</dc:title> D.759 <dcterms:created>1822-01</dcterms:created> <dc:date>1865-12-17</dc:date> <cal:location>Wien Musikfereinsall</cal:location>
type: ObjectProperty
comment: The subject musical work was first performed at an concert
range: Musical Event
sub property of: Description

Presents
type: ObjectProperty
comment: The subject musical event presents a performance of a musical work. An experiment to have better model to describe musical work, its representation and an event to present the representation.
range: Peroformance
sub property of: Event Description

Program
type: ObjectProperty
comment: The subject musical event presents a musical work as its program
range: Oeuvre
sub property of: Event Description

Program Line
type: DatatypeProperty
comment: The subject musical event presents a musical work as its program. Literal version of #program.
domain: Musical Event
range: Literal
sub property of: description

published
Example: Example
  Code: <m:composer foaf:name="Beethoven"/> <dc:title>Symphony No.9</dc:title> Op.125 <dc:date>1826-08</dc:date> <dc:description>The first published edition</dc:description> <dc:publisher>Schott</dc:publisher>
type: ObjectProperty
comment: The subject musical work is published as a score or sheet music (still not sure what kind of class is appropriate as the range)
range: Written Representation
sub property of: Description

Represents
type: ObjectProperty
comment: The subject (performance, score, etc) is a representation of the object musical work. An experiment to have better model.
domain: Musical Representation
range: Musical Work

Sections
type: ObjectProperty
comment: The subject musical work has subsections such as movements. Current model recommends RDF Collection as the object.
domain: Oeuvre
range: Thing
sub property of: Description

Soloist
type: ObjectProperty
comment: The subject performance is performed by this soloist (or the subject musical event has a soloist. See comment of #performer.
sub property of: Performer

Source
type: ObjectProperty
comment: The subject musical work has a historical source, such as sketch, autograph score or published score.
range: Written Representation
sub property of: Description

Venue
type: ObjectProperty
comment: The subject musical event is presented at the object venue.
range: Venue
sub property of: Event Description

Music Vocabulary
created: 2003-07-04
creator: 神崎正英
modified: 2007-10-31
type: Ontology
comment: A vocabulary, or music ontology, to describe classical music and performances. Classes (categories) for musical works, events, instruments and performers, as well as related properties are defined. Make sure to distinguish musical works (e.g. Opera) from performance events (Opera_Event), or works (String_Quartette) from performer (StringQuartetEnsemble in this vocab), whose natural language terms are used interchangeblly. The present version experiments more precise model to describe a musical work, its representations (performances, scores, etc) and a musical event to present a representation (a concert). Includes 30 keys as individuals.
comment: 音楽作品、楽器、演奏情報を記述するためのボキャブラリ。Opera_Event（演奏）とOpera（作品）や、String_Quartette（作品）とStringQuartetEnsemble（団体）のように、日常語では両方の意味に使われるクラスの区別に注意。このバージョンでは、音楽作品、その表現（演奏、楽譜など）とイベント（演奏会）をより精密にモデリングするべく実験中。
imports: dliser.rdf
version info: Version 0.9.6 - OWL DL version. Some stable, some experimental. Changed terms: Opera_Performance to Opera_Event, Ballet_Performance to Ballet_Event.

'circles and arrows' graphical representation of this example
type: Image

'circles and arrows' graphical representation of this example
type: Image

Example
Code: <dc:date>2008-02-11</dc:date> <foaf:name>Masato Osada</foaf:name> <foaf:name>orchestra 'do svidanya'</foaf:name> <dc:title>Symphony No.11 g-minor</dc:title> op.103
Example of: Music Vocabulary
Prefix: m:
comment: A simple description of a concert.
comment: 演奏会の簡単な記述例。

Example
Code: <dc:title>Tokyo Green Symphony Orchestra 12th Concert</dc:title> <dc:date>2003-11-02T14:00+09:00</dc:date> <m:conductor foaf:name="Yuri Nitta"/> <foaf:name>Tomoko Kawada</foaf:name> <m:performs rdf:nodeID="p1"/> <m:Orchestra foaf:name="Tokyo Green Symphony Orchestra"/> <m:composer foaf:name="Bruch"/> <dc:title>Violin Concerto No.1 g minor</dc:title> op.26 <m:composer foaf:name="Brahms"/> <dc:title>Symphony No.2 D major</dc:title> op.73 <dc:title>Sumida Triphony</dc:title>
Example of: Music Vocabulary
Image: 'circles and arrows' graphical representation of this example
Prefix: m:
comment: Another description of a concert with its title, date, program and venue. See also examples in the definition of 'performer' for more erabolate model (the preferred domain of this property is m:Performance, not m:Concert).
comment: ある演奏会の名称、日時、プログラム、会場の記述例。より精密なモデルの案として、'performer'の定義セクションにある例も参照。

Example
Code: <dc:title>Tokyo Green Symphony Orchestra 12th Concert</dc:title> <dc:date>2003-11-02T14:00+09:00</dc:date> Yuri Nitta Violin: Tomoko Kawada Orchestra: Tokyo Green Symphony Orchestra Bruch: Violin Concerto No.1 g minor Brahms: Symphony No.2 D major <cal:location>Sumida Triphony</cal:location>
Example of: Music Vocabulary
Prefix: m:
comment: A simplified description of a concert with its title, date, program and venue. All property values are literal string here.
comment: ある演奏会の名称、日時、プログラム、会場を、文字列だけで記述する例。

Example
Code: <foaf:name>シューベルト</foaf:name> <foaf:homepage rdf:resource="http://www.kanzaki.com/music/mw/sym/schubert"/> <dc:title>Symohony No.7 'Unfinished'</dc:title> D.759 <m:key rdf:resource="http://www.kanzaki.com/ns/music#h-moll"/> <dcterms:created>1822-01</dcterms:created> <dc:date>1865-12-17</dc:date> <cal:location>Wien Musikfereinsall</cal:location> Allegro moderato <m:key rdf:resource="http://www.kanzaki.com/ns/music#h-moll"/> 3/4 Andante con moto <m:key rdf:resource="http://www.kanzaki.com/ns/music#Es-dur"/> 3/8
Example of: Music Vocabulary
Image: 'circles and arrows' graphical representation of this example
Prefix: m:
Trial: D.759
comment: A description of a symphony with its composition data and descriptions of movements. Note now key values are expressed as URIs.
comment: 交響曲の楽曲情報と楽章データの記述例。調性の記述をURIに変更。

Ontology annotation DLiser vocabulary
created: 2007-10-08
creator: 神崎正英
modified: 2007-11-07
comment: Vocabulary to define some annotation properties as subproperties of common terms. Because owl:Ontology resource cannot have properties other than annotation, these terms are defined as owl:AnnotationProperty type in dliser.rdf that is to be imported. However, some RDF application might want those properties to be related to well known terms such as Dublin Core. Hence this vocabulary redefines these properties as ordinary RDF/OWL terms and subProperty of others.
comment: オントロジーのアノテーションに用いるプロパティを、汎用プロパティと関連付けるための回避策としての語彙
version info: Version 0.12

Collection
type: Class
comment: [testing] A resource that represents a set of nodes, while being a node by itself, e.g. channel of RSS. Different from NodeGroup which is just a set, not a node.
comment: [testing] Nodeのグループでありつつ、それ自身もノードとみなされるもの。たとえばRSSのchannel。NodeGroupはノードにはならないことに注意。
subclass of: Node

Help
type: Class
comment: A resource that provides help information. An xhtml:help can be expressed with an instance of this class connected by 'relation' or 'part' property.
comment: ヘルプを提供するノードを表す。xhtml:helpはこのインスタンスを'relation' or 'part'で結びつけることで表現できる。
subclass of: Node

Node
type: Class
comment: A resource as a node in a site map. It can be a document, image, etc (or even part of a document if necessary. Different from foaf:Document in that this can represent a fragment of a document).
comment: サイトマップ中のノードとなるリソース。文書、画像など（あるいは必要なら文書の一部。文書フラグメントもリソースとして表現する点でfoaf:Documentとは異なる）。

Node Group
type: Class
comment: Represents a set of nodes grouped by a definition, expressed with POWDER outline methodology. It can be an entire site, or part of a large site (sub-site).
comment: グループ化されたノードリソースの集合。サイト全体、もしくはその一部を構成するグループ（サブサイト）を表現する。グループの定義はPOWDERを用いることを想定。グループは、プロパティentryNodeによって（ツリーの出発点となる）ノードに結び付けられる。
subclass of: ResourceSet

Site
type: Class
comment: A resource that represents an entire site, which is a special case of a node group.
comment: NodeGroupの中でも、特にサイト全体を表すもの。
subclass of: Node Group

Start
type: Class
comment: A resource that serves as the first node in a NodeGroup. An xhtml:start can be expressed with an instance of this class connected by 'relation' or 'part' property.
comment: NodeGroupの出発点となるノードを表す。xhtml:startはこのインスタンスを'related' or 'part'で結びつけることで表現できる。
subclass of: Node

channel
type: ObjectProperty
comment: The object node is RSS channel of the subject node, i.e. the subject is an item in the object feed. Help to avoid container model in RSS1.0 .
domain: Node
range: channel
sub property of: collection

child
type: ObjectProperty
comment: Subject node has the object node as a child in a sitemap tree.
comment: 主語ノードは目的語ノードをサイトマップ木の子供として持つ。
domain: Node
range: Node
sub property of: related

collection
type: ObjectProperty
comment: The subject Node is an item of the object Node. Note the subject can be a collection as well.
domain: Node
range: Collection
sub property of: related
inverse of: item

entry node
type: FunctionalProperty
type: ObjectProperty
comment: NodeGroupとそのメンバー中のノードを結びつける。通常、目的語ノードはツリーのルートもしくはグループの入り口で、サイトならばトップページとなる（POWDERの表現はグループとノードをRDFグラフ上では結び付けないので、このプロパティを用いてグラフをつなぐ）
comment: Relates a NodeGroup and a node of its members Typically, the node is the root of a tree or the entry point of the group, i.e. the cover page if the group represents a site (note POWDER can express members of a group, but it does not connect a group and its members in terms of RDF graph).
domain: Node Group
range: Node
sub property of: part

feed
type: ObjectProperty
comment: [testing] The object Collection is a feed of the subject node (site). Object feed can be external to the site.
range: Collection
term status: testing

item
type: ObjectProperty
comment: The object node is an item of the subject Collection. Note the object can be a collection as well.
domain: Collection
range: Node
sub property of: related

next
type: ObjectProperty
comment: Corresponds to xhtl:next. Refers to the next node in an linear sequence of nodes.
domain: Node
range: Node
sub property of: related

owner
type: ObjectProperty
comment: The object is the owner of the subject resourece. The owner is not necessarily the creator.
comment: 目的語は主語リソースの所有者であることを表す一般的プロパティ。所有者は作者であるとは限らない。
domain: Thing
range: Agent
sub property of: relation
term status: testing

part
type: ObjectProperty
comment: 目的語ノードが主語グループの一部であることを表す一般的プロパティ。
comment: represents general relationship that the object node is a part of the subject NodeGroup .
domain: Node Group
range: Node
sub property of: relation

prev
type: ObjectProperty
comment: Corresponds to xhtl:prev. Refers to the previous node in an ordered series of nodes.
domain: Node
range: Node
sub property of: related
inverse of: next

related
type: ObjectProperty
comment: ノード間につながりがあることを表す一般的プロパティ。
comment: represents genreral relationship between nodes.
domain: Node
range: Node
sub property of: relation

section
type: ObjectProperty
comment: Subject node has the object node as section (child in a sitemap tree). Note the subject is not a group (collection) of nodes (that is the definition of XHTML link type). Such group, which includes object node, should be represented as a 'NodeGroup', and related to the subject by 'entryNode'.
comment: 主語ノードは目的語ノードをセクション（サイトマップ木構造での子）として持つ。主語はノードグループではないことに注意（XHTMLリンク型ではcollection of documentsと定義）。目的語ノードを含むグループは'NodeGroup'として表現し、'entryNode'によって主語ノードの結びつけることができる。
domain: Node
range: Node
sub property of: child

subsection
type: ObjectProperty
comment: Subject node has the object node as subsection. Defined here just for compatibility. The semantics should be: section(a, b) ∧ section(b, c) => subsection(a, c) .
comment: 主語ノードは目的語ノードをサブセクションとして持つ（互換性のためのみに定義。意味的には、bがaのセクションで cがbのセクションなら cはaのサブセクション）。
domain: Node
range: Node
sub property of: child

work
type: ObjectProperty
comment: Object node is an individual work page (child in a sitemap tree) linked from the subject node. This is a leaf node in a sitemap.
comment: 目的語ノードは主語ノードからリンクされる個別作品ページ（サイトマップ木構造での子）である。サイトマップの終点ノードとなる。
domain: Node
range: Node
sub property of: child

RDF Sitemap Vocabulary
created: 2007-10-08
creator: 神崎正英
modified: 2018-07-14
relation: RDF sitemaps using HTML link types and Dublin Core
type: Ontology
comment: Experimental vocabulary to represent relationship between resources in a site. Some property terms correspond to some XHTL link types, but semantics of section/subsection are different form those link types. Also as a test to use POWDER expressions.
comment: サイト内のリソースの関係を表現するための実験語彙。プロパティはいちおうXHTMLのリンク型にも対応するが、section/subsectionの意味は微妙に異なる。POWDERによるリソースグループ表現の実験も兼ねる。
imports: dliser.rdf
version info: Version 0.60 - testing and unstable

RDF sitemaps using HTML link types and Dublin Core
type: Document

Example
Code: <rdf:Description rdf:about="http://www.kanzaki.com/"> <map:section> <rdf:Description rdf:about="http://www.kanzaki.com/music/"> <map:work rdf:resource="http://www.kanzaki.com/music/symphonies.html"/> </rdf:Description> </map:section> <map:section> <rdf:Description rdf:about="http://www.kanzaki.com/docs/sw"> <map:work rdf:resource="http://www.kanzaki.com/docs/sw/foaf.html"/> <map:work rdf:resource="http://www.kanzaki.com/test/exif2rdf"/> </rdf:Description> </map:section> </rdf:Description>
Example of: RDF Sitemap Vocabulary
Prefix: map:
comment: You can use this vocabulary to describe a simple site map. The map:section properties relate site top page and section top pages. The map:work properties relate them to leaf pages.
comment: 簡単なサイトマップの例。map:sectionはセクション間の関係、map:workはセクションと個別ページの関係を表現する。

Example
Code: <map:Site rdf:about="http://www.kanzaki.com"> <wdr:includeHosts>www.kanzaki.com</wdr:includeHosts> <map:entryNode rdf:resource="http://www.kanzaki.com/"/> </map:Site> <map:Node rdf:about="http://www.kanzaki.com/"> <map:section> <map:Node rdf:about="http://www.kanzaki.com/music/"> <rdfs:label>Cahier de la Musique</rdfs:label> <map:work> <map:Node rdf:about="http://www.kanzaki.com/music/symphonies.html"> <rdfs:label>Symphony database</rdfs:label> </map:Node> </map:work> </map:Node> </map:section> <map:section> <map:Node rdf:about="http://www.kanzaki.com/docs/sw"> <rdfs:label>Metadata and Semantic Web</rdfs:label> <map:work> <map:Node rdf:about="http://www.kanzaki.com/docs/sw/foaf.html"> <rdfs:label>Introduction to FOAF</rdfs:label> </map:Node> </map:work> <map:work> <map:Node rdf:about="http://www.kanzaki.com/test/exif2rdf"> <rdfs:label>Exif2RDF metadata extraction</rdfs:label> </map:Node> </map:work> </map:Node> </map:section> </map:Node>
Example of: RDF Sitemap Vocabulary
Prefix: map:
comment: An example of a bit more elaborated map of the same site as above example. The site is defined by POWDER property wdr:includeHosts as resources in a host www.kanzaki.com, and connected its top page by map:entryNode. Note URI http://www.kanzaki.com represents the site while http://www.kanzaki.com/ represents its cover page in this example. Both are the same in resource retrieval, but different URIs.
comment: 上と同じサイトの、やや詳しいマップ記述の例。サイトはPOWDERのwdr:includeHostsによってホストwww.kanzaki.com内のリソースとして定義され、map:entryNodeによってそのトップページに結び付けられる。サイト全体とトップページのURIの使い分けに注意。

Yotsuya station
has part: Square Kojimachi
  depicts:
    description: A buliding of wedding/bridal service complex
  points: 326,43 514,249
  type: Rectangle
has part: Shufu Kaikan
  depicts:
    description: The head office of the Shufurengoukai, women/housewives association
  points: 260,79 322,234
  type: Rectangle
has part: Yotsuya Atre
  points: 95,192 241,254
  description: A round roof of JR station mall
  type: Rectangle
has part: JR Lines Platform
  points: 371,347 505,445
  description: JR trains go under the bridge
  type: Rectangle
height: 480
width: 640
creator: Masahide Kanzaki
description: Yotsuya station is over moat of old Edo castle, thus has a bridge in front of it
type: Image
date: 2004-01-08T14:58:37+0900
description: 丸の内線の出口から外堀を越えてスクワール麹町方面をみる
link: http://www.kanzaki.com/test/exif2rdf?xsl=on&ul=/works/2004/imgdsc/040108_1458.jpg
type: item
maker: 神崎正英
topic:
  location: 東京・四谷
  lat: 35.68529
  long: 139.72946

Yotsuya cross
has part: Sophia University
  points: 333,143 451,253
  description: One of the tall buildings of the popular Sophia University
  type: Rectangle
has part: Shufu Kaikan
  points: 0,139 65,318
  description: The head office of the Shufurengoukai, women/housewives association
  type: Rectangle
has part: Tokyu Hotel
  points: 67,186 108,313
  type: Rectangle
has part: Orient Corp. Bldg?
  points: 202,166 272,237
  description: Not sure, maby this is the head office of Orient Corporation
  type: Rectangle
has part: Yotsuya Police Box
  points: 550,237 639,358
  type: Rectangle
has part: Shinjuku-dori Str.
  points: 34,304 147,361
  type: Rectangle
has part: Sotobori-dori Str.
  points: 346,379 635,460
  type: Rectangle
height: 480
width: 640
creator: Masahide Kanzaki
description: Looking over Sophia University from Yotsuya cross
type: Image

West end of Ohtemachi
has part: Tokyo Metropolitan Fire Department
  points: 113,19 265,334
  type: Rectangle
has part: Mitsui Bussan
  depicts:
    description: The head office of one of the largest trading companies in Japan
  points: 267,84 342,346
  type: Rectangle
has part: UFJ Bank
  depicts:
    description: The head office of one of the mega banks in Japan
  points: 344,141 413,347
  type: Rectangle
has part: Tokyo subway mark
  points: 45,122 127,193
  description: The symbol of Tokyo Metropolitan subway, which was designed after capital 'S' of 'subway'.
  type: Rectangle
has part: Takebashi st.
  points: 8,305 155,475
  description: The entrance/exit of subway Takebashi station
  type: Rectangle
has part: Resona Bank bldg.
  depicts:
    description: The Tokyo office of Resona Bank and head office of Maruha corp. reside in this building
  points: 420,155 536,349
  type: Rectangle
has part: Palace moat
  points: 489,354 639,391
  description: The north-east edge of the moat of the Imperial Palace looks here
  type: Rectangle
height: 480
width: 640
creator: Masahide Kanzaki
description: The west end of Ohtemachi buildings fece the moat of the Imperial Palace. A view from Takebashi subway exit.
type: Image

A view from Tamachi station platform
has part: World Trade Center
  depicts:
    description: One of the oldest skyscrapers in Japan, built in 1970. Located in front of Hamamatsucho station.
  points: 14,78 95,186
  type: Rectangle
has part: North bound lines
  points: 11,237 80,254
  description: Rails of north bound Yamanote-line and Keihin-tohoku-line.
  type: Rectangle
has part: Tokaido line
  depicts:
    description: Tokaido line goes from Tokyo to Kobe, and continues to Kyushu.
  points: 411,290 505,351
  description: Rails of long distance Tokaido line
  type: Rectangle
has part: DATC what ?
  points: 165,318 293,391
  description: Seems some sort of 'Automatic Train Control' box, but not sure...
  type: Rectangle
has part: Seavans
  depicts:
    description: Intelligent building complex, consists of two tall buildings and an atrium. Named after 'Sea' + 'Advance'.
  points: 178,112 241,195
  type: Rectangle
has part: Toshiba Bldg.
  depicts:
    description: The head office of Toshiba, one of the largest electronics companies in Japan.
  points: 135,124 168,197
  type: Rectangle
has part: Shinkansen train
  points: 267,220 431,271
  description: World famous rapid train runs along local lines here
  type: Rectangle
has part: Yamanote-line
  points: 79,293 128,348
  description: Rail of sounth bound (outer loop) Yamanote-line
  type: Rectangle
has part: Keihin-tohoku-line
  depicts:
    description: Keihin-tohoku-line runs from Omiya through Isogo
  points: 331,357 390,392
  description: Rail of sounth bound Keihin-tohoku-line. Yamanote-line and Keihin-tohoku-line run together in east side of Tokyo
  type: Rectangle
height: 480
width: 640
creator: Masahide Kanzaki
date: 2004-01-11T16:11+0900
description: A shot from the north edge of the platform. Many railways run parallel here.
type: Image
date: 2004-01-11T16:11:31+0900
description: 電車を乗り換える時に田町駅のプラットフォームの北端で新幹線などの通過の様子を見る
description: Shinkansen train comes across at the north edge of Tamachi station platform
link: http://www.kanzaki.com/test/exif2rdf?xsl=on&ul=/works/2004/imgdsc/040111_1611.jpg
title: From Tamachi station looking north
type: item
maker: 神崎正英
topic:
  location: 東京・田町
  lat: 35.64576
  long: 139.74877

Buildings view from Tamachi
has part: NEC buliding
  depicts:
    description: The head office of one of the largest electronics companies in Japan
  points: 13,15 153,187
  type: Rectangle
has part: Mita NN buliding
  points: 291,177 383,248
  type: Rectangle
has part: Toshiba buliding
  depicts:
    description: The head office of another Japanese electronics giant.
  points: 542,268 582,322
  type: Rectangle
height: 480
width: 640
creator: Masahide Kanzaki
description: Several tall buildings can be seen from the promnade to Tamachi station
type: Image
date: 2004-01-13T15:00:28+0900
description: 田町駅前からは結構いろんなビルが目に入る
link: http://www.kanzaki.com/test/exif2rdf?xsl=on&ul=/works/2004/imgdsc/040113_1500.jpg
type: item
maker: 神崎正英
topic:
  location: 東京・田町
  lat: 35.64662
  long: 139.74674

芝公園から愛宕グリーンヒルズ方面を眺める
has part: MORIタワー
has part: フォレストタワー
has part: 芝公園
has part: 明照会館
has part: 芝公園の桜
height: 480
width: 640
creator: Masahide Kanzaki
date: 2004-03-29
description: 芝公園付近には意外に高層建築が。愛宕グリーンヒルズは2001年につくられた、オフィス棟と住宅棟からなるツインタワーで、ULI（Urban Land Institute）の2003年度Awards for Excellenceを受賞している。
type: Image
date: 2004-03-29T14:46:28+0900
description: 芝公園付近から愛宕グリーンヒルズを望む。手前が事務所棟のMORIタワー、その向こうが住宅棟のフォレストタワー。
link: http://www.kanzaki.com/test/exif2rdf?xsl=on&ul=/works/2004/imgdsc/040329_1446.jpg
title: Shiba Park looking over Atago Green Hills
type: item
maker: 神崎正英
topic:
  location: 東京・芝公園
  lat: 35.65666
  long: 139.74614

MORIタワー
depicts: Building
  description: 愛宕グリーンヒルズの事務所棟。地上42階建、延床面積86,640.81平方メートル。
points: 264,177 330,352
type: Rectangle

フォレストタワー
depicts: Building
  description: 愛宕グリーンヒルズの住宅棟。地上42階建、延床面積62,290.46平方メートル。
points: 217,249 262,340
type: Rectangle

芝公園
points: 12,265 188,397
description: この左手に東京タワー
type: Rectangle

明照会館
points: 518,269 628,391
description: だと思う…
type: Rectangle

芝公園の桜
points: 390,3 639,256
description: この日は東京の桜が満開に
type: Rectangle

image annotation
annotates: 芝公園から愛宕グリーンヒルズ方面を眺める
author: Masahide Kanzaki
created: 2004-03-29T13:26:21Z

Katsushika Symphony Hills
creator: Masahide Kanzaki
date: 2003-07-19T17:37:58+0900
description: スプレンディダの練習に葛飾へ。GPS携帯カメラのテストとして
description: Went to Katsushika for a rehearsal of Orchestra Splendida
link: http://www.kanzaki.com/test/exif2rdf?xsl=on&ul=/works/2003/imagedesc/030719_1737.jpg
type: item
maker: 神崎正英
topic:
  location: 東京・葛飾
  lat: 35.74238
  long: 139.85275

Ikebukuro
creator: Masahide Kanzaki
date: 2003-07-20T14:52:05+0900
description: GPS携帯カメラのテストとして池袋駅の東口を撮影
description: East side of Ikebukuro station. Just a test of GPS cellphone camera
link: http://www.kanzaki.com/test/exif2rdf?xsl=on&ul=/works/2003/imagedesc/030720_1452.jpg
type: item
maker: 神崎正英
topic:
  location: 東京・池袋
  lat: 35.72998
  long: 139.71297

At Mita, Tokyo
creator: Masahide Kanzaki
date: 2003-08-01T12:57:20+0900
description: 慶應大学の帰りに、GPSのテストとして撮影しただけの三田の街角
description: A scene of a daily life in Mita, Minato-ku, Tokyo
link: http://www.kanzaki.com/test/exif2rdf?xsl=on&ul=/works/2003/imagedesc/030801_1257.jpg
type: item
maker: 神崎正英
topic:
  location: 東京・三田
  lat: 35.64721
  long: 139.74408

Kayabacho cross
creator: Masahide Kanzaki
date: 2003-08-07T14:54:16+0900
description: データベース関係の打合せに茅場町に出かけた折りに撮影
description: A big cross near Nihonbashi, Tokyo
link: http://www.kanzaki.com/test/exif2rdf?xsl=on&ul=/works/2003/imagedesc/030807_1454.jpg
type: item
maker: 神崎正英
topic:
  location: 東京・茅場町
  lat: 35.67997
  long: 139.78042

Kita Ikebukuro
creator: Masahide Kanzaki
date: 2003-08-20T15:02:38+0900
description: ディマンシュの演奏会の研究のために図書館で『聖フランチェスコの小さな花』を借りてきた帰り道。あまり関係ないか
description: Went to a library to find a book related to the coming concert.
link: http://www.kanzaki.com/test/exif2rdf?xsl=on&ul=/works/2003/imagedesc/030820_1502.jpg
type: item
maker: 神崎正英
topic:
  location: 東京・北池袋
  lat: 35.73991
  long: 139.72051

Akasaka hill
creator: Masahide Kanzaki
date: 2003-10-09T15:00:52+0900
description: 溜池付近で打ち合わせたあと、赤坂見附まで歩いていく時に何となく。さすがに携帯カメラでは色再現などプア
description: A shot taken when walking from Tameike to Akasakamitsuke. Color is not so good...
link: http://www.kanzaki.com/test/exif2rdf?xsl=on&ul=/works/2003/imagedesc/031009_1500.jpg
type: item
maker: 神崎正英
topic:
  location: 東京・赤坂
  lat: 35.67312
  long: 139.73878

Daimon Tokyo
creator: Masahide Kanzaki
date: 2003-12-15T14:23:58+0900
description: 打合せで大門へ
description: A heavy traffic goes through the gate of Zojoji Temple
link: http://www.kanzaki.com/test/exif2rdf?xsl=on&ul=/works/2003/imagedesc/031215_1423.jpg
type: item
maker: 神崎正英
topic:
  location: 東京・大門
  lat: 35.65693
  long: 139.75334

Kioicho Garden Tower
creator: Masahide Kanzaki
date: 2003-12-18T15:29:11+0900
description: 打合せ帰りに赤坂見附から麹町まで歩く。紀尾井町ガーデンタワーを清水谷公園から仰ぎ見る。
description: Looking over the Kioicho building from Shimizudani park
link: http://www.kanzaki.com/test/exif2rdf?xsl=on&ul=/works/2003/imagedesc/031218_1529.jpg
type: item
maker: 神崎正英
topic:
  location: 東京・紀尾井町
  lat: 35.68079
  long: 139.73557

Shimizudani-sakashita
creator: Masahide Kanzaki
date: 2003-12-18T15:33:05+0900
description: 清水谷坂下交差点から紀尾井坂を眺める。冬の昼下がりの鈍い太陽がビルの窓に反射している。
description: Viewing Kioi-saka from Shimizudani-saka
link: http://www.kanzaki.com/test/exif2rdf?xsl=on&ul=/works/2003/imagedesc/031218_1533.jpg
type: item
maker: 神崎正英
topic:
  location: 東京・紀尾井町
  lat: 35.6823
  long: 139.7351

Year end Shibuya illumination
creator: Masahide Kanzaki
date: 2003-12-19T18:57:06+0900
description: アンサンブル花火の忘年会で久しぶりに夜の渋谷へ。さすがに年末の金曜日は賑わっています。
description: One of the most popular towns in Tokyo gathers many crowds on TGIF in the year end
link: http://www.kanzaki.com/test/exif2rdf?xsl=on&ul=/works/2003/imagedesc/031219_1857.jpg
type: item
maker: 神崎正英
topic:
  location: 東京・渋谷
  lat: 35.65987
  long: 139.70078

Nerima-Kasuga-cho
creator: Masahide Kanzaki
date: 2003-12-22T11:16:41+0900
description: 所用で春日町に。
description: A dull scene at a suburban cross
link: http://www.kanzaki.com/test/exif2rdf?xsl=on&ul=/works/2003/imagedesc/031222_1116.jpg
type: item
maker: 神崎正英
topic:
  location: 東京・春日町
  lat: 35.75172
  long: 139.63952

Nakano-sakaue
creator: Masahide Kanzaki
date: 2004-01-08T14:43:05+0900
description: 地下鉄の出口から住友中野坂上ビルを仰ぐ
description: Looking a tall building at Nakano-sakaue cross
link: http://www.kanzaki.com/test/exif2rdf?xsl=on&ul=/works/2004/imgdsc/040108_1443.jpg
type: item
maker: 神崎正英
topic:
  location: 東京・中野坂上
  lat: 35.69689
  long: 139.68244

image annotation

Yotsuya cross
creator: Masahide Kanzaki
date: 2004-01-08T14:59:52+0900
description: 打合せ前に四谷交差点南から上智大学方面。何か工事中か
description: Looking over Sophia University from Yotsuya cross
link: http://www.kanzaki.com/test/exif2rdf?xsl=on&ul=/works/2004/imgdsc/040108_1459.jpg
type: item
maker: 神崎正英
topic:
  location: 東京・四谷
  lat: 35.68529
  long: 139.72946

image annotation

West end of Ohtemachi
creator: Masahide Kanzaki
date: 2004-01-08T16:36:11+0900
description: 地下鉄竹橋駅出口から大手町ビル街の西端を望む
description: The west end of Ohtemachi buildings fece the moat of the Imperial Palace. A view from Takebashi subway exit.
link: http://www.kanzaki.com/test/exif2rdf?xsl=on&ul=/works/2004/imgdsc/040108_1636.jpg
type: item
maker: 神崎正英
topic:
  location: 東京・一ツ橋
  lat: 35.69114
  long: 139.76030

image annotation

Hitotsubashi
creator: Masahide Kanzaki
date: 2004-01-08T16:38:29+0900
description: 学術総合センターに行く前に、一ツ橋をわたって首都高速とパレスサイドビルの方向を振り返る。
description: Shuto-hiway and Palace Side Bldg. from Hitoshubashi-kagan cross
link: http://www.kanzaki.com/test/exif2rdf?xsl=on&ul=/works/2004/imgdsc/040108_1638.jpg
type: item
maker: 神崎正英
topic:
  location: 東京・一ツ橋
  lat: 35.69178
  long: 139.75908

image annotation

West entrance of Osaki station
creator: Masahide Kanzaki
date: 2004-01-11T16:22:46+0900
description: 知人宅に行く途中、大崎駅西口で
description: The west gate of Osaki station is rahter calm despite its heavy daily traffic
link: http://www.kanzaki.com/test/exif2rdf?xsl=on&ul=/works/2004/imgdsc/040111_1622.jpg
type: item
maker: 神崎正英
topic:
  location: 東京・大崎
  lat: 35.61966
  long: 139.72788

A small shrine
creator: Masahide Kanzaki
date: 2004-01-11T16:31:14+0900
description: 西品川付近で出くわした貴船神社
description: A small shrine found at a way to a house of my friend
link: http://www.kanzaki.com/test/exif2rdf?xsl=on&ul=/works/2004/imgdsc/040111_1631.jpg
type: item
maker: 神崎正英
topic:
  location: 東京・西品川
  lat: 35.61529
  long: 139.72609

Tokyo tower view from Mita
creator: Masahide Kanzaki
date: 2004-01-13T14:24:11+0900
description: 慶應大学に出かけた。試験期間とあって図書館は学生であふれかえっていた。ついでに、東京タワーの写真を撮影
description: This 333m heigh broadcasting tower was built in 1953
link: http://www.kanzaki.com/test/exif2rdf?xsl=on&ul=/works/2004/imgdsc/040113_1424.jpg
type: item
maker: 神崎正英
topic:
  location: 東京・三田
  lat: 35.65217
  long: 139.74475

image annotation

Ichigaya cross
creator: Masahide Kanzaki
date: 2004-01-14T13:56:27+0900
description: 市ヶ谷駅前交差点にて。逆光でなかなか撮影が難しかった
description: At a cross in front of Ichigaya station
link: http://www.kanzaki.com/test/exif2rdf?xsl=on&ul=/works/2004/imgdsc/040114_1356.jpg
type: item
maker: 神崎正英
topic:
  location: 東京・市ヶ谷
  lat: 35.69164
  long: 139.73551

Hosei Boissonade Tower
creator: Masahide Kanzaki
date: 2004-01-14T14:04:11+0900
description: 今日は法政大学へ。寒風が厳しかったが、そのぶん空は澄み渡っていた
description: The symbol of Hosei University
link: http://www.kanzaki.com/test/exif2rdf?xsl=on&ul=/works/2004/imgdsc/040114_1404.jpg
type: item
maker: 神崎正英
topic:
  location: 東京・市ヶ谷
  lat: 35.69516
  long: 139.73983

Ushigome bridge
creator: Masahide Kanzaki
date: 2004-01-14T14:43:50+0900
description: 牛込橋から神楽坂方面を眺める
description: Looking Kagurazaka through Ushigome bridge
link: http://www.kanzaki.com/test/exif2rdf?xsl=on&ul=/works/2004/imgdsc/040114_1443.jpg
type: item
maker: 神崎正英
topic:
  location: 東京・飯田橋
  lat: 35.69991
  long: 139.74368

An object at Igusamori park
creator: Masahide Kanzaki
date: 2004-01-18T15:38:19+0900
description: 井草森公園の入り口にあるオブジェ
description: A sculputure found at the gate of Igusamori park
link: http://www.kanzaki.com/test/exif2rdf?xsl=on&ul=/works/2004/imgdsc/040118_1538.jpg
type: item
maker: 神崎正英
topic:
  location: 東京・井草
  lat: 35.72719
  long: 139.61182

Iogi station
creator: Masahide Kanzaki
date: 2004-01-18T15:41:46+0900
description: 西武新宿線・井荻駅。かつては大変な渋滞を引き起こしていた環八井荻踏切は、今はトンネルになっており、さらに西武線の上を側道が走る
description: Seibu Shinjuku Line Iogi station is crossing the Kanpachi road
link: http://www.kanzaki.com/test/exif2rdf?xsl=on&ul=/works/2004/imgdsc/040118_1541.jpg
type: item
maker: 神崎正英
topic:
  location: 東京・井草
  lat: 35.72507
  long: 139.61449

A cross at Nerima
creator: Masahide Kanzaki
date: 2004-01-18T16:04:48+0900
description: 豊玉北六丁目交差点。信号待ちの途中に車窓から撮影
description: At Tokyotama-kita-6chome, Mejiro-dori str and Senkawa-dori str corss
link: http://www.kanzaki.com/test/exif2rdf?xsl=on&ul=/works/2004/imgdsc/040118_1604.jpg
type: item
maker: 神崎正英
topic:
  location: 東京・練馬
  lat: 35.73644
  long: 139.64996

Sukiyabashi cross
creator: Masahide Kanzaki
date: 2004-01-20T15:01:34+0900
description: 数寄屋橋交差点にて
description: At this popular cross, you'll find department stores, movie theaters and much more
link: http://www.kanzaki.com/test/exif2rdf?xsl=on&ul=/works/2004/imgdsc/040120_1501.jpg
type: item
maker: 神崎正英
topic:
  location: 東京・数寄屋橋
  lat: 35.67324
  long: 139.76378

Central cross at Ginza
creator: Masahide Kanzaki
date: 2004-01-20T15:05:35+0900
description: 銀座四丁目交差点で和光方面を望む。ビルの谷間で影が濃い
description: The central point of Ginza
link: http://www.kanzaki.com/test/exif2rdf?xsl=on&ul=/works/2004/imgdsc/040120_1505.jpg
type: item
maker: 神崎正英
topic:
  location: 東京・銀座
  lat: 35.67111
  long: 139.76459

Ginza namiki-dori
creator: Masahide Kanzaki
date: 2004-01-20T15:19:33+0900
description: 冬の昼間の並木通りは、ちょっと寂しいか
description: Back yard of Ginza
link: http://www.kanzaki.com/test/exif2rdf?xsl=on&ul=/works/2004/imgdsc/040120_1519.jpg
type: item
maker: 神崎正英
topic:
  location: 東京・銀座
  lat: 35.67057
  long: 139.76214

Subway Hongo-sanchome station
creator: Masahide Kanzaki
date: 2004-01-20T16:00:07+0900
description: アカデミアに楽譜を物色しにいった帰り。本郷三丁目の駅は春日通から少し入った所で静かだ
description: The entrance of this Marunouchi-line station located in a calm area, just a hundred meters behind a busy main street
link: http://www.kanzaki.com/test/exif2rdf?xsl=on&ul=/works/2004/imgdsc/040120_1600.jpg
type: item
maker: 神崎正英
topic:
  location: 東京・本郷
  lat: 35.70614
  long: 139.75917

Construction of a new building
creator: Masahide Kanzaki
date: 2004-01-21T13:24:01+0900
description: この付近、かなり新しいビルやマンションが建てられているのだとか
description: A new intelligent building or prescious apartment will come ?
link: http://www.kanzaki.com/test/exif2rdf?xsl=on&ul=/works/2004/imgdsc/040121_1323.jpg
type: item
maker: 神崎正英
topic:
  location: 東京・九段
  lat: 35.69226
  long: 139.74617

Jinbocho
creator: Masahide Kanzaki
date: 2004-01-22T14:33:57+0900
description: 打合せの前にいくつか古書店をのぞく
description: A lot of secondhand book sotres found in Jinbocho
link: http://www.kanzaki.com/test/exif2rdf?xsl=on&ul=/works/2004/imgdsc/040122_1433.jpg
type: item
maker: 神崎正英
topic:
  location: 東京・神保町
  lat: 35.69646
  long: 139.75891

Suzuran dori
creator: Masahide Kanzaki
date: 2004-01-22T14:54:13+0900
description: 入ったことはないけれど小さな商店街がありそう
description: A small shopping street
link: http://www.kanzaki.com/test/exif2rdf?xsl=on&ul=/works/2004/imgdsc/040122_1454.jpg
type: item
maker: 神崎正英
topic:
  location: 東京・神保町
  lat: 35.69529
  long: 139.75832

Izakaya Yagura
creator: Masahide Kanzaki
date: 2004-01-22T20:06:10+0900
description: 打合せの後に珍しく居酒屋へ。宮川さんなども参加
description: Went an izakaya after the meeting with almost twenty young researchers
link: http://www.kanzaki.com/test/exif2rdf?xsl=on&ul=/works/2004/imgdsc/040122_2006.jpg
type: item
maker: 神崎正英
topic:
  location: 東京・神保町
  lat: 35.69665
  long: 139.75887

Hotels at Akasakamitsuke
creator: Masahide Kanzaki
date: 2004-01-23T13:00:46+0900
description: 改めて見るとやはりニューオータニと赤プリが両側に並ぶのは豪華
description: Major hotels Now Ohtani and Akasaka Prince a long time landmarks hrer
link: http://www.kanzaki.com/test/exif2rdf?xsl=on&ul=/works/2004/imgdsc/040123_1300.jpg
type: item
maker: 神崎正英
topic:
  location: 東京・赤坂見附
  lat: 35.67774
  long: 139.73649

Skyscrapers in Shiodome
creator: Masahide Kanzaki
date: 2004-01-23T15:36:55+0900
description: 汐留の新高層ビル群は、見上げるのに首が痛くなるほどで、威圧感がある
description: Many tall buildings are built in Shiodome in 2003
link: http://www.kanzaki.com/test/exif2rdf?xsl=on&ul=/works/2004/imgdsc/040123_1536.jpg
type: item
maker: 神崎正英
topic:
  location: 東京・汐留
  lat: 35.66262
  long: 139.75993

Meguro Persimmon Hall
creator: Masahide Kanzaki
date: 2004-01-24T15:04:44+0900
description: アンサンブル花火の練習でパーシモンホールへ。この名前は、柿の木坂（柿=persimmon）にちなんでいるそうだ。
description: Went this hall for Ensemble Hanabi's rehearsal
link: http://www.kanzaki.com/test/exif2rdf?xsl=on&ul=/works/2004/imgdsc/040124_1504.jpg
type: item
maker: 神崎正英
topic:
  location: 東京・目黒
  lat: 35.62100
  long: 139.67376

Gaienmae at night
creator: Masahide Kanzaki
date: 2004-01-24T17:58:58+0900
description: 花火の練習からダスビの練習へと移動中、信号待ちの外苑前の交差点で
description: Took a shot from a car on waiting traffic light
link: http://www.kanzaki.com/test/exif2rdf?xsl=on&ul=/works/2004/imgdsc/040124_1758.jpg
type: item
maker: 神崎正英
topic:
  location: 東京・外苑前
  lat: 35.66875
  long: 139.71603

Ikebukuro west
creator: Masahide Kanzaki
date: 2004-01-28T15:44:12+0900
description: 池袋西口で東京芸術劇場、メトロポリタンプラザなどを望む
description: Ikebukuro Geijutsu Gekijo (Tokyo Metropolitan Art Space) and Metropolitan Plaza
link: http://www.kanzaki.com/test/exif2rdf?xsl=on&ul=/works/2004/imgdsc/040128_1544.jpg
type: item
maker: 神崎正英
topic:
  location: 東京・池袋
  lat: 35.73046
  long: 139.70809

Takadobashi cross
creator: Masahide Kanzaki
date: 2004-01-31T17:04:33+0900
description: ダスビ練習に行く途中、高戸橋交差点での信号待ち
description: A busy traffic point where Mejiro-dori str. and Meiji-dori str. cross
link: http://www.kanzaki.com/test/exif2rdf?xsl=on&ul=/works/2004/imgdsc/040131_1704.jpg
type: item
maker: 神崎正英
topic:
  location: 東京・西早稲田
  lat: 35.71486
  long: 139.71023

Asakusabashi cross
creator: Masahide Kanzaki
date: 2004-01-31T17:34:10+0900
description: 浅草橋交差点付近の週末の夕方は意外に混んでいない
description: A night scene at the cross where heavy traffic found weekday daytime
link: http://www.kanzaki.com/test/exif2rdf?xsl=on&ul=/works/2004/imgdsc/040131_1734.jpg
type: item
maker: 神崎正英
topic:
  location: 東京・日本橋
  lat: 35.69554
  long: 139.78571

Hoku-topia at night
creator: Masahide Kanzaki
date: 2004-02-01T17:48:51+0900
description: アンサンブル花火の練習で北とぴあのリハーサル室を利用。王子にあるのは北とぴあで、銀座にあるのが王子ホールとはこれいかに。
description: Went Hoku-topia for the rehearsal of Ensemble Hanabi
link: http://www.kanzaki.com/test/exif2rdf?xsl=on&ul=/works/2004/imgdsc/040201_1748.jpg
type: item
maker: 神崎正英
topic:
  location: 東京・王子
  lat: 35.75402
  long: 139.73669

Ginza 3-chome
creator: Masahide Kanzaki
date: 2004-02-02T18:32:23+0900
description: 銀座の地下のバーの入り口
description: Entrance of a bar at the basement
link: http://www.kanzaki.com/test/exif2rdf?xsl=on&ul=/works/2004/imgdsc/040202_1832.jpg
type: item
maker: 神崎正英
topic:
  location: 東京・銀座
  lat: 35.67304
  long: 139.76510

South Shinjuku Times Square
creator: Masahide Kanzaki
date: 2004-02-04T13:40:33+0900
description: 新宿駅南口から「タイムズ・スクエア」方面を望む
description: Looking over the 'Times Square' from south gate of Shinjuku station
link: http://www.kanzaki.com/test/exif2rdf?xsl=on&ul=/works/2004/imgdsc/040204_1340.jpg
type: item
maker: 神崎正英
topic:
  location: 東京・新宿
  lat: 35.68891
  long: 139.69988

Shibuya Hachiko gate squares
creator: Masahide Kanzaki
date: 2004-02-04T13:55:40+0900
description: 渋谷ハチ公口からセンター街方面を望む
description: One of the most popular square at the north gate of Shibuya station
link: http://www.kanzaki.com/test/exif2rdf?xsl=on&ul=/works/2004/imgdsc/040204_1355.jpg
type: item
maker: 神崎正英
topic:
  location: 東京・渋谷
  lat: 35.65992
  long: 139.70127

Roppongi cross
creator: Masahide Kanzaki
date: 2004-02-06T13:40:34+0900
description: 六本木交差点からアマンド方面
description: Popular night-spot roppongi is still vital in daytime
link: http://www.kanzaki.com/test/exif2rdf?xsl=on&ul=/works/2004/imgdsc/040206_1340.jpg
type: item
maker: 神崎正英
topic:
  location: 東京・六本木
  lat: 35.66308
  long: 139.73254

Entrance of Roppongi hills
creator: Masahide Kanzaki
date: 2004-02-06T13:47:17+0900
description: 六本木ヒルズで打合せ。逆光が眩しい。
description: A new crowded zone in Roppongi area
link: http://www.kanzaki.com/test/exif2rdf?xsl=on&ul=/works/2004/imgdsc/040206_1347.jpg
type: item
maker: 神崎正英
topic:
  location: 東京・六本木
  lat: 35.66265
  long: 139.72936

Waseda on Mejiro street
creator: Masahide Kanzaki
date: 2004-02-07T15:22:22+0900
description: 都電早稲田駅前の目白通り
description: The cross next to Waseda terminal of metropolitan streetcar
link: http://www.kanzaki.com/test/exif2rdf?xsl=on&ul=/works/2004/imgdsc/040207_1522.jpg
type: item
maker: 神崎正英
topic:
  location: 東京・早稲田
  lat: 35.71181
  long: 139.71914

Suidobashi Cross
creator: Masahide Kanzaki
date: 2004-02-07T15:31:18+0900
description: 水道橋交差点で車中から都立工芸高校と東京都総合技術教育センターを望む
description: The building is Tokyo Metropolitan Institute for Education of Technology
link: http://www.kanzaki.com/test/exif2rdf?xsl=on&ul=/works/2004/imgdsc/040207_1531.jpg
type: item
maker: 神崎正英
topic:
  location: 東京・水道橋
  lat: 35.70260
  long: 139.75484

Juntendo-mae Cross
creator: Masahide Kanzaki
date: 2004-02-07T15:33:00+0900
description: 順天堂前交差点で医科歯科大とお茶の水方面を望む
description: Looking over Ochanomizu and Tokyo Medical and Dental University
link: http://www.kanzaki.com/test/exif2rdf?xsl=on&ul=/works/2004/imgdsc/040207_1533.jpg
type: item
maker: 神崎正英
topic:
  location: 東京・本郷
  lat: 35.70206
  long: 139.76154

Wall of Ushima-Seido
creator: Masahide Kanzaki
date: 2004-02-07T15:41:07+0900
description: 湯島聖堂の土壁を渋滞の車中から眺める
description: A sacrid place dedicated to Confucius and other four sages
link: http://www.kanzaki.com/test/exif2rdf?xsl=on&ul=/works/2004/imgdsc/040207_1541.jpg
type: item
maker: 神崎正英
topic:
  location: 東京・湯島
  lat: 35.70002
  long: 139.76684

Morishita Bunka Center
creator: Masahide Kanzaki
date: 2004-02-07T16:57:41+0900
description: ダスビを始め多くのアマオケが練習に使う森下文化センターの外観
description: Many amateur orchestras, including 'do svidanya', use this facility for their rehearsal
link: http://www.kanzaki.com/test/exif2rdf?xsl=on&ul=/works/2004/imgdsc/040207_1657.jpg
type: item
maker: 神崎正英
topic:
  location: 東京・森下
  lat: 35.68567
  long: 139.80183

A view from Ryogoku-bashi bridge
creator: Masahide Kanzaki
date: 2004-02-08T17:17:17+0900
description: 両国橋を通過中、隅田川を南の方に望む
description: Looking at south over Sumia river
link: http://www.kanzaki.com/test/exif2rdf?xsl=on&ul=/works/2004/imgdsc/040208_1717.jpg
type: item
maker: 神崎正英
topic:
  location: 東京・両国
  lat: 35.69427
  long: 139.78806

Shinjuku-dori at Kojimachi
creator: Masahide Kanzaki
date: 2004-02-23T10:56:28+0900
description: 麹町の新宿通り交差点で四谷方面を眺める
link: http://www.kanzaki.com/test/exif2rdf?xsl=on&ul=/works/2004/imgdsc/040223_1056.jpg
type: item
maker: 神崎正英
topic:
  location: 東京・麹町
  lat: 35.68383
  long: 139.73772

Grand Hill Ichigaya
creator: Masahide Kanzaki
date: 2004-03-08T17:42:58+0900
description: ダブリン・コア・セミナーに出席
description: Attended The Dublin Core seminar as a panelist
link: http://www.kanzaki.com/test/exif2rdf?xsl=on&ul=/works/2004/imgdsc/040308_1742.jpg
type: item
maker: 神崎正英
topic:
  location: 東京・市ヶ谷
  lat: 35.69184
  long: 139.73352

On the road
creator: Masahide Kanzaki
date: 2004-03-13T17:30:35+0900
description: 花火の練習帰りに環七で
description: On the way back from an rehearsal of Ensemble Hanabi
link: http://www.kanzaki.com/test/exif2rdf?xsl=on&ul=/works/2004/imgdsc/040313_1730.jpg
type: item
maker: 神崎正英
topic:
  location: 東京・板橋
  lat: 35.75322
  long: 139.68522

An avenue in Musashino-shi
creator: Masahide Kanzaki
date: 2004-03-14T12:47:30+0900
description: Beautiful rows of tree, especially nice in Spring with cherry blossom
link: http://www.kanzaki.com/test/exif2rdf?xsl=on&ul=/works/2004/imgdsc/040314_1247.jpg
type: item
maker: 神崎正英
topic:
  location: 東京・武蔵野市
  lat: 35.71869
  long: 139.56729

Mitaka City Arts Center
creator: Masahide Kanzaki
date: 2004-03-14T15:36:18+0900
description: 三鷹市芸術文化センターの外観
description: The home of Ensemble Hanabi
link: http://www.kanzaki.com/test/exif2rdf?xsl=on&ul=/works/2004/imgdsc/040314_1536.jpg
type: item
maker: 神崎正英
topic:
  location: 東京・三鷹
  lat: 35.69324
  long: 139.55789

In Chuo-rinkan
creator: Masahide Kanzaki
date: 2004-03-21T15:07:07+0900
description: 中央林間
description: Houses surrounded with rich trees
link: http://www.kanzaki.com/test/exif2rdf?xsl=on&ul=/works/2004/imgdsc/040321_1507.jpg
type: item
maker: 神崎正英
topic:
  location: 東京・中央林間
  lat: 35.50742
  long: 139.43940

Chidorigafuchi
creator: Masahide Kanzaki
date: 2004-03-26T15:21:37+0900
description: 千鳥が淵はそろそろ見頃になりつつある
link: http://www.kanzaki.com/test/exif2rdf?xsl=on&ul=/works/2004/imgdsc/040326_1521.jpg
type: item
maker: 神崎正英
topic:
  location: 東京・九段
  lat: 35.69377
  long: 139.74768

Viewing Kudan from Kitanomaru Park
creator: Masahide Kanzaki
date: 2004-03-26T15:27:08+0900
description: 北の丸公園入り口から九段方面を望む
link: http://www.kanzaki.com/test/exif2rdf?xsl=on&ul=/works/2004/imgdsc/040326_1527.jpg
type: item
maker: 神崎正英
topic:
  location: 東京・九段
  lat: 35.69448
  long: 139.74920

Cherry blossom at Tesugakudo
creator: Masahide Kanzaki
date: 2004-03-28T11:46:55+0900
description: 哲学堂付近の桜並木
link: http://www.kanzaki.com/test/exif2rdf?xsl=on&ul=/works/2004/imgdsc/040328_1146.jpg
type: item
maker: 神崎正英
topic:
  location: 東京・哲学堂
  lat: 35.72378
  long: 139.67476

Cherry blossom on Kandagawa-river
creator: Masahide Kanzaki
date: 2004-03-28T12:02:41+0900
description: 神田川にかかる三島橋から桜並木を愛でる
link: http://www.kanzaki.com/test/exif2rdf?xsl=on&ul=/works/2004/imgdsc/040328_1202.jpg
type: item
maker: 神崎正英
topic:
  location: 東京・早稲田
  lat: 35.71311
  long: 139.71552

Bakurocho cross
creator: Masahide Kanzaki
date: 2004-03-28T12:28:50+0900
description: この辺りには馬を売買する馬市があった
description: Named after horse market in Edo era
link: http://www.kanzaki.com/test/exif2rdf?xsl=on&ul=/works/2004/imgdsc/040328_1228.jpg
type: item
maker: 神崎正英
topic:
  location: 東京・馬喰町
  lat: 35.69363
  long: 139.78211

Nihonbashi-Hamacho
creator: Masahide Kanzaki
date: 2004-03-28T12:31:13+0900
description: 江戸時代に、隅田川に沿った浜辺の街ということで浜町と呼ばれていたそうだ
link: http://www.kanzaki.com/test/exif2rdf?xsl=on&ul=/works/2004/imgdsc/040328_1231.jpg
type: item
maker: 神崎正英
topic:
  location: 東京・浜町
  lat: 35.68851
  long: 139.78579

Mansebashi cross
creator: Masahide Kanzaki
date: 2004-03-28T17:13:23+0900
description: 万世橋交差点は秋葉原電気街の南西
description: South west of Akihabara, huge electronic shopping mall
link: http://www.kanzaki.com/test/exif2rdf?xsl=on&ul=/works/2004/imgdsc/040328_1713.jpg
type: item
maker: 神崎正英
topic:
  location: 東京・神田
  lat: 35.69747
  long: 139.77148

Edogawabashi cross
creator: Masahide Kanzaki
date: 2004-03-28T17:29:38+0900
description: かつては、この付近は下流の神田川と区別して江戸川と呼ばれた
link: http://www.kanzaki.com/test/exif2rdf?xsl=on&ul=/works/2004/imgdsc/040328_1729.jpg
type: item
maker: 神崎正英
topic:
  location: 東京・江戸川橋
  lat: 35.70998
  long: 139.73185

Akabane-basi cross
creator: Masahide Kanzaki
date: 2004-03-29T14:39:27+0900
description: 赤羽橋交差点から飯倉方面を望む
link: http://www.kanzaki.com/test/exif2rdf?xsl=on&ul=/works/2004/imgdsc/040329_1439.jpg
type: item
maker: 神崎正英
topic:
  location: 東京・赤羽橋
  lat: 35.65598
  long: 139.74645

Cherry blossom and Tokyo Tower
creator: Masahide Kanzaki
date: 2004-03-29T14:42:10+0900
description: 芝公園の桜と東京タワー
link: http://www.kanzaki.com/test/exif2rdf?xsl=on&ul=/works/2004/imgdsc/040329_1442.jpg
type: item
maker: 神崎正英
topic:
  location: 東京・芝公園
  lat: 35.65554
  long: 139.74651

Buildings at Nishi-Shinjuku
creator: Masahide Kanzaki
date: 2004-04-02T16:42:32+0900
description: 西新宿のセンタービル、野村ビル、三井ビル
description: Shinjuku-Center Bldg, Shinjuku-Nomura Bldg and Shinjuku-Mitsui Blidg
link: http://www.kanzaki.com/test/exif2rdf?xsl=on&ul=/works/2004/imgdsc/040402_1642.jpg
type: item
maker: 神崎正英
topic:
  location: 東京・西新宿
  lat: 35.69177
  long: 139.69317

Tokyo Metropolitan Office
creator: Masahide Kanzaki
date: 2004-04-02T16:44:27+0900
description: 東京都庁
description: Designed by Kenzo Tange, built in 1991
link: http://www.kanzaki.com/test/exif2rdf?xsl=on&ul=/works/2004/imgdsc/040402_1644.jpg
type: item
maker: 神崎正英
topic:
  location: 東京・西新宿
  lat: 35.69097
  long: 139.69346

Sumida River and boat
creator: Masahide Kanzaki
date: 2004-04-03T12:35:49+0900
description: 新大橋から隅田川の水上バスを眺める
description: Water-buses go up and down on Sumida river
link: http://www.kanzaki.com/test/exif2rdf?xsl=on&ul=/works/2004/imgdsc/040403_1235.jpg
type: item
maker: 神崎正英
topic:
  location: 東京・新大橋
  lat: 35.68711
  long: 139.79118

A streetcar
creator: Masahide Kanzaki
date: 2004-04-04T08:29:17+0900
description: 早稲田駅付近を走る荒川都電
description: The only street car in Tokyo can be seen at Waseda
link: http://www.kanzaki.com/test/exif2rdf?xsl=on&ul=/works/2004/imgdsc/040404_0829.jpg
type: item
maker: 神崎正英
topic:
  location: 東京・早稲田
  lat: 35.71256
  long: 139.71790

Kinshicho cross
creator: Masahide Kanzaki
date: 2004-04-04T08:46:42+0900
description: JR錦糸町駅南交差点
description: South of JR Kinshicho stationq
link: http://www.kanzaki.com/test/exif2rdf?xsl=on&ul=/works/2004/imgdsc/040404_0846.jpg
type: item
maker: 神崎正英
topic:
  location: 東京・錦糸町
  lat: 35.69453
  long: 139.81418

Kameido station
creator: Masahide Kanzaki
date: 2004-04-04T10:45:33+0900
description: JR亀戸駅前ロータリー
description: Bus terminal at JR Kameido station
link: http://www.kanzaki.com/test/exif2rdf?xsl=on&ul=/works/2004/imgdsc/040404_1045.jpg
type: item
maker: 神崎正英
topic:
  location: 東京・亀戸
  lat: 35.69799
  long: 139.82500

Tiara koto and the Garden Tower
creator: Masahide Kanzaki
date: 2004-04-11T17:45:07+0900
description: 「ティアラこうとう」と、横十間川の向こう側にある高層マンション「ザ・ガーデンタワー」
link: http://www.kanzaki.com/test/exif2rdf?xsl=on&ul=/works/2004/imgdsc/040411_1745.jpg
type: item
maker: 神崎正英
topic:
  location: 東京・住吉
  lat: 35.68917
  long: 139.81946

Ichino-hashi cross
creator: Masahide Kanzaki
date: 2004-04-16T12:46:27+0900
description: 三田から麻布十番まで歩いてみた
description: Major streets and hiways meet here
link: http://www.kanzaki.com/test/exif2rdf?xsl=on&ul=/works/2004/imgdsc/040416_1246.jpg
type: item
maker: 神崎正英
topic:
  location: 東京・麻布十番
  lat: 35.65531
  long: 139.73666

Edo Tokyo Museum
creator: Masahide Kanzaki
date: 2004-04-17T09:05:48+0900
link: http://www.kanzaki.com/test/exif2rdf?xsl=on&ul=/works/2004/imgdsc/040417_0905.jpg
type: item
maker: 神崎正英
topic:
  location: 東京・両国
  lat: 35.69716
  long: 139.79765

Sumida Triphony
creator: Masahide Kanzaki
date: 2004-04-17T09:28:13+0900
description: オーケストラ・ディマンシュの演奏会ですみだトリフォニーへ
description: A concert hall where many professional and amateur orchestras have concerts
link: http://www.kanzaki.com/test/exif2rdf?xsl=on&ul=/works/2004/imgdsc/040417_0928.jpg
type: item
maker: 神崎正英
topic:
  location: 東京・錦糸町
  lat: 35.69766
  long: 139.81036

Buildings in Toyosu
creator: Masahide Kanzaki
date: 2004-04-18T17:20:26+0900
description: 越中島の相生橋から豊洲のビル群を眺める
description: viewing from Aioi-bashi bridge
link: http://www.kanzaki.com/test/exif2rdf?xsl=on&ul=/works/2004/imgdsc/040418_1720.jpg
type: item
maker: 神崎正英
topic:
  location: 東京・佃
  lat: 35.66726
  long: 139.78862

Tsukishima
creator: Masahide Kanzaki
date: 2004-04-18T17:21:39+0900
description: 相生橋横の小さな公園から月島を望む
description: viewing from Aioi-bashi bridge
link: http://www.kanzaki.com/test/exif2rdf?xsl=on&ul=/works/2004/imgdsc/040418_1721.jpg
type: item
maker: 神崎正英
topic:
  location: 東京・佃
  lat: 35.66726
  long: 139.78862

From Toyosu wharf
creator: Masahide Kanzaki
date: 2004-04-18T17:37:58+0900
description: 豊洲のガスタービン発電所入り口から有明方面を望む
description: viewing Ariake
link: http://www.kanzaki.com/test/exif2rdf?xsl=on&ul=/works/2004/imgdsc/040418_1737.jpg
type: item
maker: 神崎正英
topic:
  location: 東京・豊洲
  lat: 35.65179
  long: 139.79375

Toyosu Center Bldg
creator: Masahide Kanzaki
date: 2004-04-18T17:43:36+0900
description: 豊洲駅前の交差点と豊洲センタービル
link: http://www.kanzaki.com/test/exif2rdf?xsl=on&ul=/works/2004/imgdsc/040418_1743.jpg
type: item
maker: 神崎正英
topic:
  location: 東京・豊洲
  lat: 35.65427
  long: 139.79633

Toranomon
creator: Masahide Kanzaki
date: 2004-04-23T11:33:33+0900
description: 新橋でChiris Goadに会う前に虎ノ門で降りて歩いてみる
description: Kasumigaseki Bldg from Toranomon
link: http://www.kanzaki.com/test/exif2rdf?xsl=on&ul=/works/2004/imgdsc/040423_1133.jpg
type: item
maker: 神崎正英
topic:
  location: 東京・虎ノ門
  lat: 35.67084
  long: 139.75090

Nishi Shimbashi
creator: Masahide Kanzaki
date: 2004-04-23T11:35:40+0900
description: 以前は良く通った外堀通りの西新橋一丁目付近
link: http://www.kanzaki.com/test/exif2rdf?xsl=on&ul=/works/2004/imgdsc/040423_1135.jpg
type: item
maker: 神崎正英
topic:
  location: 東京・西新橋
  lat: 35.66952
  long: 139.75144

Shiodome skyscrapers from Shimbashi
creator: Masahide Kanzaki
date: 2004-04-23T11:43:54+0900
description: 新橋駅前のSL越しにシオサイトのビル群を望む
description: An old SL is placed in the plaza front of Shimbashi station (left), and skyscrapers of Shio-site stand over
link: http://www.kanzaki.com/test/exif2rdf?xsl=on&ul=/works/2004/imgdsc/040423_1143.jpg
type: item
maker: 神崎正英
topic:
  location: 東京・新橋
  lat: 35.66682
  long: 139.75737

Hibiya
creator: Masahide Kanzaki
date: 2004-04-23T17:01:22+0900
description: 日比谷公園の市政会館やみずほ銀行の本店などが見える
link: http://www.kanzaki.com/test/exif2rdf?xsl=on&ul=/works/2004/imgdsc/040423_1701.jpg
type: item
maker: 神崎正英
topic:
  location: 東京・日比谷
  lat: 35.67202
  long: 139.75426

Kasumigaseki
creator: Masahide Kanzaki
date: 2004-04-23T17:02:00+0900
description: 厚生労働省あたりの合同庁舎や、かつて記者クラブに通った農水省などを望む
description: The governmental district of Japan
link: http://www.kanzaki.com/test/exif2rdf?xsl=on&ul=/works/2004/imgdsc/040423_1702.jpg
type: item
maker: 神崎正英
topic:
  location: 東京・日比谷
  lat: 35.67202
  long: 139.75426

Bunkyo Civic Center
creator: Masahide Kanzaki
date: 2004-04-24T17:55:10+0900
description: アンサンブル花火の練習を文京シビックで
description: Had a rehearsal of Ensemble Hanabi in a room of this culture complex
link: http://www.kanzaki.com/test/exif2rdf?xsl=on&ul=/works/2004/imgdsc/040424_1755.jpg
type: item
maker: 神崎正英
topic:
  location: 東京・後楽園
  lat: 35.70859
  long: 139.75258

Senkawa-dori at Minami-tanaka
creator: Masahide Kanzaki
date: 2004-04-29T11:12:17+0900
description: 千川通りの景色。本当はもう少し緑がきれい
link: http://www.kanzaki.com/test/exif2rdf?xsl=on&ul=/works/2004/imgdsc/040429_1112.jpg
type: item
maker: 神崎正英
topic:
  location: 東京・南田中
  lat: 35.73147
  long: 139.62079

Shimo Shakujii
creator: Masahide Kanzaki
date: 2004-04-29T11:20:09+0900
description: アンサンブル花火の第6回演奏会に向かう途中
link: http://www.kanzaki.com/test/exif2rdf?xsl=on&ul=/works/2004/imgdsc/040429_1120.jpg
type: item
maker: 神崎正英
topic:
  location: 東京・下石神井
  lat: 35.72754
  long: 139.60638

Mita-Shiba 5 chome cross
creator: Masahide Kanzaki
date: 2004-05-07T14:22:15+0900
description: 芝五丁目の交差点から日比谷通り方面
link: http://www.kanzaki.com/test/exif2rdf?xsl=on&ul=/works/2004/imgdsc/040507_1422.jpg
type: item
maker: 神崎正英
topic:
  location: 東京・三田
  lat: 35.64765
  long: 139.74862

Eifuku-cho
creator: Masahide Kanzaki
date: 2004-05-08T13:32:22+0900
description: 永福町の大宮八幡入り口付近交差点。以前住んでいたところに近い
link: http://www.kanzaki.com/test/exif2rdf?xsl=on&ul=/works/2004/imgdsc/040508_1332.jpg
type: item
maker: 神崎正英
topic:
  location: 東京・永福
  lat: 35.68128
  long: 139.64104

Sakura-josui
creator: Masahide Kanzaki
date: 2004-05-08T13:40:17+0900
description: 珍しく通った甲州街道の桜上水付近
link: http://www.kanzaki.com/test/exif2rdf?xsl=on&ul=/works/2004/imgdsc/040508_1340.jpg
type: item
maker: 神崎正英
topic:
  location: 東京・下高井戸
  lat: 35.66924
  long: 139.63307

Komae
creator: Masahide Kanzaki
date: 2004-05-08T17:01:45+0900
description: 狛江フィルの練習でエコルマホールへ
link: http://www.kanzaki.com/test/exif2rdf?xsl=on&ul=/works/2004/imgdsc/040508_1701.jpg
type: item
maker: 神崎正英
topic:
  location: 東京・狛江
  lat: 35.63314
  long: 139.57756

Chofu Wakaba cho
creator: Masahide Kanzaki
date: 2004-05-08T17:20:01+0900
description: 調布市若葉町付近を通過中
link: http://www.kanzaki.com/test/exif2rdf?xsl=on&ul=/works/2004/imgdsc/040508_1720.jpg
type: item
maker: 神崎正英
topic:
  location: 東京・調布
  lat: 35.65106
  long: 139.58259

Toho Gakuen mae
creator: Masahide Kanzaki
date: 2004-05-08T17:22:31+0900
description: 狛江からの帰りに桐朋学園前を通過
link: http://www.kanzaki.com/test/exif2rdf?xsl=on&ul=/works/2004/imgdsc/040508_1722.jpg
type: item
maker: 神崎正英
topic:
  location: 東京・仙川
  lat: 35.65944
  long: 139.58574

Shinjuku East
creator: Masahide Kanzaki
date: 2004-05-13T13:45:29+0900
description: ひさしぶりに新宿東口にて交差点から新宿通方面
description: Shinjuku-dori street in front of east gate of JR station
link: http://www.kanzaki.com/test/exif2rdf?xsl=on&ul=/works/2004/imgdsc/040513_1345.jpg
type: item
maker: 神崎正英
topic:
  location: 東京・新宿
  lat: 35.69223
  long: 139.70110

Kugayama
creator: Masahide Kanzaki
date: 2004-05-22T17:08:14+0900
description: 狛江からの帰りに渋滞しない道を求めて久我山を通り
link: http://www.kanzaki.com/test/exif2rdf?xsl=on&ul=/works/2004/imgdsc/040522_1708.jpg
type: item
maker: 神崎正英
topic:
  location: 東京・久我山
  lat: 35.68774
  long: 139.60028

Hewlett-Packard Japan
creator: Masahide Kanzaki
date: 2004-05-22T17:16:00+0900
description: 浜田山のHPのとなりを抜けて
link: http://www.kanzaki.com/test/exif2rdf?xsl=on&ul=/works/2004/imgdsc/040522_1716.jpg
type: item
maker: 神崎正英
topic:
  location: 東京・浜田山
  lat: 35.68766
  long: 139.61755

Umesato in Suginami
creator: Masahide Kanzaki
date: 2004-05-22T17:24:31+0900
description: 五日市街道へと回ってみた
link: http://www.kanzaki.com/test/exif2rdf?xsl=on&ul=/works/2004/imgdsc/040522_1724.jpg
type: item
maker: 神崎正英
topic:
  location: 東京・梅里
  lat: 35.69554
  long: 139.64503

Tokyo Tower from Roppongi Hills
creator: Masahide Kanzaki
date: 2004-05-28T15:30:29+0900
link: http://www.kanzaki.com/test/exif2rdf?xsl=on&ul=/works/2004/imgdsc/040528_1530.jpg
type: item
maker: 神崎正英
topic:
  location: 東京・六本木
  lat: 35.66117
  long: 139.73004

Gakugeidaimae
creator: Masahide Kanzaki
date: 2004-06-04T13:49:41+0900
description: 学芸大駅前の商店街
link: http://www.kanzaki.com/test/exif2rdf?xsl=on&ul=/works/2004/imgdsc/040604_1349.jpg
type: item
maker: 神崎正英
topic:
  location: 東京・学芸大前
  lat: 35.62896
  long: 139.68524

Meguro Honmachi
creator: Masahide Kanzaki
date: 2004-06-04T16:05:16+0900
description: 打合せで碑文谷方面へ
link: http://www.kanzaki.com/test/exif2rdf?xsl=on&ul=/works/2004/imgdsc/040604_1605.jpg
type: item
maker: 神崎正英
topic:
  location: 東京・目黒本町
  lat: 35.62534
  long: 139.68950

Shin-Okubo
creator: Masahide Kanzaki
date: 2004-06-04T16:46:44+0900
description: 弦を買いに山本へ
link: http://www.kanzaki.com/test/exif2rdf?xsl=on&ul=/works/2004/imgdsc/040604_1646.jpg
type: item
maker: 神崎正英
topic:
  location: 東京・新大久保
  lat: 35.70132
  long: 139.70088

Shirakawacho
creator: Masahide Kanzaki
date: 2004-06-20T08:38:03+0900
description: 江戸川に行くために、清澄橋をわたって東に向かう
link: http://www.kanzaki.com/test/exif2rdf?xsl=on&ul=/works/2004/imgdsc/040620_0838.jpg
type: item
maker: 神崎正英
topic:
  location: 東京・白河町
  lat: 35.68199
  long: 139.79917

Seishincho Community Center
creator: Masahide Kanzaki
date: 2004-06-20T09:03:58+0900
description: マーラー9番の練習にはるばる江戸川区の清新町コミュニティ会館へ
link: http://www.kanzaki.com/test/exif2rdf?xsl=on&ul=/works/2004/imgdsc/040620_0903.jpg
type: item
maker: 神崎正英
topic:
  location: 東京・清新町
  lat: 35.65905
  long: 139.85565

Ningyocho
creator: Masahide Kanzaki
date: 2004-06-20T17:34:36+0900
link: http://www.kanzaki.com/test/exif2rdf?xsl=on&ul=/works/2004/imgdsc/040620_1734.jpg
type: item
maker: 神崎正英
topic:
  location: 東京・人形町
  lat: 35.68626
  long: 139.78213

Iwamotocho
creator: Masahide Kanzaki
date: 2004-06-20T17:36:48+0900
description: 練習帰りにいつもとやや違うルートで神田方面に向かう
link: http://www.kanzaki.com/test/exif2rdf?xsl=on&ul=/works/2004/imgdsc/040620_1736.jpg
type: item
maker: 神崎正英
topic:
  location: 東京・神田岩本町
  lat: 35.69406
  long: 139.77559

Kunitachi University of Music
creator: Masahide Kanzaki
date: 2004-06-24T13:10:00+0900
description: 資料を探しに国立音大へ
link: http://www.kanzaki.com/test/exif2rdf?xsl=on&ul=/works/2004/imgdsc/040624_1310.jpg
type: item
maker: 神崎正英
topic:
  location: 東京・玉川上水
  lat: 35.73207
  long: 139.41402

Ueno Bunka Kaikan
creator: Masahide Kanzaki
date: 2004-07-02T14:07:30+0900
description: 資料を探しに文化会館の音楽資料室へ
link: http://www.kanzaki.com/test/exif2rdf?xsl=on&ul=/works/2004/imgdsc/040702_1407.jpg
type: item
maker: 神崎正英
topic:
  location: 東京・上野
  lat: 35.71503
  long: 139.77574

Shinjuku
creator: Masahide Kanzaki
date: 2004-07-04T17:50:35+0900
description: エレガンテの打ち上げへ
link: http://www.kanzaki.com/test/exif2rdf?xsl=on&ul=/works/2004/imgdsc/040704_1750.jpg
type: item
maker: 神崎正英
topic:
  location: 東京・新宿三丁目
  lat: 35.69245
  long: 139.70579

Ogikubo
creator: Masahide Kanzaki
date: 2004-07-08T17:36:37+0900
link: http://www.kanzaki.com/test/exif2rdf?xsl=on&ul=/works/2004/imgdsc/040708_1736.jpg
type: item
maker: 神崎正英
topic:
  location: 東京・荻窪
  lat: 35.70492
  long: 139.62113

Nishi-Ogikubo
creator: Masahide Kanzaki
date: 2004-07-08T17:44:33+0900
description: 東京女子大の仕事で西荻窪へ
link: http://www.kanzaki.com/test/exif2rdf?xsl=on&ul=/works/2004/imgdsc/040708_1744.jpg
type: item
maker: 神崎正英
topic:
  location: 東京・西荻窪
  lat: 35.70417
  long: 139.59995

Komagome
creator: Masahide Kanzaki
date: 2004-07-15T18:50:21+0900
description: 内田さんたちとの会合に駒込へ
link: http://www.kanzaki.com/test/exif2rdf?xsl=on&ul=/works/2004/imgdsc/040715_1850.jpg
type: item
maker: 神崎正英
topic:
  location: 東京・駒込
  lat: 35.73590
  long: 139.74696

Ogawa / Bridgestone
creator: Masahide Kanzaki
date: 2004-07-19T17:00:16+0900
description: 久しぶりにブリヂストンでスコアールの練習に参加
link: http://www.kanzaki.com/test/exif2rdf?xsl=on&ul=/works/2004/imgdsc/040719_1700.jpg
type: item
maker: 神崎正英
topic:
  location: 東京・小川
  lat: 35.73680
  long: 139.46608

Higashi-Fushimi
creator: Masahide Kanzaki
date: 2004-07-19T17:28:10+0900
description: 小平から帰る途中の青梅街道の東伏見交差点
link: http://www.kanzaki.com/test/exif2rdf?xsl=on&ul=/works/2004/imgdsc/040719_1728.jpg
type: item
maker: 神崎正英
topic:
  location: 東京・東伏見
  lat: 35.72485
  long: 139.55703

Hitotsubashi Kanematu Kodo
creator: Masahide Kanzaki
date: 2004-07-25T13:25:53+0900
description: 水星交響楽団の練習で一橋大学の兼松講堂へ
link: http://www.kanzaki.com/test/exif2rdf?xsl=on&ul=/works/2004/imgdsc/040725_1325.jpg
type: item
maker: 神崎正英
topic:
  location: 東京・国立
  lat: 35.69482
  long: 139.44526

Nakano Fujimicho
creator: Masahide Kanzaki
date: 2004-08-23T13:22:10+0900
description: JAGATの仕事で
link: http://www.kanzaki.com/test/exif2rdf?xsl=on&ul=/works/2004/imgdsc/040823_1322.jpg
type: item
maker: 神崎正英
topic:
  location: 東京・中野富士見町
  lat: 35.69055
  long: 139.66672

Kami-ochiai
creator: Masahide Kanzaki
date: 2004-09-11T13:09:36+0900
description: 水響のGPに大久保方面へ向かうところ
link: http://www.kanzaki.com/test/exif2rdf?xsl=on&ul=/works/2004/imgdsc/040911_1309.jpg
type: item
maker: 神崎正英
topic:
  location: 東京・上落合
  lat: 35.71093
  long: 139.68727

Iidabashi
creator: Masahide Kanzaki
date: 2004-10-21T13:26:24+0900
description: 書籍の打合せに出版社へ
link: http://www.kanzaki.com/test/exif2rdf?xsl=on&ul=/works/2004/imgdsc/041021_1326.jpg
type: item
maker: 神崎正英
topic:
  location: 東京・飯田橋
  lat: 35.69897
  long: 139.74555

Surugadai
creator: Masahide Kanzaki
date: 2004-10-28T14:50:33+0900
link: http://www.kanzaki.com/test/exif2rdf?xsl=on&ul=/works/2004/imgdsc/041028_1450.jpg
type: item
maker: 神崎正英
topic:
  location: 東京・駿河台下
  lat: 35.69607
  long: 139.76051

Misakicho
creator: Masahide Kanzaki
date: 2004-10-28T15:00:36+0900
description: 打合せでお茶の水方面へ
link: http://www.kanzaki.com/test/exif2rdf?xsl=on&ul=/works/2004/imgdsc/041028_1500.jpg
type: item
maker: 神崎正英
topic:
  location: 東京・三崎町
  lat: 35.70143
  long: 139.75678

Nishi-oshima
creator: Masahide Kanzaki
date: 2004-11-03T13:12:27+0900
description: スコアールの練習
link: http://www.kanzaki.com/test/exif2rdf?xsl=on&ul=/works/2004/imgdsc/041103_1312.jpg
type: item
maker: 神崎正英
topic:
  location: 東京・西大島
  lat: 35.68930
  long: 139.82629

Namikibashi
creator: Masahide Kanzaki
date: 2004-11-04T13:26:29+0900
description: 打合せで並木橋へ。この辺りは久しぶりだ
link: http://www.kanzaki.com/test/exif2rdf?xsl=on&ul=/works/2004/imgdsc/041104_1326.jpg
type: item
maker: 神崎正英
topic:
  location: 東京・並木橋
  lat: 35.65515
  long: 139.70682

Meguro station east side
creator: Masahide Kanzaki
date: 2004-11-04T15:17:55+0900
description: 待ち時間に珍しく目黒東口の喫茶店にいって、ダフニスのスコアを読んでいた。
link: http://www.kanzaki.com/test/exif2rdf?xsl=on&ul=/works/2004/imgdsc/041104_1517.jpg
type: item
maker: 神崎正英
topic:
  location: 東京・目黒
  lat: 35.63370
  long: 139.71604

Meguro station west side
creator: Masahide Kanzaki
date: 2004-11-04T15:21:42+0900
description: 技評との打合せに目黒へ
link: http://www.kanzaki.com/test/exif2rdf?xsl=on&ul=/works/2004/imgdsc/041104_1521.jpg
type: item
maker: 神崎正英
topic:
  location: 東京・目黒
  lat: 35.63333
  long: 139.71554

Irumacho, Chofu
creator: Masahide Kanzaki
date: 2004-11-20T09:18:47+0900
description: 狛江に向かう渋滞しない道を求めて行ったのだが…
link: http://www.kanzaki.com/test/exif2rdf?xsl=on&ul=/works/2004/imgdsc/041120_0918.jpg
type: item
maker: 神崎正英
topic:
  location: 東京・調布
  lat: 35.65017
  long: 139.59001

Takanawa
creator: Masahide Kanzaki
date: 2004-11-23T10:45:13+0900
link: http://www.kanzaki.com/test/exif2rdf?xsl=on&ul=/works/2004/imgdsc/041123_1045.jpg
type: item
maker: 神崎正英
topic:
  location: 東京・高輪
  lat: 35.63212
  long: 139.73073

New Takanawa Prince
creator: Masahide Kanzaki
date: 2004-11-23T10:49:37+0900
description: ノリントンにインタビューするために、間違ってオーケストラ団員の宿泊する新高輪プリンスに行って非常に焦る
link: http://www.kanzaki.com/test/exif2rdf?xsl=on&ul=/works/2004/imgdsc/041123_1049.jpg
type: item
maker: 神崎正英
topic:
  location: 東京・高輪
  lat: 35.63056
  long: 139.73282

Suntory Hall
creator: Masahide Kanzaki
date: 2004-11-23T18:35:24+0900
description: ノリントンの演奏会のため久しぶりにサントリーホールへ
link: http://www.kanzaki.com/test/exif2rdf?xsl=on&ul=/works/2004/imgdsc/041123_1835.jpg
type: item
maker: 神崎正英
topic:
  location: 東京・赤坂
  lat: 35.66702
  long: 139.74148

Higashi-nagasaki
creator: Masahide Kanzaki
date: 2004-12-05T15:06:39+0900
description: 所用で東長崎へ
link: http://www.kanzaki.com/test/exif2rdf?xsl=on&ul=/works/2004/imgdsc/041205_1506.jpg
type: item
maker: 神崎正英
topic:
  location: 東京・東長崎
  lat: 35.72974
  long: 139.68293

Nishiazabu
creator: Masahide Kanzaki
date: 2004-12-09T19:13:22+0900
description: CUGSBの忘年会に西麻布へ
link: http://www.kanzaki.com/test/exif2rdf?xsl=on&ul=/works/2004/imgdsc/041209_1913.jpg
type: item
maker: 神崎正英
topic:
  location: 東京・西麻布
  lat: 35.66010
  long: 139.72342

Koenji
creator: Masahide Kanzaki
date: 2004-12-10T11:37:27+0900
description: 高円寺駅東の環7にかかる歩道橋から
link: http://www.kanzaki.com/test/exif2rdf?xsl=on&ul=/works/2004/imgdsc/041210_1137.jpg
type: item
maker: 神崎正英
topic:
  location: 東京・高円寺
  lat: 35.70630
  long: 139.65471

Higashi-Nakano
creator: Masahide Kanzaki
date: 2004-12-17T11:47:15+0900
description: 乗り換えの関係で珍しく東中野
link: http://www.kanzaki.com/test/exif2rdf?xsl=on&ul=/works/2004/imgdsc/041217_1147.jpg
type: item
maker: 神崎正英
topic:
  location: 東京・東中野
  lat: 35.70668
  long: 139.68309

TWCU
creator: Masahide Kanzaki
date: 2004-12-17T12:50:43+0900
description: 東京女子大学
link: http://www.kanzaki.com/test/exif2rdf?xsl=on&ul=/works/2004/imgdsc/041217_1250.jpg
type: item
maker: 神崎正英
topic:
  location: 東京・西荻窪
  lat: 35.70961
  long: 139.59114

Shin-Nikko bldg
creator: Masahide Kanzaki
date: 2004-12-20T15:04:57+0900
description: 打合せで虎ノ門の新日鉱ビルへ
link: http://www.kanzaki.com/test/exif2rdf?xsl=on&ul=/works/2004/imgdsc/041220_1504.jpg
type: item
maker: 神崎正英
topic:
  location: 東京・虎ノ門
  lat: 35.66859
  long: 139.74604

Seki-machi
creator: Masahide Kanzaki
date: 2004-12-23T08:41:01+0900
description: 花火の練習に朝から青梅街道を走る
link: http://www.kanzaki.com/test/exif2rdf?xsl=on&ul=/works/2004/imgdsc/041223_0841.jpg
type: item
maker: 神崎正英
topic:
  location: 東京・関町
  lat: 35.72146
  long: 139.59065

Musashino Shimin-Bunka Hall
creator: Masahide Kanzaki
date: 2004-12-23T09:04:11+0900
description: 花火の練習で武蔵野市民文化会館へ。以前使ったことがあったつもりが、実は初めてだった
link: http://www.kanzaki.com/test/exif2rdf?xsl=on&ul=/works/2004/imgdsc/041223_0904.jpg
type: item
maker: 神崎正英
topic:
  location: 東京・吉祥寺北町
  lat: 35.71195
  long: 139.56572

Shimo-Shakujii
creator: Masahide Kanzaki
date: 2004-12-23T13:51:12+0900
description: 花火の帰り道、新青梅街道へ
link: http://www.kanzaki.com/test/exif2rdf?xsl=on&ul=/works/2004/imgdsc/041223_1351.jpg
type: item
maker: 神崎正英
topic:
  location: 東京・下石神井
  lat: 35.72939
  long: 139.59947

Akihabara
creator: Masahide Kanzaki
date: 2004-12-24T13:40:04+0900
description: ノリントンのCD-Rを買いに久しぶりに秋葉原へ
link: http://www.kanzaki.com/test/exif2rdf?xsl=on&ul=/works/2004/imgdsc/041224_1340.jpg
type: item
maker: 神崎正英
topic:
  location: 東京・秋葉原
  lat: 35.69855
  long: 139.77070

Kami-igusa
creator: Masahide Kanzaki
date: 2004-12-26T08:37:25+0900
description: 千川通りの下りは上井草で直進できないのでこの付近を迂回する
link: http://www.kanzaki.com/test/exif2rdf?xsl=on&ul=/works/2004/imgdsc/041226_0837.jpg
type: item
maker: 神崎正英
topic:
  location: 東京・上井草
  lat: 35.72183
  long: 139.60035

Narrow street in Kichijoji
creator: Masahide Kanzaki
date: 2004-12-26T08:44:38+0900
description: 花火の練習に向かうのに、道を一本早く曲がったら住宅街の細い道に
link: http://www.kanzaki.com/test/exif2rdf?xsl=on&ul=/works/2004/imgdsc/041226_0844.jpg
type: item
maker: 神崎正英
topic:
  location: 東京・吉祥寺
  lat: 35.70857
  long: 139.58524

Yukihiro Furuse
description: Information analyst and journalist
type: Person
name: 古瀬幸広

Katsuya Hirose
description: Professor of Law, Hosei University
type: Person
name: 廣瀬克哉

Kazuo Nomura
description: Sociologist and the owner of SOCIUS.JP
type: Person
name: 野村一夫

Eric Prud'shommeaux
description: RDF and XML 'sanitation engineer' at W3C
type: Person

Chris Goad
description: Founder and developer of Mapbreau and Fabl language
type: Person

Takayuki Watanabe
description: Professor of Department of Communication, Tokyo Woman's Christian University
type: Person
name: 渡辺隆行

Koichi Oda
description: Professor of Department of Communication, Tokyo Woman's Christian University
type: Person
name: 小田浩一

Jun Ishikawa
description: Professor of Faculty of international Relations, University of Shizuoka
type: Person
name: 石川准

Keiko Kurata
description: Professor of School of Library and Information Science, Keio University
type: Person
name: 倉田敬子

Takashi Harada
description: Associate Professor of School of Library and Information Science, Keio University
type: Person
name: 原田隆史