{"text_format":"1","workbook":"xlsx","n_sheets":10,"sheets":[" ","Initialize Model","Model Input & Results","ResultsSummary","BatchOutput","D values","Charts","chemical database","scenario database","Seal"],"not_rendered":{"charts":8,"images":34,"macros":1,"external_links":0,"defined_names":1,"comments":0,"pivot_tables":0},"unopened":[],"bounds":{"document_bytes":16777216,"sheet_cells":100000,"rows_first":2000,"rows_last":500,"rows_between":2000,"halvings":0,"cell_chars":16384,"cell_head_chars":4096},"cells_cut":0,"cells_raw":0,"read":"whole","date_system":"1900"}

{"sheet":" ","index":0,"n_rows":0,"n_cols":0,"rows_kept":0,"cut":false,"hidden":false,"merged":[]}

{"sheet":"Initialize Model","index":1,"n_rows":9,"n_cols":3,"rows_kept":9,"cut":false,"hidden":false,"merged":[]}
[]
[null,null,"ACC-HUMANsteady 1.0"]
[]
[]
[]
[]
[]
[]
[null,null,"Click this button to start or reset the model."]

{"sheet":"Model Input & Results","index":2,"n_rows":56,"n_cols":17,"rows_kept":56,"cut":false,"hidden":false,"merged":[[16,1,16,2]]}
[null,"Human bioaccumulation model for neutral organic contaminants",null,null,null,null,null,null,null,null,{"$f":"B1","v":"Human bioaccumulation model for neutral organic contaminants"}]
[null,"G.Czub, E. Arbaban, E. Undeman, J. Armitage, M.S. McLachlan",null,null,null,null,null,null,null,null,{"$f":"B2","v":"G.Czub, E. Arbaban, E. Undeman, J. Armitage, M.S. McLachlan"}]
[null,"Dept. of Appl. Environ. Sci. (ITM), Stockholm University, SE-106 91 Stockholm",null,null,null,null,null,null,null,null,{"$f":"B3","v":"Dept. of Appl. Environ. Sci. (ITM), Stockholm University, SE-106 91 Stockholm"}]
[]
[null,null,null,null,null,null,null,null,null,null,"Hypothetical 1"]
[null,null,null,null,null,null,null,null,null,null,"Default Scenario"]
[]
[]
[]
[]
[]
[]
[]
[]
[]
[]
[]
[]
[null,"Human",null,null,null,null,null,null,null,null,"Cattle"]
[null,"30 year-old",null,"30 year-old",null,null,null,null,null,null,null,"Beef Cattle","Milk Cow","Beef","Milk","Dairy Products"]
[null,"Concentration (ng / g body weight)",null,5.6466941446534107E-8,null,null,null,null,null,null,"Concentration (ng / g ww)",1.3424989475276296E-8,1.7231544264503523E-8,1.3424989475276296E-8,6.0560934130094804E-9,2.442667557860861E-8]
[null,"Concentration (ng / g lipid)",null,"--",null,null,null,null,null,null,"Concentration (ng / g lipid)",6.1022679433074066E-8,7.8325201202288735E-8,6.1022679433074066E-8,1.2112186826018961E-7,"--"]
[null,"Body burden (g)",null,7.1148346222632973E-12,null,null,null,null,null,null,"Fugacity (pPa)",0.11324246188382094,0.14535151019418235,0.11324246188382094,0.14535151019418235,0.14535151019418235]
[null,"Daily intake(ng / kg. d)",null,8.6196791570659747E-7,null,null,null,null,null,null,"BAF (Lair / kg ww)",238.82038929617227,306.53611438591179]
[null,"Fugacity (pPa)",null,7.4045882663479023,null,null,null,null,null,null,"BAF (Lair / kg lipid)",1085.5472240735103,1393.345974481417]
[null,"BAF (Lair / kg body weight)",null,1004.504097635272,null,null,null,null,null,null,"BAF (Pa/Pa)",0.11324246188382094,0.14535151019418238]
[null,"BAF (Lair / kg lipid)",null,0,null,null,null,null,null,null,"mmBAF (m2 / organism)","-","-"]
[null,"BAF (Pa/Pa)",null,7.4045882663479023,null,null,null,null,null,null,"BMF (g ww / g ww)",0.32522299181110703,0.3399511959922315]
[null,"mmBAF (m2 / organism)",null,"-",null,null,null,null,null,null,"BMF (Pa / Pa)",0.18964091090468432,0.20248969885935295]
[null,"BMF (kg dietary comp. / kg body weight)",null,1.1836274814809966E-3,null,null,null,null,null,null,"t90 (d)",2.2395730072710318,2.2539091164974749]
[null,"BMF (Pa / Pa)",null,7.421067005990615]
[null,"t90 (d)",null,9.4877985998904735E-2]
[]
[]
[null,"Aquatic Food Chain",null,null,null,null,null,null,null,null,"Grass and Cultivated Plants"]
[null,null,"Zoo-         plankton","Amphipod","benthic           Filter Feeder","benthic Predator","Fish 1","Fish 2",null,null,null,"Grass","Apple","Grain","Potato","Lettuce","Carrot"]
[null,"Concentration (ng / g ww)",2.6995245297625704E-7,2.6995245297625704E-7,1.8415179816149464E-7,1.4688955950640461E-7,1.9777283474536164E-7,1.9093761443131724E-7,null,null,"Leaf:"]
[null,"Concentration (ng / g lipid)",5.8685315864403697E-6,5.8685315864403697E-6,6.6721666000541536E-6,7.9831282340437276E-6,6.1420135014087463E-6,4.7168383011689045E-6,null,null,"Concentration (pg / g ww)",1.3500031723155809E-5,2.2976041722306298E-6,8.2187228025723521E-6,1.2084318250970453E-6,9.0511086576719258E-6,9.4847215116323785E-7]
[null,"Fugacity (pPa)",1,1,0.94649360663161786,0.92127740241292744,0.90549041464087476,0.76054493000475287,null,null,"Fugacity (pPa)",0.25749895156120767,4.382439075585684E-2,0.15676352087414613,2.304957013263564E-2,0.17264040837914935,1.8091111896472261E-2]
[null,"BAF (L / kg)",3.6320081315859403,3.6320081315859403,2.4776245631209268,1.9762890416086025,2.6608854117918801,2.5689226402442027,null,null,"BAF (Lair / kg ww)",240.15533401886637,40.872637097492806,0.14620485050229512,21.497086417762024,161.01236408177343,16.872600816152257]
[null,"BAF (L / kg lipid)",78.95669851273783,78.95669851273783,89.769005910178507,107.4070131309023,82.636192912791302,63.461527674016878,null,null,"BAF (Pa / Paair)",0.25749895156120767,4.382439075585684E-2,0.15676352087414613,2.304957013263564E-2,0.17264040837914937,1.8091111896472261E-2]
[null,"BSAF (g OC / g lipid)","-","-",3.9469946381704898E-6,4.7225086279084074E-6,3.6333766542091913E-6,2.7902983543126398E-6,null,null,"t90 (d)",0.40166305736339397,0.33568956087916552,0.38481570749388216,0.4068924353023225,0.4004535115525984,0.40846040971139758]
[null,"BAF (Pa / Pa)",1,1,0.94649360663161786,0.92127740241292744,0.90549041464087476,0.76054493000475287]
[null,"BMF (g  / g )","-","-",1.0927207976757947,0.92018091373099764,0.73262099516004853,1.0587208772845584,null,null,"Root:"]
[null,"BMF (Pa / Pa)","-","-",0.94649360663161786,0.92127740241292755,0.90549041464087476,0.8274381042243123,null,null,"Concentration (pg / g ww)",6.2849279997375662E-5,2.7477141620426778E-7,1.8254123523053909E-5,4.279134536072729E-6,1.8916776399474151E-5,1.3299533204554072E-7]
[null,"t90 (d)","-","-",2.2251912597814817E-2,3.306190082405018E-2,3.9952622913589635E-2,0.10058675907958683,null,null,"Fugacity (pPa)",0.79915588108256186,3.5326582691550409E-3,0.23468809565677212,5.5015620665747583E-2,0.24320763599252915,1.7098833131915941E-3]
[null,null,null,null,null,null,null,null,null,null,"BAF (g OC / g ww)",3.7179193211468196E-2,1.6254409871479492E-4,1.0798430553189575E-2,2.5313698056868349E-3,1.1190430259878212E-2,7.8674873388382422E-5]
[null,null,null,null,null,null,null,null,null,null,"BAF (Pa / Pasoil)",0.79915588108256186,3.5326582691550409E-3,0.23468809565677212,5.5015620665747583E-2,0.24320763599252915,1.7098833131915941E-3]
[null,null,null,null,null,null,null,null,null,null,"t90 (d)",1.7503172928331658,0.40963791942881933,0.31476262723225296,0.39303484030628111,0.31476262723225307,0.41038724427799189]
[null,null,null,null,null,null,null,null,null,null,"Fruit / Tuber"]
[null,null,null,null,null,null,null,null,null,null,"Concentration (pg / g ww)","-",4.6514847112891139E-7,8.749247041681803E-6,3.7945549015874773E-6,"-","-"]
[null,null,null,null,null,null,null,null,null,null,"Fugacity (pPa)","-",7.9463661212423285E-3,4.3763321509688598E-2,8.538517957635211E-2,"-","-"]
[null,null,null,null,null,null,null,null,null,null,"BAF (Lair  / kg ww)","-",null,null,"-","-","-"]
[null,null,null,null,null,null,null,null,null,null,"BAF (g OC / g ww)","-",8.2746388114572182E-3,0.15564247468431086,2.2447113132168799E-3,"-","-"]
[null,null,null,null,null,null,null,null,null,null,"BAF (Pa / Pa)","-",7.9463661212423285E-3,4.3763321509688598E-2,8.538517957635211E-2,"-","-"]
[null,null,null,null,null,null,null,null,null,null,"t90 (d)","-",0.4156211637150094,0.41501871810328378,0.37340397224365496,"-","-"]

{"sheet":"ResultsSummary","index":3,"n_rows":199,"n_cols":3,"rows_kept":199,"cut":false,"hidden":false,"merged":[]}
["Nr outputs",{"$f":"COUNTA(B2:B199)","v":198}]
[null,"Output"]
[{"$f":"'Model Input & Results'!B19","v":"Human"},{"$f":"'Model Input & Results'!B21","v":"Concentration (ng / g body weight)"},{"$f":"'Model Input & Results'!D21","v":5.6466941446534107E-8}]
[{"$f":"'Model Input & Results'!B20","v":"30 year-old"},{"$f":"'Model Input & Results'!B22","v":"Concentration (ng / g lipid)"},{"$f":"'Model Input & Results'!D22","v":"--"}]
[null,{"$f":"'Model Input & Results'!B23","v":"Body burden (g)"},{"$f":"'Model Input & Results'!D23","v":7.1148346222632973E-12}]
[null,{"$f":"'Model Input & Results'!B24","v":"Daily intake(ng / kg. d)"},{"$f":"'Model Input & Results'!D24","v":8.6196791570659747E-7}]
[null,{"$f":"'Model Input & Results'!B25","v":"Fugacity (pPa)"},{"$f":"'Model Input & Results'!D25","v":7.4045882663479023}]
[null,{"$f":"'Model Input & Results'!B26","v":"BAF (Lair / kg body weight)"},{"$f":"'Model Input & Results'!D26","v":1004.504097635272}]
[null,{"$f":"'Model Input & Results'!B27","v":"BAF (Lair / kg lipid)"},{"$f":"'Model Input & Results'!D27","v":0}]
[null,{"$f":"'Model Input & Results'!B28","v":"BAF (Pa/Pa)"},{"$f":"'Model Input & Results'!D28","v":7.4045882663479023}]
[null,{"$f":"'Model Input & Results'!B29","v":"mmBAF (m2 / organism)"},{"$f":"'Model Input & Results'!D29","v":"-"}]
[null,{"$f":"'Model Input & Results'!B30","v":"BMF (kg dietary comp. / kg body weight)"},{"$f":"'Model Input & Results'!D30","v":1.1836274814809966E-3}]
[null,{"$f":"'Model Input & Results'!B31","v":"BMF (Pa / Pa)"},{"$f":"'Model Input & Results'!D31","v":7.421067005990615}]
[null,{"$f":"'Model Input & Results'!B32","v":"t90 (d)"},{"$f":"'Model Input & Results'!D32","v":9.4877985998904735E-2}]
[{"$f":"'Model Input & Results'!B35","v":"Aquatic Food Chain"},{"$f":"'Model Input & Results'!B37","v":"Concentration (ng / g ww)"},{"$f":"'Model Input & Results'!C37","v":2.6995245297625704E-7}]
[{"$f":"'Model Input & Results'!C36","v":"Zoo-         plankton"},{"$f":"'Model Input & Results'!B38","v":"Concentration (ng / g lipid)"},{"$f":"'Model Input & Results'!C38","v":5.8685315864403697E-6}]
[null,{"$f":"'Model Input & Results'!B39","v":"Fugacity (pPa)"},{"$f":"'Model Input & Results'!C39","v":1}]
[null,{"$f":"'Model Input & Results'!B40","v":"BAF (L / kg)"},{"$f":"'Model Input & Results'!C40","v":3.6320081315859403}]
[null,{"$f":"'Model Input & Results'!B41","v":"BAF (L / kg lipid)"},{"$f":"'Model Input & Results'!C41","v":78.95669851273783}]
[null,{"$f":"'Model Input & Results'!B42","v":"BSAF (g OC / g lipid)"},{"$f":"'Model Input & Results'!C42","v":"-"}]
[null,{"$f":"'Model Input & Results'!B43","v":"BAF (Pa / Pa)"},{"$f":"'Model Input & Results'!C43","v":1}]
[null,{"$f":"'Model Input & Results'!B44","v":"BMF (g  / g )"},{"$f":"'Model Input & Results'!C44","v":"-"}]
[null,{"$f":"'Model Input & Results'!B45","v":"BMF (Pa / Pa)"},{"$f":"'Model Input & Results'!C45","v":"-"}]
[null,{"$f":"'Model Input & Results'!B46","v":"t90 (d)"},{"$f":"'Model Input & Results'!C46","v":"-"}]
[{"$f":"'Model Input & Results'!B35","v":"Aquatic Food Chain"},{"$f":"'Model Input & Results'!B37","v":"Concentration (ng / g ww)"},{"$f":"'Model Input & Results'!D37","v":2.6995245297625704E-7}]
[{"$f":"'Model Input & Results'!D36","v":"Amphipod"},{"$f":"'Model Input & Results'!B38","v":"Concentration (ng / g lipid)"},{"$f":"'Model Input & Results'!D38","v":5.8685315864403697E-6}]
[null,{"$f":"'Model Input & Results'!B39","v":"Fugacity (pPa)"},{"$f":"'Model Input & Results'!D39","v":1}]
[null,{"$f":"'Model Input & Results'!B40","v":"BAF (L / kg)"},{"$f":"'Model Input & Results'!D40","v":3.6320081315859403}]
[null,{"$f":"'Model Input & Results'!B41","v":"BAF (L / kg lipid)"},{"$f":"'Model Input & Results'!D41","v":78.95669851273783}]
[null,{"$f":"'Model Input & Results'!B42","v":"BSAF (g OC / g lipid)"},{"$f":"'Model Input & Results'!D42","v":"-"}]
[null,{"$f":"'Model Input & Results'!B43","v":"BAF (Pa / Pa)"},{"$f":"'Model Input & Results'!D43","v":1}]
[null,{"$f":"'Model Input & Results'!B44","v":"BMF (g  / g )"},{"$f":"'Model Input & Results'!D44","v":"-"}]
[null,{"$f":"'Model Input & Results'!B45","v":"BMF (Pa / Pa)"},{"$f":"'Model Input & Results'!D45","v":"-"}]
[null,{"$f":"'Model Input & Results'!B46","v":"t90 (d)"},{"$f":"'Model Input & Results'!D46","v":"-"}]
[{"$f":"'Model Input & Results'!B35","v":"Aquatic Food Chain"},{"$f":"'Model Input & Results'!B37","v":"Concentration (ng / g ww)"},{"$f":"'Model Input & Results'!E37","v":1.8415179816149464E-7}]
[{"$f":"'Model Input & Results'!E36","v":"benthic           Filter Feeder"},{"$f":"'Model Input & Results'!B38","v":"Concentration (ng / g lipid)"},{"$f":"'Model Input & Results'!E38","v":6.6721666000541536E-6}]
[null,{"$f":"'Model Input & Results'!B39","v":"Fugacity (pPa)"},{"$f":"'Model Input & Results'!E39","v":0.94649360663161786}]
[null,{"$f":"'Model Input & Results'!B40","v":"BAF (L / kg)"},{"$f":"'Model Input & Results'!E40","v":2.4776245631209268}]
[null,{"$f":"'Model Input & Results'!B41","v":"BAF (L / kg lipid)"},{"$f":"'Model Input & Results'!E41","v":89.769005910178507}]
[null,{"$f":"'Model Input & Results'!B42","v":"BSAF (g OC / g lipid)"},{"$f":"'Model Input & Results'!E42","v":3.9469946381704898E-6}]
[null,{"$f":"'Model Input & Results'!B43","v":"BAF (Pa / Pa)"},{"$f":"'Model Input & Results'!E43","v":0.94649360663161786}]
[null,{"$f":"'Model Input & Results'!B44","v":"BMF (g  / g )"},{"$f":"'Model Input & Results'!E44","v":1.0927207976757947}]
[null,{"$f":"'Model Input & Results'!B45","v":"BMF (Pa / Pa)"},{"$f":"'Model Input & Results'!E45","v":0.94649360663161786}]
[null,{"$f":"'Model Input & Results'!B46","v":"t90 (d)"},{"$f":"'Model Input & Results'!E46","v":2.2251912597814817E-2}]
[{"$f":"'Model Input & Results'!B35","v":"Aquatic Food Chain"},{"$f":"'Model Input & Results'!B37","v":"Concentration (ng / g ww)"},{"$f":"'Model Input & Results'!F37","v":1.4688955950640461E-7}]
[{"$f":"'Model Input & Results'!F36","v":"benthic Predator"},{"$f":"'Model Input & Results'!B38","v":"Concentration (ng / g lipid)"},{"$f":"'Model Input & Results'!F38","v":7.9831282340437276E-6}]
[null,{"$f":"'Model Input & Results'!B39","v":"Fugacity (pPa)"},{"$f":"'Model Input & Results'!F39","v":0.92127740241292744}]
[null,{"$f":"'Model Input & Results'!B40","v":"BAF (L / kg)"},{"$f":"'Model Input & Results'!F40","v":1.9762890416086025}]
[null,{"$f":"'Model Input & Results'!B41","v":"BAF (L / kg lipid)"},{"$f":"'Model Input & Results'!F41","v":107.4070131309023}]
[null,{"$f":"'Model Input & Results'!B42","v":"BSAF (g OC / g lipid)"},{"$f":"'Model Input & Results'!F42","v":4.7225086279084074E-6}]
[null,{"$f":"'Model Input & Results'!B43","v":"BAF (Pa / Pa)"},{"$f":"'Model Input & Results'!F43","v":0.92127740241292744}]
[null,{"$f":"'Model Input & Results'!B44","v":"BMF (g  / g )"},{"$f":"'Model Input & Results'!F44","v":0.92018091373099764}]
[null,{"$f":"'Model Input & Results'!B45","v":"BMF (Pa / Pa)"},{"$f":"'Model Input & Results'!F45","v":0.92127740241292755}]
[null,{"$f":"'Model Input & Results'!B46","v":"t90 (d)"},{"$f":"'Model Input & Results'!F46","v":3.306190082405018E-2}]
[{"$f":"'Model Input & Results'!B35","v":"Aquatic Food Chain"},{"$f":"'Model Input & Results'!B37","v":"Concentration (ng / g ww)"},{"$f":"'Model Input & Results'!G37","v":1.9777283474536164E-7}]
[{"$f":"'Model Input & Results'!G36","v":"Fish 1"},{"$f":"'Model Input & Results'!B38","v":"Concentration (ng / g lipid)"},{"$f":"'Model Input & Results'!G38","v":6.1420135014087463E-6}]
[null,{"$f":"'Model Input & Results'!B39","v":"Fugacity (pPa)"},{"$f":"'Model Input & Results'!G39","v":0.90549041464087476}]
[null,{"$f":"'Model Input & Results'!B40","v":"BAF (L / kg)"},{"$f":"'Model Input & Results'!G40","v":2.6608854117918801}]
[null,{"$f":"'Model Input & Results'!B41","v":"BAF (L / kg lipid)"},{"$f":"'Model Input & Results'!G41","v":82.636192912791302}]
[null,{"$f":"'Model Input & Results'!B42","v":"BSAF (g OC / g lipid)"},{"$f":"'Model Input & Results'!G42","v":3.6333766542091913E-6}]
[null,{"$f":"'Model Input & Results'!B43","v":"BAF (Pa / Pa)"},{"$f":"'Model Input & Results'!G43","v":0.90549041464087476}]
[null,{"$f":"'Model Input & Results'!B44","v":"BMF (g  / g )"},{"$f":"'Model Input & Results'!G44","v":0.73262099516004853}]
[null,{"$f":"'Model Input & Results'!B45","v":"BMF (Pa / Pa)"},{"$f":"'Model Input & Results'!G45","v":0.90549041464087476}]
[null,{"$f":"'Model Input & Results'!B46","v":"t90 (d)"},{"$f":"'Model Input & Results'!G46","v":3.9952622913589635E-2}]
[{"$f":"'Model Input & Results'!B35","v":"Aquatic Food Chain"},{"$f":"'Model Input & Results'!B37","v":"Concentration (ng / g ww)"},{"$f":"'Model Input & Results'!H37","v":1.9093761443131724E-7}]
[{"$f":"'Model Input & Results'!H36","v":"Fish 2"},{"$f":"'Model Input & Results'!B38","v":"Concentration (ng / g lipid)"},{"$f":"'Model Input & Results'!H38","v":4.7168383011689045E-6}]
[null,{"$f":"'Model Input & Results'!B39","v":"Fugacity (pPa)"},{"$f":"'Model Input & Results'!H39","v":0.76054493000475287}]
[null,{"$f":"'Model Input & Results'!B40","v":"BAF (L / kg)"},{"$f":"'Model Input & Results'!H40","v":2.5689226402442027}]
[null,{"$f":"'Model Input & Results'!B41","v":"BAF (L / kg lipid)"},{"$f":"'Model Input & Results'!H41","v":63.461527674016878}]
[null,{"$f":"'Model Input & Results'!B42","v":"BSAF (g OC / g lipid)"},{"$f":"'Model Input & Results'!H42","v":2.7902983543126398E-6}]
[null,{"$f":"'Model Input & Results'!B43","v":"BAF (Pa / Pa)"},{"$f":"'Model Input & Results'!H43","v":0.76054493000475287}]
[null,{"$f":"'Model Input & Results'!B44","v":"BMF (g  / g )"},{"$f":"'Model Input & Results'!H44","v":1.0587208772845584}]
[null,{"$f":"'Model Input & Results'!B45","v":"BMF (Pa / Pa)"},{"$f":"'Model Input & Results'!H45","v":0.8274381042243123}]
[null,{"$f":"'Model Input & Results'!B46","v":"t90 (d)"},{"$f":"'Model Input & Results'!H46","v":0.10058675907958683}]
[{"$f":"'Model Input & Results'!K19","v":"Cattle"},{"$f":"'Model Input & Results'!K21","v":"Concentration (ng / g ww)"},{"$f":"'Model Input & Results'!L21","v":1.3424989475276296E-8}]
[{"$f":"'Model Input & Results'!L20","v":"Beef Cattle"},{"$f":"'Model Input & Results'!K22","v":"Concentration (ng / g lipid)"},{"$f":"'Model Input & Results'!L22","v":6.1022679433074066E-8}]
[null,{"$f":"'Model Input & Results'!K23","v":"Fugacity (pPa)"},{"$f":"'Model Input & Results'!L23","v":0.11324246188382094}]
[null,{"$f":"'Model Input & Results'!K24","v":"BAF (Lair / kg ww)"},{"$f":"'Model Input & Results'!L24","v":238.82038929617227}]
[null,{"$f":"'Model Input & Results'!K25","v":"BAF (Lair / kg lipid)"},{"$f":"'Model Input & Results'!L25","v":1085.5472240735103}]
[null,{"$f":"'Model Input & Results'!K26","v":"BAF (Pa/Pa)"},{"$f":"'Model Input & Results'!L26","v":0.11324246188382094}]
[null,{"$f":"'Model Input & Results'!K27","v":"mmBAF (m2 / organism)"},{"$f":"'Model Input & Results'!L27","v":"-"}]
[null,{"$f":"'Model Input & Results'!K28","v":"BMF (g ww / g ww)"},{"$f":"'Model Input & Results'!L28","v":0.32522299181110703}]
[null,{"$f":"'Model Input & Results'!K29","v":"BMF (Pa / Pa)"},{"$f":"'Model Input & Results'!L29","v":0.18964091090468432}]
[null,{"$f":"'Model Input & Results'!K30","v":"t90 (d)"},{"$f":"'Model Input & Results'!L30","v":2.2395730072710318}]
[{"$f":"'Model Input & Results'!K19","v":"Cattle"},{"$f":"'Model Input & Results'!K21","v":"Concentration (ng / g ww)"},{"$f":"'Model Input & Results'!M21","v":1.7231544264503523E-8}]
[{"$f":"'Model Input & Results'!M20","v":"Milk Cow"},{"$f":"'Model Input & Results'!K22","v":"Concentration (ng / g lipid)"},{"$f":"'Model Input & Results'!M22","v":7.8325201202288735E-8}]
[null,{"$f":"'Model Input & Results'!K23","v":"Fugacity (pPa)"},{"$f":"'Model Input & Results'!M23","v":0.14535151019418235}]
[null,{"$f":"'Model Input & Results'!K24","v":"BAF (Lair / kg ww)"},{"$f":"'Model Input & Results'!M24","v":306.53611438591179}]
[null,{"$f":"'Model Input & Results'!K25","v":"BAF (Lair / kg lipid)"},{"$f":"'Model Input & Results'!M25","v":1393.345974481417}]
[null,{"$f":"'Model Input & Results'!K26","v":"BAF (Pa/Pa)"},{"$f":"'Model Input & Results'!M26","v":0.14535151019418238}]
[null,{"$f":"'Model Input & Results'!K27","v":"mmBAF (m2 / organism)"},{"$f":"'Model Input & Results'!M27","v":"-"}]
[null,{"$f":"'Model Input & Results'!K28","v":"BMF (g ww / g ww)"},{"$f":"'Model Input & Results'!M28","v":0.3399511959922315}]
[null,{"$f":"'Model Input & Results'!K29","v":"BMF (Pa / Pa)"},{"$f":"'Model Input & Results'!M29","v":0.20248969885935295}]
[null,{"$f":"'Model Input & Results'!K30","v":"t90 (d)"},{"$f":"'Model Input & Results'!M30","v":2.2539091164974749}]
[{"$f":"'Model Input & Results'!K19","v":"Cattle"},{"$f":"'Model Input & Results'!K21","v":"Concentration (ng / g ww)"},{"$f":"'Model Input & Results'!N21","v":1.3424989475276296E-8}]
[{"$f":"'Model Input & Results'!N20","v":"Beef"},{"$f":"'Model Input & Results'!K22","v":"Concentration (ng / g lipid)"},{"$f":"'Model Input & Results'!N22","v":6.1022679433074066E-8}]
[null,{"$f":"'Model Input & Results'!K23","v":"Fugacity (pPa)"},{"$f":"'Model Input & Results'!N23","v":0.11324246188382094}]
[{"$f":"'Model Input & Results'!K19","v":"Cattle"},{"$f":"'Model Input & Results'!K21","v":"Concentration (ng / g ww)"},{"$f":"'Model Input & Results'!O21","v":6.0560934130094804E-9}]
[{"$f":"'Model Input & Results'!O20","v":"Milk"},{"$f":"'Model Input & Results'!K22","v":"Concentration (ng / g lipid)"},{"$f":"'Model Input & Results'!O22","v":1.2112186826018961E-7}]
[null,{"$f":"'Model Input & Results'!K23","v":"Fugacity (pPa)"},{"$f":"'Model Input & Results'!O23","v":0.14535151019418235}]
[{"$f":"'Model Input & Results'!K19","v":"Cattle"},{"$f":"'Model Input & Results'!K21","v":"Concentration (ng / g ww)"},{"$f":"'Model Input & Results'!P21","v":2.442667557860861E-8}]
[{"$f":"'Model Input & Results'!P20","v":"Dairy Products"},{"$f":"'Model Input & Results'!K22","v":"Concentration (ng / g lipid)"},{"$f":"'Model Input & Results'!P22","v":"--"}]
[null,{"$f":"'Model Input & Results'!K23","v":"Fugacity (pPa)"},{"$f":"'Model Input & Results'!P23","v":0.14535151019418235}]
[{"$f":"'Model Input & Results'!K35","v":"Grass and Cultivated Plants"},{"$f":"'Model Input & Results'!K38","v":"Concentration (pg / g ww)"},{"$f":"'Model Input & Results'!L38","v":1.3500031723155809E-5}]
[{"$f":"'Model Input & Results'!L36","v":"Grass"},{"$f":"'Model Input & Results'!K39","v":"Fugacity (pPa)"},{"$f":"'Model Input & Results'!L39","v":0.25749895156120767}]
[{"$f":"'Model Input & Results'!K37","v":"Leaf:"},{"$f":"'Model Input & Results'!K40","v":"BAF (Lair / kg ww)"},{"$f":"'Model Input & Results'!L40","v":240.15533401886637}]
[null,{"$f":"'Model Input & Results'!K41","v":"BAF (Pa / Paair)"},{"$f":"'Model Input & Results'!L41","v":0.25749895156120767}]
[null,{"$f":"'Model Input & Results'!K42","v":"t90 (d)"},{"$f":"'Model Input & Results'!L42","v":0.40166305736339397}]
[{"$f":"'Model Input & Results'!K44","v":"Root:"},{"$f":"'Model Input & Results'!K45","v":"Concentration (pg / g ww)"},{"$f":"'Model Input & Results'!L45","v":6.2849279997375662E-5}]
[null,{"$f":"'Model Input & Results'!K46","v":"Fugacity (pPa)"},{"$f":"'Model Input & Results'!L46","v":0.79915588108256186}]
[null,{"$f":"'Model Input & Results'!K47","v":"BAF (g OC / g ww)"},{"$f":"'Model Input & Results'!L47","v":3.7179193211468196E-2}]
[null,{"$f":"'Model Input & Results'!K48","v":"BAF (Pa / Pasoil)"},{"$f":"'Model Input & Results'!L48","v":0.79915588108256186}]
[null,{"$f":"'Model Input & Results'!K49","v":"t90 (d)"},{"$f":"'Model Input & Results'!L49","v":1.7503172928331658}]
[{"$f":"'Model Input & Results'!K50","v":"Fruit / Tuber"},{"$f":"'Model Input & Results'!K51","v":"Concentration (pg / g ww)"},{"$f":"'Model Input & Results'!L51","v":"-"}]
[null,{"$f":"'Model Input & Results'!K52","v":"Fugacity (pPa)"},{"$f":"'Model Input & Results'!L52","v":"-"}]
[null,{"$f":"'Model Input & Results'!K53","v":"BAF (Lair  / kg ww)"},{"$f":"'Model Input & Results'!L53","v":"-"}]
[null,{"$f":"'Model Input & Results'!K54","v":"BAF (g OC / g ww)"},{"$f":"'Model Input & Results'!L54","v":"-"}]
[null,{"$f":"'Model Input & Results'!K55","v":"BAF (Pa / Pa)"},{"$f":"'Model Input & Results'!L55","v":"-"}]
[null,{"$f":"'Model Input & Results'!K56","v":"t90 (d)"},{"$f":"'Model Input & Results'!L56","v":"-"}]
[{"$f":"'Model Input & Results'!K35","v":"Grass and Cultivated Plants"},{"$f":"'Model Input & Results'!K38","v":"Concentration (pg / g ww)"},{"$f":"'Model Input & Results'!M38","v":2.2976041722306298E-6}]
[{"$f":"'Model Input & Results'!M36","v":"Apple"},{"$f":"'Model Input & Results'!K39","v":"Fugacity (pPa)"},{"$f":"'Model Input & Results'!M39","v":4.382439075585684E-2}]
[{"$f":"'Model Input & Results'!K37","v":"Leaf:"},{"$f":"'Model Input & Results'!K40","v":"BAF (Lair / kg ww)"},{"$f":"'Model Input & Results'!M40","v":40.872637097492806}]
[null,{"$f":"'Model Input & Results'!K41","v":"BAF (Pa / Paair)"},{"$f":"'Model Input & Results'!M41","v":4.382439075585684E-2}]
[null,{"$f":"'Model Input & Results'!K42","v":"t90 (d)"},{"$f":"'Model Input & Results'!M42","v":0.33568956087916552}]
[{"$f":"'Model Input & Results'!K44","v":"Root:"},{"$f":"'Model Input & Results'!K45","v":"Concentration (pg / g ww)"},{"$f":"'Model Input & Results'!M45","v":2.7477141620426778E-7}]
[null,{"$f":"'Model Input & Results'!K46","v":"Fugacity (pPa)"},{"$f":"'Model Input & Results'!M46","v":3.5326582691550409E-3}]
[null,{"$f":"'Model Input & Results'!K47","v":"BAF (g OC / g ww)"},{"$f":"'Model Input & Results'!M47","v":1.6254409871479492E-4}]
[null,{"$f":"'Model Input & Results'!K48","v":"BAF (Pa / Pasoil)"},{"$f":"'Model Input & Results'!M48","v":3.5326582691550409E-3}]
[null,{"$f":"'Model Input & Results'!K49","v":"t90 (d)"},{"$f":"'Model Input & Results'!M49","v":0.40963791942881933}]
[{"$f":"'Model Input & Results'!K50","v":"Fruit / Tuber"},{"$f":"'Model Input & Results'!K51","v":"Concentration (pg / g ww)"},{"$f":"'Model Input & Results'!M51","v":4.6514847112891139E-7}]
[null,{"$f":"'Model Input & Results'!K52","v":"Fugacity (pPa)"},{"$f":"'Model Input & Results'!M52","v":7.9463661212423285E-3}]
[null,{"$f":"'Model Input & Results'!K53","v":"BAF (Lair  / kg ww)"},{"$f":"'Model Input & Results'!M53","v":0}]
[null,{"$f":"'Model Input & Results'!K54","v":"BAF (g OC / g ww)"},{"$f":"'Model Input & Results'!M54","v":8.2746388114572182E-3}]
[null,{"$f":"'Model Input & Results'!K55","v":"BAF (Pa / Pa)"},{"$f":"'Model Input & Results'!M55","v":7.9463661212423285E-3}]
[null,{"$f":"'Model Input & Results'!K56","v":"t90 (d)"},{"$f":"'Model Input & Results'!M56","v":0.4156211637150094}]
[{"$f":"'Model Input & Results'!K35","v":"Grass and Cultivated Plants"},{"$f":"'Model Input & Results'!K38","v":"Concentration (pg / g ww)"},{"$f":"'Model Input & Results'!N38","v":8.2187228025723521E-6}]
[{"$f":"'Model Input & Results'!N36","v":"Grain"},{"$f":"'Model Input & Results'!K39","v":"Fugacity (pPa)"},{"$f":"'Model Input & Results'!N39","v":0.15676352087414613}]
[{"$f":"'Model Input & Results'!K37","v":"Leaf:"},{"$f":"'Model Input & Results'!K40","v":"BAF (Lair / kg ww)"},{"$f":"'Model Input & Results'!N40","v":0.14620485050229512}]
[null,{"$f":"'Model Input & Results'!K41","v":"BAF (Pa / Paair)"},{"$f":"'Model Input & Results'!N41","v":0.15676352087414613}]
[null,{"$f":"'Model Input & Results'!K42","v":"t90 (d)"},{"$f":"'Model Input & Results'!N42","v":0.38481570749388216}]
[{"$f":"'Model Input & Results'!K44","v":"Root:"},{"$f":"'Model Input & Results'!K45","v":"Concentration (pg / g ww)"},{"$f":"'Model Input & Results'!N45","v":1.8254123523053909E-5}]
[null,{"$f":"'Model Input & Results'!K46","v":"Fugacity (pPa)"},{"$f":"'Model Input & Results'!N46","v":0.23468809565677212}]
[null,{"$f":"'Model Input & Results'!K47","v":"BAF (g OC / g ww)"},{"$f":"'Model Input & Results'!N47","v":1.0798430553189575E-2}]
[null,{"$f":"'Model Input & Results'!K48","v":"BAF (Pa / Pasoil)"},{"$f":"'Model Input & Results'!N48","v":0.23468809565677212}]
[null,{"$f":"'Model Input & Results'!K49","v":"t90 (d)"},{"$f":"'Model Input & Results'!N49","v":0.31476262723225296}]
[{"$f":"'Model Input & Results'!K50","v":"Fruit / Tuber"},{"$f":"'Model Input & Results'!K51","v":"Concentration (pg / g ww)"},{"$f":"'Model Input & Results'!N51","v":8.749247041681803E-6}]
[null,{"$f":"'Model Input & Results'!K52","v":"Fugacity (pPa)"},{"$f":"'Model Input & Results'!N52","v":4.3763321509688598E-2}]
[null,{"$f":"'Model Input & Results'!K53","v":"BAF (Lair  / kg ww)"},{"$f":"'Model Input & Results'!N53","v":0}]
[null,{"$f":"'Model Input & Results'!K54","v":"BAF (g OC / g ww)"},{"$f":"'Model Input & Results'!N54","v":0.15564247468431086}]
[null,{"$f":"'Model Input & Results'!K55","v":"BAF (Pa / Pa)"},{"$f":"'Model Input & Results'!N55","v":4.3763321509688598E-2}]
[null,{"$f":"'Model Input & Results'!K56","v":"t90 (d)"},{"$f":"'Model Input & Results'!N56","v":0.41501871810328378}]
[{"$f":"'Model Input & Results'!K35","v":"Grass and Cultivated Plants"},{"$f":"'Model Input & Results'!K38","v":"Concentration (pg / g ww)"},{"$f":"'Model Input & Results'!O38","v":1.2084318250970453E-6}]
[{"$f":"'Model Input & Results'!O36","v":"Potato"},{"$f":"'Model Input & Results'!K39","v":"Fugacity (pPa)"},{"$f":"'Model Input & Results'!O39","v":2.304957013263564E-2}]
[{"$f":"'Model Input & Results'!K37","v":"Leaf:"},{"$f":"'Model Input & Results'!K40","v":"BAF (Lair / kg ww)"},{"$f":"'Model Input & Results'!O40","v":21.497086417762024}]
[null,{"$f":"'Model Input & Results'!K41","v":"BAF (Pa / Paair)"},{"$f":"'Model Input & Results'!O41","v":2.304957013263564E-2}]
[null,{"$f":"'Model Input & Results'!K42","v":"t90 (d)"},{"$f":"'Model Input & Results'!O42","v":0.4068924353023225}]
[{"$f":"'Model Input & Results'!K44","v":"Root:"},{"$f":"'Model Input & Results'!K45","v":"Concentration (pg / g ww)"},{"$f":"'Model Input & Results'!O45","v":4.279134536072729E-6}]
[null,{"$f":"'Model Input & Results'!K46","v":"Fugacity (pPa)"},{"$f":"'Model Input & Results'!O46","v":5.5015620665747583E-2}]
[null,{"$f":"'Model Input & Results'!K47","v":"BAF (g OC / g ww)"},{"$f":"'Model Input & Results'!O47","v":2.5313698056868349E-3}]
[null,{"$f":"'Model Input & Results'!K48","v":"BAF (Pa / Pasoil)"},{"$f":"'Model Input & Results'!O48","v":5.5015620665747583E-2}]
[null,{"$f":"'Model Input & Results'!K49","v":"t90 (d)"},{"$f":"'Model Input & Results'!O49","v":0.39303484030628111}]
[{"$f":"'Model Input & Results'!K50","v":"Fruit / Tuber"},{"$f":"'Model Input & Results'!K51","v":"Concentration (pg / g ww)"},{"$f":"'Model Input & Results'!O51","v":3.7945549015874773E-6}]
[null,{"$f":"'Model Input & Results'!K52","v":"Fugacity (pPa)"},{"$f":"'Model Input & Results'!O52","v":8.538517957635211E-2}]
[null,{"$f":"'Model Input & Results'!K53","v":"BAF (Lair  / kg ww)"},{"$f":"'Model Input & Results'!O53","v":"-"}]
[null,{"$f":"'Model Input & Results'!K54","v":"BAF (g OC / g ww)"},{"$f":"'Model Input & Results'!O54","v":2.2447113132168799E-3}]
[null,{"$f":"'Model Input & Results'!K55","v":"BAF (Pa / Pa)"},{"$f":"'Model Input & Results'!O55","v":8.538517957635211E-2}]
[null,{"$f":"'Model Input & Results'!K56","v":"t90 (d)"},{"$f":"'Model Input & Results'!O56","v":0.37340397224365496}]
[{"$f":"'Model Input & Results'!K35","v":"Grass and Cultivated Plants"},{"$f":"'Model Input & Results'!K38","v":"Concentration (pg / g ww)"},{"$f":"'Model Input & Results'!P38","v":9.0511086576719258E-6}]
[{"$f":"'Model Input & Results'!P36","v":"Lettuce"},{"$f":"'Model Input & Results'!K39","v":"Fugacity (pPa)"},{"$f":"'Model Input & Results'!P39","v":0.17264040837914935}]
[{"$f":"'Model Input & Results'!K37","v":"Leaf:"},{"$f":"'Model Input & Results'!K40","v":"BAF (Lair / kg ww)"},{"$f":"'Model Input & Results'!P40","v":161.01236408177343}]
[null,{"$f":"'Model Input & Results'!K41","v":"BAF (Pa / Paair)"},{"$f":"'Model Input & Results'!P41","v":0.17264040837914937}]
[null,{"$f":"'Model Input & Results'!K42","v":"t90 (d)"},{"$f":"'Model Input & Results'!P42","v":0.4004535115525984}]
[{"$f":"'Model Input & Results'!K44","v":"Root:"},{"$f":"'Model Input & Results'!K45","v":"Concentration (pg / g ww)"},{"$f":"'Model Input & Results'!P45","v":1.8916776399474151E-5}]
[null,{"$f":"'Model Input & Results'!K46","v":"Fugacity (pPa)"},{"$f":"'Model Input & Results'!P46","v":0.24320763599252915}]
[null,{"$f":"'Model Input & Results'!K47","v":"BAF (g OC / g ww)"},{"$f":"'Model Input & Results'!P47","v":1.1190430259878212E-2}]
[null,{"$f":"'Model Input & Results'!K48","v":"BAF (Pa / Pasoil)"},{"$f":"'Model Input & Results'!P48","v":0.24320763599252915}]
[null,{"$f":"'Model Input & Results'!K49","v":"t90 (d)"},{"$f":"'Model Input & Results'!P49","v":0.31476262723225307}]
[{"$f":"'Model Input & Results'!K50","v":"Fruit / Tuber"},{"$f":"'Model Input & Results'!K51","v":"Concentration (pg / g ww)"},{"$f":"'Model Input & Results'!P51","v":"-"}]
[null,{"$f":"'Model Input & Results'!K52","v":"Fugacity (pPa)"},{"$f":"'Model Input & Results'!P52","v":"-"}]
[null,{"$f":"'Model Input & Results'!K53","v":"BAF (Lair  / kg ww)"},{"$f":"'Model Input & Results'!P53","v":"-"}]
[null,{"$f":"'Model Input & Results'!K54","v":"BAF (g OC / g ww)"},{"$f":"'Model Input & Results'!P54","v":"-"}]
[null,{"$f":"'Model Input & Results'!K55","v":"BAF (Pa / Pa)"},{"$f":"'Model Input & Results'!P55","v":"-"}]
[null,{"$f":"'Model Input & Results'!K56","v":"t90 (d)"},{"$f":"'Model Input & Results'!P56","v":"-"}]
[{"$f":"'Model Input & Results'!K35","v":"Grass and Cultivated Plants"},{"$f":"'Model Input & Results'!K38","v":"Concentration (pg / g ww)"},{"$f":"'Model Input & Results'!Q38","v":9.4847215116323785E-7}]
[{"$f":"'Model Input & Results'!Q36","v":"Carrot"},{"$f":"'Model Input & Results'!K39","v":"Fugacity (pPa)"},{"$f":"'Model Input & Results'!Q39","v":1.8091111896472261E-2}]
[{"$f":"'Model Input & Results'!K37","v":"Leaf:"},{"$f":"'Model Input & Results'!K40","v":"BAF (Lair / kg ww)"},{"$f":"'Model Input & Results'!Q40","v":16.872600816152257}]
[null,{"$f":"'Model Input & Results'!K41","v":"BAF (Pa / Paair)"},{"$f":"'Model Input & Results'!Q41","v":1.8091111896472261E-2}]
[null,{"$f":"'Model Input & Results'!K42","v":"t90 (d)"},{"$f":"'Model Input & Results'!Q42","v":0.40846040971139758}]
[{"$f":"'Model Input & Results'!K44","v":"Root:"},{"$f":"'Model Input & Results'!K45","v":"Concentration (pg / g ww)"},{"$f":"'Model Input & Results'!Q45","v":1.3299533204554072E-7}]
[null,{"$f":"'Model Input & Results'!K46","v":"Fugacity (pPa)"},{"$f":"'Model Input & Results'!Q46","v":1.7098833131915941E-3}]
[null,{"$f":"'Model Input & Results'!K47","v":"BAF (g OC / g ww)"},{"$f":"'Model Input & Results'!Q47","v":7.8674873388382422E-5}]
[null,{"$f":"'Model Input & Results'!K48","v":"BAF (Pa / Pasoil)"},{"$f":"'Model Input & Results'!Q48","v":1.7098833131915941E-3}]
[null,{"$f":"'Model Input & Results'!K49","v":"t90 (d)"},{"$f":"'Model Input & Results'!Q49","v":0.41038724427799189}]
[{"$f":"'Model Input & Results'!K50","v":"Fruit / Tuber"},{"$f":"'Model Input & Results'!K51","v":"Concentration (pg / g ww)"},{"$f":"'Model Input & Results'!Q51","v":"-"}]
[null,{"$f":"'Model Input & Results'!K52","v":"Fugacity (pPa)"},{"$f":"'Model Input & Results'!Q52","v":"-"}]
[null,{"$f":"'Model Input & Results'!K53","v":"BAF (Lair  / kg ww)"},{"$f":"'Model Input & Results'!Q53","v":"-"}]
[null,{"$f":"'Model Input & Results'!K54","v":"BAF (g OC / g ww)"},{"$f":"'Model Input & Results'!Q54","v":"-"}]
[null,{"$f":"'Model Input & Results'!K55","v":"BAF (Pa / Pa)"},{"$f":"'Model Input & Results'!Q55","v":"-"}]
[null,{"$f":"'Model Input & Results'!K56","v":"t90 (d)"},{"$f":"'Model Input & Results'!Q56","v":"-"}]

{"sheet":"BatchOutput","index":4,"n_rows":201,"n_cols":28,"rows_kept":201,"cut":false,"hidden":false,"merged":[]}
["2018-11-12T14:42:15","Output","Chemical"]
[null,null,"Hypothetical 1","a-HCH","g-HCH (lindane)","b-HCH","HCB","HCBz_popcycling","PCB-8","PCB-28","PCB-52","PCB-101","PCB-118","PCB-138","PCB-153","PCB-180","pp-DDT","pp-DDD","pp-DDE","PBDE-47","PBDE-99","PBDE-100","PBDE-153","test chemical","test chemical","101-80-4","102-09-0","10226-30-9"]
[{"$f":"IF(ResultsSummary!A3=\"\",\"\",ResultsSummary!A3)","v":"Human"},{"$f":"ResultsSummary!B3","v":"Concentration (ng / g body weight)"},1.1080114054936113E-5,3.5346070397848157E-4,9.3906508688418734E-4,8.8606860444676583E-3,3.2317774969260239E-4,9.8769089274940497E-5,4.6443139333195084E-4,6.4113308252214422E-3,1.3094102726896576E-2,0.18088633120564612,1.4313141098675128,1.6378307995647716,1.3888401070849288,5.5022111880211222,1.7277446120293647,1.4315688562756015,0.2732712382871974,12.381104148742113,104.47788871874542,74.744529136558796,640.35181302129752,0.70178122350167693,5.6662621562354563,0.70604594617986272,3.4277936925722415E-6,5.6466941446534107E-8]
[{"$f":"IF(ResultsSummary!A4=\"\",\"\",ResultsSummary!A4)","v":"30 year-old"},{"$f":"ResultsSummary!B4","v":"Concentration (ng / g lipid)"},"--","--","--","--","--","--","--","--","--","--","--","--","--","--","--","--","--","--","--","--","--","--","--","--","--","--"]
[{"$f":"IF(ResultsSummary!A5=\"\",\"\",ResultsSummary!A5)","v":""},{"$f":"ResultsSummary!B5","v":"Body burden (g)"},1.3960943709219502E-9,4.4536048701288678E-8,1.1832220094740761E-7,1.1164464416029249E-6,4.0720396461267902E-8,1.2444905248642503E-8,5.8518355559825806E-8,8.0782768397790172E-7,1.6498569435889685E-6,2.2791677731911413E-5,1.8034557784330662E-4,2.0636668074516123E-4,1.7499385349270102E-4,6.9327860969066143E-4,2.1769582111569997E-4,1.8037767589072578E-4,3.4432176024186877E-5,1.5600191227415061E-3,1.3164213978561923E-2,9.4178106712064086E-3,8.0684328440683489E-2,8.8424434161211288E-5,7.1394903168566751E-4,8.8961789218662703E-5,4.3190200526410245E-10,7.1148346222632973E-12]
[{"$f":"IF(ResultsSummary!A6=\"\",\"\",ResultsSummary!A6)","v":""},{"$f":"ResultsSummary!B6","v":"Daily intake(ng / kg. d)"},4.0337018544421895E-3,1.7352712108225897E-3,5.3649346964757521E-3,3.9626255124545873E-2,2.6964050751650294E-3,1.1648907277983494E-3,2.3405773333184093E-3,3.0481259249017709E-2,6.712151356200817E-2,0.52452201166399504,3.9771276608672723,4.4942886677835041,3.7773717020534727,15.083537354643584,6.1370073350955989,3.8573698959274774,1.1396793492303294,37.595939823175577,285.59379279277624,214.94248769101438,1724.3351631353783,2.7660429383111484,82.557293435190303,12.609916579755795,2.875407020647672E-6,8.6196791570659747E-7]
[{"$f":"IF(ResultsSummary!A7=\"\",\"\",ResultsSummary!A7)","v":""},{"$f":"ResultsSummary!B7","v":"Fugacity (pPa)"},5.6897009324765888E-5,20.066403772082666,20.611065946786702,30.342870261038826,25.805954162080859,18.067560522414578,43.413454568937574,103.99935182094735,183.19061027766583,290.16296433572211,574.49805735239897,505.89068740514472,553.36645530526971,447.18730731262406,279.42426397130686,486.44484733489759,239.36260739272612,619.53362576449422,620.8436732312091,958.837000023516,874.37684155014665,478.73786949866877,25.769230085332168,72.012076496377517,11.65950188041233,7.4045882663479023]
[{"$f":"IF(ResultsSummary!A8=\"\",\"\",ResultsSummary!A8)","v":""},{"$f":"ResultsSummary!B8","v":"BAF (Lair / kg body weight)"},265305.79656788765,2909376.4879635838,7729554.80961941,72933345.503014296,2717089.6964605334,830392.79484120477,4984533.3482680852,59617458.992219664,107373077.33071378,1326960844.9797719,10499951920.092793,10866374278.369316,9214417277.0506783,33328283681.648922,11669864560.98926,10745436613.384668,2038409338.4251969,61024520315.110786,443005489712.41882,316930569133.18341,2382347533182.4302,16803674185.515661,90449862848.527908,8443185371.8390903,38315.759800630862,1004.504097635272]
[{"$f":"IF(ResultsSummary!A9=\"\",\"\",ResultsSummary!A9)","v":""},{"$f":"ResultsSummary!B9","v":"BAF (Lair / kg lipid)"},0,0,0,0,0,0,0,0,0,0,0,0,0,0,0,0,0,0,0,0,0,0,0,0,0,0]
[{"$f":"IF(ResultsSummary!A10=\"\",\"\",ResultsSummary!A10)","v":""},{"$f":"ResultsSummary!B10","v":"BAF (Pa/Pa)"},5.6897009324765888E-5,20.066403772082666,20.611065946786706,30.342870261038826,25.805954162080859,18.067560522414578,43.413454568937581,103.99935182094735,183.19061027766583,290.16296433572211,574.49805735239897,505.89068740514472,553.36645530526971,447.18730731262406,279.42426397130686,486.44484733489759,239.36260739272612,619.53362576449422,620.8436732312091,958.837000023516,874.37684155014665,478.73786949866877,25.769230085332168,72.012076496377517,11.65950188041233,7.4045882663479023]
[{"$f":"IF(ResultsSummary!A11=\"\",\"\",ResultsSummary!A11)","v":""},{"$f":"ResultsSummary!B11","v":"mmBAF (m2 / organism)"},"-","-","-","-","-","-","-","-","-","-","-","-","-","-","-","-","-","-","-","-","-","-","-","-","-","-"]
[{"$f":"IF(ResultsSummary!A12=\"\",\"\",ResultsSummary!A12)","v":""},{"$f":"ResultsSummary!B12","v":"BMF (kg dietary comp. / kg body weight)"},7.8379823623052174E-3,0.33534486361546018,0.28098261966597859,0.26064348767897721,1.246986144851562,0.9167063031931667,1.5142401963171463,3.621535206452994,3.7855532927447446,7.727396702479564,8.5056036074494052,8.5961979317912967,8.6739955551878509,8.7063378006180194,6.4912089902889241,8.8179391139913026,5.2764431697327749,7.7417161356440891,8.7341696157674846,8.2391351650321614,8.9044459249009549,5.9319398463041368,1.2671012617601944,9.1452424242990948E-4,6.7981326183097351E-2,1.1836274814809966E-3]
[{"$f":"IF(ResultsSummary!A13=\"\",\"\",ResultsSummary!A13)","v":""},{"$f":"ResultsSummary!B13","v":"BMF (Pa / Pa)"},0.13811867080207033,19.386660505677693,19.422125867313255,30.048986268738034,17.37185495599579,12.726539082830445,27.494509884864591,56.091464864059184,67.155249704597779,123.99627201645792,160.41575420915515,154.42010720194847,159.29184187232718,146.83107211842915,114.34065840562032,149.13980251955323,100.15074392132598,175.66958167197973,182.29460008641718,231.96696188110863,227.62259185001807,131.37106584742673,25.208654255230496,72.053294302474711,12.492613229834916,7.421067005990615]
[{"$f":"IF(ResultsSummary!A14=\"\",\"\",ResultsSummary!A14)","v":""},{"$f":"ResultsSummary!B14","v":"t90 (d)"},2410.6675289576169,37.541888222988163,31.357935341950562,27.449713301592947,486.37622510422312,349.98462202888282,296.53485656028147,818.37679788553237,871.54875949100017,1822.6634696507863,2055.9619043032094,2082.5148454200275,2113.5038870136423,2310.606794780987,1516.0348734099582,2182.6972624906484,1213.6646691139963,1833.7309651410935,2128.2873774411228,1969.9780788075723,2266.2309586099573,2381.5168913240818,2408.796781096758,7.3804128833159857E-2,5.4418177097273173,9.4877985998904735E-2]
[{"$f":"IF(ResultsSummary!A15=\"\",\"\",ResultsSummary!A15)","v":"Aquatic Food Chain"},{"$f":"ResultsSummary!B15","v":"Concentration (ng / g ww)"},17.483963866492687,7.645460696353286E-4,2.4671683916232595E-3,3.0951974310649423E-2,5.7252887791031627E-4,2.4991775219040453E-4,7.5153991455172825E-4,4.6408338167093777E-3,8.1690637742418935E-3,5.5454043543216716E-2,0.33242773416097698,0.38333790032403781,0.31641688053997075,1.2171171286023375,0.6549351929840046,0.30551005356286626,0.14497890914096331,3.5550529161736244,23.611771373584176,19.130844155545208,136.7202143769473,0.27366323024547778,41.049481673436865,3.4725899324257492,1.3959943289426466E-5,2.6995245297625704E-7]
[{"$f":"IF(ResultsSummary!A16=\"\",\"\",ResultsSummary!A16)","v":"Zoo-         plankton"},{"$f":"ResultsSummary!B16","v":"Concentration (ng / g lipid)"},380.08617101071053,1.6620566731202793E-2,5.3634095470070857E-2,0.67286900675324823,1.2446279954572093E-2,5.432994612834881E-3,1.6337824229385393E-2,0.10088769166759516,0.17758834291830203,1.2055226857221024,7.2266898730647169,8.3334326157399516,6.8786278378254506,26.459068013094292,14.237721586608792,6.6415229035405705,3.1517154161078982,77.283759047252701,513.29937768661239,415.88791642489576,2972.1785734118976,5.949200657510386,892.38003637906218,75.491085487516273,3.034770280310101E-4,5.8685315864403697E-6]
[{"$f":"IF(ResultsSummary!A17=\"\",\"\",ResultsSummary!A17)","v":""},{"$f":"ResultsSummary!B17","v":"Fugacity (pPa)"},1,1,1,1,1,1,1,1,1,1,1,1,1,1,1,1,1,1,1,1,1,1,1,1,1,1]
[{"$f":"IF(ResultsSummary!A18=\"\",\"\",ResultsSummary!A18)","v":""},{"$f":"ResultsSummary!B18","v":"BAF (L / kg)"},93259955060.832047,617.91180983618472,624.37459114433432,691.10001094057213,25482.679959895875,26076.230357750544,11722.816599904318,58802.850100617397,94936.43006478122,154904.78057124934,479992.42266375269,418490.41437046544,481675.45295157708,1057523.1344734069,154592.67828810454,929218.96103423252,97937.78084525984,238710.37540562981,552745.2407352092,321499.22257958871,1163407.898049647,9676799.9178957399,96767992.428957567,2.8864621434571793,178.45318092600391,3.6320081315859403]
[{"$f":"IF(ResultsSummary!A19=\"\",\"\",ResultsSummary!A19)","v":""},{"$f":"ResultsSummary!B19","v":"BAF (L / kg lipid)"},2027390327409.3921,13432.865431221404,13573.360677050747,15023.913281316783,553971.30347599729,566874.572994577,254843.83912835468,1278322.8282742912,2063835.4361908964,3367495.2298097676,10434617.883994624,9097617.7037057709,10471205.498947328,22989633.358117539,3360710.3975674887,20200412.196396358,2129082.1922882572,5189355.9870789088,12016200.885548022,6989113.5343388831,25291476.044557542,210365215.6064291,2103652009.3251643,62.749177031677803,3879.4169766522582,78.95669851273783]
[{"$f":"IF(ResultsSummary!A20=\"\",\"\",ResultsSummary!A20)","v":""},{"$f":"ResultsSummary!B20","v":"BSAF (g OC / g lipid)"},"-","-","-","-","-","-","-","-","-","-","-","-","-","-","-","-","-","-","-","-","-","-","-","-","-","-"]
[{"$f":"IF(ResultsSummary!A21=\"\",\"\",ResultsSummary!A21)","v":""},{"$f":"ResultsSummary!B21","v":"BAF (Pa / Pa)"},1,1,1,1,1,1,1,1,1,1,1,1,1,1,1,1,1,1,1,1,1,1,1,1,1,1]
[{"$f":"IF(ResultsSummary!A22=\"\",\"\",ResultsSummary!A22)","v":""},{"$f":"ResultsSummary!B22","v":"BMF (g  / g )"},"-","-","-","-","-","-","-","-","-","-","-","-","-","-","-","-","-","-","-","-","-","-","-","-","-","-"]
[{"$f":"IF(ResultsSummary!A23=\"\",\"\",ResultsSummary!A23)","v":""},{"$f":"ResultsSummary!B23","v":"BMF (Pa / Pa)"},"-","-","-","-","-","-","-","-","-","-","-","-","-","-","-","-","-","-","-","-","-","-","-","-","-","-"]
[{"$f":"IF(ResultsSummary!A24=\"\",\"\",ResultsSummary!A24)","v":""},{"$f":"ResultsSummary!B24","v":"t90 (d)"},"-","-","-","-","-","-","-","-","-","-","-","-","-","-","-","-","-","-","-","-","-","-","-","-","-","-"]
[{"$f":"IF(ResultsSummary!A25=\"\",\"\",ResultsSummary!A25)","v":"Aquatic Food Chain"},{"$f":"ResultsSummary!B25","v":"Concentration (ng / g ww)"},17.483963866492687,7.645460696353286E-4,2.4671683916232595E-3,3.0951974310649423E-2,5.7252887791031627E-4,2.4991775219040453E-4,7.5153991455172825E-4,4.6408338167093777E-3,8.1690637742418935E-3,5.5454043543216716E-2,0.33242773416097698,0.38333790032403781,0.31641688053997075,1.2171171286023375,0.6549351929840046,0.30551005356286626,0.14497890914096331,3.5550529161736244,23.611771373584176,19.130844155545208,136.7202143769473,0.27366323024547778,41.049481673436865,3.4725899324257492,1.3959943289426466E-5,2.6995245297625704E-7]
[{"$f":"IF(ResultsSummary!A26=\"\",\"\",ResultsSummary!A26)","v":"Amphipod"},{"$f":"ResultsSummary!B26","v":"Concentration (ng / g lipid)"},380.08617101071053,1.6620566731202793E-2,5.3634095470070857E-2,0.67286900675324823,1.2446279954572093E-2,5.432994612834881E-3,1.6337824229385393E-2,0.10088769166759516,0.17758834291830203,1.2055226857221024,7.2266898730647169,8.3334326157399516,6.8786278378254506,26.459068013094292,14.237721586608792,6.6415229035405705,3.1517154161078982,77.283759047252701,513.29937768661239,415.88791642489576,2972.1785734118976,5.949200657510386,892.38003637906218,75.491085487516273,3.034770280310101E-4,5.8685315864403697E-6]
[{"$f":"IF(ResultsSummary!A27=\"\",\"\",ResultsSummary!A27)","v":""},{"$f":"ResultsSummary!B27","v":"Fugacity (pPa)"},1,1,1,1,1,1,1,1,1,1,1,1,1,1,1,1,1,1,1,1,1,1,1,1,1,1]
[{"$f":"IF(ResultsSummary!A28=\"\",\"\",ResultsSummary!A28)","v":""},{"$f":"ResultsSummary!B28","v":"BAF (L / kg)"},93259955060.832047,617.91180983618472,624.37459114433432,691.10001094057213,25482.679959895875,26076.230357750544,11722.816599904318,58802.850100617397,94936.43006478122,154904.78057124934,479992.42266375269,418490.41437046544,481675.45295157708,1057523.1344734069,154592.67828810454,929218.96103423252,97937.78084525984,238710.37540562981,552745.2407352092,321499.22257958871,1163407.898049647,9676799.9178957399,96767992.428957567,2.8864621434571793,178.45318092600391,3.6320081315859403]
[{"$f":"IF(ResultsSummary!A29=\"\",\"\",ResultsSummary!A29)","v":""},{"$f":"ResultsSummary!B29","v":"BAF (L / kg lipid)"},2027390327409.3921,13432.865431221404,13573.360677050747,15023.913281316783,553971.30347599729,566874.572994577,254843.83912835468,1278322.8282742912,2063835.4361908964,3367495.2298097676,10434617.883994624,9097617.7037057709,10471205.498947328,22989633.358117539,3360710.3975674887,20200412.196396358,2129082.1922882572,5189355.9870789088,12016200.885548022,6989113.5343388831,25291476.044557542,210365215.6064291,2103652009.3251643,62.749177031677803,3879.4169766522582,78.95669851273783]
[{"$f":"IF(ResultsSummary!A30=\"\",\"\",ResultsSummary!A30)","v":""},{"$f":"ResultsSummary!B30","v":"BSAF (g OC / g lipid)"},"-","-","-","-","-","-","-","-","-","-","-","-","-","-","-","-","-","-","-","-","-","-","-","-","-","-"]
[{"$f":"IF(ResultsSummary!A31=\"\",\"\",ResultsSummary!A31)","v":""},{"$f":"ResultsSummary!B31","v":"BAF (Pa / Pa)"},1,1,1,1,1,1,1,1,1,1,1,1,1,1,1,1,1,1,1,1,1,1,1,1,1,1]
[{"$f":"IF(ResultsSummary!A32=\"\",\"\",ResultsSummary!A32)","v":""},{"$f":"ResultsSummary!B32","v":"BMF (g  / g )"},"-","-","-","-","-","-","-","-","-","-","-","-","-","-","-","-","-","-","-","-","-","-","-","-","-","-"]
[{"$f":"IF(ResultsSummary!A33=\"\",\"\",ResultsSummary!A33)","v":""},{"$f":"ResultsSummary!B33","v":"BMF (Pa / Pa)"},"-","-","-","-","-","-","-","-","-","-","-","-","-","-","-","-","-","-","-","-","-","-","-","-","-","-"]
[{"$f":"IF(ResultsSummary!A34=\"\",\"\",ResultsSummary!A34)","v":""},{"$f":"ResultsSummary!B34","v":"t90 (d)"},"-","-","-","-","-","-","-","-","-","-","-","-","-","-","-","-","-","-","-","-","-","-","-","-","-","-"]
[{"$f":"IF(ResultsSummary!A35=\"\",\"\",ResultsSummary!A35)","v":"Aquatic Food Chain"},{"$f":"ResultsSummary!B35","v":"Concentration (ng / g ww)"},3.9887057615998492E-5,4.7840750347077768E-4,1.5436907773950178E-3,1.9351691796219827E-2,3.0555399296366465E-4,1.329682565994811E-4,4.3365288474359189E-4,2.1336360583682611E-3,3.3173087916975011E-3,1.9222207641499674E-2,7.385401602313188E-2,9.005512400360835E-2,7.0021106606638739E-2,0.18805807695495316,0.22745672556933411,5.1238050845390813E-2,5.8329581683790439E-2,1.0509673287212795,4.9352224750993461,5.0204057148828491,20.655652231864902,1.3028594763455942E-2,0.22792037238946591,2.4160026541586999,6.0439682188527299E-6,1.8415179816149464E-7]
[{"$f":"IF(ResultsSummary!A36=\"\",\"\",ResultsSummary!A36)","v":"benthic           Filter Feeder"},{"$f":"ResultsSummary!B36","v":"Concentration (ng / g lipid)"},1.4451832469564673E-3,1.7333605198216584E-2,5.5930825267935434E-2,0.70114825348622567,1.1070796846509591E-2,4.8176904565029382E-3,1.5712061041434491E-2,7.7305654288705117E-2,0.12019234752527178,0.69645679860506071,2.6758701457656477,3.26286681172494,2.536996616182563,6.8136984403968537,8.2411857090338447,1.8564511175866236,2.1133906407170451,38.07852640294491,178.81240851809224,181.89875778561046,748.39319680669928,0.47205053490782395,8.2579845068647071,87.53632804922826,2.1898435575553368E-4,6.6721666000541536E-6]
[{"$f":"IF(ResultsSummary!A37=\"\",\"\",ResultsSummary!A37)","v":""},{"$f":"ResultsSummary!B37","v":"Fugacity (pPa)"},3.617162845000222E-6,0.99130218396123804,0.99123590743528156,0.9905602120730721,0.84617013278212372,0.84356430638293012,0.91484378885864626,0.72894784652134736,0.64385371004209568,0.54959725208959009,0.35225110060811149,0.37247925653028191,0.3508688544261851,0.2449826705136384,0.55064913262849113,0.26591498560418853,0.63790748230706096,0.46872504954632832,0.33140092725526082,0.4160829712353511,0.23954215359285105,7.5484375242488702E-2,8.8034200959985799E-3,0.93515280399463585,0.68447033314605077,0.94649360663161786]
[{"$f":"IF(ResultsSummary!A38=\"\",\"\",ResultsSummary!A38)","v":""},{"$f":"ResultsSummary!B38","v":"BAF (L / kg)"},212758.68728519909,386.65249623196701,390.66700970303043,432.08728069681234,13599.898474258327,13873.807918674449,6764.289078246512,27034.77139340065,38551.964191943182,53695.126027752551,106637.81758120231,98313.279559877832,106591.81072566964,163399.03722562836,53689.502071488976,155842.23110410999,39403.45407198718,70569.077730671968,115532.23567684049,84369.331601141836,175767.34395444568,460694.35277884098,537288.07211860805,2.0082129866827478,77.261442378986615,2.4776245631209268]
[{"$f":"IF(ResultsSummary!A39=\"\",\"\",ResultsSummary!A39)","v":""},{"$f":"ResultsSummary!B39","v":"BAF (L / kg lipid)"},7708648.090043447,14009.148414201703,14154.601800834438,15655.336257130884,492749.94471950468,502674.19995197281,245082.93761762732,979520.70265944384,1396810.2968095357,1945475.5807156723,3863689.0427971855,3562075.346372385,3862022.1277416539,5920254.9719430553,1945271.8141843833,5646457.6486996375,1427661.3794198255,2556850.6424156511,4185950.5680014663,3056859.8406210812,6368382.0273349872,16691824.376044963,19466959.134732179,72.761340097201014,2799.3276224270512,89.769005910178507]
[{"$f":"IF(ResultsSummary!A40=\"\",\"\",ResultsSummary!A40)","v":""},{"$f":"ResultsSummary!B40","v":"BSAF (g OC / g lipid)"},1.7714568315929953E-9,1.1553781903268799E-5,1.213302160460528E-5,1.4531453528529715E-5,1.9824236436902837E-5,1.9849838351231913E-5,2.0577496769083253E-5,2.2263000499304723E-5,2.3562908613832694E-5,2.1899329173608274E-5,1.8791719358507525E-5,1.8978663040979797E-5,1.8658361379939282E-5,1.4468493787567593E-5,2.2157180445376805E-5,1.4969830564472225E-5,2.461247037831704E-5,2.3646239927481735E-5,1.8461317547778201E-5,2.4187595595060125E-5,1.6539373194868517E-5,7.7946470217650419E-6,1.4079630829091467E-6,6.8754268429606379E-6,6.2457092721117583E-6,3.9469946381704898E-6]
[{"$f":"IF(ResultsSummary!A41=\"\",\"\",ResultsSummary!A41)","v":""},{"$f":"ResultsSummary!B41","v":"BAF (Pa / Pa)"},3.617162845000222E-6,0.99130218396123804,0.99123590743528156,0.9905602120730721,0.84617013278212372,0.84356430638293023,0.91484378885864637,0.72894784652134736,0.64385371004209568,0.54959725208959009,0.35225110060811149,0.37247925653028191,0.3508688544261851,0.2449826705136384,0.55064913262849113,0.26591498560418853,0.63790748230706096,0.46872504954632832,0.33140092725526088,0.41608297123535115,0.23954215359285105,7.5484375242488702E-2,8.8034200959985799E-3,0.93515280399463585,0.68447033314605077,0.94649360663161786]
[{"$f":"IF(ResultsSummary!A42=\"\",\"\",ResultsSummary!A42)","v":""},{"$f":"ResultsSummary!B42","v":"BMF (g  / g )"},2.8791282654178118E-4,2.2076204951408522,2.2117994452370717,2.2529530664654156,3.8134171341112757,3.8183376055321747,3.5575875321064241,3.8507145689195079,3.7252503759416538,3.489883173979714,2.7729291522402506,2.8567640479820295,2.7638855508207589,2.2407931444040581,3.4952229328423261,2.3732125400989705,3.7127362802667037,3.2312206966906407,2.6796940982961273,3.0352642924324864,2.2311168449921484,1.051470308948393,0.18992901867402376,1.1287128837094509,1.209306877400159,1.0927207976757947]
[{"$f":"IF(ResultsSummary!A43=\"\",\"\",ResultsSummary!A43)","v":""},{"$f":"ResultsSummary!B43","v":"BMF (Pa / Pa)"},3.6171628450002216E-6,0.99130218396123804,0.99123590743528134,0.99056021207307188,0.84617013278212361,0.84356430638293034,0.91484378885864626,0.72894784652134748,0.64385371004209568,0.5495972520895902,0.35225110060811149,0.37247925653028191,0.3508688544261851,0.24498267051363837,0.55064913262849102,0.26591498560418858,0.63790748230706085,0.46872504954632832,0.33140092725526088,0.41608297123535115,0.23954215359285105,7.5484375242488702E-2,8.8034200959985816E-3,0.93515280399463574,0.68447033314605066,0.94649360663161786]
[{"$f":"IF(ResultsSummary!A44=\"\",\"\",ResultsSummary!A44)","v":""},{"$f":"ResultsSummary!B44","v":"t90 (d)"},362.43794586593407,1.7135886056800882,1.731237301158091,1.9132694466335554,55.787376946801615,56.832242930267121,28.738315745456298,103.53134674981375,138.78215125094155,177.86398031566216,259.41308179256288,251.05485130925646,259.7834273615623,300.0491511718069,177.56545284337869,293.51920934388943,141.23118549710563,211.59902824399603,267.71804664074028,233.32677035393272,303.02191839584123,350.41896225200878,361.38940649830414,2.1227319225468465E-2,0.34731874260618811,2.2251912597814817E-2]
[{"$f":"IF(ResultsSummary!A45=\"\",\"\",ResultsSummary!A45)","v":"Aquatic Food Chain"},{"$f":"ResultsSummary!B45","v":"Concentration (ng / g ww)"},5.8264810929016799E-3,3.7157760468953125E-4,1.1993445179754776E-3,1.5082037000650786E-2,4.3452905002176626E-4,1.9070214131801909E-4,4.8072987247504073E-4,4.2612303164453408E-3,8.238349494253068E-3,6.0143486264099322E-2,0.40140341720990935,0.45817305167582528,0.38116677241139357,1.4794850723991178,0.7122494619324824,0.37810398330043588,0.14690132648220544,4.0672284263412397,28.683683506602375,22.476808586800377,168.70974870114765,0.26761141236450914,11.31752402899013,1.9474832527923525,4.0874367522615142E-6,1.4688955950640461E-7]
[{"$f":"IF(ResultsSummary!A46=\"\",\"\",ResultsSummary!A46)","v":"benthic Predator"},{"$f":"ResultsSummary!B46","v":"Concentration (ng / g lipid)"},0.31665658113596085,2.0194435037474524E-2,6.5181767281275949E-2,0.81967592394841227,2.3615709240313382E-2,1.0364246810761906E-2,2.6126623504078298E-2,0.23158860415463808,0.44773638555723194,3.2686677317445278,21.815403109234204,24.900709330207892,20.715585457140953,80.40679741299553,38.709209887634913,20.5491295271976,7.9837677435981211,221.04502317071956,1558.8958427501288,1221.565684065238,9169.008081584112,14.544098498071149,615.08282766250704,105.84148113001915,2.2214330175334313E-4,7.9831282340437276E-6]
[{"$f":"IF(ResultsSummary!A47=\"\",\"\",ResultsSummary!A47)","v":""},{"$f":"ResultsSummary!B47","v":"Fugacity (pPa)"},7.0352175672007704E-4,1.0245359546061543,1.0247855877194409,1.0273528443456179,1.6022018511981693,1.6108482197623346,1.3502896317142909,1.9384002636680646,2.128996341571312,2.2896228848432778,2.5491423969868543,2.523236410830759,2.5431130889265017,2.5661907579759897,2.2958439976114682,2.6127413508538639,2.1390848165154028,2.4152492443609148,2.5645828840484515,2.4803352963799092,2.6050628442475849,2.0644255833942018,0.58204268440098217,0.90332922030183527,0.61503773852640187,0.92127740241292744]
[{"$f":"IF(ResultsSummary!A48=\"\",\"\",ResultsSummary!A48)","v":""},{"$f":"ResultsSummary!B48","v":"BAF (L / kg)"},31078614.039471857,300.31177888052946,303.52214530417297,336.75383132408575,19340.447516634747,19897.718041799399,7498.6145379673017,53992.988639229574,95741.631137279808,168004.22380866893,579586.41500950523,500188.03276982781,580242.99284549698,1285488.1871285541,168121.29369278369,1150015.8061182711,99236.433796749741,273101.31449670641,671477.34467593161,377729.09694797534,1435619.8533724742,9462806.1317332853,26679364.389162309,1.6187735360608029,52.250648527160976,1.9762890416086025]
[{"$f":"IF(ResultsSummary!A49=\"\",\"\",ResultsSummary!A49)","v":""},{"$f":"ResultsSummary!B49","v":"BAF (L / kg lipid)"},1689055110.8408618,16321.292330463557,16495.768766531135,18301.838658917706,1051111.2780779754,1081397.7196630107,407533.39880257071,2934401.5564798675,5203349.5183304241,9130664.337427659,31499261.685299195,27184132.215751506,31534945.263342224,69863488.430899695,9137026.8311295472,62500859.028166898,5393284.4454755289,14842462.74438622,36493333.949778885,20528755.268911704,78022818.118069261,514282941.94202638,1449965455.932734,87.976822612000134,2839.7091590848354,107.4070131309023]
[{"$f":"IF(ResultsSummary!A50=\"\",\"\",ResultsSummary!A50)","v":""},{"$f":"ResultsSummary!B50","v":"BSAF (g OC / g lipid)"},3.8814694614230919E-7,1.3460679149812211E-5,1.4139819801719641E-5,1.6987965866116228E-5,4.2288139697254624E-5,4.270274848152633E-5,3.421705843201979E-5,6.6694438555205371E-5,8.7775734089514889E-5,1.0277971406122589E-4,1.5320210271419684E-4,1.4483648862442016E-4,1.5235293464362136E-4,1.7073917477046041E-4,1.0407324609104601E-4,1.6570163596305284E-4,9.2978668169932811E-5,1.3726591195678092E-4,1.6094672296754816E-4,1.624350661800414E-4,2.0263365184926223E-4,2.4015673250827777E-4,1.048698884770585E-4,8.313181243458167E-6,6.3358063853989035E-6,4.7225086279084074E-6]
[{"$f":"IF(ResultsSummary!A51=\"\",\"\",ResultsSummary!A51)","v":""},{"$f":"ResultsSummary!B51","v":"BAF (Pa / Pa)"},7.0352175672007704E-4,1.0245359546061543,1.0247855877194409,1.0273528443456179,1.6022018511981693,1.6108482197623346,1.3502896317142909,1.9384002636680648,2.128996341571312,2.2896228848432778,2.5491423969868543,2.523236410830759,2.5431130889265021,2.5661907579759897,2.2958439976114682,2.6127413508538639,2.1390848165154033,2.4152492443609148,2.5645828840484515,2.4803352963799092,2.6050628442475854,2.0644255833942022,0.58204268440098217,0.90332922030183527,0.61503773852640187,0.92127740241292744]
[{"$f":"IF(ResultsSummary!A52=\"\",\"\",ResultsSummary!A52)","v":""},{"$f":"ResultsSummary!B52","v":"BMF (g  / g )"},1.0972986955360194E-3,1.1243100247083613,1.1252436164276096,1.1344982203006184,2.0775871925260252,2.0904285392255217,1.7026243704917399,2.5812736520333743,2.874228068728748,3.1313961972040154,3.5789265324837456,3.532224519295255,3.5707245962716825,3.659374071106305,3.1397434784718037,3.7167977161286525,2.8903178082541667,3.3384428298521058,3.611191708964685,3.4520585064251237,3.7212820337211951,3.0451442338037022,0.87904067812670827,0.95433336192273166,0.62687612909419255,0.92018091373099764]
[{"$f":"IF(ResultsSummary!A53=\"\",\"\",ResultsSummary!A53)","v":""},{"$f":"ResultsSummary!B53","v":"BMF (Pa / Pa)"},7.0352175672007704E-4,1.0245359546061543,1.0247855877194407,1.0273528443456179,1.6022018511981695,1.6108482197623346,1.3502896317142909,1.9384002636680646,2.128996341571312,2.2896228848432782,2.5491423969868547,2.5232364108307586,2.5431130889265017,2.5661907579759902,2.2958439976114686,2.6127413508538648,2.1390848165154033,2.4152492443609148,2.5645828840484519,2.4803352963799092,2.6050628442475858,2.0644255833942022,0.58204268440098217,0.90332922030183538,0.61503773852640198,0.92127740241292755]
[{"$f":"IF(ResultsSummary!A54=\"\",\"\",ResultsSummary!A54)","v":""},{"$f":"ResultsSummary!B54","v":"t90 (d)"},534.80342128765392,2.3789697714214886,2.4032255647185239,2.6531368658611396,60.879430185554462,61.776613461098179,34.995866450325948,96.110442811105955,116.50458666266711,136.34482324494837,171.02444199580123,167.9304828848687,171.8030538311852,196.15255944102694,135.71506529566415,187.19357343132819,117.89160017489577,150.82992896758375,174.96790605436826,160.0594928389084,194.33074512702549,291.41354205227987,469.78671094195039,3.187402112247683E-2,0.43205013871074427,3.306190082405018E-2]
[{"$f":"IF(ResultsSummary!A55=\"\",\"\",ResultsSummary!A55)","v":"Aquatic Food Chain"},{"$f":"ResultsSummary!B55","v":"Concentration (ng / g ww)"},7.4955283568251249E-2,6.4545570987966597E-4,2.0845666550558307E-3,2.6371623209603162E-2,1.4455374839785987E-3,6.3729013958729245E-4,1.3423380490520057E-3,1.6159775228407558E-2,3.2641816758762349E-2,0.24491727606191452,1.6703984736582471,1.9062242958297448,1.5882498959211702,6.2657071059245473,2.8978484985894606,1.5811134189909348,0.58337085250007803,16.76642460034244,119.56746321199958,93.152364870837147,709.52994911697726,1.314578870347439,98.362899468652202,2.5213868597150344,5.7427650297577832E-6,1.9777283474536164E-7]
[{"$f":"IF(ResultsSummary!A56=\"\",\"\",ResultsSummary!A56)","v":"Fish 1"},{"$f":"ResultsSummary!B56","v":"Concentration (ng / g lipid)"},2.3278038375233305,2.0045208381356084E-2,6.4738094877510269E-2,0.81899450961500486,4.489246844654033E-2,1.979161924184138E-2,4.1687517051304523E-2,0.5018563735530297,1.0137210173528679,7.6061265857737412,51.875728995597733,59.199512292849214,49.324530929228878,194.58717720262567,89.995294987250318,49.102901210898587,18.117107220499314,520.69641615970295,3713.2752550310424,2892.9305860508425,22035.091587483763,40.825430756131645,3054.7484307034842,78.303939742702923,1.7834674005458951E-4,6.1420135014087463E-6]
[{"$f":"IF(ResultsSummary!A57=\"\",\"\",ResultsSummary!A57)","v":""},{"$f":"ResultsSummary!B57","v":"Fugacity (pPa)"},5.5192318360171447E-3,1.0866078196970383,1.0874971631992969,1.0966544247870329,3.250466316326631,3.2828713265273444,2.2994318066596815,4.4828526902602137,5.1441974541485775,5.6859372626105689,6.4690273021711606,6.4018923894070436,6.4621247897798462,6.6275641345001937,5.6963046698609237,6.6627533047526804,5.1803071899213444,6.0717013472969112,6.5192946901873432,6.2686761287782504,6.6811962756715522,6.1842420226572159,3.0848917528938649,0.88824076460188339,0.52915865000183671,0.90549041464087476]
[{"$f":"IF(ResultsSummary!A58=\"\",\"\",ResultsSummary!A58)","v":""},{"$f":"ResultsSummary!B58","v":"BAF (L / kg)"},399813590.9296698,521.66209689767811,527.54828465812545,588.82929100928789,64339.408011537787,66494.374004854239,20938.319388526539,204756.48944686761,379345.49656435143,684149.51340585772,2411888.4430888016,2081027.1949903916,2417762.8788723396,5444118.7808758114,684016.01481972635,4809008.90605132,394085.22965304891,1125811.5153081063,2799042.2739377352,1565451.7199516033,6037678.8499582717,46483835.965960145,231875773.40914875,2.0958097158606677,73.411092410891712,2.6608854117918801]
[{"$f":"IF(ResultsSummary!A59=\"\",\"\",ResultsSummary!A59)","v":""},{"$f":"ResultsSummary!B59","v":"BAF (L / kg lipid)"},12416571146.884153,16200.686239058328,16383.487101184022,18286.623944387818,1998118.2612278813,2065042.6709582058,650258.36610330851,6358897.1877909182,11780916.042371159,21246879.298318561,74903367.797788858,64628173.757465579,75085803.691687539,169072011.82844132,21242733.379494604,149348102.67240122,12238671.728355553,34963090.537518822,86926778.693718478,48616513.041975252,187505554.34653011,1443597390.2472095,7201110975.4394016,65.087258256542469,2279.8475904003635,82.636192912791302]
[{"$f":"IF(ResultsSummary!A60=\"\",\"\",ResultsSummary!A60)","v":""},{"$f":"ResultsSummary!B60","v":"BSAF (g OC / g lipid)"},2.853343352321125E-6,1.3361211542281611E-5,1.4043574362206302E-5,1.697384340247127E-5,8.0387972163088029E-5,8.1545389062802462E-5,5.4596576806323527E-5,1.4452796238247198E-4,1.9873324869359752E-4,2.3916640654756335E-4,3.6430547362167843E-4,3.4433755982897903E-4,3.6275764701584391E-4,4.1319459455451427E-4,2.4196056983421521E-4,3.9595015693531788E-4,2.1099117040380332E-4,3.2334529586575572E-4,3.8337358236802154E-4,3.8468121471422963E-4,4.8697209528834586E-4,6.7412236344080076E-4,5.2082599748520212E-4,6.1502809315211893E-6,5.0866733569469026E-6,3.6333766542091913E-6]
[{"$f":"IF(ResultsSummary!A61=\"\",\"\",ResultsSummary!A61)","v":""},{"$f":"ResultsSummary!B61","v":"BAF (Pa / Pa)"},5.5192318360171447E-3,1.0866078196970383,1.0874971631992969,1.0966544247870329,3.250466316326631,3.2828713265273444,2.2994318066596815,4.4828526902602137,5.1441974541485775,5.6859372626105689,6.4690273021711606,6.4018923894070445,6.4621247897798462,6.6275641345001937,5.6963046698609237,6.6627533047526804,5.1803071899213444,6.0717013472969112,6.5192946901873432,6.2686761287782504,6.6811962756715522,6.1842420226572159,3.0848917528938649,0.88824076460188339,0.52915865000183671,0.90549041464087476]
[{"$f":"IF(ResultsSummary!A62=\"\",\"\",ResultsSummary!A62)","v":""},{"$f":"ResultsSummary!B62","v":"BMF (g  / g )"},4.2870875357904426E-3,0.84423389971455065,0.84492273090622005,0.85201748182278858,2.524828947064981,2.5499994858378887,1.7861167757838536,3.4820844414260415,3.9957842980350069,4.4165810175960276,5.0248469125905197,4.9726997884070476,5.019485348603383,5.1479902457043707,4.4246339632267011,5.1753236941041667,4.0238325419655707,4.7162236387717353,5.0638921290660317,4.8692239669850785,5.1896491850192179,4.8036371900172812,2.3962032030310105,0.72608252306765741,0.41137452428674731,0.73262099516004853]
[{"$f":"IF(ResultsSummary!A63=\"\",\"\",ResultsSummary!A63)","v":""},{"$f":"ResultsSummary!B63","v":"BMF (Pa / Pa)"},5.5192318360171447E-3,1.0866078196970383,1.0874971631992971,1.0966544247870329,3.2504663163266314,3.2828713265273444,2.2994318066596815,4.4828526902602137,5.1441974541485775,5.6859372626105698,6.4690273021711606,6.4018923894070436,6.4621247897798462,6.6275641345001928,5.6963046698609237,6.6627533047526804,5.1803071899213444,6.0717013472969121,6.5192946901873432,6.2686761287782513,6.6811962756715531,6.1842420226572159,3.0848917528938649,0.88824076460188328,0.52915865000183671,0.90549041464087476]
[{"$f":"IF(ResultsSummary!A64=\"\",\"\",ResultsSummary!A64)","v":""},{"$f":"ResultsSummary!B64","v":"t90 (d)"},1989.4232363393817,3.5235685550241969,3.5597025623834337,3.932143560100128,91.811938106625391,93.140683907044945,52.920347388099252,142.41447409350232,169.7198219867027,194.97896884136264,233.67122187231993,230.80280733610709,235.04229769021021,265.54743197321994,193.84659079472857,251.02741831569421,171.57602064510814,211.6119507894667,238.11735604888534,221.94455589452224,260.44392503605974,438.15079372096801,1219.3137409708013,3.7038654125287208E-2,0.53704813088310832,3.9952622913589635E-2]
[{"$f":"IF(ResultsSummary!A65=\"\",\"\",ResultsSummary!A65)","v":"Aquatic Food Chain"},{"$f":"ResultsSummary!B65","v":"Concentration (ng / g ww)"},4.5848165617421929E-3,7.8149784245086843E-4,2.5243727274537392E-3,3.1994915731432864E-2,3.8968438842874663E-3,1.7345261702826796E-3,2.6117663564538818E-3,5.9424821417797924E-2,0.1368787984816634,1.1275854007062336,8.65862859383504,9.7849037256078901,8.219251741665488,32.912598432001751,13.372589746868067,8.398154933038013,2.4622083875753988,82.073071781337191,623.75492574867985,469.43274815148084,3766.4003110508202,6.036502203452085,180.33282112970448,2.3489243203379218,3.3552894243596096E-6,1.9093761443131724E-7]
[{"$f":"IF(ResultsSummary!A66=\"\",\"\",ResultsSummary!A66)","v":"Fish 2"},{"$f":"ResultsSummary!B66","v":"Concentration (ng / g lipid)"},0.11326127869916483,1.9305776740387064E-2,6.2360986350141777E-2,0.79038823447215578,9.6265906232397891E-2,4.2848966657180819E-2,6.4519919872872575E-2,1.4680044816649687,3.3813932431240956,27.855370570806166,213.89892771331623,241.72192998043207,203.0447564640684,813.0582616601223,330.35053722500169,207.4643017054845,60.825306017178832,2027.4968325429147,15408.965557032605,11596.658798208518,93043.485944931337,149.12307814851988,4454.8621820579174,58.026786569612696,8.2887584593863871E-5,4.7168383011689045E-6]
[{"$f":"IF(ResultsSummary!A67=\"\",\"\",ResultsSummary!A67)","v":""},{"$f":"ResultsSummary!B67","v":"Fugacity (pPa)"},2.8223374805693867E-4,1.1001416675198803,1.1012329623238468,1.1125444147509809,7.3255870201289577,7.4698275092832107,3.7403222905487565,13.781570856872776,18.03394585818484,21.884825841665858,28.03359133191401,27.472720826019579,27.957575982303297,29.104267573560183,21.975768074868313,29.585931932484034,18.278764726502864,24.847430916626099,28.432319804253435,26.409861519406228,29.649721904653106,23.740824284218842,4.7281797469392295,0.7271622481698613,0.25868124457984598,0.76054493000475287]
[{"$f":"IF(ResultsSummary!A68=\"\",\"\",ResultsSummary!A68)","v":""},{"$f":"ResultsSummary!B68","v":"BAF (L / kg)"},24455540.504157349,631.61235848380034,638.85148454046737,714.38695283577204,173444.57089993314,180979.15646815975,40739.363812461626,752957.12022811174,1590731.182731116,3149785.9833362731,12502194.277472522,10682190.337149873,12512011.997696338,28596947.195578381,3156502.3329978082,25543266.777884569,1663298.6610711487,5510942.9416603856,14601935.667497132,7888949.5077693705,32049831.760884117,213452219.99442458,425107561.85903299,1.9524565988029363,42.891440050323624,2.5689226402442027]
[{"$f":"IF(ResultsSummary!A69=\"\",\"\",ResultsSummary!A69)","v":""},{"$f":"ResultsSummary!B69","v":"BAF (L / kg lipid)"},604138846.44657469,15603.072096931823,15781.904262363325,17647.89903250425,4284697.8977256212,4470828.9641343812,1006407.2088058701,18600719.373224109,39296718.94098606,77810918.560678691,308848672.86246347,263888101.21417668,309091205.47668821,706446324.00144219,77976836.289471552,631009554.78963852,41089393.801164746,136139894.80386326,360719754.63184619,194885116.29865047,791744855.75306618,5273029150.0598955,10501669018.256746,48.232623488214827,1059.5711474882319,63.461527674016878]
[{"$f":"IF(ResultsSummary!A70=\"\",\"\",ResultsSummary!A70)","v":""},{"$f":"ResultsSummary!B70","v":"BSAF (g OC / g lipid)"},1.3883185148259435E-7,1.2868340508562025E-5,1.352791043304222E-5,1.6380971986482196E-5,1.7238127593005695E-4,1.7654622465714792E-4,8.4499318022273424E-5,4.2276577061535665E-4,6.6289960730163606E-4,8.7588193640255501E-4,1.5021388937856014E-3,1.4059902911846664E-3,1.4932942433754236E-3,1.726482102291986E-3,8.881775902098495E-4,1.6729260551417316E-3,7.0836929707039425E-4,1.25904758096971E-3,1.590884036453059E-3,1.5420407301272557E-3,2.0562465612473987E-3,2.462367206497854E-3,7.5954144580576586E-4,4.5576383529258659E-6,2.3640581714374882E-6,2.7902983543126398E-6]
[{"$f":"IF(ResultsSummary!A71=\"\",\"\",ResultsSummary!A71)","v":""},{"$f":"ResultsSummary!B71","v":"BAF (Pa / Pa)"},2.8223374805693867E-4,1.1001416675198803,1.1012329623238468,1.1125444147509809,7.3255870201289577,7.4698275092832107,3.7403222905487565,13.781570856872776,18.03394585818484,21.884825841665862,28.03359133191401,27.472720826019579,27.957575982303297,29.104267573560183,21.975768074868313,29.585931932484034,18.278764726502864,24.847430916626099,28.432319804253435,26.409861519406231,29.649721904653106,23.740824284218842,4.7281797469392295,0.7271622481698613,0.25868124457984598,0.76054493000475287]
[{"$f":"IF(ResultsSummary!A72=\"\",\"\",ResultsSummary!A72)","v":""},{"$f":"ResultsSummary!B72","v":"BMF (g  / g )"},5.0161644596419504E-3,1.4648326344637914,1.4654739045498286,1.4721264314794684,4.1434429395973327,4.1889661660860567,2.8305061340306441,5.8702178611658589,6.7793440273898007,7.5047358617044413,8.5216457693863976,8.4348908440953743,8.5093036413103622,8.6728354968895953,7.5213800489854341,8.7513989555737588,6.8278720935665955,8.0146316793482715,8.5816708696084962,8.2683777000711238,8.756674270290338,7.7523381196506396,3.2333743796222407,1.0063441396007842,0.6093266607237896,1.0587208772845584]
[{"$f":"IF(ResultsSummary!A73=\"\",\"\",ResultsSummary!A73)","v":""},{"$f":"ResultsSummary!B73","v":"BMF (Pa / Pa)"},3.5599044791613829E-3,1.0401913122384387,1.0406402712354366,1.0453047963676598,2.9405882257240687,2.9728949367486308,2.0088352255800026,4.1660407749981916,4.8112279686090629,5.3260228027268681,6.047702074491375,5.9861338977914569,6.0389430092256857,6.1549968960090169,5.3378350123508591,6.2107526443268473,4.845667242520288,5.6878851241433068,6.0903004990604739,5.8679632112627695,6.2144959701930471,5.5017303495214449,2.2946823361099011,0.80515948699815587,0.43332290670786172,0.8274381042243123]
[{"$f":"IF(ResultsSummary!A74=\"\",\"\",ResultsSummary!A74)","v":""},{"$f":"ResultsSummary!B74","v":"t90 (d)"},3622.776671053864,10.962611643972309,11.074777667171867,12.23056525687786,268.98976957137319,272.64313776192034,159.14356494568864,403.7418359137223,472.91505952373456,535.2866404654892,627.69064258031835,621.04479766843644,631.15348494026409,704.90988216196683,532.30420980729411,669.1082602569428,477.58391246544079,575.16085250339177,638.35697465515386,599.84136149317703,692.0217006245075,1109.3702939933983,2579.7297131983073,8.9982044316222282E-2,0.8266325808435987,0.10058675907958683]
[{"$f":"IF(ResultsSummary!A75=\"\",\"\",ResultsSummary!A75)","v":"Cattle"},{"$f":"ResultsSummary!B75","v":"Concentration (ng / g ww)"},2.75755759862079E-7,1.3570334811572175E-4,4.2158314973821055E-4,2.4557996468532344E-3,9.1277636893707668E-5,3.6242968851781777E-5,1.1774238234996514E-4,3.8126383981477475E-4,5.1023577743714217E-4,7.7019004919177589E-4,1.022057704590274E-3,1.1382596170847442E-3,1.1113016716497524E-3,1.1475874661025657E-3,1.2514569398897448E-3,9.3283958772893754E-4,1.0371613845800377E-3,2.088365499193241E-3,5.0006639793860972E-3,4.4004513644555279E-3,1.621463744133448E-2,1.121215472008703E-4,7.983536747615924E-5,6.1135212944620432E-2,8.9980304913451097E-8,1.3424989475276296E-8]
[{"$f":"IF(ResultsSummary!A76=\"\",\"\",ResultsSummary!A76)","v":"Beef Cattle"},{"$f":"ResultsSummary!B76","v":"Concentration (ng / g lipid)"},1.2534352721003592E-6,6.1683340052600798E-4,1.9162870442645933E-3,1.1162725667514702E-2,4.1489834951685304E-4,1.6474076750809898E-4,5.3519264704529612E-4,1.7330174537035217E-3,2.3192535338051913E-3,3.5008638599626175E-3,4.6457168390466996E-3,5.1739073503852002E-3,5.0513712347716013E-3,5.2163066641025711E-3,5.6884406358624767E-3,4.2401799442224435E-3,4.7143699299092619E-3,9.4925704508783681E-3,2.2730290815391352E-2,2.0002051656616036E-2,7.3702897460611275E-2,5.0964339636759234E-4,3.62888033982542E-4,0.27788733156645651,4.0900138597023221E-7,6.1022679433074066E-8]
[{"$f":"IF(ResultsSummary!A77=\"\",\"\",ResultsSummary!A77)","v":""},{"$f":"ResultsSummary!B77","v":"Fugacity (pPa)"},1.0111118666881334E-7,0.54995332124783669,0.66049345823911576,0.60026144016822669,0.520436200574384,0.47339861601304956,0.78587543901310952,0.44160520836379291,0.50971197860498985,8.8219170916798831E-2,2.9292612854708473E-2,2.5104876527111818E-2,3.1617075416171141E-2,6.6598942656339553E-3,1.4452025816737643E-2,2.2633803903353001E-2,6.4868852929110155E-2,7.4617518992962433E-3,2.1218500535126182E-3,4.0308029280209942E-3,1.5809441437449568E-3,5.4615323699552338E-3,2.5925641608590059E-5,0.38768788668363269,2.1815631182329199E-2,0.11324246188382094]
[{"$f":"IF(ResultsSummary!A78=\"\",\"\",ResultsSummary!A78)","v":""},{"$f":"ResultsSummary!B78","v":"BAF (Lair / kg ww)"},6602.7841559807703,1116990.1658144551,3470100.3244894003,20213974.768009983,767409.04024815653,304709.70643858792,1263676.0558269464,3545282.8679431728,4183989.2912341482,5650023.5902768439,7497695.0787913548,7551912.5836948343,7373057.0358871361,6951227.2998606227,8452830.8702230714,7001946.5822099708,7736487.2535910886,10293225.975636601,21203736.237806629,18658724.210192975,60324497.759368271,2684674.205072741,1274402.3907778338,731079809.22645652,1005.7967483055158,238.82038929617227]
[{"$f":"IF(ResultsSummary!A79=\"\",\"\",ResultsSummary!A79)","v":""},{"$f":"ResultsSummary!B79","v":"BAF (Lair / kg lipid)"},30012.655254458052,5077228.0264293421,15773183.293133635,91881703.490954459,3488222.9102188931,1385044.1201753996,5743982.071940667,16114922.127014425,19018133.141973399,25681925.410349291,34080432.176324338,34326875.380431063,33513895.6176688,31596487.726639196,38421958.501013972,31827029.919136234,35165851.152686767,46787390.798348188,96380619.262757421,84812382.773604423,274202262.54258305,12203064.56851246,5792738.1398992445,3323090041.9384389,4571.8034013887082,1085.5472240735103]
[{"$f":"IF(ResultsSummary!A80=\"\",\"\",ResultsSummary!A80)","v":""},{"$f":"ResultsSummary!B80","v":"BAF (Pa/Pa)"},1.0111118666881334E-7,0.5499533212478368,0.66049345823911576,0.60026144016822669,0.520436200574384,0.47339861601304961,0.78587543901310952,0.44160520836379291,0.50971197860498985,8.8219170916798831E-2,2.9292612854708473E-2,2.5104876527111818E-2,3.1617075416171141E-2,6.6598942656339562E-3,1.4452025816737643E-2,2.2633803903353001E-2,6.4868852929110168E-2,7.4617518992962442E-3,2.1218500535126182E-3,4.0308029280209942E-3,1.5809441437449568E-3,5.4615323699552338E-3,2.5925641608590059E-5,0.38768788668363269,2.1815631182329199E-2,0.11324246188382094]
[{"$f":"IF(ResultsSummary!A81=\"\",\"\",ResultsSummary!A81)","v":""},{"$f":"ResultsSummary!B81","v":"mmBAF (m2 / organism)"},"-","-","-","-","-","-","-","-","-","-","-","-","-","-","-","-","-","-","-","-","-","-","-","-","-","-"]
[{"$f":"IF(ResultsSummary!A82=\"\",\"\",ResultsSummary!A82)","v":""},{"$f":"ResultsSummary!B82","v":"BMF (g ww / g ww)"},7.1715174597657681E-4,3.8281617464059381,3.821863935808774,3.8196719416164413,3.8240139485116051,3.8436336197456615,3.8225940016888504,2.9799687799531078,2.9703086070065887,2.9125837413026971,3.567863458688143,3.5767189535485864,3.5353679001032328,3.0236797638754163,3.7550897608353164,3.346848497688963,3.7831019169068085,3.702781456339642,3.5127815413163392,3.6508782620650413,3.1611972985930636,1.2314898161064658,0.16784025692532217,0.10703403234775845,0.55601215930791581,0.32522299181110703]
[{"$f":"IF(ResultsSummary!A83=\"\",\"\",ResultsSummary!A83)","v":""},{"$f":"ResultsSummary!B83","v":"BMF (Pa / Pa)"},2.2934115105964822E-3,0.63320327087504413,0.98140683436990772,3.0282623118488812,0.6123378009024002,0.51737148591616255,1.0056909227855166,1.1846232610819141,1.8869526969096904,2.1545896185006725,5.5403798002677291,5.0308164134936639,5.0545915627969444,4.5209313462474983,5.3652249928629452,4.0907704348154548,4.7373295313271733,11.27450789774289,12.44756291563465,20.498786846581563,20.38652874685193,3.185842364115794,3.7591414875755332E-5,1.0157771495997621,5.3611952600813868E-2,0.18964091090468432]
[{"$f":"IF(ResultsSummary!A84=\"\",\"\",ResultsSummary!A84)","v":""},{"$f":"ResultsSummary!B84","v":"t90 (d)"},76.75274476627753,67.499694978377633,67.567420013593662,67.599057394599782,67.782220804980341,67.546208900433939,67.632293297354565,53.360556271658723,53.388952937202021,54.321791069869995,70.629024573630616,70.804531828591337,71.089296349103975,73.638641042625849,68.759169441041493,71.743116377588777,68.366168078016941,69.508021940740718,71.065102518703355,70.049648607308598,72.696674568406863,75.947894153436749,76.665427530550659,1.8942763217377119,6.01006796695704,2.2395730072710318]
[{"$f":"IF(ResultsSummary!A85=\"\",\"\",ResultsSummary!A85)","v":"Cattle"},{"$f":"ResultsSummary!B85","v":"Concentration (ng / g ww)"},1.36613207346135E-6,3.4778423125668108E-4,1.0822974030325996E-3,6.3915166223290944E-3,2.3363363969062143E-4,9.2263718878198838E-5,2.9955165148527909E-4,6.8093438809763141E-4,9.118893630871937E-4,1.4127376266715012E-3,2.9184639543539895E-3,3.2743798366704868E-3,3.2360525412072076E-3,3.7394528639459186E-3,3.3195563412485936E-3,2.7932624056309289E-3,2.7104014317570397E-3,5.6976529632670296E-3,1.4344963887314892E-2,1.222093923996378E-2,4.944694365608808E-2,4.1144817532942575E-4,2.9124799057867173E-4,9.5934616611180634E-2,1.0192818159471109E-7,1.7231544264503523E-8]
[{"$f":"IF(ResultsSummary!A86=\"\",\"\",ResultsSummary!A86)","v":"Milk Cow"},{"$f":"ResultsSummary!B86","v":"Concentration (ng / g lipid)"},6.2096912430061365E-6,1.5808374148030958E-3,4.9195336501481803E-3,2.9052348283314065E-2,1.0619710895028245E-3,4.1938054035544926E-4,1.3615984158421776E-3,3.0951563095346882E-3,4.1449516503963349E-3,6.4215346666886422E-3,1.3265745247063589E-2,1.4883544712138578E-2,1.4709329732760033E-2,1.6997513017935992E-2,1.508889246022088E-2,1.2696647298322405E-2,1.2320006507986543E-2,2.5898422560304678E-2,6.5204381305976777E-2,5.5549723818017177E-2,0.22475883480040035,1.8702189787701169E-3,1.323854502630326E-3,0.43606643914173016,4.6330991633959589E-7,7.8325201202288735E-8]
[{"$f":"IF(ResultsSummary!A87=\"\",\"\",ResultsSummary!A87)","v":""},{"$f":"ResultsSummary!B87","v":"Fugacity (pPa)"},5.0091876653126217E-7,1.4094353287004766,1.6956331272161012,1.5622532471223649,1.3321050796762428,1.2051307662950779,1.9993674403358579,0.78870362446125009,0.91095323393953509,0.16181790751349107,8.3644430604419062E-2,7.2218060158376937E-2,9.2067275570774904E-2,2.1701492409796037E-2,3.8334769990621034E-2,6.7773874920528637E-2,0.16952099689547295,2.0357773979991743E-2,6.0867641811982653E-3,1.1194351122593916E-2,4.8211288277035689E-3,2.0041977516550291E-2,9.4579523607998733E-5,0.60836769812978786,2.4712381436076729E-2,0.14535151019418235]
[{"$f":"IF(ResultsSummary!A88=\"\",\"\",ResultsSummary!A88)","v":""},{"$f":"ResultsSummary!B88","v":"BAF (Lair / kg ww)"},32711.103529222048,2862652.7755806129,8908516.7938747425,52609322.547393441,1964255.1374708423,775699.44143596955,3214953.204702823,6331848.8883937132,7477592.7103958754,10363677.024835462,21409508.220440347,21724244.558267135,21469957.767658293,22650811.029404942,22421585.131984614,20966385.230218474,20217669.535965256,28082837.7524524,60825288.773917392,51819033.090534687,183961069.28578985,9851846.7735038698,4649156.7238484705,1147225270.5465837,1139.3497022183244,306.53611438591179]
[{"$f":"IF(ResultsSummary!A89=\"\",\"\",ResultsSummary!A89)","v":""},{"$f":"ResultsSummary!B89","v":"BAF (Lair / kg lipid)"},148686.83422373657,13012058.070820969,40493258.153976105,239133284.30633381,8928432.4430492837,3525906.5519816801,14613423.657740105,28781131.310880516,33989057.774526708,47107622.840161197,97315946.456547037,98746566.173941538,97590717.125719503,102958231.95184062,101916296.05447553,95301751.046447605,91898497.890751168,127649262.51114726,276478585.33598816,235541059.50243038,836186678.57177198,44781121.697744854,21132530.562947594,5214660320.6662903,5178.8622828105663,1393.345974481417]
[{"$f":"IF(ResultsSummary!A90=\"\",\"\",ResultsSummary!A90)","v":""},{"$f":"ResultsSummary!B90","v":"BAF (Pa/Pa)"},5.0091876653126217E-7,1.4094353287004766,1.6956331272161012,1.5622532471223649,1.332105079676243,1.2051307662950779,1.9993674403358579,0.78870362446125009,0.91095323393953509,0.16181790751349107,8.3644430604419062E-2,7.2218060158376937E-2,9.2067275570774904E-2,2.1701492409796037E-2,3.8334769990621034E-2,6.7773874920528637E-2,0.16952099689547295,2.0357773979991743E-2,6.0867641811982653E-3,1.1194351122593916E-2,4.8211288277035689E-3,2.0041977516550291E-2,9.4579523607998746E-5,0.60836769812978786,2.4712381436076729E-2,0.14535151019418238]
[{"$f":"IF(ResultsSummary!A91=\"\",\"\",ResultsSummary!A91)","v":""},{"$f":"ResultsSummary!B91","v":"mmBAF (m2 / organism)"},"-","-","-","-","-","-","-","-","-","-","-","-","-","-","-","-","-","-","-","-","-","-","-","-","-","-"]
[{"$f":"IF(ResultsSummary!A92=\"\",\"\",ResultsSummary!A92)","v":""},{"$f":"ResultsSummary!B92","v":"BMF (g ww / g ww)"},5.0069725278005239E-3,13.526459855794331,13.522465826441861,13.523264383683548,13.676053948099838,13.671321732619182,13.582286493433378,7.4374504466016154,7.4187354694877508,7.4662907303436112,14.252912108902832,14.394028629949968,14.400652270873875,13.820655426725335,13.911334089116471,14.024363344897301,13.804655975839783,14.127873972824288,14.291690374429789,14.237163666524763,13.822196823070248,6.3317356086865884,0.89859494328377243,0.12772472354944348,0.73882182055226175,0.3399511959922315]
[{"$f":"IF(ResultsSummary!A93=\"\",\"\",ResultsSummary!A93)","v":""},{"$f":"ResultsSummary!B93","v":"BMF (Pa / Pa)"},1.1456516163531726E-2,1.619902537818628,2.5080427982004254,7.7127600977611408,1.5672691700663381,1.3170384548021399,2.5581972796947734,2.1155429373850603,3.3721410711579805,3.9518357296931059,15.835773337404365,14.485734874861338,14.731192158396601,14.785126097412272,14.221448197965966,12.264667215638838,12.368677305222441,30.778875245576206,36.234502545627102,57.195318410852344,63.778529062541033,11.719821250949773,1.3926721920390667E-4,1.1446346668822744,5.4942433617387397E-2,0.20248969885935295]
[{"$f":"IF(ResultsSummary!A94=\"\",\"\",ResultsSummary!A94)","v":""},{"$f":"ResultsSummary!B94","v":"t90 (d)"},350.03246754931394,202.23651105175608,202.91106592432681,203.21332404562781,205.39365036423806,202.88765538739875,203.78739919610769,113.04673187328125,113.19568873597676,118.21836108462966,239.53263679781861,241.90519620042983,245.83034807678752,285.73984215026547,216.26177249704213,255.21389166450155,211.79315328366295,225.16401434227379,245.49315870973888,231.94205832992333,269.90730440482292,331.34939499945193,347.92409476441071,1.9194879502697881,6.3789526637593275,2.2539091164974749]
[{"$f":"IF(ResultsSummary!A95=\"\",\"\",ResultsSummary!A95)","v":"Cattle"},{"$f":"ResultsSummary!B95","v":"Concentration (ng / g ww)"},2.75755759862079E-7,1.3570334811572175E-4,4.2158314973821055E-4,2.4557996468532344E-3,9.1277636893707668E-5,3.6242968851781777E-5,1.1774238234996514E-4,3.8126383981477475E-4,5.1023577743714217E-4,7.7019004919177589E-4,1.022057704590274E-3,1.1382596170847442E-3,1.1113016716497524E-3,1.1475874661025657E-3,1.2514569398897448E-3,9.3283958772893754E-4,1.0371613845800377E-3,2.088365499193241E-3,5.0006639793860972E-3,4.4004513644555279E-3,1.621463744133448E-2,1.121215472008703E-4,7.983536747615924E-5,6.1135212944620432E-2,8.9980304913451097E-8,1.3424989475276296E-8]
[{"$f":"IF(ResultsSummary!A96=\"\",\"\",ResultsSummary!A96)","v":"Beef"},{"$f":"ResultsSummary!B96","v":"Concentration (ng / g lipid)"},1.2534352721003592E-6,6.1683340052600798E-4,1.9162870442645933E-3,1.1162725667514702E-2,4.1489834951685304E-4,1.6474076750809898E-4,5.3519264704529612E-4,1.7330174537035217E-3,2.3192535338051913E-3,3.5008638599626175E-3,4.6457168390466996E-3,5.1739073503852002E-3,5.0513712347716013E-3,5.2163066641025711E-3,5.6884406358624767E-3,4.2401799442224435E-3,4.7143699299092619E-3,9.4925704508783681E-3,2.2730290815391352E-2,2.0002051656616036E-2,7.3702897460611275E-2,5.0964339636759234E-4,3.62888033982542E-4,0.27788733156645651,4.0900138597023221E-7,6.1022679433074066E-8]
[{"$f":"IF(ResultsSummary!A97=\"\",\"\",ResultsSummary!A97)","v":""},{"$f":"ResultsSummary!B97","v":"Fugacity (pPa)"},1.0111118666881334E-7,0.54995332124783669,0.66049345823911576,0.60026144016822669,0.520436200574384,0.47339861601304956,0.78587543901310952,0.44160520836379291,0.50971197860498985,8.8219170916798831E-2,2.9292612854708473E-2,2.5104876527111818E-2,3.1617075416171141E-2,6.6598942656339553E-3,1.4452025816737643E-2,2.2633803903353001E-2,6.4868852929110155E-2,7.4617518992962433E-3,2.1218500535126182E-3,4.0308029280209942E-3,1.5809441437449568E-3,5.4615323699552338E-3,2.5925641608590059E-5,0.38768788668363269,2.1815631182329199E-2,0.11324246188382094]
[{"$f":"IF(ResultsSummary!A98=\"\",\"\",ResultsSummary!A98)","v":"Cattle"},{"$f":"ResultsSummary!B98","v":"Concentration (ng / g ww)"},3.1855451136518476E-7,8.1213351336910191E-5,2.5281257394362623E-4,1.4933785126109616E-3,5.4481722565936523E-5,2.1515223225482945E-5,6.9858705600230812E-5,1.5878633849238693E-4,2.126416163590343E-4,3.2942418875148112E-4,6.8052966172000315E-4,7.6352215798229889E-4,7.5458463648264413E-4,8.7196600043087968E-4,7.7406429811304595E-4,6.5133406064976618E-4,6.3202529323315448E-4,1.3285876980692855E-3,3.3449672464474305E-3,2.8496919249573803E-3,1.1530049412270723E-2,9.5941452758185444E-5,6.7913172363148668E-5,3.7164322773860378E-2,2.3984246665558796E-8,6.0560934130094804E-9]
[{"$f":"IF(ResultsSummary!A99=\"\",\"\",ResultsSummary!A99)","v":"Milk"},{"$f":"ResultsSummary!B99","v":"Concentration (ng / g lipid)"},6.3710902273036953E-6,1.6242670267382037E-3,5.0562514788725244E-3,2.9867570252219228E-2,1.0896344513187303E-3,4.3030446450965888E-4,1.397174112004616E-3,3.1757267698477383E-3,4.2528323271806851E-3,6.5884837750296221E-3,1.3610593234400063E-2,1.5270443159645977E-2,1.5091692729652882E-2,1.743932000861759E-2,1.5481285962260918E-2,1.3026681212995323E-2,1.2640505864663089E-2,2.6571753961385711E-2,6.6899344928948612E-2,5.6993838499147603E-2,0.23060098824541447,1.9188290551637086E-3,1.3582634472629734E-3,0.74328645547720751,4.7968493331117589E-7,1.2112186826018961E-7]
[{"$f":"IF(ResultsSummary!A100=\"\",\"\",ResultsSummary!A100)","v":""},{"$f":"ResultsSummary!B100","v":"Fugacity (pPa)"},5.0091876653126217E-7,1.4094353287004766,1.6956331272161012,1.5622532471223649,1.3321050796762428,1.2051307662950779,1.9993674403358579,0.78870362446125009,0.91095323393953509,0.16181790751349107,8.3644430604419062E-2,7.2218060158376937E-2,9.2067275570774904E-2,2.1701492409796037E-2,3.8334769990621034E-2,6.7773874920528637E-2,0.16952099689547295,2.0357773979991743E-2,6.0867641811982653E-3,1.1194351122593916E-2,4.8211288277035689E-3,2.0041977516550291E-2,9.4579523607998733E-5,0.60836769812978786,2.4712381436076729E-2,0.14535151019418235]
[{"$f":"IF(ResultsSummary!A101=\"\",\"\",ResultsSummary!A101)","v":"Cattle"},{"$f":"ResultsSummary!B101","v":"Concentration (ng / g ww)"},2.0560265287496724E-6,5.2332814757210448E-4,1.6285285942030281E-3,9.6170000402663203E-3,3.5161598292818058E-4,1.3885587278550135E-4,4.5081787725033921E-4,1.024800596963805E-3,1.372386549820401E-3,2.1261661832435688E-3,4.3922815469528568E-3,4.9279343111136055E-3,4.8702520659535693E-3,5.6278698067211558E-3,4.9959190444021275E-3,4.2038542489606515E-3,4.0791391970190277E-3,8.5749512103571023E-3,2.1589139491542168E-2,1.8392482564391698E-2,7.441755643159402E-2,6.1922881605538276E-4,4.3832774699228939E-4,0.13344369244509782,1.5324157520975377E-7,2.442667557860861E-8]
[{"$f":"IF(ResultsSummary!A102=\"\",\"\",ResultsSummary!A102)","v":"Dairy Products"},{"$f":"ResultsSummary!B102","v":"Concentration (ng / g lipid)"},"--","--","--","--","--","--","--","--","--","--","--","--","--","--","--","--","--","--","--","--","--","--","--","--","--","--"]
[{"$f":"IF(ResultsSummary!A103=\"\",\"\",ResultsSummary!A103)","v":""},{"$f":"ResultsSummary!B103","v":"Fugacity (pPa)"},5.0091876653126217E-7,1.4094353287004766,1.6956331272161012,1.5622532471223649,1.3321050796762428,1.2051307662950779,1.9993674403358579,0.78870362446125009,0.91095323393953509,0.16181790751349107,8.3644430604419062E-2,7.2218060158376937E-2,9.2067275570774904E-2,2.1701492409796037E-2,3.8334769990621034E-2,6.7773874920528637E-2,0.16952099689547295,2.0357773979991743E-2,6.0867641811982653E-3,1.1194351122593916E-2,4.8211288277035689E-3,2.0041977516550291E-2,9.4579523607998733E-5,0.60836769812978786,2.4712381436076729E-2,0.14535151019418235]
[{"$f":"IF(ResultsSummary!A104=\"\",\"\",ResultsSummary!A104)","v":"Grass and Cultivated Plants"},{"$f":"ResultsSummary!B104","v":"Concentration (pg / g ww)"},0.46235186505766829,4.8679202976919404E-2,0.15142399533160883,0.86771768392275528,3.3300430765891745E-2,1.3152419518786413E-2,4.2946644210152041E-2,0.1784725100604394,0.2395934337955633,0.3664897942286105,0.38689635931241828,0.42846614497360364,0.42647487519914201,0.4864661841405975,0.42908552491544216,0.37798532919314387,0.37443415107728234,0.63124424973277637,1.0726038323454961,0.95699851929059365,2.9331640561035752,0.12167059010577283,0.12451558926803967,84.297852803634669,1.7662409495505237E-4,1.3500031723155809E-5]
[{"$f":"IF(ResultsSummary!A105=\"\",\"\",ResultsSummary!A105)","v":"Grass"},{"$f":"ResultsSummary!B105","v":"Fugacity (pPa)"},3.7925431869204501E-5,0.86648649011732159,0.66901061203235557,0.1927028596960374,0.84966890750502966,0.91484145463523581,0.78099789820857168,0.37230156030396699,0.26969658738792301,4.0610982183928751E-2,5.1094616127145519E-3,4.8074077906739001E-3,6.0724383150444847E-3,1.3509732756214795E-3,2.4816066843191755E-3,5.3688302166279523E-3,1.3383437582110304E-2,5.2999413072441675E-4,9.1892244260344407E-5,1.1170259117137334E-4,3.172673750086426E-5,1.6390864846017154E-3,0.29388026569631898,6.1184265434046849E-2,0.34883512367329317,0.25749895156120767]
[{"$f":"IF(ResultsSummary!A106=\"\",\"\",ResultsSummary!A106)","v":"Leaf:"},{"$f":"ResultsSummary!B106","v":"BAF (Lair / kg ww)"},11070701.009537628,400684.22599666927,1246388.6558606215,7142285.9723290848,279970.56544815906,110577.85875423731,460927.02460512222,1659573.9386758758,1964692.4139382816,2688526.0140147069,2838226.1746971579,2842707.2553101573,2829495.9500494101,2946648.6168078398,2898211.8803789336,2837179.209249523,2793012.8138077236,3111303.8933226662,4548037.7890750673,4057849.9708553469,10912464.072691416,2913319.5440814584,1987627.4096150051,1008068103.1029944,1974.298048323682,240.15533401886637]
[{"$f":"IF(ResultsSummary!A107=\"\",\"\",ResultsSummary!A107)","v":""},{"$f":"ResultsSummary!B107","v":"BAF (Pa / Paair)"},3.7925431869204501E-5,0.86648649011732159,0.66901061203235557,0.1927028596960374,0.84966890750502966,0.91484145463523581,0.78099789820857168,0.37230156030396699,0.26969658738792301,4.0610982183928751E-2,5.1094616127145519E-3,4.8074077906739001E-3,6.0724383150444847E-3,1.3509732756214795E-3,2.4816066843191755E-3,5.3688302166279523E-3,1.3383437582110304E-2,5.2999413072441685E-4,9.1892244260344407E-5,1.1170259117137335E-4,3.172673750086426E-5,1.6390864846017154E-3,0.29388026569631898,6.1184265434046856E-2,0.34883512367329317,0.25749895156120767]
[{"$f":"IF(ResultsSummary!A108=\"\",\"\",ResultsSummary!A108)","v":""},{"$f":"ResultsSummary!B108","v":"t90 (d)"},65.787458594631332,12.227757287728004,28.125095157196888,61.198618654077819,9.9033226173279871,5.6111404834465866,14.459464901589421,41.310182662270769,48.05684246060256,63.124716823128935,65.45707346863351,65.477014603185481,65.393915432447628,65.703433798980953,65.630164287072319,65.440216327201199,64.915662458313975,65.756640403633654,65.784406454039896,65.783051503406696,65.787607439591241,65.684153700992283,46.461563010468247,0.32723477566113784,0.73523213710313351,0.40166305736339397]
[{"$f":"IF(ResultsSummary!A109=\"\",\"\",ResultsSummary!A109)","v":"Root:"},{"$f":"ResultsSummary!B109","v":"Concentration (pg / g ww)"},4.4119585349932545E-6,1.4536840640048633E-2,4.5464673958077573E-2,0.46818980937067406,5.703560243409913E-4,2.435761052528321E-4,1.4123028940509139E-3,2.0406420884713414E-3,2.2185886759247203E-3,7.3985657117895034E-3,1.5056780688160539E-2,1.9373888216629283E-2,1.3695581314107346E-2,2.3295814143084209E-2,0.10035632230876361,7.9284431496123454E-3,3.3580279641401943E-2,0.29515786997283,0.90093618148335919,1.0767880113724884,2.3158983917550797,5.589991234239873E-4,8.3900979943379323E-3,510.91607894294685,3.3479988308770647E-4,6.2849279997375662E-5]
[{"$f":"IF(ResultsSummary!A110=\"\",\"\",ResultsSummary!A110)","v":""},{"$f":"ResultsSummary!B110","v":"Fugacity (pPa)"},6.2092273263357338E-7,0.51710804739571681,0.52511921140699813,0.51774635419553572,6.4070195520790102E-2,6.3016536406740487E-2,0.11226840216655104,3.7957819230919544E-2,2.8532097665713005E-2,1.5754099219625783E-2,7.4490574095729626E-3,7.9135546055104991E-3,7.1130146073478994E-3,3.6190232008134981E-3,1.8135440419083472E-2,4.6181014072712075E-3,2.5794525086679319E-2,1.2561875729727912E-2,6.5947970526830779E-3,9.9354017394083834E-3,3.7380738232361461E-3,7.3380744328461101E-4,1.2469588784608227E-4,0.77775007954932773,0.46527713434716217,0.79915588108256186]
[{"$f":"IF(ResultsSummary!A111=\"\",\"\",ResultsSummary!A111)","v":""},{"$f":"ResultsSummary!B111","v":"BAF (g OC / g ww)"},5.4080298148891095E-9,9.6895876187936582E-3,9.8626091915709861E-3,9.7033379511010879E-3,1.0213241952238112E-3,1.0035817699672147E-3,1.8496401053089543E-3,5.8767778699439206E-4,4.3493952234776456E-4,2.3263987983112298E-4,1.0573861275826223E-4,1.1268939784355887E-4,1.0072425947948891E-4,4.9467311351382853E-5,2.6981713805965826E-4,6.3932440485715906E-5,3.9107471285535259E-4,1.832889680657974E-4,9.3016301690070568E-5,1.4318356693443613E-4,5.1180994089830616E-5,9.2303694845232449E-6,1.4304880601553556E-6,4.0129237791297727E-2,9.5489137883311079E-3,3.7179193211468196E-2]
[{"$f":"IF(ResultsSummary!A112=\"\",\"\",ResultsSummary!A112)","v":""},{"$f":"ResultsSummary!B112","v":"BAF (Pa / Pasoil)"},6.2092273263357349E-7,0.51710804739571681,0.52511921140699813,0.51774635419553572,6.4070195520790102E-2,6.30165364067405E-2,0.11226840216655104,3.7957819230919544E-2,2.8532097665713005E-2,1.5754099219625783E-2,7.4490574095729626E-3,7.9135546055104991E-3,7.1130146073478994E-3,3.6190232008134985E-3,1.8135440419083472E-2,4.6181014072712075E-3,2.5794525086679319E-2,1.2561875729727912E-2,6.5947970526830779E-3,9.9354017394083834E-3,3.7380738232361461E-3,7.3380744328461101E-4,1.2469588784608227E-4,0.77775007954932773,0.46527713434716222,0.79915588108256186]
[{"$f":"IF(ResultsSummary!A113=\"\",\"\",ResultsSummary!A113)","v":""},{"$f":"ResultsSummary!B113","v":"t90 (d)"},65.78810466476051,31.76856604552599,31.24152642181437,31.726573024896858,61.573086168076017,61.642404447193385,58.402215535745277,63.290970979153364,63.911071721060701,64.751712542211038,65.298085841311604,65.26752743219437,65.320193474083368,65.550056689161508,64.595048520862363,65.484329186735081,64.091171544245626,64.96172300567801,65.354286045977602,65.134513858742196,65.542224569490031,65.739869683257453,65.779942002900967,1.5662826455246619,10.136167535907381,1.7503172928331658]
[{"$f":"IF(ResultsSummary!A114=\"\",\"\",ResultsSummary!A114)","v":"Fruit / Tuber"},{"$f":"ResultsSummary!B114","v":"Concentration (pg / g ww)"},"-","-","-","-","-","-","-","-","-","-","-","-","-","-","-","-","-","-","-","-","-","-","-","-","-","-"]
[{"$f":"IF(ResultsSummary!A115=\"\",\"\",ResultsSummary!A115)","v":""},{"$f":"ResultsSummary!B115","v":"Fugacity (pPa)"},"-","-","-","-","-","-","-","-","-","-","-","-","-","-","-","-","-","-","-","-","-","-","-","-","-","-"]
[{"$f":"IF(ResultsSummary!A116=\"\",\"\",ResultsSummary!A116)","v":""},{"$f":"ResultsSummary!B116","v":"BAF (Lair  / kg ww)"},"-","-","-","-","-","-","-","-","-","-","-","-","-","-","-","-","-","-","-","-","-","-","-","-","-","-"]
[{"$f":"IF(ResultsSummary!A117=\"\",\"\",ResultsSummary!A117)","v":""},{"$f":"ResultsSummary!B117","v":"BAF (g OC / g ww)"},"-","-","-","-","-","-","-","-","-","-","-","-","-","-","-","-","-","-","-","-","-","-","-","-","-","-"]
[{"$f":"IF(ResultsSummary!A118=\"\",\"\",ResultsSummary!A118)","v":""},{"$f":"ResultsSummary!B118","v":"BAF (Pa / Pa)"},"-","-","-","-","-","-","-","-","-","-","-","-","-","-","-","-","-","-","-","-","-","-","-","-","-","-"]
[{"$f":"IF(ResultsSummary!A119=\"\",\"\",ResultsSummary!A119)","v":""},{"$f":"ResultsSummary!B119","v":"t90 (d)"},"-","-","-","-","-","-","-","-","-","-","-","-","-","-","-","-","-","-","-","-","-","-","-","-","-","-"]
[{"$f":"IF(ResultsSummary!A120=\"\",\"\",ResultsSummary!A120)","v":"Grass and Cultivated Plants"},{"$f":"ResultsSummary!B120","v":"Concentration (pg / g ww)"},2.141659457554808,4.5048822486720839E-2,0.1562651844467767,1.1359758802080895,3.2556937335104841E-2,1.2396125294916748E-2,4.4107318991606748E-2,0.2795004989650321,0.44161815685345929,1.1808552937733168,1.5538571660892151,1.7203455405262766,1.6898816593535302,2.0490897041207963,1.7859105296271753,1.4905487316740995,1.4149232974648258,2.8162491860566465,4.9916754652823858,4.4610837192653765,14.192705825407595,0.51159984357042021,1.282655093477078E-4,0.54123159471016102,1.4572365116255365E-4,2.2976041722306298E-6]
[{"$f":"IF(ResultsSummary!A121=\"\",\"\",ResultsSummary!A121)","v":"Apple"},{"$f":"ResultsSummary!B121","v":"Fugacity (pPa)"},1.7567434238510428E-4,0.80186596520375564,0.69039960580319115,0.25227767592818723,0.83069848470434549,0.86223597722411127,0.80210512512912213,0.58305041955861736,0.49710423171925838,0.13085137445140455,2.0520672657359466E-2,1.9302347807868547E-2,2.4061680377672045E-2,5.6905608650040136E-3,1.0328774219993033E-2,2.1171464741900702E-2,5.0573745959368248E-2,2.3645293242659984E-3,4.276474195706088E-4,5.2070572820087742E-4,1.5351621782378518E-4,6.8920220440423516E-3,3.0273078405977096E-4,3.9283156629359774E-4,0.2878063034850904,4.382439075585684E-2]
[{"$f":"IF(ResultsSummary!A122=\"\",\"\",ResultsSummary!A122)","v":"Leaf:"},{"$f":"ResultsSummary!B122","v":"BAF (Lair / kg ww)"},51280579.382718742,370802.13861988299,1286237.050963439,9350350.6318268012,273719.70708275895,104219.37879971242,473384.02522506018,2599009.470826562,3621317.2827087063,8662615.5109688435,11398913.36370506,11413827.689923562,11211711.613658056,12411854.182690023,12062739.975391414,11188142.886143817,10554322.806838933,13880850.496228876,21165623.282604981,18915816.561161738,52802158.164919756,12249910.366400084,2047.4869338563378,6472268.1405635532,1628.8939521985699,40.872637097492806]
[{"$f":"IF(ResultsSummary!A123=\"\",\"\",ResultsSummary!A123)","v":""},{"$f":"ResultsSummary!B123","v":"BAF (Pa / Paair)"},1.7567434238510428E-4,0.80186596520375564,0.69039960580319115,0.25227767592818723,0.83069848470434549,0.86223597722411138,0.80210512512912213,0.58305041955861736,0.49710423171925838,0.13085137445140455,2.0520672657359466E-2,1.9302347807868547E-2,2.4061680377672045E-2,5.6905608650040136E-3,1.0328774219993033E-2,2.1171464741900702E-2,5.0573745959368248E-2,2.3645293242659984E-3,4.276474195706088E-4,5.2070572820087742E-4,1.5351621782378518E-4,6.8920220440423516E-3,3.0273078405977096E-4,3.9283156629359774E-4,0.2878063034850904,4.382439075585684E-2]
[{"$f":"IF(ResultsSummary!A124=\"\",\"\",ResultsSummary!A124)","v":""},{"$f":"ResultsSummary!B124","v":"t90 (d)"},56.141119044604118,5.7409307877849738,10.334159962258703,34.869667120994031,5.1853633523064016,3.8289230481264966,6.7062335290203086,16.278947439138523,20.777841588512064,39.84156119956387,49.914093086258326,49.894195974716588,49.246328216951859,52.276491430012342,51.897077649147143,48.98414552138432,47.088879738690828,55.67912543129129,58.031222083521364,58.471033482277704,60.173526316554103,52.154686898362193,9.0195774578644711E-3,0.31147523956043516,0.72296970531053373,0.33568956087916552]
[{"$f":"IF(ResultsSummary!A125=\"\",\"\",ResultsSummary!A125)","v":"Root:"},{"$f":"ResultsSummary!B125","v":"Concentration (pg / g ww)"},2.8846133669976917E-8,1.9543950016163048E-4,6.2141563901432632E-4,6.3027619525903595E-3,3.9825586592955534E-6,1.6988914445219379E-6,1.0392957549955226E-5,1.3864856655268714E-5,1.4928629615127819E-5,4.9142120236167266E-5,9.9177622624044149E-5,1.2767336192185966E-4,9.0181199337537426E-5,1.5286144448165733E-4,6.6818396424374055E-4,5.2076379039097263E-5,2.2532721702657102E-4,1.9541769000967243E-3,5.9293141454309492E-3,7.1103960438835484E-3,1.5198163669702332E-2,3.6574950385295113E-6,5.4862646683293785E-5,1.9697677308439421,6.5252828060871079E-7,2.7477141620426778E-7]
[{"$f":"IF(ResultsSummary!A126=\"\",\"\",ResultsSummary!A126)","v":""},{"$f":"ResultsSummary!B126","v":"Fugacity (pPa)"},4.1048059626566057E-9,7.0294685636372641E-3,7.2571297506627656E-3,7.0473344140752521E-3,4.523463396095537E-4,4.44410549278989E-4,8.3534856122674745E-4,2.6076462798778669E-4,1.9412243756723551E-4,1.0580320265694296E-4,4.9611433190043701E-5,5.272954103343509E-5,4.7357429286507859E-5,2.4011003804705382E-5,1.2208949600022432E-4,3.0670101340891926E-5,1.7500713841833173E-4,8.4093588105968556E-5,4.3884459140624787E-5,6.6335788405800844E-5,2.4803808683336319E-5,4.8546018196378294E-6,8.2444319251391551E-7,3.0318268519638836E-3,9.1690561859981957E-4,3.5326582691550409E-3]
[{"$f":"IF(ResultsSummary!A127=\"\",\"\",ResultsSummary!A127)","v":""},{"$f":"ResultsSummary!B127","v":"BAF (g OC / g ww)"},3.5358616744513511E-11,1.3027095831072002E-4,1.3480311326503577E-4,1.3062614355817024E-4,7.1314816431304632E-6,6.9997690500294281E-6,1.3611266519487621E-5,3.9928943552597989E-6,2.926658332195825E-6,1.5452207078692516E-6,6.9649046832268352E-7,7.4261986622220147E-7,6.6323833314684501E-7,3.245924191080946E-7,1.7964736130417119E-6,4.1992733514037437E-7,2.624152557339545E-6,1.2135169137442234E-6,6.1216641611456372E-7,9.4548960159955391E-7,3.3587705217318384E-7,6.039370936156514E-8,9.3539266265943666E-9,1.5471284017563351E-4,1.8610927335205221E-5,1.6254409871479492E-4]
[{"$f":"IF(ResultsSummary!A128=\"\",\"\",ResultsSummary!A128)","v":""},{"$f":"ResultsSummary!B128","v":"BAF (Pa / Pasoil)"},4.1048059626566057E-9,7.0294685636372641E-3,7.2571297506627656E-3,7.0473344140752521E-3,4.523463396095537E-4,4.44410549278989E-4,8.3534856122674745E-4,2.6076462798778669E-4,1.9412243756723553E-4,1.0580320265694296E-4,4.9611433190043701E-5,5.2729541033435097E-5,4.7357429286507859E-5,2.4011003804705382E-5,1.2208949600022432E-4,3.0670101340891926E-5,1.7500713841833173E-4,8.4093588105968556E-5,4.3884459140624787E-5,6.6335788405800844E-5,2.4803808683336319E-5,4.8546018196378294E-6,8.2444319251391551E-7,3.0318268519638836E-3,9.1690561859981957E-4,3.5326582691550409E-3]
[{"$f":"IF(ResultsSummary!A129=\"\",\"\",ResultsSummary!A129)","v":""},{"$f":"ResultsSummary!B129","v":"t90 (d)"},23.02585083542381,22.863991434677445,22.858749342122458,22.863580058268521,23.015435270555908,23.015617998881069,23.006616318495109,23.019846602488606,23.021381095630876,23.023414721168169,23.024708584475402,23.024636787389017,23.024760484833283,23.02529805614617,23.023039715405442,23.025144724758974,23.021821241659559,23.023914603516566,23.024840452926146,23.024323491965305,23.02527980113922,23.025739148602636,23.025831946434408,0.32325682770441011,1.0575476487239455,0.40963791942881933]
[{"$f":"IF(ResultsSummary!A130=\"\",\"\",ResultsSummary!A130)","v":"Fruit / Tuber"},{"$f":"ResultsSummary!B130","v":"Concentration (pg / g ww)"},7.6551143917317641E-2,1.1822935894017049E-2,3.2622466214762259E-2,0.1544926316597392,7.7167434121755592E-3,3.4936316780704775E-3,8.9035043925806273E-3,4.2256644406754265E-2,6.0044529202857105E-2,0.15174725781246606,0.17880312800181852,0.19881561941709322,0.19716515340815469,0.22211360979685965,0.19867819732444092,0.17651569151575555,0.16786744655763627,0.27266973435723207,0.33978347179924329,0.33607645747460141,0.46419334633909243,5.5638489717152066E-2,0.14158070328523681,2.8004937000496164,5.0929531877497308E-6,4.6514847112891139E-7]
[{"$f":"IF(ResultsSummary!A131=\"\",\"\",ResultsSummary!A131)","v":""},{"$f":"ResultsSummary!B131","v":"Fugacity (pPa)"},2.9834632945875168E-4,0.33793229247749951,0.30510666835298256,0.13736100081938013,0.36270637022575331,0.37661923840113337,0.34212278808924873,0.2890004531842893,0.26494552537427435,9.6176005040189347E-2,2.2053620563747926E-2,2.053683280613533E-2,2.5253135024116514E-2,7.2595903339254557E-3,1.1050700812484311E-2,2.2905631095234757E-2,4.3180556916820059E-2,3.2733592341331937E-3,6.0253796990026231E-4,8.2745599418236691E-4,1.5883633902599381E-4,1.0574210100757703E-2,2.0127330503511229E-4,5.6052057618840041E-3,7.2975465556633029E-3,7.9463661212423285E-3]
[{"$f":"IF(ResultsSummary!A132=\"\",\"\",ResultsSummary!A132)","v":""},{"$f":"ResultsSummary!B132","v":"BAF (Lair  / kg ww)"},0,0,0,0,0,0,0,0,0,0,0,0,0,0,0,0,0,0,0,0,0,0,0,0,0,0]
[{"$f":"IF(ResultsSummary!A133=\"\",\"\",ResultsSummary!A133)","v":""},{"$f":"ResultsSummary!B133","v":"BAF (g OC / g ww)"},1832.9650863223071,97.315971256730947,268.51934349792242,1271.6469611904183,64.877869950499814,29.372413926213653,95.557309859863807,392.93460807826574,492.37171968580662,1113.200030693685,1311.6787113592229,1319.0647859022149,1308.1145818935845,1345.3982669696793,1341.9504467586903,1324.9367406503247,1252.1719183672715,1343.9463511248578,1440.7444978700294,1425.0260744179648,1726.9723472054159,1332.2258021041985,2260.035776857841,33489.445793323692,5.6928855269361665E-2,8.2746388114572182E-3]
[{"$f":"IF(ResultsSummary!A134=\"\",\"\",ResultsSummary!A134)","v":""},{"$f":"ResultsSummary!B134","v":"BAF (Pa / Pa)"},2.9834632945875168E-4,0.33793229247749951,0.30510666835298261,0.13736100081938013,0.36270637022575331,0.37661923840113337,0.34212278808924873,0.2890004531842893,0.26494552537427435,9.6176005040189347E-2,2.2053620563747926E-2,2.053683280613533E-2,2.5253135024116514E-2,7.2595903339254557E-3,1.1050700812484313E-2,2.2905631095234757E-2,4.3180556916820059E-2,3.2733592341331937E-3,6.0253796990026231E-4,8.2745599418236691E-4,1.5883633902599381E-4,1.0574210100757703E-2,2.0127330503511229E-4,5.6052057618840041E-3,7.2975465556633029E-3,7.9463661212423285E-3]
[{"$f":"IF(ResultsSummary!A135=\"\",\"\",ResultsSummary!A135)","v":""},{"$f":"ResultsSummary!B135","v":"t90 (d)"},65.775647200659307,51.063824205019515,52.635896986263084,60.490288994801212,48.400249472676073,47.634642733401911,49.31734799298237,51.944861736790862,53.003381517436502,60.971884507799494,64.613222628946886,64.69557824581554,64.450543404471375,65.395175545631986,65.1956688898198,64.580467879880558,63.533643344373587,65.608987187704514,65.75714608096068,65.745132383033464,65.781319823026109,65.213953182301367,65.781535708032777,0.32723474738081476,1.0859155172199588,0.4156211637150094]
[{"$f":"IF(ResultsSummary!A136=\"\",\"\",ResultsSummary!A136)","v":"Grass and Cultivated Plants"},{"$f":"ResultsSummary!B136","v":"Concentration (pg / g ww)"},0.53624456626472772,5.0419579569368309E-2,0.16914639539964155,1.3960743582733213,3.2662572505851035E-2,1.2920320313090903E-2,4.2313981016386497E-2,0.1798178963953784,0.24543142544034841,0.3926256647208104,0.4287198699291877,0.47464407332433078,0.47119015244037238,0.54385466614777922,0.48254972136974605,0.41662054667002968,0.41272221020251937,0.72388036598924499,1.2418230361599518,1.1205716508287253,3.411422241080535,0.13603365795901551,1.2558111145534974E-4,43.040698101725759,1.6827927803879028E-4,8.2187228025723521E-6]
[{"$f":"IF(ResultsSummary!A137=\"\",\"\",ResultsSummary!A137)","v":"Grain"},{"$f":"ResultsSummary!B137","v":"Fugacity (pPa)"},4.398664372331972E-5,0.89746507466375314,0.74731044615198705,0.3100403808429566,0.83339379278468284,0.89869735471089307,0.769492723969882,0.37510809578407978,0.27626807976505224,4.3507115685147375E-2,5.6617946002492942E-3,5.3255260483582815E-3,6.7091247380387884E-3,1.5103477769697149E-3,2.7908156871605094E-3,5.9175973432745686E-3,1.4751971536527821E-2,6.0777162799241903E-4,1.0638961219949809E-4,1.3079514175585029E-4,3.6899844630971535E-5,1.832578686580856E-3,2.9639509894212188E-4,3.1239389967108632E-2,0.33235399044084224,0.15676352087414613]
[{"$f":"IF(ResultsSummary!A138=\"\",\"\",ResultsSummary!A138)","v":"Leaf:"},{"$f":"ResultsSummary!B138","v":"BAF (Lair / kg ww)"},12840.011492903845,415.00946974026022,1392.2638082831024,11491.251694152992,274.60782587896733,108.62650424127413,454.13693497547445,1672.0843701039948,2012.5645852054256,2880.2556851371924,3145.038528168765,3149.0799605933057,3126.1645305849424,3294.2651555111543,3259.3300266256806,3127.1773316746471,3078.6145396250431,3567.8927799431035,5265.5583781096966,4751.4301736092193,12691.762864442118,3257.2334369412142,2.0046362124283732,514698.22123114124,1.8810199723307812,0.14620485050229512]
[{"$f":"IF(ResultsSummary!A139=\"\",\"\",ResultsSummary!A139)","v":""},{"$f":"ResultsSummary!B139","v":"BAF (Pa / Paair)"},4.398664372331972E-5,0.89746507466375314,0.74731044615198705,0.3100403808429566,0.83339379278468284,0.89869735471089307,0.769492723969882,0.37510809578407983,0.27626807976505224,4.3507115685147375E-2,5.6617946002492942E-3,5.3255260483582815E-3,6.7091247380387893E-3,1.5103477769697149E-3,2.7908156871605094E-3,5.9175973432745695E-3,1.4751971536527821E-2,6.0777162799241903E-4,1.0638961219949809E-4,1.3079514175585029E-4,3.6899844630971535E-5,1.832578686580856E-3,2.9639509894212188E-4,3.1239389967108632E-2,0.33235399044084224,0.15676352087414613]
[{"$f":"IF(ResultsSummary!A140=\"\",\"\",ResultsSummary!A140)","v":""},{"$f":"ResultsSummary!B140","v":"t90 (d)"},63.314238426816232,10.582374571264317,23.724635676649207,54.589996544546999,8.7128207476780055,5.0976337364532043,12.590760514638491,35.585813099932132,41.969790586270221,57.261739495256606,61.35612020230397,61.349157179383873,61.124929885924246,62.137900880162405,62.016547528202643,61.03249893161324,60.344084075526212,63.180458564014387,63.847587312925022,63.967995823460434,64.421315154961249,62.099020047783853,3.9647180111963026E-2,0.32351291328775428,0.72375643722419858,0.38481570749388216]
[{"$f":"IF(ResultsSummary!A141=\"\",\"\",ResultsSummary!A141)","v":"Root:"},{"$f":"ResultsSummary!B141","v":"Concentration (pg / g ww)"},7.1256672108570581E-6,1.7288815437342744E-2,5.3851673298052488E-2,0.55664186292213402,8.8204683691989476E-4,3.7694999797106973E-4,2.1164815295516989E-3,3.2114111683342588E-3,3.5137924431657493E-3,1.1820361741389646E-2,2.41931549099994E-2,3.1119904224110397E-2,2.2011081511133863E-2,3.7530594059767039E-2,0.16007381095951867,1.2764268415151304E-2,5.3283349999835333E-2,0.47259386010184656,1.4484716986470836,1.7272193985142108,3.7307087319888734,9.0237042424540638E-4,1.3549517912335366E-2,135.21611795265338,5.3659365380047387E-5,1.8254123523053909E-5]
[{"$f":"IF(ResultsSummary!A142=\"\",\"\",ResultsSummary!A142)","v":""},{"$f":"ResultsSummary!B142","v":"Fugacity (pPa)"},1.0139827260620235E-6,0.62183532253623197,0.62890045869164002,0.62240036771083729,0.10018450252167133,9.8605803324989125E-2,0.17011517578859101,6.0398925098751867E-2,4.5691129846336331E-2,2.544929121479363E-2,1.2102095782469667E-2,1.2852628316830162E-2,1.155881984094654E-2,5.8951898552159323E-3,2.9248428499780321E-2,7.517446739934144E-3,4.1384111213311522E-2,2.0337009106415761E-2,1.0720531163728602E-2,1.6113935123036278E-2,6.08861620736294E-3,1.1977183994459611E-3,2.0361408863768638E-4,0.2081219276810507,7.5399909964928041E-2,0.23468809565677212]
[{"$f":"IF(ResultsSummary!A143=\"\",\"\",ResultsSummary!A143)","v":""},{"$f":"ResultsSummary!B143","v":"BAF (g OC / g ww)"},8.734402289062222E-9,1.1523927114105343E-2,1.1681993112731609E-2,1.1536526437694549E-2,1.5794621910197213E-3,1.5531086095668884E-3,2.7718764407370349E-3,9.2484371423972862E-4,6.8885558798892582E-4,3.7167846339397734E-4,1.6990023906243145E-4,1.8101081356266651E-4,1.6188067046616863E-4,7.9694041605667736E-5,4.303730602892815E-4,1.0292699529986088E-4,6.2053595216239534E-4,2.9347427171863306E-4,1.4954608692599686E-4,2.2967327992665161E-4,8.2448082455853784E-5,1.4900224488140365E-5,2.310154614110242E-6,1.0620373822966168E-2,1.5304325952121152E-3,1.0798430553189575E-2]
[{"$f":"IF(ResultsSummary!A144=\"\",\"\",ResultsSummary!A144)","v":""},{"$f":"ResultsSummary!B144","v":"BAF (Pa / Pasoil)"},1.0139827260620235E-6,0.62183532253623197,0.62890045869164002,0.62240036771083729,0.10018450252167133,9.8605803324989125E-2,0.17011517578859101,6.0398925098751867E-2,4.5691129846336331E-2,2.5449291214793633E-2,1.2102095782469667E-2,1.2852628316830164E-2,1.155881984094654E-2,5.8951898552159323E-3,2.9248428499780321E-2,7.517446739934144E-3,4.1384111213311522E-2,2.0337009106415761E-2,1.0720531163728604E-2,1.6113935123036278E-2,6.0886162073629409E-3,1.1977183994459611E-3,2.0361408863768638E-4,0.2081219276810507,7.5399909964928041E-2,0.23468809565677212]
[{"$f":"IF(ResultsSummary!A145=\"\",\"\",ResultsSummary!A145)","v":""},{"$f":"ResultsSummary!B145","v":"t90 (d)"},65.788076384467473,23.39367869242097,22.912003449030866,23.355155970987486,58.957931124106402,59.065561083823404,54.190312592014315,61.670366846089117,62.673090742997488,64.053105555882354,64.963068713990609,64.911900140136083,65.000107288422157,65.386232947127269,63.79409421679901,65.275633382929243,62.966727582078079,64.40164232497871,65.057258756383746,64.689556123673398,65.373045843128281,65.706489437165914,65.774263847358597,0.25665795433061933,1.0058650407488203,0.31476262723225296]
[{"$f":"IF(ResultsSummary!A146=\"\",\"\",ResultsSummary!A146)","v":"Fruit / Tuber"},{"$f":"ResultsSummary!B146","v":"Concentration (pg / g ww)"},0.94857614045746608,0.16657244237416552,0.46480744854903228,2.5761736981770476,0.11011116226417383,4.9676645647724345E-2,0.12484349599588601,0.57214272245817577,0.8067417111806171,2.1202927645582657,2.6629561636046488,2.960836378664407,2.9221129056839223,3.3632457618213247,3.0058221267246812,2.6124330777932236,2.4457634400523216,4.2400621845553053,5.2273810803419627,5.2647719092593164,6.6820401288578566,0.84253909289402684,2.4636164301174293,47.797206688954894,8.7056933239266208E-5,8.749247041681803E-6]
[{"$f":"IF(ResultsSummary!A147=\"\",\"\",ResultsSummary!A147)","v":""},{"$f":"ResultsSummary!B147","v":"Fugacity (pPa)"},1.7733684628995031E-4,0.61473439239190231,0.56276942687586096,0.29580202681173656,0.54888054847728718,0.56725850872376427,0.53051304753964601,0.39975051893007302,0.35646012419550571,0.12914618481711598,2.9986659470420434E-2,2.8038219391086153E-2,3.4062223508076597E-2,9.5540322197010322E-3,1.6223848309217706E-2,2.995748001557855E-2,6.2557480278868371E-2,4.8163051586852523E-3,8.3929672197050357E-4,1.2069621326998804E-3,1.9916280122417491E-4,1.2484866056649682E-2,2.4197391587831813E-4,2.9525619455271067E-2,1.7793038802030172E-2,4.3763321509688598E-2]
[{"$f":"IF(ResultsSummary!A148=\"\",\"\",ResultsSummary!A148)","v":""},{"$f":"ResultsSummary!B148","v":"BAF (Lair  / kg ww)"},0,0,0,0,0,0,0,0,0,0,0,0,0,0,0,0,0,0,0,0,0,0,0,0,0,0]
[{"$f":"IF(ResultsSummary!A149=\"\",\"\",ResultsSummary!A149)","v":""},{"$f":"ResultsSummary!B149","v":"BAF (g OC / g ww)"},22713.010651478515,1371.0772992054242,3825.8845948578773,21204.787694993003,925.75031770551357,417.65221204905862,1339.8891161112565,5320.2207503727168,6615.3704417316003,15554.218274591842,19535.13312724328,19644.004909498955,19387.089634199405,20372.029536982944,20302.50123141786,19609.070091932866,18243.658085019815,20898.601434106891,22165.058500027208,22323.602500852845,24859.681028311643,20174.025652764303,39326.41343999291,571578.49076885404,0.97311940044798395,0.15564247468431086]
[{"$f":"IF(ResultsSummary!A150=\"\",\"\",ResultsSummary!A150)","v":""},{"$f":"ResultsSummary!B150","v":"BAF (Pa / Pa)"},1.7733684628995031E-4,0.61473439239190231,0.56276942687586096,0.29580202681173656,0.54888054847728718,0.56725850872376427,0.53051304753964601,0.39975051893007302,0.35646012419550571,0.12914618481711598,2.9986659470420434E-2,2.8038219391086156E-2,3.4062223508076597E-2,9.5540322197010322E-3,1.6223848309217706E-2,2.995748001557855E-2,6.2557480278868371E-2,4.8163051586852523E-3,8.3929672197050357E-4,1.2069621326998804E-3,1.9916280122417491E-4,1.2484866056649684E-2,2.4197391587831813E-4,2.9525619455271067E-2,1.7793038802030172E-2,4.3763321509688598E-2]
[{"$f":"IF(ResultsSummary!A151=\"\",\"\",ResultsSummary!A151)","v":""},{"$f":"ResultsSummary!B151","v":"t90 (d)"},65.778000692714301,40.000196861294754,42.156791598494124,54.980280422697305,39.718021042517535,39.140267237512631,40.144485391802604,44.692500175168561,46.363820148481494,58.116785730526516,63.940810029029151,64.062084761330667,63.694524437935222,65.195475030339679,64.793633424945241,63.949063710422692,61.982970556244112,65.49358812172116,65.739301548873954,65.718457704214657,65.777796487048917,65.011562874033828,65.780196538978402,0.32723340874857465,1.0787874488312541,0.41501871810328378]
[{"$f":"IF(ResultsSummary!A152=\"\",\"\",ResultsSummary!A152)","v":"Grass and Cultivated Plants"},{"$f":"ResultsSummary!B152","v":"Concentration (pg / g ww)"},1.1978345306428322,4.6401799399813107E-2,0.1570420036774518,0.95136070751315649,3.2797018012346024E-2,1.2599804094723721E-2,4.363566492007228E-2,0.25673986640493202,0.38660907111732629,0.86395836560707195,0.9905151228781427,1.0979467585637908,1.089132098908991,1.2592912702202623,1.1026083256745296,0.96751452994652232,0.93641769627429305,1.6288358413666169,2.7730383931271407,2.460047819782317,7.6040149813595912,0.31459932082163977,0.22022056062997952,1.7156214729467691,8.6840820313449467E-5,1.2084318250970453E-6]
[{"$f":"IF(ResultsSummary!A153=\"\",\"\",ResultsSummary!A153)","v":"Potato"},{"$f":"ResultsSummary!B153","v":"Fugacity (pPa)"},9.8255020290248174E-5,0.82594886190177541,0.69383169269149669,0.21127831360015339,0.83682420386331569,0.87640324197928565,0.79352795116536778,0.53557073199911087,0.43518365875804949,9.5735811326409778E-2,1.3081019956231633E-2,1.2319007844108432E-2,1.5507800980002682E-2,3.4971985880097767E-3,6.3769109706488117E-3,1.3742388506166655E-2,3.3470472051797033E-2,1.3675743362467419E-3,2.3757207804052665E-4,2.8714121321616286E-4,8.224926483884201E-5,4.2381276722283506E-3,0.51976204144537963,1.2452160534817277E-3,0.17151186706231344,2.304957013263564E-2]
[{"$f":"IF(ResultsSummary!A154=\"\",\"\",ResultsSummary!A154)","v":"Leaf:"},{"$f":"ResultsSummary!B154","v":"BAF (Lair / kg ww)"},28681333.308761779,381938.65019076417,1292631.1411117509,7830761.5043387506,275738.16514514643,105931.79114514575,468321.97411877412,2387363.696293958,3170236.7512794584,6337896.9279328203,7266302.4102431284,7284452.3496852722,7225970.4900383847,7627845.4711258365,7447448.9660409456,7262218.6550749568,6985010.8950948538,8028276.3715832662,11758193.493416335,10431055.819403244,28289771.286275338,7532866.8095360054,3515354.3828690876,20516101.257108718,970.7036976087644,21.497086417762024]
[{"$f":"IF(ResultsSummary!A155=\"\",\"\",ResultsSummary!A155)","v":""},{"$f":"ResultsSummary!B155","v":"BAF (Pa / Paair)"},9.8255020290248174E-5,0.82594886190177541,0.6938316926914968,0.21127831360015339,0.83682420386331569,0.87640324197928565,0.79352795116536778,0.53557073199911098,0.43518365875804949,9.5735811326409778E-2,1.3081019956231633E-2,1.2319007844108432E-2,1.5507800980002682E-2,3.4971985880097767E-3,6.3769109706488117E-3,1.3742388506166655E-2,3.3470472051797033E-2,1.3675743362467419E-3,2.3757207804052667E-4,2.8714121321616286E-4,8.224926483884201E-5,4.2381276722283506E-3,0.51976204144537963,1.2452160534817277E-3,0.17151186706231344,2.304957013263564E-2]
[{"$f":"IF(ResultsSummary!A156=\"\",\"\",ResultsSummary!A156)","v":""},{"$f":"ResultsSummary!B156","v":"t90 (d)"},65.786382544939997,11.996682899098081,20.911066188405862,55.61088980932054,10.745472085576891,8.1405716564591426,13.59816350831899,30.569885402373874,37.17448140529487,59.50819946910589,64.94039817096612,64.990675189715702,64.781242610238365,65.56884151218209,65.380506859411298,64.897575564034213,63.601391679849797,65.706381114967584,65.778425299496817,65.77490408025362,65.786746153411968,65.519286510715048,31.606400617582487,0.32680183229328119,0.90430490146886378,0.4068924353023225]
[{"$f":"IF(ResultsSummary!A157=\"\",\"\",ResultsSummary!A157)","v":"Root:"},{"$f":"ResultsSummary!B157","v":"Concentration (pg / g ww)"},1.3377438930343997E-6,6.871714138635015E-3,2.1679375243620253E-2,0.22147096627731894,1.8097719656739482E-4,7.7229028272030674E-5,4.6437345034711937E-4,6.3546599862488872E-4,6.8627270588602989E-4,2.2680851132087158E-3,4.5890478564842392E-3,5.9067403965014677E-3,4.1732002060351995E-3,7.0812593036207105E-3,3.0816422291361903E-2,2.4116942902426713E-3,1.0367260171730206E-2,9.028078186755352E-2,0.27442645254544112,0.32875621809994821,0.70402494913122859,1.6957957277648138E-4,2.5441689906259926E-3,30.829563790192385,1.0762379401057078E-5,4.279134536072729E-6]
[{"$f":"IF(ResultsSummary!A158=\"\",\"\",ResultsSummary!A158)","v":""},{"$f":"ResultsSummary!B158","v":"Fugacity (pPa)"},1.9036100891227195E-7,0.24715831997057014,0.2531800443674242,0.2476342870165337,2.0555722946850489E-2,2.0202229509910588E-2,3.732466833957556E-2,1.1951588022176701E-2,8.9238552993142883E-3,4.8831973004576489E-3,2.2955706651783168E-3,2.4395042585453066E-3,2.191499282639156E-3,1.1123023510467014E-3,5.6307269665484159E-3,1.4203542882553566E-3,8.0520434230494878E-3,3.8850294893359259E-3,2.0311044664613085E-3,3.0671010146796612E-3,1.1489875044153009E-3,2.2508336823475085E-4,3.8232256949523279E-5,4.7452244175708862E-2,1.5122848212995083E-2,5.5015620665747583E-2]
[{"$f":"IF(ResultsSummary!A159=\"\",\"\",ResultsSummary!A159)","v":""},{"$f":"ResultsSummary!B159","v":"BAF (g OC / g ww)"},1.639761298941338E-9,4.5803677625913912E-3,4.7028865915194288E-3,4.5900350437664715E-3,3.2407195111443281E-4,3.1819888410499755E-4,6.0817248284401231E-4,1.830057577915632E-4,1.3453918977296078E-4,7.1317478108336187E-5,3.2227311021902197E-5,3.4356914371408614E-5,3.0691833429484715E-5,1.5036643775597448E-5,8.2852765790990284E-5,1.9447134673371432E-5,1.2073673412050411E-4,5.6063120885783847E-5,2.833289885158649E-5,4.3715650120794713E-5,1.5558841825211383E-5,2.8001512849731144E-6,4.337736420437569E-7,2.4214679226737834E-3,3.0695659780467289E-4,2.5313698056868349E-3]
[{"$f":"IF(ResultsSummary!A160=\"\",\"\",ResultsSummary!A160)","v":""},{"$f":"ResultsSummary!B160","v":"BAF (Pa / Pasoil)"},1.9036100891227195E-7,0.24715831997057014,0.2531800443674242,0.24763428701653373,2.0555722946850489E-2,2.0202229509910588E-2,3.732466833957556E-2,1.1951588022176701E-2,8.9238552993142883E-3,4.8831973004576489E-3,2.2955706651783168E-3,2.4395042585453066E-3,2.191499282639156E-3,1.1123023510467014E-3,5.6307269665484159E-3,1.4203542882553566E-3,8.0520434230494878E-3,3.8850294893359259E-3,2.0311044664613085E-3,3.0671010146796612E-3,1.1489875044153012E-3,2.2508336823475085E-4,3.8232256949523279E-5,4.7452244175708862E-2,1.5122848212995085E-2,5.5015620665747583E-2]
[{"$f":"IF(ResultsSummary!A161=\"\",\"\",ResultsSummary!A161)","v":""},{"$f":"ResultsSummary!B161","v":"t90 (d)"},65.788132990617854,49.528057994867375,49.131899914001252,49.496745005587606,64.435822621740343,64.459078299408034,63.332624802125487,65.001872702187868,65.201061623137392,65.466889019538939,65.637124177156892,65.627655052972116,65.64397084041525,65.714969205189234,65.41771042909005,65.694703039518245,65.258416509714024,65.53255662874453,65.654522917921668,65.586366626255355,65.712555756981217,65.77333769673335,65.785630284832067,0.31170701588239513,1.0746212211385118,0.39303484030628111]
[{"$f":"IF(ResultsSummary!A162=\"\",\"\",ResultsSummary!A162)","v":"Fruit / Tuber"},{"$f":"ResultsSummary!B162","v":"Concentration (pg / g ww)"},3.6460493353659148E-7,7.7199853927847602E-4,2.430049036042374E-3,2.4870409237396217E-2,2.7583467291953328E-5,1.1781998860591678E-5,7.5415042186280126E-5,1.0401545742646689E-4,1.0669221598566422E-4,3.3765189967154859E-4,6.8795281533062444E-4,8.4214839151589037E-4,5.9536747243181759E-4,9.6812102657407037E-4,4.3968208137740213E-3,3.6656600894310117E-4,1.5428600589471914E-3,1.107468496243713E-2,3.1356709241250023E-2,3.7493130720602334E-2,7.5490425928057145E-2,4.6159005405981513E-5,5.6620629241771177E-4,23.000266502417706,6.9034194334932903E-6,3.7945549015874773E-6]
[{"$f":"IF(ResultsSummary!A163=\"\",\"\",ResultsSummary!A163)","v":""},{"$f":"ResultsSummary!B163","v":"Fugacity (pPa)"},1.2970820563230132E-6,0.47107638726111495,0.47646681218079751,0.4713943578212651,7.6023050284839397E-2,7.482556924770592E-2,0.14351319289938444,4.8068277271203941E-2,3.4239224187891333E-2,1.8046405231690491E-2,8.5748726410373698E-3,8.6646889080035597E-3,7.7915425056932384E-3,3.7956395358054226E-3,1.9921768650539979E-2,5.3861252690410319E-3,2.9610978779885676E-2,1.1847694204563315E-2,5.7850031126124614E-3,8.7060804374637403E-3,3.0749572672506133E-3,1.5311766646060306E-3,2.1270354561184668E-4,5.72942878804669E-2,0.10383574079389535,8.538517957635211E-2]
[{"$f":"IF(ResultsSummary!A164=\"\",\"\",ResultsSummary!A164)","v":""},{"$f":"ResultsSummary!B164","v":"BAF (Lair  / kg ww)"},"-","-","-","-","-","-","-","-","-","-","-","-","-","-","-","-","-","-","-","-","-","-","-","-","-","-"]
[{"$f":"IF(ResultsSummary!A165=\"\",\"\",ResultsSummary!A165)","v":""},{"$f":"ResultsSummary!B165","v":"BAF (g OC / g ww)"},4.4692041767445207E-10,5.1457862634273779E-4,5.2714826418724713E-4,5.1544476403069201E-4,4.9393118212413104E-5,4.8544167573378257E-5,9.8768250889303731E-5,2.9955068641844264E-5,2.0916297807969113E-5,1.0617098019305167E-5,4.8312569494620228E-6,4.8984072827152138E-6,4.3786347146213463E-6,2.0557488977725664E-6,1.1821254319022084E-5,2.955871551148989E-6,1.7968092016269314E-5,6.8772266807785268E-6,3.2373937097183937E-6,4.9855683155984378E-6,1.6683266662379959E-6,7.6219202693123995E-7,9.65365769785961E-8,1.8065259673336837E-3,1.9689420559877588E-4,2.2447113132168799E-3]
[{"$f":"IF(ResultsSummary!A166=\"\",\"\",ResultsSummary!A166)","v":""},{"$f":"ResultsSummary!B166","v":"BAF (Pa / Pa)"},1.2970820563230132E-6,0.47107638726111495,0.47646681218079751,0.4713943578212651,7.6023050284839397E-2,7.4825569247705934E-2,0.14351319289938444,4.8068277271203941E-2,3.4239224187891333E-2,1.8046405231690491E-2,8.5748726410373698E-3,8.6646889080035597E-3,7.7915425056932384E-3,3.7956395358054226E-3,1.9921768650539979E-2,5.3861252690410319E-3,2.9610978779885676E-2,1.1847694204563315E-2,5.7850031126124614E-3,8.7060804374637403E-3,3.0749572672506133E-3,1.5311766646060306E-3,2.1270354561184668E-4,5.72942878804669E-2,0.10383574079389535,8.538517957635211E-2]
[{"$f":"IF(ResultsSummary!A167=\"\",\"\",ResultsSummary!A167)","v":""},{"$f":"ResultsSummary!B167","v":"t90 (d)"},16.565338894621405,8.7645086397074845,8.6750069008094268,8.7573524466118631,15.306449325295768,15.326299841016699,14.188713564477339,15.769295496513298,15.998320158406594,16.26642733799595,16.423315529191743,16.421827611668856,16.436291725842558,16.502484354581131,16.235350294146166,16.476137979883827,16.074852661872555,16.369099226168249,16.469529735759608,16.421141049366774,16.514422609188777,16.539995923498481,16.561837682414168,0.3039939372002266,0.93191318792568667,0.37340397224365496]
[{"$f":"IF(ResultsSummary!A168=\"\",\"\",ResultsSummary!A168)","v":"Grass and Cultivated Plants"},{"$f":"ResultsSummary!B168","v":"Concentration (pg / g ww)"},0.55800193908533213,5.3351101271254454E-2,0.18730613886298295,1.6261702366897184,3.3835731043143399E-2,1.3240353769936094E-2,4.4132632554038792E-2,0.19640307850581928,0.26855297706636,0.42971756019514179,0.45698526349454804,0.50618323115984754,0.50357537665235774,0.57494841052482237,0.510876567264135,0.44629093607910741,0.44312904307003176,0.75421124355844205,1.2808889317176346,1.154889536443082,3.4858191471883928,0.14385388657866932,0.13970123692218811,46.753944863235866,1.7049989242514727E-4,9.0511086576719258E-6]
[{"$f":"IF(ResultsSummary!A169=\"\",\"\",ResultsSummary!A169)","v":"Lettuce"},{"$f":"ResultsSummary!B169","v":"Fugacity (pPa)"},4.5771340234618087E-5,0.94964596084988173,0.82754251942514911,0.36114010440126848,0.86332722937350859,0.9209578880503293,0.80256546002650908,0.40970552020284062,0.30229468437546819,4.7617293731023844E-2,6.035075299109161E-3,5.6793966980430953E-3,7.170247509349378E-3,1.5966987280982116E-3,2.9546433765961942E-3,6.3390297928847426E-3,1.5838806026867935E-2,6.3323750288664632E-4,1.0973647029246764E-4,1.348007871872435E-4,3.7704563039424956E-5,1.9379289690593655E-3,0.32972125712242079,3.3934503400277281E-2,0.3367397357395947,0.17264040837914935]
[{"$f":"IF(ResultsSummary!A170=\"\",\"\",ResultsSummary!A170)","v":"Leaf:"},{"$f":"ResultsSummary!B170","v":"BAF (Lair / kg ww)"},13360976.990079699,439139.16850853333,1541738.7854588174,13385197.841792492,284471.05741957843,111317.15856058855,473655.70431031921,1826306.0818362946,2202163.8424073919,3152357.4665844785,3352390.1300238287,3358330.0818856638,3341027.9752520318,3482607.8231969932,3450660.6507966071,3349884.9487704365,3305427.9154400695,3717388.9179418022,5431204.9699849812,4896944.3288905285,12968547.097949965,3444483.4934833632,2230034.0808404582,559102740.38239813,1905.8419234364885,161.01236408177343]
[{"$f":"IF(ResultsSummary!A171=\"\",\"\",ResultsSummary!A171)","v":""},{"$f":"ResultsSummary!B171","v":"BAF (Pa / Paair)"},4.5771340234618087E-5,0.94964596084988173,0.82754251942514911,0.36114010440126848,0.86332722937350859,0.9209578880503293,0.80256546002650919,0.40970552020284062,0.30229468437546819,4.7617293731023844E-2,6.035075299109161E-3,5.6793966980430953E-3,7.170247509349378E-3,1.5966987280982116E-3,2.9546433765961942E-3,6.3390297928847426E-3,1.5838806026867935E-2,6.3323750288664632E-4,1.0973647029246764E-4,1.348007871872435E-4,3.7704563039424956E-5,1.9379289690593655E-3,0.32972125712242079,3.3934503400277281E-2,0.3367397357395947,0.17264040837914937]
[{"$f":"IF(ResultsSummary!A172=\"\",\"\",ResultsSummary!A172)","v":""},{"$f":"ResultsSummary!B172","v":"t90 (d)"},65.787271170663459,11.101599090804152,25.792117857212844,60.442765423926609,9.0245886228940364,5.2220765033794843,13.129168004046766,38.865156896632783,45.92107490080982,62.667030106549703,65.397311966321112,65.420828914108952,65.3228455765897,65.688058728181034,65.601544225198467,65.377418047923172,64.760037311133402,65.750916677135109,65.783726692265773,65.782125449187831,65.787509609291703,65.665191208819166,44.104778425648661,0.32723472514420876,0.7319742301821508,0.4004535115525984]
[{"$f":"IF(ResultsSummary!A173=\"\",\"\",ResultsSummary!A173)","v":"Root:"},{"$f":"ResultsSummary!B173","v":"Concentration (pg / g ww)"},7.3843399358292752E-6,1.7916426139384115E-2,5.5806572209847916E-2,0.57684882225027823,9.1406649937501936E-4,3.9063386507685898E-4,2.1933130778687936E-3,3.3279903536003802E-3,3.6413485357202238E-3,1.2249459128528895E-2,2.5071403798287269E-2,3.2249604810500376E-2,2.2810117764945351E-2,3.8893012588164522E-2,0.16588473752292829,1.3227631072362299E-2,5.5217617898160043E-2,0.489749747119896,1.5010534583963031,1.7899201302797636,3.8661392208434231,9.3512786430915843E-4,1.4041386339070674E-2,140.12467186851475,5.5607283217409768E-5,1.8916776399474151E-5]
[{"$f":"IF(ResultsSummary!A174=\"\",\"\",ResultsSummary!A174)","v":""},{"$f":"ResultsSummary!B174","v":"Fugacity (pPa)"},1.0507918650610469E-6,0.64440890513623628,0.65173051664581683,0.64499446232336233,0.10382135469290113,0.10218534627716151,0.17629061940365559,6.2591499362798605E-2,4.7349788427304446E-2,2.6373139790981954E-2,1.2541420550423527E-2,1.3319198574939321E-2,1.1978422853162E-2,6.1091943517708391E-3,3.0310191626981325E-2,7.7903416668947288E-3,4.2886418365937165E-2,2.1075273946419233E-2,1.1109703002268297E-2,1.6698895855127491E-2,6.3096423792376082E-3,1.2411974271589019E-3,2.1100559452648154E-4,0.21567707508924022,7.8137043147848875E-2,0.24320763599252915]
[{"$f":"IF(ResultsSummary!A175=\"\",\"\",ResultsSummary!A175)","v":""},{"$f":"ResultsSummary!B175","v":"BAF (g OC / g ww)"},9.0514745819799764E-9,1.1942263466446487E-2,1.2106067504947506E-2,1.1955320164940974E-2,1.6367991079499909E-3,1.6094888507887004E-3,2.8724998365531156E-3,9.584169694390887E-4,7.1386210973413682E-4,3.851709656530103E-4,1.7606788014237803E-4,1.8758178565666939E-4,1.6775718882026911E-4,8.258705839920782E-5,4.459962670663309E-4,1.0666340419457477E-4,6.4306236561102021E-4,3.0412784103759158E-4,1.5497484084747376E-4,2.3801077470628611E-4,8.5441075185726809E-5,1.5441125649672636E-5,2.3940167945147009E-6,1.1005909795348439E-2,1.585989662090938E-3,1.1190430259878212E-2]
[{"$f":"IF(ResultsSummary!A176=\"\",\"\",ResultsSummary!A176)","v":""},{"$f":"ResultsSummary!B176","v":"BAF (Pa / Pasoil)"},1.0507918650610469E-6,0.64440890513623628,0.65173051664581683,0.64499446232336233,0.10382135469290113,0.10218534627716153,0.17629061940365562,6.2591499362798605E-2,4.7349788427304446E-2,2.6373139790981957E-2,1.2541420550423527E-2,1.3319198574939321E-2,1.1978422853162E-2,6.1091943517708391E-3,3.0310191626981325E-2,7.7903416668947288E-3,4.2886418365937165E-2,2.1075273946419233E-2,1.1109703002268297E-2,1.6698895855127491E-2,6.3096423792376091E-3,1.2411974271589019E-3,2.1100559452648154E-4,0.21567707508924025,7.8137043147848875E-2,0.24320763599252915]
[{"$f":"IF(ResultsSummary!A177=\"\",\"\",ResultsSummary!A177)","v":""},{"$f":"ResultsSummary!B177","v":"t90 (d)"},65.788076384467473,23.39367869242097,22.912003449030863,23.355155970987486,58.957931124106402,59.065561083823404,54.190312592014315,61.670366846089117,62.673090742997488,64.053105555882354,64.963068713990609,64.911900140136083,65.000107288422157,65.386232947127269,63.79409421679901,65.275633382929243,62.966727582078079,64.40164232497871,65.057258756383746,64.689556123673398,65.373045843128281,65.706489437165914,65.774263847358597,0.25665795433061933,1.0058650407488203,0.31476262723225307]
[{"$f":"IF(ResultsSummary!A178=\"\",\"\",ResultsSummary!A178)","v":"Fruit / Tuber"},{"$f":"ResultsSummary!B178","v":"Concentration (pg / g ww)"},"-","-","-","-","-","-","-","-","-","-","-","-","-","-","-","-","-","-","-","-","-","-","-","-","-","-"]
[{"$f":"IF(ResultsSummary!A179=\"\",\"\",ResultsSummary!A179)","v":""},{"$f":"ResultsSummary!B179","v":"Fugacity (pPa)"},"-","-","-","-","-","-","-","-","-","-","-","-","-","-","-","-","-","-","-","-","-","-","-","-","-","-"]
[{"$f":"IF(ResultsSummary!A180=\"\",\"\",ResultsSummary!A180)","v":""},{"$f":"ResultsSummary!B180","v":"BAF (Lair  / kg ww)"},"-","-","-","-","-","-","-","-","-","-","-","-","-","-","-","-","-","-","-","-","-","-","-","-","-","-"]
[{"$f":"IF(ResultsSummary!A181=\"\",\"\",ResultsSummary!A181)","v":""},{"$f":"ResultsSummary!B181","v":"BAF (g OC / g ww)"},"-","-","-","-","-","-","-","-","-","-","-","-","-","-","-","-","-","-","-","-","-","-","-","-","-","-"]
[{"$f":"IF(ResultsSummary!A182=\"\",\"\",ResultsSummary!A182)","v":""},{"$f":"ResultsSummary!B182","v":"BAF (Pa / Pa)"},"-","-","-","-","-","-","-","-","-","-","-","-","-","-","-","-","-","-","-","-","-","-","-","-","-","-"]
[{"$f":"IF(ResultsSummary!A183=\"\",\"\",ResultsSummary!A183)","v":""},{"$f":"ResultsSummary!B183","v":"t90 (d)"},"-","-","-","-","-","-","-","-","-","-","-","-","-","-","-","-","-","-","-","-","-","-","-","-","-","-"]
[{"$f":"IF(ResultsSummary!A184=\"\",\"\",ResultsSummary!A184)","v":"Grass and Cultivated Plants"},{"$f":"ResultsSummary!B184","v":"Concentration (pg / g ww)"},1.1978345306427278,4.5949880114051399E-2,0.15447540630959489,0.88356780766238041,3.2796350836648211E-2,1.2599592570135735E-2,4.3631612506734647E-2,0.25673605874381256,0.38660538323139976,0.86394737932067633,0.99050366113240973,1.0979310534219013,1.0891221804773334,1.2592826069534016,1.1024169407847895,0.96751082243414677,0.93632812529885701,1.6284474871893562,2.7724215870589668,2.458930894230539,7.6031204753169117,0.31459927950352556,0.22022117302604771,5.6526159283687503E-2,8.6694837064072076E-5,9.4847215116323785E-7]
[{"$f":"IF(ResultsSummary!A185=\"\",\"\",ResultsSummary!A185)","v":"Carrot"},{"$f":"ResultsSummary!B185","v":"Fugacity (pPa)"},9.8255020290239622E-5,0.8179047294635009,0.68249213668420539,0.19622285730327033,0.83680718070676074,0.87638852898587116,0.79345425678580517,0.53556278904937937,0.43517950751636764,9.5734593928577416E-2,1.3080868589209361E-2,1.2318831631769701E-2,1.5507659754650557E-2,3.4971745291082742E-3,6.3758041003535481E-3,1.3742335845380817E-2,3.3467270507398721E-2,1.3672482731821238E-3,2.37519234957024E-4,2.8701084365365652E-4,8.2239589362848777E-5,4.2381271156109908E-3,0.51976348681555606,4.1027279089025943E-5,0.17122354804862649,1.8091111896472261E-2]
[{"$f":"IF(ResultsSummary!A186=\"\",\"\",ResultsSummary!A186)","v":"Leaf:"},{"$f":"ResultsSummary!B186","v":"BAF (Lair / kg ww)"},28681333.30875928,378218.84957459033,1271505.1773141832,7272750.1988196941,275732.55592168978,105930.01276999735,468278.48138828174,2387328.2897478235,3170206.5102107087,6337816.3338283263,7266218.3282248722,7284348.152139402,7225904.685078145,7627792.9955290845,7446156.2774533285,7262190.8262778651,6984342.7592386063,8026362.2347587161,11755578.122090979,10426319.849361107,28286443.390233099,7532865.820201857,3515364.1584740365,675962.86583408306,969.07190187666413,16.872600816152257]
[{"$f":"IF(ResultsSummary!A187=\"\",\"\",ResultsSummary!A187)","v":""},{"$f":"ResultsSummary!B187","v":"BAF (Pa / Paair)"},9.8255020290239622E-5,0.8179047294635009,0.68249213668420539,0.19622285730327033,0.83680718070676074,0.87638852898587116,0.79345425678580517,0.53556278904937937,0.43517950751636769,9.5734593928577416E-2,1.3080868589209361E-2,1.2318831631769701E-2,1.5507659754650557E-2,3.4971745291082742E-3,6.3758041003535481E-3,1.3742335845380817E-2,3.3467270507398728E-2,1.3672482731821238E-3,2.37519234957024E-4,2.8701084365365652E-4,8.2239589362848777E-5,4.2381271156109908E-3,0.51976348681555606,4.1027279089025943E-5,0.17122354804862649,1.8091111896472261E-2]
[{"$f":"IF(ResultsSummary!A188=\"\",\"\",ResultsSummary!A188)","v":""},{"$f":"ResultsSummary!B188","v":"t90 (d)"},65.786382544949717,11.996934798711608,20.911722578197367,55.613441680052141,10.745477971546409,8.1405755876781019,13.598181215745214,30.569901759682129,37.174497640058838,59.508208699446371,64.940401530428957,64.990678578925539,64.781245649703976,65.56884244747674,65.380516954489948,64.89757760388531,63.601411548127203,65.706385234883271,65.778426611663136,65.774906164100841,65.786746592715772,65.519286652840009,31.606495918599354,0.32723433154905235,0.90433017312995956,0.40846040971139758]
[{"$f":"IF(ResultsSummary!A189=\"\",\"\",ResultsSummary!A189)","v":"Root:"},{"$f":"ResultsSummary!B189","v":"Concentration (pg / g ww)"},1.393666165601915E-8,9.4768557031413425E-5,3.0135985355407617E-4,3.0562357703492449E-3,1.924575157413871E-6,8.2098749441593967E-7,5.0234010148518938E-6,6.6995412561292502E-6,7.2133111179851277E-6,2.374372122722464E-5,4.7917701104053539E-5,6.1685526367612992E-5,4.3571025461995292E-5,7.3854080098556858E-5,3.2284539732973822E-4,2.5160473391622265E-5,1.0887397582670414E-4,9.4417804231263685E-4,2.8647416063036241E-3,3.4354198925305342E-3,7.3429036391153132E-3,1.7670790559307754E-6,2.6506237450026099E-5,0.9531631669354157,3.1541064735744542E-7,1.3299533204554072E-7]
[{"$f":"IF(ResultsSummary!A190=\"\",\"\",ResultsSummary!A190)","v":""},{"$f":"ResultsSummary!B190","v":"Fugacity (pPa)"},1.9831875051142986E-9,3.4085872708569873E-3,3.5193957499229287E-3,3.417282087428042E-3,2.1859678720052679E-4,2.1476092808698428E-4,4.0376291253490121E-4,1.2600226794840343E-4,9.3797325893541154E-5,5.1120337029844407E-5,2.3969780319859191E-5,2.5476336213037304E-5,2.2880730932996046E-5,1.160077090892762E-5,5.8989790170423342E-5,1.4818124511431978E-5,8.4560237369865791E-5,4.0630569005809378E-5,2.1202728154850013E-5,3.2050435119154804E-5,1.1983814689920198E-5,2.3454482125051345E-6,3.983199562168743E-7,1.4670895652146708E-3,4.4320193211927342E-4,1.7098833131915941E-3]
[{"$f":"IF(ResultsSummary!A191=\"\",\"\",ResultsSummary!A191)","v":""},{"$f":"ResultsSummary!B191","v":"BAF (g OC / g ww)"},1.7083089325971788E-11,6.3168349959943703E-5,6.5373711122915842E-5,6.3341166220180526E-5,3.4462951032464324E-6,3.3826309929361084E-6,6.5789598118495427E-6,1.9293787977435223E-6,1.4141215657718094E-6,7.4659557922736739E-7,3.3650959964448203E-7,3.5879761172890089E-7,3.2044344623041486E-7,1.5682485928013158E-7,8.6799933615778182E-7,2.0288604425207725E-7,1.2679423545167158E-6,5.8632154738682166E-7,2.9576753047846942E-7,4.5681756198516955E-7,1.6227702782372391E-7,2.9178565602565772E-8,4.5192387761732112E-9,7.4864959151401051E-5,8.9959083968644989E-6,7.8674873388382422E-5]
[{"$f":"IF(ResultsSummary!A192=\"\",\"\",ResultsSummary!A192)","v":""},{"$f":"ResultsSummary!B192","v":"BAF (Pa / Pasoil)"},1.9831875051142986E-9,3.4085872708569877E-3,3.5193957499229287E-3,3.417282087428042E-3,2.1859678720052679E-4,2.1476092808698428E-4,4.0376291253490121E-4,1.2600226794840343E-4,9.3797325893541154E-5,5.1120337029844407E-5,2.3969780319859191E-5,2.5476336213037308E-5,2.2880730932996049E-5,1.1600770908927622E-5,5.8989790170423342E-5,1.4818124511431978E-5,8.4560237369865791E-5,4.0630569005809378E-5,2.1202728154850013E-5,3.2050435119154804E-5,1.1983814689920198E-5,2.3454482125051345E-6,3.983199562168743E-7,1.4670895652146708E-3,4.4320193211927342E-4,1.7098833131915941E-3]
[{"$f":"IF(ResultsSummary!A193=\"\",\"\",ResultsSummary!A193)","v":""},{"$f":"ResultsSummary!B193","v":"t90 (d)"},23.025850884275879,22.947365307560013,22.944813848039267,22.947165102009787,23.020817552904614,23.020905876824752,23.016553945305393,23.022949620501841,23.023691166696807,23.024673840680524,23.025299005351989,23.025264315620571,23.025324081640829,23.025583812318835,23.024492639825606,23.025509730014395,23.023903858520178,23.024915376515331,23.025362719082654,23.025112941399161,23.025574992409837,23.02579692399955,23.025841758284525,0.32376417791390399,1.0580490727022378,0.41038724427799189]
[{"$f":"IF(ResultsSummary!A194=\"\",\"\",ResultsSummary!A194)","v":"Fruit / Tuber"},{"$f":"ResultsSummary!B194","v":"Concentration (pg / g ww)"},"-","-","-","-","-","-","-","-","-","-","-","-","-","-","-","-","-","-","-","-","-","-","-","-","-","-"]
[{"$f":"IF(ResultsSummary!A195=\"\",\"\",ResultsSummary!A195)","v":""},{"$f":"ResultsSummary!B195","v":"Fugacity (pPa)"},"-","-","-","-","-","-","-","-","-","-","-","-","-","-","-","-","-","-","-","-","-","-","-","-","-","-"]
[{"$f":"IF(ResultsSummary!A196=\"\",\"\",ResultsSummary!A196)","v":""},{"$f":"ResultsSummary!B196","v":"BAF (Lair  / kg ww)"},"-","-","-","-","-","-","-","-","-","-","-","-","-","-","-","-","-","-","-","-","-","-","-","-","-","-"]
[{"$f":"IF(ResultsSummary!A197=\"\",\"\",ResultsSummary!A197)","v":""},{"$f":"ResultsSummary!B197","v":"BAF (g OC / g ww)"},"-","-","-","-","-","-","-","-","-","-","-","-","-","-","-","-","-","-","-","-","-","-","-","-","-","-"]
[{"$f":"IF(ResultsSummary!A198=\"\",\"\",ResultsSummary!A198)","v":""},{"$f":"ResultsSummary!B198","v":"BAF (Pa / Pa)"},"-","-","-","-","-","-","-","-","-","-","-","-","-","-","-","-","-","-","-","-","-","-","-","-","-","-"]
[{"$f":"IF(ResultsSummary!A199=\"\",\"\",ResultsSummary!A199)","v":""},{"$f":"ResultsSummary!B199","v":"t90 (d)"},"-","-","-","-","-","-","-","-","-","-","-","-","-","-","-","-","-","-","-","-","-","-","-","-","-","-"]
["ChemProp","logKow",12,3.98,3.93,3.91,5.47,5.48,5.1100000000000003,5.71,5.82,6.34,6.68,6.68,6.74,7.18,6.15,6.93,5.94,6.39,6.76,6.53,7.08,8,9,1.36,3.28,1.49]
[null,"logKoa",12,7.37,7.82,8.74,7.24,6.88,7.35,8.06,8.14,8.99,9.66,9.7100000000000009,9.61,10.220000000000001,9.98,9.6999999999999993,9.32,10.44,11.26,11.02,11.89,10,8,10.581,5.74,4.2679999999999998]

{"sheet":"D values","index":5,"n_rows":41,"n_cols":17,"rows_kept":41,"cut":false,"hidden":false,"merged":[]}
[null,"Human bioaccumulation model for neutral organic contaminants",null,null,null,null,null,null,null,null,{"$f":"B1","v":"Human bioaccumulation model for neutral organic contaminants"}]
[null,"G.Czub, E. Arbaban, E. Undeman, J. Armitage, M.S. McLachlan",null,null,null,null,null,null,null,null,{"$f":"B2","v":"G.Czub, E. Arbaban, E. Undeman, J. Armitage, M.S. McLachlan"}]
[null,"Dept. of Appl. Environ. Sci. (ITM), Stockholm University, SE-106 91 Stockholm",null,null,null,null,null,null,null,null,{"$f":"B3","v":"Dept. of Appl. Environ. Sci. (ITM), Stockholm University, SE-106 91 Stockholm"}]
[]
[null,"b-HCH",null,null,null,null,null,null,null,null,"b-HCH"]
[null,"Default Scenario",null,null,null,null,null,null,null,null,"Default Scenario"]
[]
[null,"Human",null,null,null,null,null,null,null,null,"Grass and Cultivated Plants"]
[null,"D value (mol Pa-1 d-1)","30yr old woman (annual mean)",null,null,null,null,null,null,null,"D value (mol Pa-1 d-1)","Grass","Apple","Grain","Potato","Lettuce","Carrot"]
[null,"Ingestion",null,null,null,null,null,null,null,null,"Gaseous deposition (leaf)",1.4921892822744351E-4,4.1643146112160166E-5,1.3671653900846785E-4,2.9523039543402754E-5,1.3739030086134954E-4,2.9523039543402754E-5]
[null,"water",0.31845300948997329,null,null,null,null,null,null,null,"Gaseous deposition (fruit)","-",8.3241933507417625E-6,4.9691210868002962E-6,"-","-","-"]
[null,"dairy",4.3766048612194427E-4,null,null,null,null,null,null,null,"Particle bound deposition",2.8111520391164294E-9,2.8111520391164294E-9,2.8111520391164294E-9,2.8111520391164294E-9,2.8111520391164294E-9,2.8111520391164294E-9]
[null,"fish1",2.3399306258382794E-5,null,null,null,null,null,null,null,"Transp. stream into fuits","-",7.8272891390419565E-5,7.2100392319603674E-5,"-","-","-"]
[null,"fish2",2.6895945565976229E-5,null,null,null,null,null,null,null,"Transp. stream into leaves",1.2162401674079776E-3,3.9161681944085481E-4,1.9861521986785122E-3,1.5592822659076639E-4,2.0582525909981159E-3,1.5592822659076639E-4]
[null,"beef",6.6127766683303214E-5,null,null,null,null,null,null,null,"Phloem stream into fruit/tuber","-",1.4775017720628297E-4,1.5084431030932188E-4,6.3460078062262955E-6,"-","-"]
[null,"aerial fruit (apple)",7.9993398709515115E-5,null,null,null,null,null,null,null,"Phloem stream into root",0,0,0,0,0,0]
[null,"grain",1.3642517005966063E-4,null,null,null,null,null,null,null,"Leaf growth",2.6583791358973369E-5,5.0100222176526735E-6,2.2493977303746702E-5,1.0224535138066681E-5,2.2493977303746702E-5,1.0224535138066681E-5]
[null,"tuber (potato)",3.6542851683783709E-5,null,null,null,null,null,null,null,"Fruit/tuber growth","-",7.3994794371958143E-5,1.4518105631257793E-5,9.1778365207645498E-5,"-","-"]
[null,"leavy veg. (lettuce)",1.5086165645138501E-5,null,null,null,null,null,null,null,"Root growth",4.049085819646747E-5,2.366348855637709E-3,4.049085819646747E-5,1.6932540700340943E-5,4.049085819646747E-5,1.6253108342253015E-3]
[null,"root fruit (carrot)",1.1954829090459811E-5,null,null,null,null,null,null,null,"Leaf metabolism",4.1783401426453955E-3,7.8745641149855535E-4,3.5355185822384121E-3,1.6070539010174599E-3,3.5355185822384121E-3,1.6070539010174599E-3]
[null,"in- and exhalation",4.0719974128467489E-3,null,null,null,null,null,null,null,"Fruit/tuber metabolism ","-",1.1630222924044354E-2,2.2819011304711532E-3,3.6322893159803776E-3,"-","-"]
[null,"absorption efficiency",1,null,null,null,null,null,null,null,"Root metabolism",2.6517502076090253E-4,0.13017682837353398,6.3642004982616615E-3,2.6613929356366947E-3,6.3642004982616615E-3,8.9411081133079232E-2]
[null,"egestion",3.0998391173555835E-12,null,null,null,null,null,null,null,"Soil water-tuber exchange","-","-","-",3.4750575637241106E-4,"-","-"]
[null,"water excretion          (urination, perspiration,...)",8.254876035946751E-2]
[null,"metabolism",3.4265736648063667E-9,null,null,null,null,null,null,null,null,"Grass","Apple","Grain","Potato","Lettuce","Carrot"]
[null,"growth",8.8698725002494507E-7,null,null,null,null,null,null,null,"Gaseous deposition (leaf)",7.8649298520044986E-2,7.051926456524138E-2,7.8536370154757576E-2,7.0214961600185963E-2,7.8551196323829994E-2,7.0214961600185963E-2]
[null,"percutaneous excretion",2.5187776938958362E-6,null,null,null,null,null,null,null,"Gaseous deposition (fruit)",7.8649298520044986E-2,7.051926456524138E-2,7.8536370154757576E-2,7.0214961600185963E-2,7.8551196323829994E-2,7.0214961600185963E-2]
[]
[]
[null,null,null,null,null,null,null,null,null,null,"Cattle"]
[null,null,null,null,null,null,null,null,null,null,"D value (mol Pa-1 d-1)","Beef Cattle","Milk Cow"]
[null,null,null,null,null,null,null,null,null,null,"ingestion",6.0572097374717873E-2,6.2455750883949827E-2]
[null,null,null,null,null,null,null,null,null,null,"    Grass",3.2864577229500043E-2,2.3735527999083367E-2]
[null,null,null,null,null,null,null,null,null,null,"    Soil",9.7583480576476228E-5,6.6311554368570711E-5]
[null,"Aquatic Food Chain",null,null,null,null,null,null,null,null,"   Water",2.760993666464135E-2,3.8653911330497892E-2]
[null,"D value (mol Pa-1 d-1)","benthic Filter Feeder","benthic Predator","Fish 1","Fish 2",null,null,null,null,"Transfer across intestinal wall",2.2315381640654183E-3,2.2315381640654183E-3]
[null,"Ingestion (E0*DU)",1.457422998286552E-8,4.0481072543879861E-7,5.1429553142838859E-7,4.7700356535956367E-6,null,null,null,null,"Respiration",4.0719974128467486E-2,4.0719974128467486E-2]
[null,"Egestion (E0*DE)",5.6807621748993327E-8,2.15226252311518E-7,6.4286941428548574E-8,5.9625445669945458E-7,null,null,null,null,"Urination",7.1569932685510238E-3,7.1569932685510238E-3]
[null,"Gill ventilation ",1.415580385736164E-4,5.3161986844522783E-4,4.2289654727356557E-4,3.2429073155755077E-3,null,null,null,null,"Lactation ","-",5.2395348646824469E-3]
[null,"Growth",9.1832115400159274E-9,3.5695646433132326E-8,9.3841533058757244E-9,1.1849579147330379E-7,null,null,null,null,"Growth",1.8496045556065096E-2,0]
[null,"Metabolism",7.9518491956220624E-6,4.5615076320329813E-5,4.4633674460231288E-5,1.0260687777970496E-3,null,null,null,null,"Metabolism",0.56527697657384501,0.48452312277758147]

{"sheet":"Charts","index":6,"n_rows":69,"n_cols":11,"rows_kept":69,"cut":false,"hidden":false,"merged":[]}
[null,"Human bioaccumulation model for neutral organic contaminants",null,null,null,null,null,null,null,null,{"$f":"B1","v":"Human bioaccumulation model for neutral organic contaminants"}]
[null,"G.Czub, E. Arbaban, E. Undeman, J. Armitage, M.S. McLachlan",null,null,null,null,null,null,null,null,{"$f":"B2","v":"G.Czub, E. Arbaban, E. Undeman, J. Armitage, M.S. McLachlan"}]
[null,"Dept. of Appl. Environ. Sci. (ITM), Stockholm University, SE-106 91 Stockholm",null,null,null,null,null,null,null,null,{"$f":"B3","v":"Dept. of Appl. Environ. Sci. (ITM), Stockholm University, SE-106 91 Stockholm"}]
[]
[null,"b-HCH",null,null,null,null,null,null,null,null,"b-HCH"]
[null,"Default Scenario",null,null,null,null,null,null,null,null,"Default Scenario"]
[]
[]
[null,"Organism","fugacity pPa","conc  ng/g ww"]
[null,"Zooplankton",{"$f":"'Model Input & Results'!C39","v":1},{"$f":"'Model Input & Results'!C37","v":2.6995245297625704E-7}]
[null,"Amphipod",{"$f":"'Model Input & Results'!D39","v":1},{"$f":"'Model Input & Results'!D37","v":2.6995245297625704E-7}]
[null,"Benthic filter feeder",{"$f":"'Model Input & Results'!E39","v":0.94649360663161786},{"$f":"'Model Input & Results'!E37","v":1.8415179816149464E-7}]
[null,"Benthic predator",{"$f":"'Model Input & Results'!F39","v":0.92127740241292744},{"$f":"'Model Input & Results'!F37","v":1.4688955950640461E-7}]
[null,{"$f":"'Model Input & Results'!G36","v":"Fish 1"},{"$f":"'Model Input & Results'!G39","v":0.90549041464087476},{"$f":"'Model Input & Results'!G37","v":1.9777283474536164E-7}]
[null,{"$f":"'Model Input & Results'!H36","v":"Fish 2"},{"$f":"'Model Input & Results'!H39","v":0.76054493000475287},{"$f":"'Model Input & Results'!H37","v":1.9093761443131724E-7}]
[null,{"$f":"'Model Input & Results'!L20","v":"Beef Cattle"},{"$f":"'Model Input & Results'!L23","v":0.11324246188382094},{"$f":"'Model Input & Results'!L21","v":1.3424989475276296E-8}]
[null,{"$f":"'Model Input & Results'!M20","v":"Milk Cow"},{"$f":"'Model Input & Results'!M23","v":0.14535151019418235},{"$f":"'Model Input & Results'!M21","v":1.7231544264503523E-8}]
[null,{"$f":"'Model Input & Results'!N20","v":"Beef"},{"$f":"'Model Input & Results'!N23","v":0.11324246188382094},{"$f":"'Model Input & Results'!N21","v":1.3424989475276296E-8}]
[null,{"$f":"'Model Input & Results'!O20","v":"Milk"},{"$f":"'Model Input & Results'!O23","v":0.14535151019418235},{"$f":"'Model Input & Results'!O21","v":6.0560934130094804E-9}]
[null,{"$f":"'Model Input & Results'!P20","v":"Dairy Products"},{"$f":"'Model Input & Results'!P23","v":0.14535151019418235},{"$f":"'Model Input & Results'!P21","v":2.442667557860861E-8}]
[null,"Grass (leaf)",{"$f":"'Model Input & Results'!L39","v":0.25749895156120767},{"$f":"'Model Input & Results'!L38/1000","v":1.350003172315581E-8}]
[null,"Apple (fruit)",{"$f":"'Model Input & Results'!M52","v":7.9463661212423285E-3},{"$f":"'Model Input & Results'!M51/1000","v":4.6514847112891139E-10},"obs converted from pg/g ww"]
[null,"Grain (fruit)",{"$f":"'Model Input & Results'!N52","v":4.3763321509688598E-2},{"$f":"'Model Input & Results'!N51/1000","v":8.7492470416818036E-9}]
[null,"Potato (tuber)",{"$f":"'Model Input & Results'!O52","v":8.538517957635211E-2},{"$f":"'Model Input & Results'!O51/1000","v":3.7945549015874777E-9}]
[null,"Lettuce (leaf)",{"$f":"'Model Input & Results'!P39","v":0.17264040837914935},{"$f":"'Model Input & Results'!P38/1000","v":9.0511086576719266E-9}]
[null,"Carrot (root)",{"$f":"'Model Input & Results'!Q46","v":1.7098833131915941E-3},{"$f":"'Model Input & Results'!Q45/1000","v":1.3299533204554071E-10}]
[null,{"$f":"'Model Input & Results'!B19","v":"Human"},{"$f":"'Model Input & Results'!D25","v":7.4045882663479023},{"$f":"'Model Input & Results'!D22","v":"--"}]
[]
[null,"Environmental compartment","fugacity","conc"]
[null,"Air",1,4.1763558121508597E-5]
[null,"Aerosol",1,55.551910097980198]
[null,"Water",1,5.9284982831202E-3]
[null,"Susp matter",1,5.2062800775966496]
[null,"Sediment ",1,5.2062563636035097]
[null,"Soil",1,2.2993034936239898]
[]
[]
[]
[]
[]
[]
[]
[]
[]
[]
[]
[]
[]
[]
[]
[]
[]
[]
[]
[]
[]
[]
[]
[]
[]
[]
[]
[]
[]
[]
[]
[]
[null,"b-HCH",null,null,null,null,null,null,null,null,"b-HCH"]
[null,null,null,null,null,null,null,null,null,null,"Default Scenario"]

{"sheet":"chemical database","index":7,"n_rows":109,"n_cols":43,"rows_kept":109,"cut":false,"hidden":false,"merged":[]}
[null,null,null,null,null,null,null,null,null,null,null,null,null,"heats of phase transfer",null,null,null,"metabolism rate constants"]
[null,"MW","log KAW","log KOA","log KOW","KNLOM : Koct","log KE_OC","log Kss_oc","log KS_OC","log KQ","log KPA","log KProt","log KCHO","DUAW","DUOA","DUOW","DUOC","kM (plant leaf)","kM (plant root)","kM (plantfruit)","kM (cattle)","kM (human)","kM (seal)","kM (benthos)","kM (fish)","KFB (human)","KFB (seal)","E0 (human)","E0 (cattle)","E0(benthos)","E0 (fish)","E0 (seal)","E0 (human)","E0 (cattle)","E0(benthos)","E0 (fish)","E0 (seal)","S","A","B","L","V","E"]
["Chemical Name","[g mol-1]",null,null,null,"b","[L kg-1]","[L kg-1]","[L kg-1]","[m3 m-3]","[m3 m-3]","[m3 m-3]","[m3 m-3]","[J mol-1]","[J mol-1]","[J mol-1]","[J mol-1]","[h-1]","[h-1]","[h-1]","[h-1]","[h-1]","[h-1]","[h-1]","[h-1]",null,null,"sp","sp","sp","sp","sp","pp","pp","pp","pp","pp"]
["Hypothetical 1",100,0,12,12,3.5000000000000003E-2,null,null,null,null,null,null,null,60000,-80000,-20000,null,0,0,0,0,0,0,0,0,2E-8,2E-8,null,null,null,null,null,null,null,null,null,null,1.48,0,0.15,8.1440000000000001,1.8138000000000001,1.9]
["a-HCH",290.89999999999998,-3.39,7.37,3.98,3.5000000000000003E-2,0,0,0,0,0,0,0,56800,-61900,-5100,-5100,0,0,0,0,0,0,0,0,2E-8,2E-8,0,0,0,0,0,0,0.77201710926594402,0.65739726861464998,0.65739726861464998,0,1.2,0,0.47,7.34,1.58,1.45]
["g-HCH (lindane)",290.89999999999998,{"$f":"E6-D6","v":-3.89},7.82,3.93,3.5000000000000003E-2,null,null,null,null,null,null,null,{"$f":"P6-O6","v":57200},-67400,-10200,null,0,0,0,0,0,0,0,0,2E-8,2E-8,null,null,null,null,null,null,null,null,null,null,1.18,0.12,0.57999999999999996,7.63,1.58,1.45]
["b-HCH",290.89999999999998,-4.83,8.74,3.91,3.5000000000000003E-2,0,0,0,10,0,0,0,67900,-84100,-16200,-16200,0,0,0,0,0,0,0,0,2E-8,2E-8,0,0,0,0,0,0,0.77204444415580498,0.65740693300884601,0.65740693300884601,0,1.18,0.12,0.57999999999999996,7.63,1.58,1.45]
["HCB",284.8,-1.7700000000000005,7.24,5.47,3.5000000000000003E-2,null,null,null,null,null,null,null,46350,-63220,-16870,null,0,0,0,0,0,0,0,0,8.0000000000000002E-8,8.0000000000000002E-8,null,null,null,null,null,null,null,null,null,null,0.99,0,0,7.6239999999999997,1.4510000000000001,1.49]
["HCBz_popcycling",284.8,-1.3999999999999995,6.88,5.48,3.5000000000000003E-2,null,null,null,null,null,null,null,46350,-63220,-16870,null,0,0,0,0,0,0,0,0,8.0000000000000002E-8,8.0000000000000002E-8,null,null,null,null,null,null,null,null,null,null,1.2,0,0.18,7.1970000000000001,1.569,1.62]
["PCB-8",223.1,-2.2399999999999993,7.35,5.1100000000000003,3.5000000000000003E-2,null,null,null,null,null,null,null,54900,-73900,-19000,null,0,0,0,0,0,0,0,0,2E-8,2E-8,null,null,null,null,null,null,null,null,null,null,1.2,0,0.18,7.1970000000000001,1.569,1.62]
["PCB-28",257.5,-2.3500000000000005,8.06,5.71,3.5000000000000003E-2,null,null,null,null,null,null,null,47230,-75620,-28390,null,0,0,0,9.3200000000000002E-3,5.0000000000000002E-5,5.0000000000000002E-5,0,0,2E-8,2E-8,null,null,null,null,null,null,null,null,null,null,1.33,0,0.15,7.9039999999999999,1.6914,1.76]
["PCB-52",292,-2.3200000000000003,8.14,5.82,3.5000000000000003E-2,null,null,null,null,null,null,null,48440,-86000,-37560,null,0,0,0,9.3200000000000002E-3,5.0000000000000002E-5,5.0000000000000002E-5,0,0,2E-8,2E-8,null,null,null,null,null,null,null,null,null,null,1.48,0,0.15,8.1440000000000001,1.8138000000000001,1.9]
["PCB-101",326.39999999999998,-2.6500000000000004,8.99,6.34,3.5000000000000003E-2,null,null,null,null,null,null,null,70960,-79770,-8810,null,0,0,0,9.3200000000000002E-3,5.0000000000000002E-5,5.0000000000000002E-5,0,0,2E-8,2E-8,null,null,null,null,null,null,null,null,null,null,1.61,0,0.13,8.8680000000000003,1.9361999999999999,2.04]
["PCB-118",326.39999999999998,-2.9800000000000004,9.66,6.68,3.5000000000000003E-2,null,null,null,null,null,null,null,66900,-89850,-22950,null,0,0,0,0,0,0,0,0,2E-8,2E-8,null,null,null,null,null,null,null,null,null,null,1.59,0,0.11,9.3960000000000008,1.9361999999999999,2.06]
["PCB-138",360.9,-3.0300000000000011,9.7100000000000009,6.68,3.5000000000000003E-2,null,null,null,null,null,null,null,69500,-86880,-17380,null,0,0,0,0,0,0,0,0,2E-8,2E-8,null,null,null,null,null,null,null,null,null,null,1.74,0,0.11,9.7720000000000002,2.0586000000000002,2.1800000000000002]
["PCB-153",360.9,-2.8699999999999992,9.61,6.74,3.5000000000000003E-2,null,null,null,null,null,null,null,70960,-88440,-17480,null,0,0,0,0,0,0,0,0,2E-8,2E-8,null,null,null,null,null,null,null,null,null,null,1.74,0,0.11,9.5869999999999997,2.0586000000000002,2.1800000000000002]
["PCB-180",395.3,-3.0400000000000009,10.220000000000001,7.18,3.5000000000000003E-2,null,null,null,null,null,null,null,74140,-82410,-8270,null,0,0,0,0,0,0,0,0,2E-8,2E-8,null,null,null,null,null,null,null,null,null,null,1.87,0,0.09,10.414999999999999,2.181,2.29]
["pp-DDT",354.5,-3.83,9.98,6.15,3.5000000000000003E-2,null,null,null,null,null,null,null,57610,-84110,-26500,null,0,0,0,0,0,0,0,0,2E-8,2E-8]
["pp-DDD",319,-2.7699999999999996,9.6999999999999993,6.93,3.5000000000000003E-2,null,null,null,null,null,null,null,57210,-83610,-26400,null,0,0,0,0,0,0,0,0,2E-8,2E-8]
["pp-DDE",321,-3.38,9.32,5.94,3.5000000000000003E-2,null,null,null,null,null,null,null,61020,-88620,-27600,null,0,0,0,0,0,0,0,0,2E-8,2E-8]
["PBDE-47",485.8,-4.05,10.44,6.39,3.5000000000000003E-2,null,null,null,null,null,null,null,75300,-97000,-21700,null,0,0,0,0,0,0,0,0,2E-8,2E-8]
["PBDE-99",564.70000000000005,-4.5,11.26,6.76,3.5000000000000003E-2,null,null,null,null,null,null,null,69900,-91100,-21200,null,0,0,0,0,0,0,0,0,2E-8,2E-8]
["PBDE-100",564.70000000000005,-4.4899999999999993,11.02,6.53,3.5000000000000003E-2,null,null,null,null,null,null,null,84300,-105000,-20700,null,0,0,0,0,0,0,0,0,2E-8,2E-8]
["PBDE-153",643.6,-4.8100000000000005,11.89,7.08,3.5000000000000003E-2,null,null,null,null,null,null,null,76700,-98200,-21500,null,0,0,0,0,0,0,0,0,2E-8,2E-8]
["test chemical",100,-2,10,8,3.5000000000000003E-2,null,null,null,null,null,null,null,{"$f":"P25-O25","v":76700},-98200,-21500,null,0,0,0,0,0,0,0,0,2E-8,2E-8]
["test chemical",150,-3,8,9,3.5000000000000003E-2,null,null,null,null,null,null,null,{"$f":"P26-O26","v":76700},-98200,-21500,null,0,0,0,0,0,0,0,0,2E-8,2E-8]
["101-80-4",200.23,-9.2210000000000001,10.581,1.36,3.5000000000000003E-2,null,null,null,null,null,null,null,86640.475999999981,-106640.47599999998,-20000,null,0.2917286113467783,0.2917286113467783,0.2917286113467783,{"$f":"4*0.291728611346778","v":1.1669144453871121},0.2917286113467783,0.2917286113467783,0.2917286113467783,0.2917286113467783,2E-8]
["102-09-0",214.21,-2.4600000000000004,5.74,3.28,3.5000000000000003E-2,null,null,null,null,null,null,null,44059.039999999994,-64059.039999999994,-20000,null,8.6470456656679795E-2,8.6470456656679795E-2,8.6470456656679795E-2,{"$f":"4*0.0864704566566798","v":0.34588182662671918},8.6470456656679795E-2,8.6470456656679795E-2,8.6470456656679795E-2,8.6470456656679795E-2,2E-8]
["10226-30-9",134.6,-2.7779999999999996,4.2679999999999998,1.49,3.5000000000000003E-2,null,null,null,null,null,null,null,31111.327999999994,-51111.327999999994,-20000,null,0.22921533748675441,0.22921533748675441,0.22921533748675441,{"$f":"4*0.229215337486754","v":0.91686134994701596},0.22921533748675441,0.22921533748675441,0.22921533748675441,0.22921533748675441,2E-8]
[]
[]
[]
[]
[]
[]
[]
[]
[]
[]
[]
[]
[]
[]
[]
[]
[]
[]
[]
[]
[]
[]
[]
[]
[]
[]
[]
[]
[]
[]
[]
[]
[]
[]
[]
[]
[]
[]
[]
[]
[]
[]
[]
[]
[]
[]
[]
[]
[]
[]
[]
[]
[]
[]
[]
[]
[]
[]
[]
[]
[]
[]
[]
[]
[]
[]
[]
[]
[]
[]
[]
[]
[]
[]
[]
[null,null,5,"AETS2",30000,null,null,null,null,null,null,null,null,30000,30000,30000,null,30000,null,null,30000]
[null,null,5,"AECS1",30000,null,null,null,null,null,null,null,null,30000,30000,30000,null,30000,null,null,30000]
[null,null,5,"AECS2",30000,null,null,null,null,null,null,null,null,30000,30000,30000,null,30000,null,null,30000]
[null,null,5,"AEDS1",30000,null,null,null,null,null,null,null,null,30000,30000,30000,null,30000,null,null,30000]
[null,null,5,"AEDS2",30000,null,null,null,null,null,null,null,null,30000,30000,30000,null,30000,null,null,30000]

{"sheet":"scenario database","index":8,"n_rows":654,"n_cols":6,"rows_kept":654,"cut":false,"hidden":false,"merged":[]}
[]
[null,null,null,null,"Scenario:","Scenario:"]
["ScenID","Parameter","Description","Unit","Default Scenario","Scenario No.1"]
[1,"dUaw_s","pp-LFER phase descriptor","kJ/mol",-2.8359999999999999,-2.8359999999999999]
[2,"dUaw_a","pp-LFER phase descriptor","kJ/mol",32.01,32.01]
[3,"dUaw_b","pp-LFER phase descriptor","kJ/mol",41.816000000000003,41.816000000000003]
[4,"dUaw_l","pp-LFER phase descriptor","kJ/mol",6.3540000000000001,6.3540000000000001]
[5,"dUaw_v","pp-LFER phase descriptor","kJ/mol"]
[6,"dUaw_e","pp-LFER phase descriptor","kJ/mol",-9.91,-9.91]
[7,"dUaw_c","pp-LFER phase descriptor","kJ/mol",13.31,13.31]
[8,"dUoa_s","pp-LFER phase descriptor","kJ/mol",5.89,5.89]
[9,"dUoa_a","pp-LFER phase descriptor","kJ/mol",-53.99,-53.99]
[10,"dUoa_b","pp-LFER phase descriptor","kJ/mol",-8.99,-8.99]
[11,"dUoa_l","pp-LFER phase descriptor","kJ/mol",-9.18,-9.18]
[12,"dUoa_v","pp-LFER phase descriptor","kJ/mol"]
[13,"dUoa_e","pp-LFER phase descriptor","kJ/mol",-1.04,-1.04]
[14,"dUoa_c","pp-LFER phase descriptor","kJ/mol",-6.49,-6.49]
[15,"dUow_s","pp-LFER phase descriptor","kJ/mol"]
[16,"dUow_a","pp-LFER phase descriptor","kJ/mol",null,0]
[17,"dUow_b","pp-LFER phase descriptor","kJ/mol",null,0]
[18,"dUow_l","pp-LFER phase descriptor","kJ/mol",null,0]
[19,"dUow_v","pp-LFER phase descriptor","kJ/mol",null,0]
[20,"dUow_e","pp-LFER phase descriptor","kJ/mol"]
[21,"dUow_c","pp-LFER phase descriptor","kJ/mol"]
[22,"dUhaa_s","pp-LFER phase descriptor","kJ/mol"]
[23,"dUhaa_a","pp-LFER phase descriptor","kJ/mol",-29.8,-29.8]
[24,"dUhaa_b","pp-LFER phase descriptor","kJ/mol",-24.9,-24.9]
[25,"dUhaa_l","pp-LFER phase descriptor","kJ/mol",-9.49,-9.49]
[26,"dUhaa_v","pp-LFER phase descriptor","kJ/mol"]
[27,"dUhaa_e","pp-LFER phase descriptor","kJ/mol"]
[28,"dUhaa_c","pp-LFER phase descriptor","kJ/mol",-5,-5]
[29,"dUhaw_s","pp-LFER phase descriptor","kJ/mol"]
[30,"dUhaw_a","pp-LFER phase descriptor","kJ/mol",6.42,6.42]
[31,"dUhaw_b","pp-LFER phase descriptor","kJ/mol",10.5,10.5]
[32,"dUhaw_l","pp-LFER phase descriptor","kJ/mol",-11.2,-11.2]
[33,"dUhaw_v","pp-LFER phase descriptor","kJ/mol",30.9,30.9]
[34,"dUhaw_e","pp-LFER phase descriptor","kJ/mol"]
[35,"dUhaw_c","pp-LFER phase descriptor","kJ/mol",4.2,4.2]
[36,"dUq_s","pp-LFER phase descriptor"]
[37,"dUq_a","pp-LFER phase descriptor",null,-29.8,-29.8]
[38,"dUq_b","pp-LFER phase descriptor",null,-24.9,-24.9]
[39,"dUq_l","pp-LFER phase descriptor",null,-9.49,-9.49]
[40,"dUq_v","pp-LFER phase descriptor"]
[41,"dUq_e","pp-LFER phase descriptor"]
[42,"dUq_c","pp-LFER phase descriptor",null,-5,-5]
[43,"dUoc_s","pp-LFER phase descriptor"]
[44,"dUoc_a","pp-LFER phase descriptor",null,6.42,6.42]
[45,"dUoc_b","pp-LFER phase descriptor",null,10.5,10.5]
[46,"dUoc_l","pp-LFER phase descriptor",null,-11.2,-11.2]
[47,"dUoc_v","pp-LFER phase descriptor",null,30.9,30.9]
[48,"dUoc_e","pp-LFER phase descriptor"]
[49,"dUoc_c","pp-LFER phase descriptor",null,4.2,4.2]
[50,"dUfish_s","pp-LFER phase descriptor"]
[51,"dUfish_a","pp-LFER phase descriptor"]
[52,"dUfish_b","pp-LFER phase descriptor"]
[53,"dUfish_l","pp-LFER phase descriptor"]
[54,"dUfish_v","pp-LFER phase descriptor"]
[55,"dUfish_e","pp-LFER phase descriptor"]
[56,"dUfish_c","pp-LFER phase descriptor"]
[57,"Kaw_s","pp-LFER phase descriptor",null,-2.39,-2.39]
[58,"Kaw_a","pp-LFER phase descriptor",null,-3.77,-3.77]
[59,"Kaw_b","pp-LFER phase descriptor",null,-4.8899999999999997,-4.8899999999999997]
[60,"Kaw_l","pp-LFER phase descriptor"]
[61,"Kaw_v","pp-LFER phase descriptor",null,0.85,0.85]
[62,"Kaw_e","pp-LFER phase descriptor",null,-0.67,-0.67]
[63,"Kaw_c","pp-LFER phase descriptor",null,0.96,0.96]
[64,"Koa_s","pp-LFER phase descriptor",null,0.56000000000000005,0.56000000000000005]
[65,"Koa_a","pp-LFER phase descriptor",null,3.56,3.56]
[66,"Koa_b","pp-LFER phase descriptor",null,0.70199999999999996,0.70199999999999996]
[67,"Koa_l","pp-LFER phase descriptor",null,0.93899999999999995,0.93899999999999995]
[68,"Koa_v","pp-LFER phase descriptor"]
[69,"Koa_e","pp-LFER phase descriptor",null,-0.20300000000000001,-0.20300000000000001]
[70,"Koa_c","pp-LFER phase descriptor",null,-0.12,-0.12]
[71,"Kow_s","pp-LFER phase descriptor",null,-1.054,-1.054]
[72,"Kow_a","pp-LFER phase descriptor",null,3.4000000000000002E-2,3.4000000000000002E-2]
[73,"Kow_b","pp-LFER phase descriptor",null,-3.46,-3.46]
[74,"Kow_l","pp-LFER phase descriptor"]
[75,"Kow_v","pp-LFER phase descriptor",null,3.8140000000000001,3.8140000000000001]
[76,"Kow_e","pp-LFER phase descriptor",null,0.56200000000000006,0.56200000000000006]
[77,"Kow_c","pp-LFER phase descriptor",null,8.7999999999999995E-2,8.7999999999999995E-2]
[78,"Kq_s","pp-LFER phase descriptor",null,1.19,1.19]
[79,"Kq_a","pp-LFER phase descriptor",null,3.37,3.37]
[80,"Kq_b","pp-LFER phase descriptor",null,0.03,0.03]
[81,"Kq_l","pp-LFER phase descriptor",null,0.66,0.66]
[82,"Kq_v","pp-LFER phase descriptor",null,0.73,0.73]
[83,"Kq_e","pp-LFER phase descriptor"]
[84,"Kq_c","pp-LFER phase descriptor",null,-7.08,-7.08]
[85,"KocSoil_s","pp-LFER phase descriptor",null,-0.24,-0.24]
[86,"KocSoil_a","pp-LFER phase descriptor",null,-0.31,-0.31]
[87,"KocSoil_b","pp-LFER phase descriptor",null,-2.4,-2.4]
[88,"KocSoil_l","pp-LFER phase descriptor"]
[89,"KocSoil_v","pp-LFER phase descriptor",null,2,2]
[90,"KocSoil_e","pp-LFER phase descriptor",null,1.01,1.01]
[91,"KocSoil_c","pp-LFER phase descriptor",null,0.04,0.04]
[92,"KocSusp_s","pp-LFER phase descriptor",null,-0.79,-0.79]
[93,"KocSusp_a","pp-LFER phase descriptor",null,-0.21,-0.21]
[94,"KocSusp_b","pp-LFER phase descriptor",null,-3.29,-3.29]
[95,"KocSusp_l","pp-LFER phase descriptor",null,0.28999999999999998,0.28999999999999998]
[96,"KocSusp_v","pp-LFER phase descriptor",null,2.5,2.5]
[97,"KocSusp_e","pp-LFER phase descriptor"]
[98,"KocSusp_c","pp-LFER phase descriptor",null,0.01,0.01]
[99,"KocSolids_s","pp-LFER phase descriptor",null,-0.79,-0.79]
[100,"KocSolids_a","pp-LFER phase descriptor",null,-0.21,-0.21]
[101,"KocSolids_b","pp-LFER phase descriptor",null,-3.29,-3.29]
[102,"KocSolids_l","pp-LFER phase descriptor",null,0.28999999999999998,0.28999999999999998]
[103,"KocSolids_v","pp-LFER phase descriptor",null,2.5,2.5]
[104,"KocSolids_e","pp-LFER phase descriptor"]
[105,"KocSolids_c","pp-LFER phase descriptor",null,0.01,0.01]
[106,"KbloodMammal_s","pp-LFER phase descriptor",null,1.083,1.083]
[107,"KbloodMammal_a","pp-LFER phase descriptor",null,3.738,3.738]
[108,"KbloodMammal_b","pp-LFER phase descriptor",null,2.58,2.58]
[109,"KbloodMammal_l","pp-LFER phase descriptor",null,0.376,0.376]
[110,"KbloodMammal_v","pp-LFER phase descriptor"]
[111,"KbloodMammal_e","pp-LFER phase descriptor",null,0.45600000000000002,0.45600000000000002]
[112,"KbloodMammal_c","pp-LFER phase descriptor",null,-1.069,-1.069]
[113,"KmuscleMammal_s","pp-LFER phase descriptor",null,0.72299999999999998,0.72299999999999998]
[114,"KmuscleMammal_a","pp-LFER phase descriptor",null,3.242,3.242]
[115,"KmuscleMammal_b","pp-LFER phase descriptor",null,2.4689999999999999,2.4689999999999999]
[116,"KmuscleMammal_l","pp-LFER phase descriptor",null,0.46300000000000002,0.46300000000000002]
[117,"KmuscleMammal_v","pp-LFER phase descriptor"]
[118,"KmuscleMammal_e","pp-LFER phase descriptor",null,0.20699999999999999,0.20699999999999999]
[119,"KmuscleMammal_c","pp-LFER phase descriptor",null,-1.0389999999999999,-1.0389999999999999]
[120,"KfatMammal_s","pp-LFER phase descriptor",null,0.72799999999999998,0.72799999999999998]
[121,"KfatMammal_a","pp-LFER phase descriptor",null,1.7829999999999999,1.7829999999999999]
[122,"KfatMammal_b","pp-LFER phase descriptor",null,0.33200000000000002,0.33200000000000002]
[123,"KfatMammal_l","pp-LFER phase descriptor",null,0.74299999999999999,0.74299999999999999]
[124,"KfatMammal_v","pp-LFER phase descriptor"]
[125,"KfatMammal_e","pp-LFER phase descriptor",null,5.0999999999999997E-2,5.0999999999999997E-2]
[126,"KfatMammal_c","pp-LFER phase descriptor",null,-5.1999999999999998E-2,-5.1999999999999998E-2]
[127,"KliverMammal_s","pp-LFER phase descriptor",null,0.83599999999999997,0.83599999999999997]
[128,"KliverMammal_a","pp-LFER phase descriptor",null,2.8359999999999999,2.8359999999999999]
[129,"KliverMammal_b","pp-LFER phase descriptor",null,2.081,2.081]
[130,"KliverMammal_l","pp-LFER phase descriptor",null,0.56399999999999995,0.56399999999999995]
[131,"KliverMammal_v","pp-LFER phase descriptor"]
[132,"KliverMammal_e","pp-LFER phase descriptor",null,0,0]
[133,"KliverMammal_c","pp-LFER phase descriptor",null,-0.94299999999999995,-0.94299999999999995]
[134,"KbrainMammal_s","pp-LFER phase descriptor",null,0.41099999999999998,0.41099999999999998]
[135,"KbrainMammal_a","pp-LFER phase descriptor",null,3.3580000000000001,3.3580000000000001]
[136,"KbrainMammal_b","pp-LFER phase descriptor",null,2.0249999999999999,2.0249999999999999]
[137,"KbrainMammal_l","pp-LFER phase descriptor",null,0.59099999999999997,0.59099999999999997]
[138,"KbrainMammal_v","pp-LFER phase descriptor"]
[139,"KbrainMammal_e","pp-LFER phase descriptor",null,0.26300000000000001,0.26300000000000001]
[140,"KbrainMammal_c","pp-LFER phase descriptor",null,-0.98699999999999999,-0.98699999999999999]
[141,"KskinMammal_s","pp-LFER phase descriptor"]
[142,"KskinMammal_a","pp-LFER phase descriptor",null,-0.189,-0.189]
[143,"KskinMammal_b","pp-LFER phase descriptor",null,-0.62,-0.62]
[144,"KskinMammal_l","pp-LFER phase descriptor"]
[145,"KskinMammal_v","pp-LFER phase descriptor",null,0.71299999999999997,0.71299999999999997]
[146,"KskinMammal_e","pp-LFER phase descriptor"]
[147,"KskinMammal_c","pp-LFER phase descriptor",null,-0.253,-0.253]
[148,"KbloodFish_s","pp-LFER phase descriptor"]
[149,"KbloodFish_a","pp-LFER phase descriptor"]
[150,"KbloodFish_b","pp-LFER phase descriptor"]
[151,"KbloodFish_l","pp-LFER phase descriptor"]
[152,"KbloodFish_v","pp-LFER phase descriptor"]
[153,"KbloodFish_e","pp-LFER phase descriptor"]
[154,"KbloodFish_c","pp-LFER phase descriptor"]
[155,"KmuscleFish_s","pp-LFER phase descriptor"]
[156,"KmuscleFish_a","pp-LFER phase descriptor"]
[157,"KmuscleFish_b","pp-LFER phase descriptor"]
[158,"KmuscleFish_l","pp-LFER phase descriptor"]
[159,"KmuscleFish_v","pp-LFER phase descriptor"]
[160,"KmuscleFish_e","pp-LFER phase descriptor"]
[161,"KmuscleFish_c","pp-LFER phase descriptor"]
[162,"KfatFish_s","pp-LFER phase descriptor"]
[163,"KfatFish_a","pp-LFER phase descriptor"]
[164,"KfatFish_b","pp-LFER phase descriptor"]
[165,"KfatFish_l","pp-LFER phase descriptor"]
[166,"KfatFish_v","pp-LFER phase descriptor"]
[167,"KfatFish_e","pp-LFER phase descriptor"]
[168,"KfatFish_c","pp-LFER phase descriptor"]
[169,"KliverFish_s","pp-LFER phase descriptor"]
[170,"KliverFish_a","pp-LFER phase descriptor"]
[171,"KliverFish_b","pp-LFER phase descriptor"]
[172,"KliverFish_l","pp-LFER phase descriptor"]
[173,"KliverFish_v","pp-LFER phase descriptor"]
[174,"KliverFish_e","pp-LFER phase descriptor"]
[175,"KliverFish_c","pp-LFER phase descriptor"]
[176,"KbrainFish_s","pp-LFER phase descriptor"]
[177,"KbrainFish_a","pp-LFER phase descriptor"]
[178,"KbrainFish_b","pp-LFER phase descriptor"]
[179,"KbrainFish_l","pp-LFER phase descriptor"]
[180,"KbrainFish_v","pp-LFER phase descriptor"]
[181,"KbrainFish_e","pp-LFER phase descriptor"]
[182,"KbrainFish_c","pp-LFER phase descriptor"]
[183,"EoHuman_s","pp-LFER phase descriptor",null,0,0]
[184,"EoHuman_a","pp-LFER phase descriptor",null,-20,-20]
[185,"EoHuman_b","pp-LFER phase descriptor",null,-19.8,-19.8]
[186,"EoHuman_l","pp-LFER phase descriptor"]
[187,"EoHuman_v","pp-LFER phase descriptor",null,13.9,13.9]
[188,"EoHuman_e","pp-LFER phase descriptor",null,0,0]
[189,"EoHuman_c","pp-LFER phase descriptor",null,96,96]
[190,"EoCattle_s","pp-LFER phase descriptor"]
[191,"EoCattle_a","pp-LFER phase descriptor"]
[192,"EoCattle_b","pp-LFER phase descriptor"]
[193,"EoCattle_l","pp-LFER phase descriptor"]
[194,"EoCattle_v","pp-LFER phase descriptor"]
[195,"EoCattle_e","pp-LFER phase descriptor"]
[196,"EoCattle_c","pp-LFER phase descriptor"]
[197,"Eofish_s","pp-LFER phase descriptor"]
[198,"Eofish_a","pp-LFER phase descriptor"]
[199,"Eofish_b","pp-LFER phase descriptor"]
[200,"Eofish_l","pp-LFER phase descriptor"]
[201,"Eofish_v","pp-LFER phase descriptor"]
[202,"Eofish_e","pp-LFER phase descriptor"]
[203,"Eofish_c","pp-LFER phase descriptor"]
[204,"T_Kaw","reference temperature","K",298.14999999999998,298.14999999999998]
[205,"T_Koa","reference temperature","K",298.14999999999998,298.14999999999998]
[206,"T_Kow","reference temperature","K",298.14999999999998,298.14999999999998]
[207,"T_Kq","reference temperature","K",298.14999999999998,298.14999999999998]
[208,"T_KocSoil","reference temperature","K",298.14999999999998,298.14999999999998]
[209,"T_KocSusp","reference temperature","K",298.14999999999998,298.14999999999998]
[210,"T_KocSolids","reference temperature","K",298.14999999999998,298.14999999999998]
[211,"T_KbloodMammal","reference temperature","K",310.14999999999998,310.14999999999998]
[212,"T_KmuscleMammal","reference temperature","K",310.14999999999998,310.14999999999998]
[213,"T_KfatMammal","reference temperature","K",310.14999999999998,310.14999999999998]
[214,"T_KliverMammal","reference temperature","K",310.14999999999998,310.14999999999998]
[215,"T_KbrainMammal","reference temperature","K",310.14999999999998,310.14999999999998]
[216,"T_KbloodFish","reference temperature","K",310.14999999999998,310.14999999999998]
[217,"T_KmuscleFish","reference temperature","K",310.14999999999998,310.14999999999998]
[218,"T_KfatFish","reference temperature","K",310.14999999999998,310.14999999999998]
[219,"T_KliverFish","reference temperature","K",310.14999999999998,310.14999999999998]
[220,"T_KbrainFish","reference temperature","K",310.14999999999998,310.14999999999998]
[221,"RH","Relative humidity",null,0.5,0.5]
[222,"TA","Air temperature","K",288,250]
[223,"TW","Water temperature","K",281,250]
[224,"Tsoil","Soil temperature","K",288,250]
[225,"Tsed","Sediment temperature","K",281,250]
[226,"v Q","Volume fraction of aerosols in air","m3 m-3",1.9999999999999999E-11,1.9999999999999999E-11]
[227,"v SS","Volume fraction of particles in water","m3 m-3",8.4200000000000007E-6,8.4200000000000007E-6]
[228,"v SS_Solid","Volume fraction of solids  in susp-matter","m3 m-3",0.1,0.1]
[229,"v SS_W","Volume fraction of water in susp-matter","m3 m-3",0.9,0.9]
[230,"v E_solids","Volume fraction of solids  in soil","m3 m-3",0.6,0.6]
[231,"v E_W","Volume fraction of water in soil","m3 m-3",0.2,0.2]
[232,"v E_A","Volume fraction of air  in soil","m3 m-3",0.2,0.2]
[233,"vS_solid","Volume fraction of solids  in  sediment","m3 m-3",0.2,0.2]
[234,"v S_W","Volume fraction of water in sediment","m3 m-3",0.8,0.8]
[235,"y Q_OC","Mass fraction of OC in aerosols","g g-1",0.04,0.04]
[236,"y SS_OC","Mass fraction of OC in susp-matter solids","g g-1",0.1,0.1]
[237,"y E_OC","Mass fraction of OC in soil solids","g g-1",0.02,0.02]
[238,"y S_OC","Mass fraction of OC in sediment solids","g g-1",0.05,0.05]
[239,"rO","Density of octanol  (O)","g m-3",820000,820000]
[240,"rsolid","Density of solid phase","g m-3",2500000,2500000]
[241,"rOC","Density of organic matter (OM)","g m-3",1000000,1000000]
[242,"rSS","Density of bulk susp. matter (SS)","g m-3",1150000,1150000]
[243,"rE","Density of bulk soil (E)","g m-3",1700000,1700000]
[244,"A_env","Unit World: Area of total environment","m2",40400000000,40400000000]
[245,"A_A","Unit World: Area of air compartment","m2",40400000000,40400000000]
[246,"A_W","Unit World: Area of water compartment","m2",1616000000,1615999999.9999998]
[247,"A_E","Unit World: Area of soil compartment","m2",38784000000,38783999999.999992]
[248,"A_S","Unit World: Area of sediment","m2",1616000000,1616000000]
[249,"D_A","Unit World: Height of air compartment","m",1000,1000]
[250,"D_W","Unit World: Depth of water compartment","m",4.7300000000000004,4.7300000000000004]
[251,"D_E","Unit World: Depth of soil compartment","m",0.14000000000000001,0.14000000000000001]
[252,"D_S","Unit World: Depth of sediment","m",0.03,0.03]
[253,"M_chem","Unit World: total amount of chemical","g resp. g/d",1000000,1000000]
[254,"fA","Air fugacity","Pa",9.9999999999999998E-13,9.9999999999999998E-13]
[255,"fW","Water fugacity","Pa",9.9999999999999998E-13,9.9999999999999998E-13]
[256,"fE","Soil fugacity","Pa",9.9999999999999998E-13,9.9999999999999998E-13]
[257,"fS","Sediment fugacity","Pa",9.9999999999999998E-13,9.9999999999999998E-13]
[258,"ySS_b2","Mass  fraction of feeding rate of filter feeder on suspended particles","g / g prey",0.5,0.5]
[259,"yS_b2","Mass fraction of feeding rate of filter feeder on sediment","g / g prey",0.5,0.5]
[260,"yzoo_b2","Mass  fraction of feeding rate of filter feeder on zooplankton","g / g prey",0,0]
[261,"ySS_b3","Mass  fraction of feeding rate of invertebrate b3 on suspended particles","g / g prey",0,0]
[262,"yS_b3","Mass fraction of feeding rate of invertebrate b3 on sediment","g / g prey",0.7,0.7]
[263,"yzoo_b3","Mass  fraction of feeding rate of invertebrate b3 on zooplankton","g / g prey",0,0]
[264,"yb1_b3","Mass fraction  of feeding rate of invertebrate b3 on invertebrate b1","g / g prey",0.3,0.3]
[265,"yS_F1","Mass fraction of feeding rate of fish1 on sediment","g / g prey",0,0]
[266,"yzoo_F1","Mass  fraction of feeding rate of fish1 on zooplankton","g / g prey",1,1]
[267,"yb1_F1","Mass fraction  of feeding rate of  fish1 on invertebrate b1","g / g prey",0,0]
[268,"yb2_F1","Mass fraction  of feeding rate of  fish1 on invertebrate b2","g / g prey",0,0]
[269,"yb3_F1","Mass fraction  of feeding rate of  fish1 on invertebrate b3","g / g prey",0,0]
[270,"yS_F2","Mass fraction of feeding rate of fish2 on sediment","g / g prey",0,0]
[271,"yzoo_F2","Mass  fraction of feeding rate of fish2 on zooplankton","g / g prey",0,0]
[272,"yb1_F2","Mass fraction  of feeding rate of fish2 on invertebrate b1","g / g prey",0.05,0.05]
[273,"yb2_F2","Mass fraction  of feeding rate of fish2 on invertebrate b2","g / g prey",0.05,0.05]
[274,"yb3_F2","Mass fraction  of feeding rate of fish2 on invertebrate b3","g / g prey",0.4,0.4]
[275,"yF1_F2","Mass fraction  of feeding rate of fish2  on fish 1","g / g prey",0.5,0.5]
[276,"yF2_F2","Mass fraction  of feeding rate of fish2 on fish 2","g / g prey",0,0]
[277,"yS_S","Mass fraction of feeding rate of seal on sediment","g / g prey",0,0]
[278,"yzoo_S","Mass  fraction of feeding rate of seal on zooplankton","g / g prey",0,0]
[279,"yb1_S","Mass fraction  of feeding rate of seal on invertebrate b1","g / g prey",0,0]
[280,"yb2_S","Mass fraction  of feeding rate of seal on invertebrate b2","g / g prey",1E-3,1E-3]
[281,"yb3_S","Mass fraction  of feeding rate of seal on invertebrate b3","g / g prey",7.0000000000000001E-3,7.0000000000000001E-3]
[282,"yF1_S","Mass fraction  of feeding rate of seal  on fish 1","g / g prey",0.91600000000000004,0.91600000000000004]
[283,"yF2_S","Mass fraction  of feeding rate of seal on fish 2","g / g prey",7.5999999999999998E-2,7.5999999999999998E-2]
[284]
[285,"v lip_zoo","Volume fraction  of lipid in zooplankton","m3 m-3",0.05,0.05]
[286,"v NLOM_zoo","Volume fraction of protein/ carbohydrate in zooplankton","m3 m-3",0.2,0.2]
[287,"v W_zoo","Volume fraction of water in zooplankton","m3 m-3",0.75,0.75]
[288,"v lip_b1","Volume fraction  of lipid in b1","m3 m-3",0.05,0.05]
[289,"v NLOM_b1","Volume fraction of protein/ carbohydrate in b1","m3 m-3",0.2,0.2]
[290,"v W_b1","Volume fraction of water in b1","m3 m-3",0.75,0.75]
[291,"v lip_b2","Volume fraction  of lipid in filter feeder  b2","m3 m-3",0.03,0.03]
[292,"v NLOM_b2","Volume fraction of protein/ carbohydrate in b2","m3 m-3",0.17,0.17]
[293,"v W_b2","Volume fraction of water in b2","m3 m-3",0.8,0.8]
[294,"v lip_b3","Volume fraction  of lipid in  deposit feeder b3","m3 m-3",0.02,0.02]
[295,"v NLOM_b3","Volume fraction of protein/ carbohydrate in b3","m3 m-3",0.2,0.2]
[296,"v W_b3","Volume fraction of water in b3","m3 m-3",0.78,0.78]
[297,"rbenthos","Density of benthic organisms","kg L-1",1,1]
[298,"Mb2","Body mass of b2 (filter feeder)","kg",1E-3,1E-3]
[299,"Mb3","Body mass of b3 (predator)","kg",7.0000000000000001E-3,7.0000000000000001E-3]
[300,"TF_w","Time fraction of spending in water phase for B1","-",0.1,0.1]
[301,"TF_s","Time fraction of spending in sediment phase for B1","-",0.9,0.9]
[302,"Vfo_b2","Volume fraction of respective respired water","m3 m-3",0.95,0.95]
[303,"VFp_b2","Volume fraction of respective respired pore water","m3 m-3",0.05,0.05]
[304,"Vfo_b3","Volume fraction of respective respired water","m3 m-3",0.95,0.95]
[305,"VFp_b3","Volume fraction of respective respired pore water","m3 m-3",0.05,0.05]
[306,"GU_b2","Ingestion rate b2 (filter feeder)","m3 d-1"]
[307,"GU_b3","Ingestion rate b3 (predator)","m3 d-1"]
[308]
[309]
[310]
[311,"k1_b2","Ventilation uptake rate constant of b2 ","L kg-1 d-1"]
[312,"k1_b3","Ventilation uptake rate constant of  b3","L kg-1 d-1"]
[313,"kG_b2,3","Growth rate constant of b2 ","d-1"]
[314,"kG_b2,3","Growth rate constant of b3","d-1"]
[315,"Qb2","Egestion factor of b2 (filter feeder)","-"]
[316,"Qb3","Egestion factor of b3 (predator)","-"]
[317,"εlip","Lipid assimilation efficiency","-",0.75,0.75]
[318,"εNLOM","NLOM assimilation efficiency","-",0.75,0.75]
[319,"εOC","Organic carbon assimilation efficiency","-",0.46,0.46]
[320,"εW","Water assimilation efficiency","-",0.25,0.25]
[321,"Sox","Dissolved oxygen concentration in ventilated water","%",75,75]
[322,"σb2","Particle scavenging efficiency","m3 m-3",1,1]
[323,"v lip_f1","Volume fraction  of lipid in fish 1","m3 m-3",3.5000000000000003E-2,3.5000000000000003E-2]
[324,"v NLOM_f1","Volume fraction of protein/ carbohydrate in fish1","m3 m-3",0.26500000000000001,0.26500000000000001]
[325,"v W_f1","Volume fraction of water in fish1","m3 m-3",0.7,0.7]
[326,"v lip_f1_filet","Volume fraction  of lipid in filet of fish1","m3 m-3",3.5000000000000003E-2,3.5000000000000003E-2]
[327,"v NLOM_f1_filet","Volume fraction of protein/ carbohydrate in filet of fish1","m3 m-3",0.26500000000000001,0.26500000000000001]
[328,"v W_f1_filet","Volume fraction of water in filet of fish1","m3 m-3",0.7,0.7]
[329,"v lip_f2","Volume fraction  of lipid in fish2","m3 m-3",4.3999999999999997E-2,4.3999999999999997E-2]
[330,"v NLOM_f2","Volume fraction of protein/ carbohydrate in fish2","m3 m-3",0.25600000000000001,0.25600000000000001]
[331,"v W_f2","Volume fraction of water in fish2","m3 m-3",0.7,0.7]
[332,"v lip_f2_filet","Volume fraction  of lipid in filet of fish2","m3 m-3",5.0000000000000001E-3,5.0000000000000001E-3]
[333,"v NLOM_f2_filet","Volume fraction of protein/ carbohydrate in filet of fish2","m3 m-3",0.29499999999999998,0.29499999999999998]
[334,"v W_f2_filet","Volume fraction of water in filet of fish2","m3 m-3",0.7,0.7]
[335,"MF1","Body mass of F1 (planktivore)","kg",5.0000000000000001E-3,5.0000000000000001E-3]
[336,"MF2","Body mass of F2 (piscivore)","kg",0.1,0.1]
[337,"rFish","Fish density","kg L-1",1,1]
[338,"QF","Egestion factor F1","-",8,8]
[339,"QF","Egestion factor F2","-",8,8]
[340,"k1_F1","Ventilation uptake rate constant of F1 ","L kg-1 d-1"]
[341,"k1_F2","Ventilation uptake rate constant of F2","L kg-1 d-1"]
[342,"GU_F1","Ingestion rate F1 ","m3 d-1"]
[343,"GU_F2","Ingestion rate of F2","m3 d-1"]
[344,"kG_F1","Growth rate constant of F1","d-1"]
[345,"kG_F2","Growth rate constant of F2","d-1"]
[346,"ρlipid","Density of lipid","kg L-1",0.92,0.92]
[347,"ρNLOM","Density of NLOM","kg L-1",1,1]
[348,"ρwater","Density of water","kg L-1",1,1]
[349,"ρair","Density of air","kg L-1",1.2999999999999999E-3,1.2999999999999999E-3]
[350,"ρadipose","Density of adipose tissue","kg L-1",0.92,0.92]
[351,"ρblood","Density of blood","kg L-1",1,1]
[352,"ρmuscle","Density of muscle","kg L-1",1.04,1.04]
[353,"ρliver","Density of liver","kg L-1",1.05,1.05]
[354,"ρbrain","Density of brain","kg L-1",1.03,1.03]
[355,"ρskin","Density of skin","kg L-1",0.82,0.82]
[356,"y lip_grass_root","Mass fraction of lipid in grass(root)","g g-1",2.5000000000000001E-2,2.5000000000000001E-2]
[357,"y prot_grass_root","Mass  fraction of protein in grass root","g g-1",0.01,0.01]
[358,"y carbo_grass_root","Mass  fraction of carbohydrate in grass root","g g-1",0.08,0.08]
[359,"y W_grass_root","Mass  fraction of water in grass(root)","g g-1",0.88500000000000001,0.88500000000000001]
[360,"y a_grass_root","Mass  fraction of air in grass(root)","g g-1",1.2999999999999999E-4,1.2999999999999999E-4]
[361,"v lip_grass_leaves","Volume fraction of organic sorbing matrix in grass(leaves)","m3 m-3",0.01,0.01]
[362,"v W_grass_leaves","Volume fraction of water in grass(leaves)","m3 m-3",0.7,0.7]
[363,"v a_grass_leaves","Volume fraction of air in grass(leaves)","m3 m-3",0.28999999999999998,0.28999999999999998]
[364,"k’gg_Gr","Gaseous deposition velocity (air-side)","m d-1",192,192]
[365,"k’gp_Gr","Gaseous deposition velocity (plant-side)","m d-1",6.7199999999999998E-7,6.7199999999999998E-7]
[366,"k’p_Gr","Particle bound deposition velocity (wet & dry)","m d-1",72,72]
[367,"ALF_Gr","Leaf area of grass  (reference plane for gaseous deposition (plant side)","m2 m-3",5000,5000]
[368,"Gtr_Gr","Transpiration rate","m3 m-2 d-1",2.4000000000000001E-4,2.3999999999999998E-4]
[369]
[370,"GPh_Gr","Phloem flow rate","m3 m-2 d-1"]
[371,"VR_Gr","Volume of roots","m3 m-2",2.2000000000000001E-3,2E-3]
[372,"VLF_Gr","Volume of leaves","m3 m-2",2.5999999999999999E-3,2.5999999999999999E-3]
[373,"kG_RGr","Growth rate constant of roots","d-1",3.5000000000000003E-2,3.5000000000000003E-2]
[374,"kG_LFGr","Growth rate constants of leaves","d-1",3.5000000000000003E-2,0.01]
[375,"k’stom_Gr","Stomatal mass transfer coefficient  ","m d-1"]
[376,"AC_Gr","Reference plane in gaseous deposition (air side)","m2",1,1]
[377,"AC_Gr_particle deposition","Reference plane in particle bound deposition","m2",1,1]
[378]
[379,"y lip_cattle","Mass fraction  of lipid in cattle (sorbing matrix)","g g-1",0.22,0.22]
[380,"y NLOM_cattle","Mass fraction of protein/carbohydrate in cattle (sorbing matrix)","g g-1",0.17,0.17]
[381,"y W_cattle","Mass fraction of water in cattle (sorbing matrix)","g g-1",0.61,0.61]
[382,"y lip_cow milk","Mass fraction  of lipid in cow milk","g g-1",0.05,0.05]
[383,"y NLOM_cow milk","Mass fraction of protein/carbohydrate in cow milk","g g-1",0.08,0.08]
[384,"y W_cow milk","Mass fraction of water in cow milk","g g-1",0.87,0.87]
[385,"MMC","Beef cattle: mass of lipids, NLOM & water (sorbing matrix)","kg",700,700]
[386,"MC","Milk cow: mass of lipids, NLOM & water (sorbing matrix)","kg",600,600]
[387,"GUG_BC","Ingestion rate of grass (beef cattle)","mfw3 d-1",0.09,0.09]
[388,"GUS_BC","Ingestion rate of soil (beef cattle)","m3 d-1",2.5900000000000001E-4,2.5900000000000001E-4]
[389,"GUW_BC","Ingestion rate of water (beef cattle)","m3 d-1",0.05,0.05]
[390,"GUG_MC","Ingestion rate of grass (milk cow)","mfw3 d-1",6.5000000000000002E-2,6.5000000000000002E-2]
[391,"GUS_MC","Ingestion rate of soil (milk cow)","m3 d-1",1.76E-4,1.76E-4]
[392,"GUW_MC","Ingestion rate of water (milk cow)","m3 d-1",7.0000000000000007E-2,7.0000000000000007E-2]
[393,"Gre_BC","Respiration rate (beef cattle)","m3 d-1",150,150]
[394,"Gre_MC","Respiration rate (milk cow)","m3 d-1",150,150]
[395,"Gur_BC","Urination rate (beef cattle)","m3 d-1",0.05,0.05]
[396,"Gur_MC","Urination rate (milk cow)","m3 d-1",0.05,0.05]
[397,"GL_ MC","Lactation rate (milk cow)","m3 d-1",1.7000000000000001E-2,2.9000000000000001E-2]
[398,"kG_BC","Growth rate constant  (beef cattle)","d-1",0.03,0.01]
[399,"kG_MC","Growth rate constant  (milk cow)","d-1",0,0]
[400,"T_KskinMammal","reference temperature pp-LFER skin mammal","K",310.14999999999998,310.14999999999998]
[401,"y lip_dairy p.","Mass fraction  of lipid in dairy product","g g-1",0.33,0.33]
[402,"y NLOM_dairy p.","Mass fraction of protein/carbohydrate in dairy products","g g-1",0.28999999999999998,0.28999999999999998]
[403,"y W_dairy p.","Mass fraction of water in dairy products","g g-1",0.38,0.38]
[404,"v lip_leaf","Volume fraction of organic sorbing matrix in leaves","m3 m-3",0.01,0.01]
[405,"v W_leaf","Volume fraction of water in leaves","m3 m-3",0.7,0.7]
[406,"v a_leaf","Volume fraction of air in leaves","m3 m-3",0.28999999999999998,0.28999999999999998]
[407,"y lip_root","Mass fraction  of lipid in roots","g g-1",2.5000000000000001E-2,2.5000000000000001E-2]
[408,"y protein_root","Mass fraction of protein in roots","g g-1",0.01,0.01]
[409,"y carbo_root","Mass fraction of carbohydrate in roots","g g-1",0.08,0.08]
[410,"y W_root","Mass fraction of  water in roots","g g-1",0.88500000000000001,0.88500000000000001]
[411,"y a_root","Mass fraction of air in roots","g g-1",1.2999999999999999E-4,1.3000000000000002E-4]
[412,"y lip_carrot","Mass fraction  of lipid in carrots","g g-1",2.5000000000000001E-2,2.5000000000000001E-2]
[413,"y protein_carrot","Mass fraction of protein in carrots","g g-1",0.01,0.01]
[414,"y carbo_carrot","Mass fraction of carbohydrate in carrots","g g-1",0.08,0.08]
[415,"y W_carrot","Mass fraction of  water in carrots","g g-1",0.88500000000000001,0.88500000000000001]
[416,"y a_carrot","Mass fraction of air in carrots","g g-1",1.2999999999999999E-4,1.3000000000000002E-4]
[417,"y lip_apple","Mass fraction of lipid in apples","g g-1",6.0000000000000001E-3,6.0000000000000001E-3]
[418,"y W_apple","Mass fraction of water in apples","g g-1",0.84399999999999997,0.84399999999999997]
[419,"y a_appple","Mass fraction of air in apples","g g-1",3.2499999999999999E-4,3.2499999999999999E-4]
[420,"y lip_grain","Mass fraction of lipid in grain","g g-1",0.03,0.03]
[421,"y prot_grain","Mass fraction of protein in grain","g g-1",0.1,0.1]
[422,"y carbo_grain","Mass fraction of carbohydrate in grain","g g-1",0.7,0.7]
[423,"y W_grain","Mass faction of water in grain","g g-1",0.17,0.17]
[424,"y lip_tuber","Mass fraction of lipid in potato/tuber","g g-1",1E-3,1E-3]
[425,"y protein_tuber","Mass fraction of protein in potato/tuber","g g-1",0.02,0.02]
[426,"y carbo_tuber","Mass fraction of carbohydrate in potato/tuber","g g-1",0.19900000000000001,0.19900000000000001]
[427,"y W_tuber","Mass faction of water in potato/tuber","g g-1",0.78,0.78]
[428]
[429]
[430,"v carbo_phloem","Volume fraction of carbohydrate in phloem stream","m3 m-3",0.1,0.1]
[431,"v W_phloem","Volume fraction of water in phloem stream","m3 m-3",0.9,0.9]
[432,"ALF_v1a","Leaf area (apple), ref. plane for gaseous deposition (plant side)","m2 m-3",4100,4100]
[433,"VLF_v1a","Leaf volume (apple)","m3 m-2",4.8999999999999998E-4,4.8999999999999998E-4]
[434,"kG_LFv1a","Leaf growth rate constant (apple)","d-1",3.5000000000000003E-2,3.5000000000000003E-2]
[435,"VFR_v1a","Fruit volume (apple)","m3 m-2",5.3499999999999997E-3,5.3499999999999997E-3]
[436,"nFR_v1a","Number of fruits (apple)","m-2",20,20]
[437,"kG_FRv1a","Fruit growth rate constant (apple)","d-1",3.5000000000000003E-2,3.5000000000000003E-2]
[438,"tFR_v1a","Fruit ripening period (apple)","d",60,60]
[439,"VR_v1a","Root volume (apple)","m3 m-2",4.4999999999999998E-2,4.4999999999999998E-2]
[440,"kG_Rv1a","Root growth rate constant (apple)","d-1",0.1,0.1]
[441,"Gtr_v1a","Transpiration rate (apple)","m3 d-1 m-2",5.9999999999999995E-4,5.9999999999999995E-4]
[442,"ALF_v1b","Leaf area (grain), ref. plane for gaseous deposition (plant side)","m2 m-3",5000,5000]
[443,"VLF_v1b","Leaf volume (grain)","m3 m-2",2.2000000000000001E-3,2.2000000000000001E-3]
[444,"kG_LFv1b","Leaf growth rate constant (grain)","d-1",3.5000000000000003E-2,3.5000000000000003E-2]
[445,"VFR_v1b","Fruit  volume (grain)","m3 m-2",2.7999999999999998E-4,2.8000000000000003E-4]
[446,"nFR_v1b","Number of fruits (grain)",null,7181,7181]
[447,"kG_FRv1b","Fruit growth rate constant (grain)","d-1",3.5000000000000003E-2,3.5000000000000003E-2]
[448,"tFR_1b","Fruit ripening period (grain)","d",60,60]
[449,"VR_v1b","Root volume (grain)","m3 m-2",2.2000000000000001E-3,2.2000000000000001E-3]
[450,"kG_Rv1b","Root growth rate constant (grain)","d-1",3.5000000000000003E-2,3.5000000000000003E-2]
[451,"Gtr_v1b","Transpiration rate (grain)","m3 d-1 m-2",4.8000000000000001E-4,4.7999999999999996E-4]
[452,"ALF_v2","Leaf area (potato), ref. plane for gaseous deposition (plant side)","m2 m-3",2000,2000]
[453,"VLF_v2","Leaf volume (potato)","m3 m-2",1E-3,1E-3]
[454,"kG_LFv2","Leaf growth rate constant (potato)","d-1",3.5000000000000003E-2,3.5000000000000003E-2]
[455,"VFR_v2","Tuber volume (potato)","m3 m-2",2E-3,2E-3]
[456,"nFR_v2","Number of tubers (potato)","m-2",30,30]
[457,"kG_FRv2","Tuber growth rate constant (potato)","d-1",0.13900000000000001,0.13900000000000001]
[458,"tFR_v2","Tuber ripening period (potato)","d",60,60]
[459,"VR_v2","Root volume (potato)","m3 m-2",9.2000000000000003E-4,9.2000000000000003E-4]
[460,"kG_Rv2","Root growth rate constant (potato)","d-1",3.5000000000000003E-2,7.0000000000000007E-2]
[461,"Gtr_v2","Transpiration rate (potato)","m3 d-1 m-2",2.0000000000000001E-4,2.0000000000000001E-4]
[462,"ALF_v3","Leaf area (lettuce), ref. plane for gaseous deposition (plant side)","m2 m-3",5000,5000]
[463,"VLF_v3","Leaf volume (lettuce)","m3 m-2",2.2000000000000001E-3,2.2000000000000001E-3]
[464,"kG_LFv3","Leaf growth rate constant (lettuce)","d-1",3.5000000000000003E-2,3.5000000000000003E-2]
[465,"rRoot_Gr","Root density (grass)","kg L-1",0.9,0.9]
[466,"rRoot_veg","Root density (cultivated plants)","kg L-1",0.91,0.91]
[467,"VR_v3","Root volume (lettuce)","m3 m-2",2.2000000000000001E-3,2.2000000000000001E-3]
[468,"kG_Rv3","Root growth rate constant (lettuce)","d-1",3.5000000000000003E-2,3.5000000000000003E-2]
[469,"Gtr_v3","Transpiration rate (lettuce)","m3 d-1 m-2",4.8000000000000001E-4,4.7999999999999996E-4]
[470,"ALF_v4","Leaf area (carrot), ref. plane for gaseous deposition (plant side)","m2 m-3",2000,2000]
[471,"VLF_v4","Leaf volume (carrot)","m3 m-2",1E-3,1E-3]
[472,"kG_LFv4","Leaf growth rate constant (carrot)","d-1",3.5000000000000003E-2,3.5000000000000003E-2]
[473,"rzoo","Zooplankton density","kg L-1",1,1]
[474]
[475,"VR_v4","Root volume (carrot)","m3 m-2",3.1E-2,3.1E-2]
[476,"kG_Rv4","Root growth rate constant (carrot)","d-1",0.1,0.1]
[477,"Gtr_v4","Transpiration rate (carrot)","m3 d-1 m-2",2.0000000000000001E-4,2.0000000000000001E-4]
[478,"k’gg_vx","Gaseous deposition velocity (air-side)","m d-1",192,192]
[479,"k’gp_vx","Gaseous deposition velocity (plant-side)","m d-1",6.7199999999999998E-7,6.7199999999999998E-7]
[480,"k’p_vx","Particle bound deposition velocity (wet & dry)","m d-1",72,72]
[481,"GphFR_v1a","Phloem flow rate into fruit (apple)","m3 d-1"]
[482,"GphFR_v1b","Phloem flow rate into fruit (grain)","m3 d-1"]
[483,"GphFR_v2","Phloem flow rate into potato/tuber","m3 d-1"]
[484,"GrExp_cow","Contribution of grass to total dietary exposure (milk cow)",null,0.75,0.75]
[485,"GrExp_beef cattle","Contribution of grass to total dietary exposure (beef cattle)",null,0.75,0.75]
[486,"k’stom_v1a_fruit","Stomatal mass transfer coefficient (apple; fruit)","m d-1"]
[487,"k’stom_v1b_fruit","Stomatal mass transfer coefficient (grain; \"fruit\")","m d-1"]
[488,"DW","Chemical diffusitivity in water","m2d-1"]
[489,"K’WT_v2","Soil water-tuber mass transfer coefficient (potato tuber)","m d-1"]
[490,"k’stom_v1a_leaves","Stomatal mass transfer coefficient (apple; leaves)","m d-1"]
[491]
[492]
[493,"k’stom_v1b_leaves","Stomatal mass transfer coefficient (grain; leaves)","m d-1"]
[494,"Gph_root (potato)","Phloem flow rate into root (potato)","m3 d-1 m-2"]
[495,"k’stom_v2","Stomatal mass transfer coefficient (potato; leaves)","m d-1"]
[496,"k’stom_v3","Stomatal mass transfer coefficient (lettuce; leaves)","m d-1"]
[497,"k’stom_v4","Stomatal mass transfer coefficient (carrot; leaves)","m d-1"]
[498,"Gph_root (apple)","Phloem flow rate into root (apple)","m3 d-1 m-2"]
[499,null,"Woman(30y): lipid mass fraction","g g-1",null,0.38]
[500,"GUF_H_percF1","Woman (30y): protein/carbohydrate mass fraction","g g-1",null,0.06]
[501,null,"Woman(30y): water mass fraction","g g-1",null,0.44]
[502,"y lip_Hmilk","Human Milk: lipid mass fraction","g g-1",4.3999999999999997E-2,4.3999999999999997E-2]
[503,"y NLOM_Hmilk","Human milk: protein/carbohydrate mass fraction","g g-1",7.9000000000000001E-2,7.9000000000000001E-2]
[504,"y W_Hmilk","Human Milk: water mass fraction","g g-1",0.877,0.877]
[505,"y lip_child","Newborn: lipid mass fraction  (sp-LFER)","g g-1",0.28999999999999998,0.28999999999999998]
[506,"y NLOM_child","Newborn: protein/carbohydrate mass fraction  (sp-LFER)","g g-1",7.0000000000000007E-2,7.0000000000000007E-2]
[507,"y W_child","Newborn: water mass fraction  (sp-LFER)","g g-1",0.64,0.64]
[508,"y adipose_w","Woman: adipose tissue mass fraction (pp-LFER)","g g-1",0.38,0.38]
[509,"y blood_w","Woman: blood mass fraction (pp-LFER)","g g-1",7.0000000000000007E-2,7.0000000000000007E-2]
[510,"y muscle_w","Woman: muscle mass fraction (pp-LFER)","g g-1",0.28999999999999998,0.28999999999999998]
[511,"y liver_w","Woman: liver mass fraction (pp-LFER)","g g-1",0.02,0.02]
[512,"y brain_w","Woman: brain mass fraction (pp-LFER)","g g-1",0.02,0.02]
[513,"y skin_w","Woman: skin mass fraction (pp-LFER)","g g-1",0.04,0.04]
[514,"y W_w","Woman: water (add. tissues) mass fraction (pp-LFER)","g g-1",0.18,0.18]
[515,"y adipose_child","Newborn: adipose tissue mass fraction (pp-LFER)","g g-1",0.27,0.27]
[516,"y blood_child","Newborn: blood mass fraction (pp-LFER)","g g-1",0.08,0.08]
[517,"y muscle_child","Newborn: muscle mass fraction (pp-LFER)","g g-1",0.23,0.23]
[518,"y liver_child","Newborn: liver mass fraction (pp-LFER)","g g-1",0.04,0.04]
[519,"y brain_child","Newborn: brain mass fraction (pp-LFER)","g g-1",0.1,0.1]
[520,"y skin_child","Newborn: skin mass fraction (pp-LFER)","g g-1",0.05,0.05]
[521,"y W_child","Newborn: water (add. tissues)  mass fraction (pp-LFER)","g g-1",0.23,0.23]
[522,"MHuman","Human body mass","kg"]
[523,"MChild","Childbirth body mass","kg"]
[524,"GuW_H","Ingestion rate of water (Woman 30yr)","m3 d-1"]
[525,"GuF_H","Ingestion rate of fish (Woman 30yr)","gww d-1"]
[526,"GuMC_H","Ingestion rate of dairy products  (Woman 30yr)","gww d-1"]
[527,"GuB_H","Ingestion rate beef  (Woman 30yr)","gww d-1"]
[528,"Guv1a_H","Ingestion rate veg1,aerial fruits  (Woman 30yr)","gww d-1"]
[529,"GuV1b_H","Ingestion rate of veg2, grain  (Woman 30yr)","gww d-1"]
[530,"GuV2_H","Ingestion rate of veg 2, tuber,potato  (Woman 30yr)","gww d-1"]
[531,"GuV3_H","Ingestion rate of veg4, leafy, lettuce  (Woman 30yr)","gww d-1"]
[532,"GuV4_H","Ingestion rate of veg5,root, carrot  (Woman 30yr)","gww d-1"]
[533,"Tchild_birth","Age at child birth","year",25,25]
[534,"Gchild_lip_H","Single loss of lipid during baby delivery-SP","m3",1.01E-3,1.01E-3]
[535,"Gchild_NLOM_H","Single loss of NLOM during baby delivery-SP","m3",6.7000000000000002E-4,6.7000000000000002E-4]
[536,"Gchild_w_H","Single loss of water during baby delivery-SP","m3",1.8499999999999999E-2,1.8499999999999999E-2]
[537,"Gchild_adipose_H","Single loss of adipose tissue during baby delivery-PP","m3",1.01E-3,1.01E-3]
[538,"Gchild_blood_H","Single loss of blood during baby delivery-PP","m3",7.9000000000000001E-4,7.9000000000000001E-4]
[539,"Gchild_muscle_H","Single loss of muscle during baby delivery-PP","m3",7.6900000000000004E-4,7.6900000000000004E-4]
[540,"Gchild_liver_H","Single loss of liver during baby delivery-PP","m3",1.2400000000000001E-4,1.2400000000000001E-4]
[541,"Gchild_brain_H","Single loss of brain during baby delivery-PP","m3",3.6900000000000002E-4,3.6900000000000002E-4]
[542,null,"Percentage of fish 1 in human diet",null,0.5,0.5]
[543,"Gchild_skin_H","Single loss of skin during baby delivery-PP","m3",2.13E-4,2.13E-4]
[544,"vudw","Fraction of excretion of dry weight ingestion ","-",0.1,0.1]
[545,"vw","Fraction of drunken water which is excreted (urination, perspiration,...)","-",1,1]
[546,"GP_H","Percutaneous body lipid excretion rate","m3 d-1",7.7800000000000001E-7,7.7800000000000001E-7]
[547,"Gre_H","Inhalation rate (30yr old)","m3 d-1",15,15]
[548,"GL_H","Lactation rate","m3 d-1",8.4999999999999995E-4,8.4999999999999995E-4]
[549,"Tlact","Lactation length","d",182,182]
[550,"rgrassLeaf","leaf density (grass)","kg L-1",0.75,0.75]
[551,"rvegLeaf","leaf density (cultivated vegetation)","kg L-3",0.75,0.75]
[552,"raerosol","density of aerosols","g m-3",2260000,2260000]
[553,"v adipose_f1","Volume fraction  of adipose tissue in fish1","m3 m-3",3.5000000000000003E-2,3.5000000000000003E-2]
[554,"v blood_f1","Volume fraction of blood in fish1","m3 m-3",2.4E-2,2.4E-2]
[555,"v muscle_f1","Volume fraction of muscle in fish1","m3 m-3",0.56999999999999995,0.56999999999999995]
[556,"v liver_f1","Volume fraction  of liver in fish1","m3 m-3",2.1999999999999999E-2,2.1999999999999999E-2]
[557,"v brain_f1","Volume fraction of brain in fish1","m3 m-3",3.0000000000000001E-3,3.0000000000000001E-3]
[558,"v W_f1","Volume fraction of water in fish1","m3 m-3",0.34599999999999997,0.34599999999999997]
[559,"v adipose_f2","Volume fraction  of adipose tissue in fish2","m3 m-3",3.5000000000000003E-2,3.5000000000000003E-2]
[560,"v blood_f2","Volume fraction of blood in fish2","m3 m-3",2.4E-2,2.4E-2]
[561,"v muscle_f2","Volume fraction of muscle in fish2","m3 m-3",0.56999999999999995,0.56999999999999995]
[562,"v liver_f2","Volume fraction  of liver in fish2","m3 m-3",2.1999999999999999E-2,2.1999999999999999E-2]
[563,"v brain_f2","Volume fraction of brain in fish2","m3 m-3",3.0000000000000001E-3,3.0000000000000001E-3]
[564,"v W_f2","Volume fraction of water in fish2","m3 m-3",0.34599999999999997,0.34599999999999997]
[565,"y adipose_cattle","Mass fraction  of adipose tissue in cattle (sorbing matrix)","g g-1",0.22,0.22]
[566,"y blood_cattle","Mass fraction of blood in cattle (sorbing matrix)","g g-1",0.08,0.08]
[567,"y muscle_cattle","Mass fraction of muscle in cattle (sorbing matrix)","g g-1",0.44,0.44]
[568,"y liver_cattle","Mass fraction  of liver in cattle (sorbing matrix)","g g-1",0.01,0.01]
[569,"y skin_cattle","Mass fraction of skin in cattle (sorbing matrix)","g g-1",7.0000000000000007E-2,7.0000000000000007E-2]
[570,"y W_cattle","Mass fraction of water in cattle (sorbing matrix)","g g-1",0.18,0.18]
[571,"Gph_root (grain)","Phloem flow rate into root (grain)","m3 d-1 m-2"]
[572,"Gph_root (lettuce)","Phloem flow rate into root (lettuce)","m3 d-1 m-2"]
[573,"Gph_root (carrot)","Phloem flow rate into root (carrot)","m3 d-1 m-2"]
[574,"y lip_seal blubber","Mass fraction  of lipid in seal blubber","g g-1",0.96,0.96]
[575,"y W_seal blubber","Mass fraction of water in seal blubber","g g-1",0.04,0.04]
[576,"y lip_seal core","Mass fraction  of lipid in seal core","g g-1",0.05,0.05]
[577,"y NLOM_seal core","Mass fraction of protein/ carbohydrate in seal core","g g-1",0.14599999999999999,0.14599999999999999]
[578,"yW_seal core","Mass fraction of water in seal core","g g-1",0.69,0.69]
[579,"y lip_seal milk","Mass  fraction  of lipid in seal milk","g g-1",0.47,0.47]
[580,"yNLOM_seal milk","Mass fraction of protein/ carbohydrate in seal milk","g g-1",0.14000000000000001,0.14000000000000001]
[581,"y W_seal milk","Mass fraction of water in seal milk","g g-1",0.39,0.39]
[582,"y adipose_seal","Mass fraction  of adipose tissue in seal (adult)","g g-1",0.35,0.35]
[583,"y blood_seal","Mass fraction of blood in seal (adult)","g g-1",7.0000000000000007E-2,7.0000000000000007E-2]
[584,"y muscle_seal","Mass fraction of muscle in seal (adult)","g g-1",0.3,0.3]
[585,"y liver_seal","Mass fraction  of liver in seal (adult)","g g-1",0.02,0.02]
[586,"y brain_seal","Mass fraction of brain in seal (adult)","g g-1",0.02,0.02]
[587,"y skin_seal","Mass fraction of skin in seal (adult)","g g-1",0.04,0.04]
[588,"tseal","Seal age","y",15,15]
[589,"tmaturity","seal maturity age","y",5,5]
[590,"MS","Body mass of seal(15)","kg"]
[591,"yBl_S","Blubber weight fraction(15)","g g-1"]
[592]
[593]
[594,"ykJ_Sc","Deposition energy for core mass gain","kJ kg-1",9410,9410]
[595,"ykJ_Sbl","Deposition energy for gain in blubber mass","kJ kg-1",46030,46030]
[596,"G’U_SkJ","Energy intake","kJ d-1",null,0]
[597,"ykJ_lip","Lipid energy content","kJ glip-1",39.299999999999997,39.299999999999997]
[598,"ykJ_NLOM","NLOM energy content","kJ gNLOM-1",33.5,33.5]
[599,"ykJ_i","energy content of biota i","kJ g-1"]
[600,"GUi_S","Ingestion rate of biota i","m3 d-1"]
[601,"G’U_Sdw","Dry weight ingestion rate (total diet)","g dw d-1"]
[602,"GUW_S","Drinking rate","m3 d-1",0,0]
[603,"v’F_Sdw","fraction of feces dry weight excretion","-",0.1,0.1]
[604,"Gur_S","Water excretion rate","m3 d-1",1.25E-4,1.25E-4]
[605,"GP_S","Body lipid excretion rate","m3 d-1",7.7800000000000001E-7,7.7800000000000001E-7]
[606,"Gre_S","Respiration rate","m3 d-1"]
[607]
[608,"GL_S","Lactation rate","m3 d-1",2.2599999999999999E-4,2.2599999999999999E-4]
[609,"Tlact_seal","Lactation length","d",15,15]
[610,"Gpup_lip_seal","loss of lipid during delivery for seal-sp","m3 birth-1",1.39E-3,1.39E-3]
[611,"Gpup_NLOM_seal","loss of NLOM during delivery for seal-sp","m3 birth-1",2.3400000000000001E-3,2.3400000000000001E-3]
[612,"Gpup_w_seal","loss of water during delivery for seal-sp","m3 birth-1",0.1,0.1]
[613,"Gpup_adipose_seal","loss of lipid during delivery for seal-pp","m3 birth-1",1.39E-3,1.39E-3]
[614,"Gpup_blood_seal","loss of blood during delivery for seal-pp","m3 birth-1",1.66E-3,1.66E-3]
[615,"Gpup_muscle_seal","loss of muscle during delivery for seal-sp","m3 birth-1",4.4099999999999999E-3,4.4099999999999999E-3]
[616,"Gpup_liver_seal","loss of liver during delivery for seal-sp","m3 birth-1",7.1000000000000002E-4,7.1000000000000002E-4]
[617,"Gpup_brain_seal","loss of brain during delivery for seal-sp","m3 birth-1",2.1099999999999999E-3,2.1099999999999999E-3]
[618,"Gpup_skin_seal","loss of skin during delivery for seal-sp","m3 birth-1",1.2199999999999999E-3,1.2199999999999999E-3]
[]
[]
[]
[]
[]
[]
[]
[]
[]
[]
[]
[]
[]
[]
[]
[]
[]
[]
[]
[]
[]
[]
[]
[]
[]
[]
[]
[]
[]
[]
[]
[]
[null,null,null,"       -"]

{"sheet":"Seal","index":9,"n_rows":4,"n_cols":17,"rows_kept":4,"cut":false,"hidden":true,"merged":[[2,0,2,2],[2,4,2,14]]}
[null,null,null,null,{"$f":"E4","v":"Sediment"},{"$f":"F4","v":"zooplankton"},"Benthos 1","benthos 2","Benrhos 3","Fish 1","Fish 2","Egestion","Urination","Respiration","Lipid  excretion","metabolism",{"$f":"Q4","v":"lactation"}]
[null,null,null,"15yr old, 15 days after pupping",1,1,1,1,1,1,1,1,1,1,1,1,1]
["Seal",null,null,null,"Seal D value"]
["age (yr)","fugacity","concentration","t90","Sediment","zooplankton","Benthos 1","benthos 2","Benrhos 3","Fish 1","Fish 2","Egestion","Urination","Respiration","Lipid  excretion","metabolism","lactation"]