VH-Z00R
type: Concept
definition: High-performance low-range zoom lens (0.1 x to 50 x)
in scheme: kitmtxxls Tribology Lab at KIT
scope note: option

Electrolyte Flow Rate
type: Concept
definition: The term denotes the flow rate of the electrolyte as specified by the vendor.
in scheme: kitmtxxls Tribology Lab at KIT
scope note: float

Array Produced File Metadata
type: Concept
definition: Instances of this class contain a collection of metadata records each associated with a file or a series of files sharing the same metadata.
in scheme: kitmtxxls Tribology Lab at KIT
scope note: dictionary

Diamond Suspension
type: Concept
definition: Diamond suspensions are used during the sample preparation stages for fast stock removal and to produce a perfect polished surface ready for analysis. The type of diamond suspension to use depends on the material being polished and the surface finish required.
in scheme: kitmtxxls Tribology Lab at KIT
scope note: option

Diamond (Fixed Installation)
type: Concept
definition: n/a
in scheme: kitmtxxls Tribology Lab at KIT
scope note: option

Time Duration
type: Concept
definition: The equipment setting which specifies the temperature setting of a machine.
in scheme: kitmtxxls Tribology Lab at KIT
scope note: float
scope note: s, min, h

Droplet with Syringe
type: Concept
definition: Application by hand and syringe at the contact.
in scheme: kitmtxxls Tribology Lab at KIT
scope note: option

Transformation Direction
type: Concept
definition: Describes the direction which coordinate system is transformed into which.
in scheme: kitmtxxls Tribology Lab at KIT
scope note: string

2.31.2.0
type: Concept
definition: n/a
in scheme: kitmtxxls Tribology Lab at KIT
scope note: option

Hardness Measurement Type
type: Concept
definition: Instances of this class specify the hardness measuring principle.
in scheme: kitmtxxls Tribology Lab at KIT
scope note: string

316a
type: Concept
definition: n/a
in scheme: kitmtxxls Tribology Lab at KIT
scope note: option

Specimen Cleaning
type: Concept
definition: Class representing the physical process of reducing the amount of residue on a physical object's surfaces.
in scheme: kitmtxxls Tribology Lab at KIT
scope note: https://purls.helmholtz-metadaten.de/vp/kitmtxx-41732562-vp/phy_xxx_xxx-3c41e6aa10d14a51b0c7a950b897fbba-vp: https://purls.helmholtz-metadaten.de/vp/kitmtxx-41732562-vp/blo_spe_xxx-ae137cec891644ec9e9d131be42ef67c-vp
scope note: https://purls.helmholtz-metadaten.de/vp/kitmtxx-41732562-vp/emp_xxx_xxx-b0c09f9f6cd948839bac12aa4a2ad55d-vp: https://purls.helmholtz-metadaten.de/vp/kitmtxx-41732562-vp/ult_cle_xxx-192eb37ff24644798963cd87107e9a5f-vp
scope note: process
scope note: record

Beam Current
type: Concept
definition: Electrical current which flows along the beam path.
in scheme: kitmtxxls Tribology Lab at KIT
scope note: float
scope note: pA, nA, µA, mA, A

Technical Specifications (Grinding Machine)
type: Concept
definition: Class containing information about the technical specifications of a grinding machine.
in scheme: kitmtxxls Tribology Lab at KIT
scope note: dictionary

Connected PC
type: Concept
definition: Collection of information about the PC's connected to a lab equipment.
in scheme: kitmtxxls Tribology Lab at KIT
scope note: dictionary

Technical Specifications (Optical Surface Profilometer)
type: Concept
definition: Class containing information about the technical specifications of a optical surface profilometer.
in scheme: kitmtxxls Tribology Lab at KIT
scope note: dictionary

Motion End Distance in Front of Demagnetizing Plate
type: Concept
definition: Instances of this class give information about the distance between sample and trailing edge of the demagnetizing plate after finishing the respective demagnetizing motion.
in scheme: kitmtxxls Tribology Lab at KIT
scope note: float
scope note: µm, nm, mm, m, cm

Holding
type: Concept
definition: n/a
in scheme: kitmtxxls Tribology Lab at KIT
scope note: option

FFF-Printer
type: Concept
definition: Objects of this class pertain to the category of machines used for additive manufacturing via Fused Filament Fabrication.
in scheme: kitmtxxls Tribology Lab at KIT
scope note: equipment
scope note: record

Binary File Scaling Factor
type: Concept
definition: Scaling factor that has to be applied to all data in a file to get meaningful values.
in scheme: kitmtxxls Tribology Lab at KIT
scope note: float

Elastic Spring
type: Concept
definition: A spring is an example of an elastic object - when stretched, it exerts a restoring force which tends to bring it back to its original length.
in scheme: kitmtxxls Tribology Lab at KIT
scope note: option

*.bin
type: Concept
definition: A BIN file, also called a binary file, is a file format that contains information.
in scheme: kitmtxxls Tribology Lab at KIT
scope note: option

Available Hardness Testing Indenters Array
type: Concept
definition: Term containing information about the available hardness testing indenters of a hardness testing system.
in scheme: kitmtxxls Tribology Lab at KIT
scope note: string

Innovatest
type: Concept
definition: Manual or automatic hardness testing machines.
in scheme: kitmtxxls Tribology Lab at KIT
scope note: option

Cup Grinding Tool Info
type: Concept
definition: Class containing information that characterizes the grinding tool.
in scheme: kitmtxxls Tribology Lab at KIT
scope note: dictionary

Coating Properties
type: Concept
definition: A collective of information about the coating's composition and way of application.
in scheme: kitmtxxls Tribology Lab at KIT
scope note: dictionary

Author(s)
type: Concept
definition: Class containing information about who published a thesis, paper, or talk.
in scheme: kitmtxxls Tribology Lab at KIT
scope note: dictionary

Heat Treatment Type
type: Concept
definition: Instances of this class specify the classification type of heat treatment.
in scheme: kitmtxxls Tribology Lab at KIT
scope note: string

Measurement Results (Hardness Measurement)
type: Concept
definition: Compiles measurement results from hardness measurement.
in scheme: kitmtxxls Tribology Lab at KIT
scope note: dictionary

%
type: Concept
definition: This reads as % Relative Humidity, but "% RH" is not SI unit, so it is kept just as "%".
in scheme: kitmtxxls Tribology Lab at KIT
scope note: option

*.json
type: Concept
definition: JSON is an open standard file format and data interchange format that uses human-readable text to store and transmit data objects consisting of attribute–value pairs and arrays.
in scheme: kitmtxxls Tribology Lab at KIT
scope note: option

Distance Between Specimen and Plate
type: Concept
definition: Instances of this class give information about the distance between the specimen and the demagnetizing plate. Often an estimate is good enough for this value.
in scheme: kitmtxxls Tribology Lab at KIT
scope note: float
scope note: µm, nm, mm, m, cm

Field-Free Mode
type: Concept
definition: The field-free mode ensures undistorted, very low magnification imaging. In immersion mode, the highest resolution is achieved.
in scheme: kitmtxxls Tribology Lab at KIT
scope note: option

SEM or FIB Pattern Application Type
type: Concept
definition: The type of the box. E.g., Cleaning Cross Section, Regular Cross Section, Rectangle.
in scheme: kitmtxxls Tribology Lab at KIT
scope note: string

Cleaning Procedure Type
type: Concept
definition: Instances of this class specify the classification type of object cleaning procedure.
in scheme: kitmtxxls Tribology Lab at KIT
scope note: string

DC Motor
type: Concept
definition: A DC motor is defined as a class of electrical motors that convert direct current electrical energy into mechanical energy.
in scheme: kitmtxxls Tribology Lab at KIT
scope note: option

Measure the Height of the Counter Body's Bulk - Respectively Its Wear
type: Concept
in scheme: kitmtxxls Tribology Lab at KIT
scope note: option

Equipped for Wet Grinding
type: Concept
definition: Boolean that indicates whether the grinding machine is properly equipped for wet grinding processes i.e. utilizing a liquid cooling medium. Often this is realized by some sort of enhousing or fume hood.
in scheme: kitmtxxls Tribology Lab at KIT
scope note: boolean

Analyzed Topography Data
type: Concept
definition: n/a
in scheme: kitmtxxls Tribology Lab at KIT
scope note: option

Cutting Face Side
type: Concept
definition: The side of the specimen being cut.
in scheme: kitmtxxls Tribology Lab at KIT
scope note: string

Power Supply Voltage
type: Concept
definition: The physical quantity that characterizes the operating voltage at which the power supply is used.
in scheme: kitmtxxls Tribology Lab at KIT
scope note: float

Analysis Results
type: Concept
definition: Contains key-value pairs of data resulting from an analysis process.
in scheme: kitmtxxls Tribology Lab at KIT
scope note: dictionary

Debedding
type: Concept
alternative label: Debadding
alternative label: divesting
alternative label: removing
definition: A process that removes the mounting resin from a specimen so that it can be used for further processes.
in scheme: kitmtxxls Tribology Lab at KIT
scope note: https://purls.helmholtz-metadaten.de/vp/kitmtxx-41732562-vp/phy_xxx_xxx-3c41e6aa10d14a51b0c7a950b897fbba-vp: https://purls.helmholtz-metadaten.de/vp/kitmtxx-41732562-vp/blo_spe_xxx-ae137cec891644ec9e9d131be42ef67c-vp
scope note: https://purls.helmholtz-metadaten.de/vp/kitmtxx-41732562-vp/inv_xxx_xxx-c5ceb18203384c359584362949572590-vp: https://purls.helmholtz-metadaten.de/vp/kitmtxx-41732562-vp/blo_spe_xxx-ae137cec891644ec9e9d131be42ef67c-vp
scope note: process
scope note: record

Software Versions
type: Concept
definition: Array of Software Versions
in scheme: kitmtxxls Tribology Lab at KIT
scope note: dictionary

noise_freq
type: Concept
definition: The mean of the most prominent frequency per cycle.
in scheme: kitmtxxls Tribology Lab at KIT
scope note: float
scope note: Hz

Technical Specifications (Interfacial Lubricating Medium)
type: Concept
definition: Class containing information about the technical specifications of a piece of interfacial lubricating medium.
in scheme: kitmtxxls Tribology Lab at KIT
scope note: dictionary

Mounting Resin
type: Concept
definition: Information about the mounting resin used for embedding.
in scheme: kitmtxxls Tribology Lab at KIT
scope note: dictionary

Cup Grinding Wheel
type: Concept
definition: Cup grinding wheels, sometimes called cup wheels, have abrasive material on the side of the wheel for cutting, grinding, and finishing metal, wood, glass, plastic, cement, ceramic, and composite materials. They're designed for use with bench or angle grinders.
in scheme: kitmtxxls Tribology Lab at KIT
scope note: option

681
type: Concept
definition: n/a
in scheme: kitmtxxls Tribology Lab at KIT
scope note: option

MPa
type: Concept
definition: A megapascal is a unit of Pressure in the International System of Units (SI). Mega denotes a factor of a million (106) which means that there are 1,000,000 pascals in a megapascal.
in scheme: kitmtxxls Tribology Lab at KIT
scope note: option

Poster
type: Concept
definition: Poster
in scheme: kitmtxxls Tribology Lab at KIT
scope note: option

Processed Data
type: Concept
definition: Data processing occurs when data is collected and translated into usable information.
in scheme: kitmtxxls Tribology Lab at KIT
scope note: option

Standard Deviation of Mass
type: Concept
definition: Indicates the standard deviation of measured mass.
in scheme: kitmtxxls Tribology Lab at KIT
scope note: float
scope note: g, kg, mg, µg, t

Cura Slicer
type: Concept
definition: Slicing software for 3D-printing from Cura
in scheme: kitmtxxls Tribology Lab at KIT
scope note: option

Maximum Turning Speed
type: Concept
definition: The maximum permissable turning speed.
in scheme: kitmtxxls Tribology Lab at KIT
scope note: float
scope note: min^(-1)

Conversion Offset
type: Concept
definition: Scaling offset that has to be applied to data. The conversion offset to convert V/mA raw-signal into something physically meaningful.
in scheme: kitmtxxls Tribology Lab at KIT
scope note: float
scope note: µm*V^(-1), µm*s^(-1), µm, W, V, s, Pa, null, nm, N*V^(-1), N, MPa, mm^2*s^(-1), mm*s^(-1), mm, ml*h^(-1), ml, min^(-1), min, mbar, MB, m*s^(-1), m, l, km*h^(-1), kHz, kgf, kg*m^(-3), kg, kB, K, Hz, HV20, HV10, h, gf, g, cm, bit, °C, °, %*V^(-1), %

Y Offset Between Profiles
type: Concept
definition: Instances of this class characterize the measurement offset in y-direction when multiple profiles from the same sample are taken.
in scheme: kitmtxxls Tribology Lab at KIT
scope note: float
scope note: µm, nm, mm, m, cm

List of Available Cutting Speed Setpoints
type: Concept
definition: Class containing information about the available cutting speed setpoints of a band saw object.
in scheme: kitmtxxls Tribology Lab at KIT
scope note: dictionary

Principal Investigator
type: Concept
definition: A Principal Investigator or PI is the individual responsible for the preparation, conduct, and administration of a research grant, cooperative agreement, training or public service project, contract, or other sponsored project.
in scheme: kitmtxxls Tribology Lab at KIT
scope note: option

Fiji
type: Concept
definition: Schindelin, J., Arganda-Carreras, I., Frise, E., Kaynig, V., Longair, M., Pietzsch, T., … Cardona, A. (2012). Fiji: an open-source platform for biological-image analysis. Nature Methods, 9(7), 676–682. doi:10.1038/nmeth.2019
in scheme: kitmtxxls Tribology Lab at KIT
scope note: option

Time at Receipt of Delivery
type: Concept
definition: Instances of this class identify when a delivery was left at the research institution. Please note: In the Kadi4Mat the data type for this is Date — dd. "Month" yyyy HH:MM:SS.
in scheme: kitmtxxls Tribology Lab at KIT
scope note: date

Vickers
type: Concept
definition: The Vickers hardness test is a versatile hardness test method, used for both macro and micro hardness testing.
in scheme: kitmtxxls Tribology Lab at KIT
scope note: option

Tactile Surface Profilometry
type: Concept
definition: Class representing the monitored processes that produce a (set of) file(s) whose contents could be used for 1D visualization.
in scheme: kitmtxxls Tribology Lab at KIT
scope note: https://purls.helmholtz-metadaten.de/vp/kitmtxx-41732562-vp/emp_xxx_xxx-b0c09f9f6cd948839bac12aa4a2ad55d-vp: https://purls.helmholtz-metadaten.de/vp/kitmtxx-41732562-vp/tac_sur_pro-ec98dbf380804321bb8aa65a96c41b24-vp
scope note: https://purls.helmholtz-metadaten.de/vp/kitmtxx-41732562-vp/phy_xxx_xxx-3c41e6aa10d14a51b0c7a950b897fbba-vp: https://purls.helmholtz-metadaten.de/vp/kitmtxx-41732562-vp/blo_spe_xxx-ae137cec891644ec9e9d131be42ef67c-vp
scope note: https://purls.helmholtz-metadaten.de/vp/kitmtxx-41732562-vp/cha_xxx_xxx-5b70f2376c68474381ef5cc428fe240b-vp: https://purls.helmholtz-metadaten.de/vp/kitmtxx-41732562-vp/blo_spe_xxx-ae137cec891644ec9e9d131be42ef67c-vp
scope note: https://purls.helmholtz-metadaten.de/vp/kitmtxx-41732562-vp/que_xxx_xxx-dc882ce905ba4dfbb3a906b1c1b0cdad-vp: https://purls.helmholtz-metadaten.de/vp/kitmtxx-41732562-vp/fib_cut_xxx-88c4fd89f922478585b33011e810e1f0-vp
scope note: https://purls.helmholtz-metadaten.de/vp/kitmtxx-41732562-vp/que_xxx_xxx-dc882ce905ba4dfbb3a906b1c1b0cdad-vp: https://purls.helmholtz-metadaten.de/vp/kitmtxx-41732562-vp/tri_exp_xxx-9b84c31083254e40a6eb78601271d381-vp
scope note: https://purls.helmholtz-metadaten.de/vp/kitmtxx-41732562-vp/que_xxx_xxx-dc882ce905ba4dfbb3a906b1c1b0cdad-vp: https://purls.helmholtz-metadaten.de/vp/kitmtxx-41732562-vp/opt_mic_xxx-c73af6d31f314907b33d212d43f61891-vp
scope note: process
scope note: record

Micro Pillar
type: Concept
definition: Cutting a micro pillar from bulk material.
in scheme: kitmtxxls Tribology Lab at KIT
scope note: option

Ion Beam Ga+
type: Concept
definition: A beam which consists of Ga+ ions.
in scheme: kitmtxxls Tribology Lab at KIT
scope note: option

Load Settings
type: Concept
definition: Instances of this class list information on the chosen parameters to define the controllables associated with the load for mechanical interaction in the system.
in scheme: kitmtxxls Tribology Lab at KIT
scope note: dictionary

Rectangle
type: Concept
definition: n/a
in scheme: kitmtxxls Tribology Lab at KIT
scope note: option

CAD Modelling
type: Concept
definition: Class representing the modelling process using computer aided design.
in scheme: kitmtxxls Tribology Lab at KIT
scope note: process
scope note: record

Polishing Steps Array
type: Concept
definition: Describes the sequential order of polishing steps.
in scheme: kitmtxxls Tribology Lab at KIT
scope note: sub-workflow

Minimum Positioning System Turning Speed
type: Concept
definition: Instances of this class characterize the minimum permissable turning speed.
in scheme: kitmtxxls Tribology Lab at KIT
scope note: float
scope note: min^(-1), h^(-1), s^(-1), Hz

h
type: Concept
definition: n/a
in scheme: kitmtxxls Tribology Lab at KIT
scope note: option

min
type: Concept
definition: A minute is a unit of time that is equal to sixty seconds.
in scheme: kitmtxxls Tribology Lab at KIT
scope note: option

EDX Mode
type: Concept
definition: Energy Dispersive X-ray Spectroscopy (EDS or EDX) is an analytical technique used to identify and characterize the elemental composition of sample material.
in scheme: kitmtxxls Tribology Lab at KIT
scope note: option

Equipment Abbreviation
type: Concept
definition: The agreed upon abbreviation of the equipment.
in scheme: kitmtxxls Tribology Lab at KIT
scope note: string

Oxford Instruments
type: Concept
definition: n/a
in scheme: kitmtxxls Tribology Lab at KIT
scope note: option

X Pixel Position (Set)
type: Concept
definition: The x coordinate of a pixel in the range of scanning.
in scheme: kitmtxxls Tribology Lab at KIT
scope note: option

Condenser Volume
type: Concept
definition: The volume of the condenser.
in scheme: kitmtxxls Tribology Lab at KIT
scope note: float
scope note: ml, l

Propanol
type: Concept
definition: A colorless liquid made by oxidation of aliphatic hydrocarbons that is used as a solvent and chemical intermediate.
in scheme: kitmtxxls Tribology Lab at KIT
scope note: option

Head Speed
type: Concept
definition: The speed of the head.
in scheme: kitmtxxls Tribology Lab at KIT
scope note: float
scope note: min^(-1)

Technical Specifications (Lubricant for Polishing)
type: Concept
definition: Term containing information about the technical specifications of a lubricant for polishing.
in scheme: kitmtxxls Tribology Lab at KIT
scope note: dictionary

Polishing Process Parameters
type: Concept
definition: Term containing information about the parameters specific to the process.
in scheme: kitmtxxls Tribology Lab at KIT
scope note: dictionary

Base Speed
type: Concept
definition: The speed of the rotating plate.
in scheme: kitmtxxls Tribology Lab at KIT
scope note: float
scope note: min^(-1)

Signed Integer
type: Concept
definition: A signed integer is a 32-bit datum that encodes an integer in the range [-2147483648 to 2147483647].
in scheme: kitmtxxls Tribology Lab at KIT
scope note: option

CAV Standard
type: Concept
definition: Class containing information about the technical standard of the interfacial medium.
in scheme: kitmtxxls Tribology Lab at KIT
scope note: string

(Human Readable) Processed Data
type: Concept
definition: Human-readable data can be understood and interpreted by humans. It has a natural language (e.g., English, French, etc.), and the data representation is unstructured.
in scheme: kitmtxxls Tribology Lab at KIT
scope note: option

Exchangeable
type: Concept
definition: n/a
in scheme: kitmtxxls Tribology Lab at KIT
scope note: option

VH-Z20R
type: Concept
definition: Standard zoom lens (20 x to 200 x)
in scheme: kitmtxxls Tribology Lab at KIT
scope note: option

Elmag
type: Concept
definition: A manufacturer specializing in lathes, welding machines and stone cutting technology
in scheme: kitmtxxls Tribology Lab at KIT
scope note: option

Transverse
type: Concept
definition: n/a
in scheme: kitmtxxls Tribology Lab at KIT
scope note: option

Top
type: Concept
definition: n/a
in scheme: kitmtxxls Tribology Lab at KIT
scope note: option

kitmtxxl Category (Block Specimen)
type: Concept
definition: The material class which block specimen fits into best.
in scheme: kitmtxxls Tribology Lab at KIT
scope note: string

Signal Recording
type: Concept
definition: n/a
in scheme: kitmtxxls Tribology Lab at KIT
scope note: option

Hardness
type: Concept
definition: Value of hardness of a specimen.
in scheme: kitmtxxls Tribology Lab at KIT
scope note: float

Terminal Configuration
type: Concept
definition: Instances of this class give the configuration for reading or writing at a terminal.
in scheme: kitmtxxls Tribology Lab at KIT
scope note: string

IAM-CMS
type: Concept
definition: n/a
in scheme: kitmtxxls Tribology Lab at KIT
scope note: option

Front-Right-Top Intersection
type: Concept
definition: n/a
in scheme: kitmtxxls Tribology Lab at KIT
scope note: option

µm*s^(-1)
type: Concept
definition: n/a
in scheme: kitmtxxls Tribology Lab at KIT
scope note: option

Total Number of Reciprocation Cycles Setpoint
type: Concept
definition: Denotes the total number of reciprocation cycles as part of the setup. Not necessarily the number of completed cycles.
in scheme: kitmtxxls Tribology Lab at KIT
scope note: integer

Wieland
type: Concept
definition: semi-finished copper and copper alloy
in scheme: kitmtxxls Tribology Lab at KIT
scope note: option

MZE, 30.48
type: Concept
definition: n/a
in scheme: kitmtxxls Tribology Lab at KIT
scope note: option

Temperature Controller
type: Concept
definition: Objects of this class pertain to the category of machines called temperature controller.
in scheme: kitmtxxls Tribology Lab at KIT
scope note: string

*.csv
type: Concept
definition: A CSV is a comma-separated values file, which allows data to be saved in a tabular format.
in scheme: kitmtxxls Tribology Lab at KIT
scope note: option

CSH02-CAm1,4
type: Concept
definition: n/a
in scheme: kitmtxxls Tribology Lab at KIT
scope note: option

Variable
type: Concept
definition: Throughout an experiment it changes.
in scheme: kitmtxxls Tribology Lab at KIT
scope note: option

Tensile Tester
type: Concept
definition: Objects of this class pertain to the category of machines called universal testing machine (UTM). It is an electromechanical test system that applies a tensile (pull) force to a material to determine the tensile strength and deformation behavior until break.
in scheme: kitmtxxls Tribology Lab at KIT
scope note: equipment
scope note: record

Machine Dimensions
type: Concept
definition: Class containing information about the dimensions of an object.
in scheme: kitmtxxls Tribology Lab at KIT
scope note: dictionary

DT6112
type: Concept
definition: The capacitive DT6112 controller is the entry model for dynamic measurement tasks. A bandwidth of up to 20kHz (-3dB) enables reliable monitoring of fast processes.
in scheme: kitmtxxls Tribology Lab at KIT
scope note: option

Shell
type: Concept
definition: n/a
in scheme: kitmtxxls Tribology Lab at KIT
scope note: option

GOHT-65A50BMS-M6
type: Concept
definition: Goniometer 65X65mm Goniometer, EXC Bearings, 1-Axis, +/-10 deg, 50mm Axis Ht, Micrometer, M6 Thd
in scheme: kitmtxxls Tribology Lab at KIT
scope note: option

D181
type: Concept
definition: n/a
in scheme: kitmtxxls Tribology Lab at KIT
scope note: option

employsEquipment
type: Concept
definition: Denotes the relationship between a piece of equipment and the procedure it is applied to.
in scheme: kitmtxxls Tribology Lab at KIT
scope note: none
scope note: relationship_type

SEM or FIB Imaging
type: Concept
definition: SEM Imaging is a subprocess of a SEM session during which images in the SEM were taken. The imaging parameters will be stored together with the image files.
in scheme: kitmtxxls Tribology Lab at KIT
scope note: https://purls.helmholtz-metadaten.de/vp/kitmtxx-41732562-vp/use_xxx_xxx-f130aac753c3467a9ef4cd8d2163a609-vp: https://purls.helmholtz-metadaten.de/vp/kitmtxx-41732562-vp/sof_xxx_xxx-43c5e712afb04a16a8954dbb3c865c0f-vp
scope note: https://purls.helmholtz-metadaten.de/vp/kitmtxx-41732562-vp/que_xxx_xxx-dc882ce905ba4dfbb3a906b1c1b0cdad-vp: https://purls.helmholtz-metadaten.de/vp/kitmtxx-41732562-vp/fib_cut_xxx-88c4fd89f922478585b33011e810e1f0-vp
scope note: https://purls.helmholtz-metadaten.de/vp/kitmtxx-41732562-vp/que_xxx_xxx-dc882ce905ba4dfbb3a906b1c1b0cdad-vp: https://purls.helmholtz-metadaten.de/vp/kitmtxx-41732562-vp/tri_exp_xxx-9b84c31083254e40a6eb78601271d381-vp
scope note: https://purls.helmholtz-metadaten.de/vp/kitmtxx-41732562-vp/was_xxx_xxx-3362f63dcded4e41aa5b40b49059f80a-vp: https://purls.helmholtz-metadaten.de/vp/kitmtxx-41732562-vp/ele_mic_xxx-840bbf9ffd9648fc883b251d106e3733-vp
scope note: https://purls.helmholtz-metadaten.de/vp/kitmtxx-41732562-vp/cha_xxx_xxx-5b70f2376c68474381ef5cc428fe240b-vp: https://purls.helmholtz-metadaten.de/vp/kitmtxx-41732562-vp/blo_spe_xxx-ae137cec891644ec9e9d131be42ef67c-vp
scope note: https://purls.helmholtz-metadaten.de/vp/kitmtxx-41732562-vp/was_xxx_xxx-26c4aa3ea27e41709e31d7e2275182df-vp: https://purls.helmholtz-metadaten.de/vp/kitmtxx-41732562-vp/sem_ses_xxx-75349c79f6be496cbe9631a2acd32562-vp
scope note: subprocess
scope note: record

Application
type: Concept
definition: Application for the cross section cutting step
in scheme: kitmtxxls Tribology Lab at KIT
scope note: string

Debedding Summary
type: Concept
definition: Describes the process of debedding.
in scheme: kitmtxxls Tribology Lab at KIT
scope note: dictionary

Right
type: Concept
definition: n/a
in scheme: kitmtxxls Tribology Lab at KIT
scope note: option

Esprit
type: Concept
definition: n/a
in scheme: kitmtxxls Tribology Lab at KIT
scope note: option

Minimum Duration
type: Concept
definition: Instances of this class characterize the minimum permissible duration for a process maintained by a machine.
in scheme: kitmtxxls Tribology Lab at KIT
scope note: float
scope note: s, min, h

Relative Height at Track Relative Negative End
type: Concept
definition: The relative height measured for example by the stage at the relative negative track end.
in scheme: kitmtxxls Tribology Lab at KIT
scope note: float
scope note: µm, nm, mm, m, cm

USB-6002
type: Concept
definition: 8 AI (16-Bit, 50 kS/s), 2 AO (5 kS/s per Channel), 13 DIO USB Multifunction I/O Device—The USB‑6002 is a cost-effective multifunction data acquisition device.
in scheme: kitmtxxls Tribology Lab at KIT
scope note: option

Surrounding Medium Control Method
type: Concept
definition: Object of this class state what type of method was used to control the susrrounding medium.
in scheme: kitmtxxls Tribology Lab at KIT
scope note: string

Pre-test Unloaded Relaxed Zero Offset Load
type: Concept
definition: The force of the normal force sensor immediately after preloading the stage.
in scheme: kitmtxxls Tribology Lab at KIT
scope note: float

isSimilarTo
type: Concept
definition: The property skos:relatedMatch is used to state an associative mapping link between two concepts. The SKOS mapping properties are skos:closeMatch, skos:exactMatch, skos:broadMatch, skos:narrowMatch and skos:relatedMatch. These properties are used to state mapping (alignment) links between SKOS concepts in different concept schemes, where the links are inherent in the meaning of the linked concepts.
in scheme: kitmtxxls Tribology Lab at KIT
scope note: none
scope note: relationship_type

gf
type: Concept
definition: gram force
in scheme: kitmtxxls Tribology Lab at KIT
scope note: option

DAQ AI Factor
type: Concept
definition: DAQ Analog Input proportionality factor.
in scheme: kitmtxxls Tribology Lab at KIT
scope note: float

Target Controlled Humidity
type: Concept
definition: The humidity setpoint for the climate inside the climate box.
in scheme: kitmtxxls Tribology Lab at KIT
scope note: float
scope note: %

Space Height
type: Concept
definition: The maximum height inside the chamber of a piece of equipment.
in scheme: kitmtxxls Tribology Lab at KIT
scope note: float
scope note: µm, nm, mm, m, cm

Windows XP
type: Concept
definition: Windows XP is an operating system that was first released on October 25, 2001, by Microsoft and designed to help bridge the gap between Windows 9x/ME and Windows NT/2000. The Windows XP upgrade was available for Windows 98, ME, and 2000 users. The two primary versions of Windows XP are Windows XP Home Edition and Windows XP Professional.
in scheme: kitmtxxls Tribology Lab at KIT
scope note: option

Fraunhofer IWM
type: Concept
definition: Fraunhofer Institute for Mechanics of kitmtxxls IWM
in scheme: kitmtxxls Tribology Lab at KIT
scope note: option

Heat Treatment Goal
type: Concept
definition: Instances of this class specify the classification goal of heat treatment.
in scheme: kitmtxxls Tribology Lab at KIT
scope note: string

Lens
type: Concept
definition: n/a
in scheme: kitmtxxls Tribology Lab at KIT
scope note: option

Measure Load Cell Displacement - Respectively the Normal Force
type: Concept
definition: n/a
in scheme: kitmtxxls Tribology Lab at KIT
scope note: option

Available Hardness Testing Lenses Array
type: Concept
definition: Class containing information about the available hardness testing lenses of a hardness testing system.
in scheme: kitmtxxls Tribology Lab at KIT
scope note: dictionary

Axis Rotation Angle Range
type: Concept
definition: Describes the range of rotation of the given axis.
in scheme: kitmtxxls Tribology Lab at KIT
scope note: float
scope note: °

Institution (Location)
type: Concept
definition: The premises on which an object exists or a process happens. *Not to be confused with an institution as an organization, or as an employer.
in scheme: kitmtxxls Tribology Lab at KIT
scope note: string

Clamping Method
type: Concept
definition: Way of of clamping of a physical object.
in scheme: kitmtxxls Tribology Lab at KIT
scope note: string

Working Frequency
type: Concept
definition: Instances of this class quantify the frequency in a process that a machine supports.
in scheme: kitmtxxls Tribology Lab at KIT
scope note: float
scope note: min^(-1), kHz, Hz

Sequential Order Position
type: Concept
definition: The physical quantity that places an object in a specific position within a sequential order.
in scheme: kitmtxxls Tribology Lab at KIT
scope note: integer

Demagnetizing Plate
type: Concept
definition: Objects of this class pertain to the category of machines called demagnetizing plate.
in scheme: kitmtxxls Tribology Lab at KIT
scope note: https://purls.helmholtz-metadaten.de/vp/kitmtxx-41732562-vp/ism_xxx_xxx-cd4f36f6200648d294054682584c8e2b-vp: https://purls.helmholtz-metadaten.de/vp/kitmtxx-41732562-vp/dem_pla_xxx-c4882064ea124afab8aae0b78eeae19c-vp
scope note: equipment
scope note: record

Z-direction Measurement Range
type: Concept
definition: Instances of this class represent the maximum range of values in z-direction (vertical) that the system can capture in one acquisition process/one measurement.
in scheme: kitmtxxls Tribology Lab at KIT
scope note: float
scope note: µm, nm, mm, m, cm

Cleaning Steps Array
type: Concept
definition: Class containing the ordered list of sequential steps, in terms of parameters, specific to the process.
in scheme: kitmtxxls Tribology Lab at KIT
scope note: sub-workflow

Abrasive Particles kitmtxxl
type: Concept
definition: The name of the material of the abrasive particles.
in scheme: kitmtxxls Tribology Lab at KIT
scope note: string

Cutting Direction
type: Concept
definition: Direction in which the saw cuts the specimen
in scheme: kitmtxxls Tribology Lab at KIT
scope note: string

Back
type: Concept
definition: n/a
in scheme: kitmtxxls Tribology Lab at KIT
scope note: option

Phosphoric Acid
type: Concept
definition: A phosphorus oxoacid that consists of one oxo and three hydroxy groups joined covalently to a central phosphorus atom.
in scheme: kitmtxxls Tribology Lab at KIT
scope note: option

Surface Imaging Summary
type: Concept
definition: Contains multiple types of information related to the surface imaging.
in scheme: kitmtxxls Tribology Lab at KIT
scope note: detached
scope note: dictionary

Warm Air Jet
type: Concept
definition: n/a
in scheme: kitmtxxls Tribology Lab at KIT
scope note: option

Cap on Bolt
type: Concept
definition: A cap that compresses the specimen around its periphery while being tightened on the end of a threaded rod, in turn attached to equipment.
in scheme: kitmtxxls Tribology Lab at KIT
scope note: option

Time of Last Self Calibration
type: Concept
definition: Instances of this class contain information about the time when an electronic equipment was self calibrated last (e.g. DAQ Board).
in scheme: kitmtxxls Tribology Lab at KIT
scope note: date

Pt e-dep surface
type: Concept
definition: n/a
in scheme: kitmtxxls Tribology Lab at KIT
scope note: option

Electropolishing Area
type: Concept
definition: The size of the electropolished area of the sample.
in scheme: kitmtxxls Tribology Lab at KIT
scope note: float
scope note: mm^2, cm^2

Transverse Subsystem
type: Concept
definition: Class containing information about the technical specifications of a tactile profilometer transverse system.
in scheme: kitmtxxls Tribology Lab at KIT
scope note: dictionary

Distilled Water
type: Concept
definition: Distilled water is water that has been purified using a method called distillation, in which pure H2O is separated from its contaminants.
in scheme: kitmtxxls Tribology Lab at KIT
scope note: option

physicallyResultsIn
type: Concept
definition: This rekationship relates a scientific process to the objects which are physically established as its result. It can also mean it is a combination/separation of other objects, or their subparts. This property relates the process to the child object.
in scheme: kitmtxxls Tribology Lab at KIT
scope note: none
scope note: relationship_type

ml
type: Concept
definition: n/a
in scheme: kitmtxxls Tribology Lab at KIT
scope note: option

File MD5 Checksum
type: Concept
definition: The file's MD5 Checksum used to identify the exact file regardless of database.
in scheme: kitmtxxls Tribology Lab at KIT
scope note: string

Temperature Climate
type: Concept
definition: n/a
in scheme: kitmtxxls Tribology Lab at KIT
scope note: option

Air Dry
type: Concept
definition: n/a
in scheme: kitmtxxls Tribology Lab at KIT
scope note: option

queriesPositionOfFeatureFromProcess
type: Concept
definition: Denotes that a given process relies on the position of a notable feature on a specimen to conduct a measurement or procedure. The position of the feature can be, indirectly, part of the data or metadata of the parent digital object.
in scheme: kitmtxxls Tribology Lab at KIT
scope note: none
scope note: relationship_type

Spark Out Table Rotations
type: Concept
definition: Instances of this class characterize the spark out time given in number of table rotations.
in scheme: kitmtxxls Tribology Lab at KIT
scope note: float

002
type: Concept
definition: n/a
in scheme: kitmtxxls Tribology Lab at KIT
scope note: option

Measure ultrasonic
type: Concept
definition: An ultrasonic device operates by combining the creation of a pulse, or series of pulses of sound by measuring the return of those pulses from the target back to the device.
in scheme: kitmtxxls Tribology Lab at KIT
scope note: option

Building
type: Concept
definition: The "unique identifier" of the building within the specific institution.
in scheme: kitmtxxls Tribology Lab at KIT
scope note: string

Version Controlled Repository
type: Concept
definition: Link to a version controlled repository for software and data, e.g. GitLab.com..
in scheme: kitmtxxls Tribology Lab at KIT
scope note: https://purls.helmholtz-metadaten.de/vp/kitmtxx-41732562-vp/isr_xxx_xxx-14ceeb9f5e964ebbbfd7fd93e0e9aef2-vp: https://purls.helmholtz-metadaten.de/vp/kitmtxx-41732562-vp/sof_url_xxx-db86294005d048dd80bea3e6e4a19c2c-vp
scope note: string

Decimal Separator
type: Concept
definition: Instances of this class specify the decimal separator used in a file.
in scheme: kitmtxxls Tribology Lab at KIT
scope note: string

Carbolite Gero GmbH & Co. KG
type: Concept
definition: Neuhausen, Germany
in scheme: kitmtxxls Tribology Lab at KIT
scope note: option

Rinsed with Water
type: Concept
definition: Contains information on whether the sample was rinsed with water after the electropolishing process.
in scheme: kitmtxxls Tribology Lab at KIT
scope note: boolean

2.62
type: Concept
definition: n/a
in scheme: kitmtxxls Tribology Lab at KIT
scope note: option

211-15/16
type: Concept
definition: n/a
in scheme: kitmtxxls Tribology Lab at KIT
scope note: option

Multi Charge Amplifier Type 5019A
type: Concept
definition: n/a
in scheme: kitmtxxls Tribology Lab at KIT
scope note: option

Bachelor's Thesis
type: Concept
definition: n/a
in scheme: kitmtxxls Tribology Lab at KIT
scope note: option

OPTIMUS TKD
type: Concept
definition: OPTIMUS™ TKD detector head was specifically designed for best sample-detector geometry for on-axis Transmission Kikuchi Diffraction analysis (TKD) in SEM
in scheme: kitmtxxls Tribology Lab at KIT
scope note: option

System or Setup Inputs (Tactile Surface Profilometry)
type: Concept
definition: Class containing information about the parameters that are put into the involved scientific equipment to run it optimally.
in scheme: kitmtxxls Tribology Lab at KIT
scope note: dictionary

isSameAs
type: Concept
definition: A skos:exactMatch link indicates a high degree of confidence that two concepts can be used interchangeably across a wide range of information retrieval applications.
in scheme: kitmtxxls Tribology Lab at KIT
scope note: none
scope note: relationship_type

Fine Vertical Travel Resolution
type: Concept
definition: The resolution of the precise/fine/slow vertical drive of the machine's column (the step size of this drive).
in scheme: kitmtxxls Tribology Lab at KIT
scope note: float
scope note: µm, nm, mm, m, cm

Acoustic Emissions Sensor 1 FFT Channels (Measured)
type: Concept
definition: Those channels contain the FFT data of the sensor 1 raw signal.
in scheme: kitmtxxls Tribology Lab at KIT
scope note: option

Cup Grinding Tool ID
type: Concept
definition: Instances of this class specify the model of cup grinding tool.
in scheme: kitmtxxls Tribology Lab at KIT
scope note: string

Number of Procedure Repeats
type: Concept
definition: Instances of this class represent the total number of a particular repeated action.
in scheme: kitmtxxls Tribology Lab at KIT
scope note: integer

Number of Columns
type: Concept
definition: Denotes the total number of columns in the tabular data file.
in scheme: kitmtxxls Tribology Lab at KIT
scope note: integer

Nominally Known kitmtxxl Information
type: Concept
definition: Class containing information about the material details of a block specimen. These pieces of information are either reported (and assumed true) by the vendor, or are of general knowledge, but have not specifically been measured by a FAIR'ly described process.
in scheme: kitmtxxls Tribology Lab at KIT
scope note: dictionary

Diamond 5 µm 90°
type: Concept
definition: n/a
in scheme: kitmtxxls Tribology Lab at KIT
scope note: option

Available Hardness Testing Cameras Array
type: Concept
definition: Class containing information about the available hardness testing cameras of a hardness testing system.
in scheme: kitmtxxls Tribology Lab at KIT
scope note: dictionary

Differential
type: Concept
definition: The differential is a device that splits the engine torque two ways, allowing each output to spin at a different speed.
in scheme: kitmtxxls Tribology Lab at KIT
scope note: option

Test Program (Set of Operating Points)
type: Concept
definition: n/a
in scheme: kitmtxxls Tribology Lab at KIT
scope note: option

Stroke Amplitude of the Motor Current (Measured)
type: Concept
definition: Amplitude of the electrical current through the oscillation drive.
in scheme: kitmtxxls Tribology Lab at KIT
scope note: option

queriesPositionOfWearTrackFromProcess
type: Concept
definition: Denotes that a given process relies on the position of the wear track on a specimen to conduct a measurement or procedure. The position of the wear track is part of the metadata of the parent digital object.
in scheme: kitmtxxls Tribology Lab at KIT
scope note: none
scope note: relationship_type

Interface Temperature Control Type
type: Concept
definition: The general concept of Interface Temperature, which does not prescribe anything in specific - this is not the controlled or measured interface temperature.
in scheme: kitmtxxls Tribology Lab at KIT
scope note: string

Dimensions Information
type: Concept
definition: Class containing information about the spatial dimensions of a block specimen.
in scheme: kitmtxxls Tribology Lab at KIT
scope note: dictionary

Windows 10
type: Concept
definition: Windows 10 follows Windows 8.
in scheme: kitmtxxls Tribology Lab at KIT
scope note: option

FEI Company
type: Concept
definition: FEI Company, Hillsboro, OR, USA
in scheme: kitmtxxls Tribology Lab at KIT
scope note: option

CBS detector
type: Concept
definition: Circular backscattered electron detector
in scheme: kitmtxxls Tribology Lab at KIT
scope note: option

Motion Inducing Subsystems Attributes
type: Concept
definition: Class containing attributes about the installed subsystems responsible for making parts move in the tribometer.
in scheme: kitmtxxls Tribology Lab at KIT
scope note: dictionary

Measurement Direction
type: Concept
definition: Instances of this class characterize the measurement direction as defined by the equipment specifications.
in scheme: kitmtxxls Tribology Lab at KIT
scope note: integer

Tabular Data Contents Specifications
type: Concept
definition: Contains the information about the content of tabular data file (what information is stored and how to interpret it).
in scheme: kitmtxxls Tribology Lab at KIT
scope note: dictionary

Coolant Supply Method
type: Concept
definition: Method to supply the coolant.
in scheme: kitmtxxls Tribology Lab at KIT
scope note: string

Electron Beam e-
type: Concept
definition: A beam which consists of electrons.
in scheme: kitmtxxls Tribology Lab at KIT
scope note: option

Preparation Procedure
type: Concept
definition: Procedure conducted in sample preparation for electron microscopy.
in scheme: kitmtxxls Tribology Lab at KIT
scope note: string

Ran Preprogrammed Cleaning Procedure
type: Concept
definition: Denotes whether the machine was cleaned using the preprogrammed cleaning procedure.
in scheme: kitmtxxls Tribology Lab at KIT
scope note: boolean

half-automatic (single pressure)
type: Concept
definition: n/a
in scheme: kitmtxxls Tribology Lab at KIT
scope note: option

FFF-Printing
type: Concept
definition: Class representing the additive manufacturing process of printing with a FFF-printer.
in scheme: kitmtxxls Tribology Lab at KIT
scope note: https://purls.helmholtz-metadaten.de/vp/kitmtxx-41732562-vp/tak_xxx_xxx-ca48d075c7de4872b4f12e464652bcb1-vp: https://purls.helmholtz-metadaten.de/vp/kitmtxx-41732562-vp/too_gen_xxx-8d2c6b16030c465f97af9a7eed1ba400-vp
scope note: https://purls.helmholtz-metadaten.de/vp/kitmtxx-41732562-vp/emp_xxx_xxx-b0c09f9f6cd948839bac12aa4a2ad55d-vp: https://purls.helmholtz-metadaten.de/vp/kitmtxx-41732562-vp/fff_xxx_xxx-6ab1d49a0e5d439b946eeb97e700c23d-vp
scope note: https://purls.helmholtz-metadaten.de/vp/kitmtxx-41732562-vp/phy_xxx_xxx-9da2eadd1cba429c8381945b334fe39c-vp: https://purls.helmholtz-metadaten.de/vp/kitmtxx-41732562-vp/blo_spe_xxx-ae137cec891644ec9e9d131be42ef67c-vp
scope note: process
scope note: record

DC Motor with a Preloaded Precision Leadscrew
type: Concept
definition: A lead screw is a kind of mechanical linear actuator that converts rotational motion into linear motion.
in scheme: kitmtxxls Tribology Lab at KIT
scope note: option

Working Area Width
type: Concept
definition: Instances of this class specify the available width of the area for manipulation within a machine.
in scheme: kitmtxxls Tribology Lab at KIT
scope note: float
scope note: µm, nm, mm, m, cm

Gluing Specimen onto FIB Stub with Silver Glue
type: Concept
definition: n/a
in scheme: kitmtxxls Tribology Lab at KIT
scope note: option

Clamping Area Length
type: Concept
definition: The maximum permissable length of specimen to be held.
in scheme: kitmtxxls Tribology Lab at KIT
scope note: float
scope note: µm, nm, mm, m, cm

Motion Direction Flag (Measured)
type: Concept
definition: A 0/1 value which indicated the direction of tribological contact motion. Interpretation unknown. Used in: Optimol SRV5
in scheme: kitmtxxls Tribology Lab at KIT
scope note: option

Relative Transverse Position
type: Concept
definition: Position on the specimen orthogonal to sliding direction
in scheme: kitmtxxls Tribology Lab at KIT
scope note: float
scope note: µm, nm, mm, m, cm

Reduce Waviness
type: Concept
definition: Get a flat surface. Done with a coarse grinding tool typically.
in scheme: kitmtxxls Tribology Lab at KIT
scope note: option

Duration Setpoint
type: Concept
definition: The duration setting assigned to be maintained by the machine in a specific process.
in scheme: kitmtxxls Tribology Lab at KIT
scope note: float
scope note: s, min, h

Wire Grit Size
type: Concept
definition: Average diameter of the abrasive particles on the wire.
in scheme: kitmtxxls Tribology Lab at KIT
scope note: float
scope note: µm, nm, mm, m, cm

Sensor Calibration Values
type: Concept
definition: Sensor calibration is an adjustment or set of adjustments performed on a sensor or instrument to make that instrument function as accurately, or error free, as possible.
in scheme: kitmtxxls Tribology Lab at KIT
scope note: option

M-403.2PD
type: Concept
definition: X/Linear Stage
in scheme: kitmtxxls Tribology Lab at KIT
scope note: option

Spark Out Time
type: Concept
definition: Instances of this class characterize the time the machine is allowed to spark out after the last feed, i.e. grind with low pressure.
in scheme: kitmtxxls Tribology Lab at KIT
scope note: float
scope note: s, min, h

Character
type: Concept
definition: n/a
in scheme: kitmtxxls Tribology Lab at KIT
scope note: option

Maximum Specimen Dimensions
type: Concept
definition: Describes the maximum permissible dimensions of the specimen in the machine.
in scheme: kitmtxxls Tribology Lab at KIT
scope note: dictionary

Pour Point
type: Concept
definition: Object's Pour Point.
in scheme: kitmtxxls Tribology Lab at KIT
scope note: float
scope note: K, °C

Spark Out Rotary Speed
type: Concept
definition: Instances of this class characterize the specimen positioning system rotary speed during spark out phase. Only needed if the value is different from the value for key 'Workpiece positioning system rotary speed'.
in scheme: kitmtxxls Tribology Lab at KIT
scope note: float
scope note: min^(-1)

Capacitive Sensing
type: Concept
definition: Capacitive sensing is a technology based on capacitive coupling that takes the capacitance produced by the human body as the input. It allows a more reliable solution for applications to measure liquid levels, material composition, mechanical buttons, and human-to-machine interfaces.
in scheme: kitmtxxls Tribology Lab at KIT
scope note: option

Floating-Point Number
type: Concept
definition: A floating point number, is a positive or negative whole number with a decimal point.
in scheme: kitmtxxls Tribology Lab at KIT
scope note: option

Rinsing
type: Concept
definition: The process of rinsing the sample's surface with a jet of liquid medium.
in scheme: kitmtxxls Tribology Lab at KIT
scope note: option

S3.04
type: Concept
definition: -
in scheme: kitmtxxls Tribology Lab at KIT
scope note: option

General Info (External Process)
type: Concept
definition: Objects of this class contain information that describes known information about a process external to the research insitution.
in scheme: kitmtxxls Tribology Lab at KIT
scope note: dictionary

Space Diameter
type: Concept
definition: The maximum diameter inside the chamber of a piece of equipment.
in scheme: kitmtxxls Tribology Lab at KIT
scope note: float
scope note: µm, nm, mm, m, cm

standard_deviation_of_wear_track_depth
type: Concept
definition: Standard deviation of depth of the wear track at its deepest spot measured from the profile.
in scheme: kitmtxxls Tribology Lab at KIT
scope note: float
scope note: nm, µm, mm, m

Scanning Tip Specifications
type: Concept
definition: Class containing information about the parameters that identify the scanning tip and its use in the profilometry measurement.
in scheme: kitmtxxls Tribology Lab at KIT
scope note: dictionary

Beams Information
type: Concept
definition: Contains information about the beams available in the machine.
in scheme: kitmtxxls Tribology Lab at KIT
scope note: dictionary

2.4
type: Concept
definition: n/a
in scheme: kitmtxxls Tribology Lab at KIT
scope note: option

Technical Specifications (Tribometer)
type: Concept
definition: Class containing information about the technical Specifications of a Tribometer
in scheme: kitmtxxls Tribology Lab at KIT
scope note: dictionary

Summary About Experiment
type: Concept
definition: Contains key-value pairs of summary data about an experiment.
in scheme: kitmtxxls Tribology Lab at KIT
scope note: option

Working Distance
type: Concept
definition: Denotes the distance from the front of the lens to the focal plane.
in scheme: kitmtxxls Tribology Lab at KIT
scope note: float
scope note: µm, nm, mm, m, cm

Technical Specifications (Laser Processing System)
type: Concept
definition: Term containing information about the technical specifications of a laser processing system.
in scheme: kitmtxxls Tribology Lab at KIT
scope note: dictionary

File Name
type: Concept
definition: Denotes the name of a given file.
in scheme: kitmtxxls Tribology Lab at KIT
scope note: string

Block Specimen
type: Concept
definition: Objects of this class contain a self-bound collection of mass bearing particles.
in scheme: kitmtxxls Tribology Lab at KIT
scope note: https://purls.helmholtz-metadaten.de/vp/kitmtxx-41732562-vp/ori_xxx_xxx-a308af15cef14d8096b3a61ad8a2701d-vp: https://purls.helmholtz-metadaten.de/vp/kitmtxx-41732562-vp/blo_spe_xxx-ae137cec891644ec9e9d131be42ef67c-vp
scope note: specimen
scope note: record

STEM Lamella
type: Concept
definition: Cutting a STEM lamella which will be lifted out as new specimen.
in scheme: kitmtxxls Tribology Lab at KIT
scope note: option

Initial Amount of Interfacial Medium
type: Concept
definition: The initial amount of interfacial medium supplied to a process.
in scheme: kitmtxxls Tribology Lab at KIT
scope note: float
scope note: ml, l

Relative Starting Position Setpoint
type: Concept
definition: n/a
in scheme: kitmtxxls Tribology Lab at KIT
scope note: float
scope note: µm, nm, mm, m, cm

Measure Forces and Moments
type: Concept
definition: n/a
in scheme: kitmtxxls Tribology Lab at KIT
scope note: option

Technical Specifications (Precision Scale)
type: Concept
definition: Class containing information about the technical specifications of a precision scale.
in scheme: kitmtxxls Tribology Lab at KIT
scope note: dictionary

m*s^(-1)
type: Concept
definition: 1ms−1=1m/s is one meter per second. That's the same thing as 3.6 km/h and again the same thing as roughly 2.24 mph.
in scheme: kitmtxxls Tribology Lab at KIT
scope note: option

SEM or FIB Pattern Dimensions
type: Concept
definition: Dimensions of the specified box.
in scheme: kitmtxxls Tribology Lab at KIT
scope note: dictionary

Hardening
type: Concept
definition: A process to increase hardness of a metal. Typically done by heating to a certain temperature and subsequent quenching.
in scheme: kitmtxxls Tribology Lab at KIT
scope note: option

Principle of Vapor Generation
type: Concept
definition: Principle of Vapor Generation
in scheme: kitmtxxls Tribology Lab at KIT
scope note: string

Strapping Specimen with Copper Tape
type: Concept
definition: n/a
in scheme: kitmtxxls Tribology Lab at KIT
scope note: option

kitmtxxl Name
type: Concept
definition: The type of material and the way it is referred to. The friendly way to identify it.
in scheme: kitmtxxls Tribology Lab at KIT
scope note: string

Maximum Horizontal Field Width
type: Concept
definition: The maximum HFW of the beam.
in scheme: kitmtxxls Tribology Lab at KIT
scope note: float
scope note: µm, nm, mm, m, cm

µm*V^(-1)
type: Concept
definition: n/a
in scheme: kitmtxxls Tribology Lab at KIT
scope note: option

Technical Specifications (Demagnetizing Plate)
type: Concept
definition: Class containing information about the technical specifications of a demagnetizing plate.
in scheme: kitmtxxls Tribology Lab at KIT
scope note: dictionary

9.7
type: Concept
definition: n/a
in scheme: kitmtxxls Tribology Lab at KIT
scope note: option

Commercial Machining
type: Concept
definition: Class representing the physical process of machining a block of material for eventual use in scientific processes or equipment. The exact process is unknown, but it is performed by a firm that is external to the scientific institution.
in scheme: kitmtxxls Tribology Lab at KIT
scope note: https://purls.helmholtz-metadaten.de/vp/kitmtxx-41732562-vp/phy_xxx_xxx-9da2eadd1cba429c8381945b334fe39c-vp: https://purls.helmholtz-metadaten.de/vp/kitmtxx-41732562-vp/blo_spe_xxx-ae137cec891644ec9e9d131be42ef67c-vp
scope note: https://purls.helmholtz-metadaten.de/vp/kitmtxx-41732562-vp/phy_xxx_xxx-3c41e6aa10d14a51b0c7a950b897fbba-vp: https://purls.helmholtz-metadaten.de/vp/kitmtxx-41732562-vp/blo_spe_xxx-ae137cec891644ec9e9d131be42ef67c-vp
scope note: process
scope note: record

Inductive Sensing
type: Concept
definition: Inductive sensing is based on the principle of electromagnetic coupling, between a coil and the target.
in scheme: kitmtxxls Tribology Lab at KIT
scope note: option

Model 4240
type: Concept
definition: n/a
in scheme: kitmtxxls Tribology Lab at KIT
scope note: option

Base Body Tilt
type: Concept
definition: n/a
in scheme: kitmtxxls Tribology Lab at KIT
scope note: option

Cleaning Step
type: Concept
definition: n/a
in scheme: kitmtxxls Tribology Lab at KIT
scope note: detached
scope note: option

Power Supply Wattage
type: Concept
definition: The physical quantity that characterizes the power conversion capability of a power supply
in scheme: kitmtxxls Tribology Lab at KIT
scope note: float

Duty Cycle
type: Concept
definition: Instances of this class characterize the duty cycle of the plate.
in scheme: kitmtxxls Tribology Lab at KIT
scope note: float
scope note: %

LectroPol5
type: Concept
definition: The LectroPol-5 is designed for automated electrolytic polishing and etching of metallographic specimens.
in scheme: kitmtxxls Tribology Lab at KIT
scope note: option

Duration of Experiment Setpoint
type: Concept
definition: If the experiment's duration is limited by time.
in scheme: kitmtxxls Tribology Lab at KIT
scope note: float
scope note: s, min, h

MATLAB
type: Concept
definition: MATLAB is a programming and numeric computing platform to analyze data, develop algorithms, and create models.
in scheme: kitmtxxls Tribology Lab at KIT
scope note: option

Aral Multrol G 100
type: Concept
definition: Aral Multrol G 100 is a water-mixable coolant that fully synthetic, chlorine- and nitrite-free, boron- and amine-containing, transparent, low-foaming grinding material that can be mixed with water.
in scheme: kitmtxxls Tribology Lab at KIT
scope note: option

Load
type: Concept
definition: n/a
in scheme: kitmtxxls Tribology Lab at KIT
scope note: option

Motion Speed Setpoint
type: Concept
definition: Instances of this class characterize the relative motion of an object. For Demagnetizing: The (estimated) speed of the demagnetizing motion. Sometimes is given as seconds per demagnetizing motion.
in scheme: kitmtxxls Tribology Lab at KIT
scope note: float
scope note: µm*s^(-1), mm*s^(-1), m*s^(-1), km*h^(-1)

Kinematic Viscosity Acquisition Temperature
type: Concept
definition: The specification of an object defining its kinematic viscosity acquisition temperature.
in scheme: kitmtxxls Tribology Lab at KIT
scope note: float
scope note: K, °C

012
type: Concept
definition: n/a
in scheme: kitmtxxls Tribology Lab at KIT
scope note: option

Label
type: Concept
definition: n/a
in scheme: kitmtxxls Tribology Lab at KIT
scope note: option

Stone Table with Passive Pneumatic Dampers
type: Concept
definition: n/a
in scheme: kitmtxxls Tribology Lab at KIT
scope note: option

Point Contact
type: Concept
definition: The type of contact that forms when a convex spherical (or aspherical) curved object is pressed against a flat surface or another convex shaped object.
in scheme: kitmtxxls Tribology Lab at KIT
scope note: option

goodness_of_tilt
type: Concept
definition: The R^2 of the plane fit to the unworn region.
in scheme: kitmtxxls Tribology Lab at KIT
scope note: float

wear_track_width
type: Concept
definition: Width of the wear track measured in light or electron microscopy as mean width perpendicular to sliding direction
in scheme: kitmtxxls Tribology Lab at KIT
scope note: float
scope note: nm, µm, mm, m

Cross Section
type: Concept
definition: Cutting a cross section to analyze the subsurface mcirostructure.
in scheme: kitmtxxls Tribology Lab at KIT
scope note: option

Cup Grinding Steps Array
type: Concept
definition: Class containing the ordered list of sequential steps, in terms of parameters, specific to the process.
in scheme: kitmtxxls Tribology Lab at KIT
scope note: sub-workflow

Dead Weight(s)
type: Concept
definition: Weights positioned on top of a flexible construction with the aim of maintaining contant load regardless of height.
in scheme: kitmtxxls Tribology Lab at KIT
scope note: option

l
type: Concept
definition: n/a
in scheme: kitmtxxls Tribology Lab at KIT
scope note: option

Software
type: Concept
definition: Class representing a software developed for research processes.
in scheme: kitmtxxls Tribology Lab at KIT
scope note: software
scope note: record

Weighing
type: Concept
definition: The process of weighing a specimen.
in scheme: kitmtxxls Tribology Lab at KIT
scope note: https://purls.helmholtz-metadaten.de/vp/kitmtxx-41732562-vp/emp_xxx_xxx-b0c09f9f6cd948839bac12aa4a2ad55d-vp: https://purls.helmholtz-metadaten.de/vp/kitmtxx-41732562-vp/pre_sca_xxx-ceedd099da754c79bcb9c002a1daa545-vp
scope note: https://purls.helmholtz-metadaten.de/vp/kitmtxx-41732562-vp/cha_xxx_xxx-5b70f2376c68474381ef5cc428fe240b-vp: https://purls.helmholtz-metadaten.de/vp/kitmtxx-41732562-vp/blo_spe_xxx-ae137cec891644ec9e9d131be42ef67c-vp
scope note: process
scope note: record

Polishing Machine
type: Concept
definition: Objects of this class pertain to the category of machines called polishing machine.
in scheme: kitmtxxls Tribology Lab at KIT
scope note: https://purls.helmholtz-metadaten.de/vp/kitmtxx-41732562-vp/ism_xxx_xxx-cd4f36f6200648d294054682584c8e2b-vp: https://purls.helmholtz-metadaten.de/vp/kitmtxx-41732562-vp/pol_mac_xxx-20c35bf0b41948689b5bae72ab59bdb4-vp
scope note: equipment
scope note: record

Height (Measured)
type: Concept
definition: The height of a position in the range of scanning.
in scheme: kitmtxxls Tribology Lab at KIT
scope note: option

Base Body Clamping Method
type: Concept
definition: Way of clamping of a physical object with the role of being a base body (specimen) in a tribometer.
in scheme: kitmtxxls Tribology Lab at KIT
scope note: string

Angular Offset Between Profiles
type: Concept
definition: Instances of this class characterize the measurement offset in radial-direction when multiple profiles from the same sample are taken.
in scheme: kitmtxxls Tribology Lab at KIT
scope note: float
scope note: °

Hardness Tester
type: Concept
definition: Objects of this class pertain to the category of machines called hardness tester.
in scheme: kitmtxxls Tribology Lab at KIT
scope note: https://purls.helmholtz-metadaten.de/vp/kitmtxx-41732562-vp/ism_xxx_xxx-cd4f36f6200648d294054682584c8e2b-vp: https://purls.helmholtz-metadaten.de/vp/kitmtxx-41732562-vp/har_tes_xxx-d1fe762442144018958df899aaffe37d-vp
scope note: equipment
scope note: record

Double-sided Tape
type: Concept
definition: Double-sided tape secures the specimen's bottom surface to the equipment's structure.
in scheme: kitmtxxls Tribology Lab at KIT
scope note: option

Beam Used
type: Concept
definition: The type of beam used in the process.
in scheme: kitmtxxls Tribology Lab at KIT
scope note: string

Solvent
type: Concept
definition: Solvents, which are generally in liquid form, are used to dissolve, suspend or extract other materials, usually without chemically changing either the solvents or the other materials.
in scheme: kitmtxxls Tribology Lab at KIT
scope note: option

S2.05
type: Concept
definition: n/a
in scheme: kitmtxxls Tribology Lab at KIT
scope note: option

Vacuum
type: Concept
definition: The end of a vacuum line is directly attached to specimen's surface to keep it attached to a piece of equipment.
in scheme: kitmtxxls Tribology Lab at KIT
scope note: option

*.csv File Technical Specifications
type: Concept
definition: Instances of this class contain the information to open/access/read and interprete a *.csv file's contents adequately.
in scheme: kitmtxxls Tribology Lab at KIT
scope note: dictionary

De-Ionized Water
type: Concept
definition: Deionized water is a form of pure, clean water purified by removing atoms, ions, and molecules from tap water through an ion exchange process.
in scheme: kitmtxxls Tribology Lab at KIT
scope note: option

Linear Unidirectional
type: Concept
definition: n/a
in scheme: kitmtxxls Tribology Lab at KIT
scope note: option

Institute
type: Concept
definition: The official name of the institute which the responsible person/operator belongs to.
in scheme: kitmtxxls Tribology Lab at KIT
scope note: string

Metal
type: Concept
definition: Metals are opaque, lustrous elements that are good conductors of heat and electricity. Most metals are malleable and ductile and are, in general, denser than the other elemental substances.
in scheme: kitmtxxls Tribology Lab at KIT
scope note: option

EBSD detector
type: Concept
definition: Electron backscattered diffraction pattern detector
in scheme: kitmtxxls Tribology Lab at KIT
scope note: option

Generic Matrix
type: Concept
definition: A 2-dimensional tabular data type. A more generic version of 'Spreadsheet'.
in scheme: kitmtxxls Tribology Lab at KIT
scope note: option

Final Roughness Adjustment - Finish
type: Concept
definition: The surface finish — minimal removal of waviness and generation of desired level of roughness.
in scheme: kitmtxxls Tribology Lab at KIT
scope note: option

Target Unit of Conversion
type: Concept
definition: Instances of this class lock the meaning of a magnitude. Their purpose is to indicate the conversion target.
in scheme: kitmtxxls Tribology Lab at KIT
scope note: string

ATM GmbH
type: Concept
definition: ATM GmbH, Mammelzen, Germany
in scheme: kitmtxxls Tribology Lab at KIT
scope note: option

Summary of Tribological and Topographical Data About a Wear Track
type: Concept
definition: n/a
in scheme: kitmtxxls Tribology Lab at KIT
scope note: option

HiWi
type: Concept
definition: Hiwi stands for "Hilfswissenschaftler" (research assistant) and is used for student jobs in research or teaching offered by the university's departments or department chairs.
in scheme: kitmtxxls Tribology Lab at KIT
scope note: option

Sliding
type: Concept
definition: n/a
in scheme: kitmtxxls Tribology Lab at KIT
scope note: option

Diameter
type: Concept
definition: The specification of a preferencially curved object defining its diameter.
in scheme: kitmtxxls Tribology Lab at KIT
scope note: float
scope note: µm, nm, mm, m, cm

Motion Type
type: Concept
definition: Instances of this class give the type of relative motion between base body and counter body.
in scheme: kitmtxxls Tribology Lab at KIT
scope note: string

Technical Specifications (Light Microscope)
type: Concept
definition: Term containing information about the technical specifications of a light microscope.
in scheme: kitmtxxls Tribology Lab at KIT
scope note: dictionary

Total Elapsed Time
type: Concept
definition: Instances of this class represent the total elapsed time between the beginning and the end of an experiment.
in scheme: kitmtxxls Tribology Lab at KIT
scope note: float
scope note: s, min, h

S3.05
type: Concept
definition: n/a
in scheme: kitmtxxls Tribology Lab at KIT
scope note: option

Axis Name
type: Concept
definition: Field to specify for which of the general motion axis of a tribometer this subsystem is responsible.
in scheme: kitmtxxls Tribology Lab at KIT
scope note: string

Piecewise Load Parameters
type: Concept
definition: A bundle of parameters which prescribes the load at particular positions. The load in-between the prescribed points can be found by linear interpolation.
in scheme: kitmtxxls Tribology Lab at KIT
scope note: dictionary

Software-Generated
type: Concept
definition: Values that originate from the software (e.g. time stamps, cycle number indicating values, test programm step numbers etc.)
in scheme: kitmtxxls Tribology Lab at KIT
scope note: option

Reciprocation Frequency Setpoint
type: Concept
definition: This value describes the velocity of a reciprocating tribological experiment, when it is set as frequency.
in scheme: kitmtxxls Tribology Lab at KIT
scope note: float
scope note: Hz, kHz

10X-N
type: Concept
definition: Confocal microscopy lens.
in scheme: kitmtxxls Tribology Lab at KIT
scope note: option

Motion Inducing Subsystem Parameters
type: Concept
definition: Class containing information about an option parameter and its setting related to a motion inducing subsystem.
in scheme: kitmtxxls Tribology Lab at KIT
scope note: dictionary

Kinematic Viscosity
type: Concept
definition: The specification of an object defining its kinematic viscosity.
in scheme: kitmtxxls Tribology Lab at KIT
scope note: float
scope note: mm^2*s^(-1)

Detector Angle
type: Concept
definition: The titl angle of the camera/detector.
in scheme: kitmtxxls Tribology Lab at KIT
scope note: float
scope note: °

50XDI-N
type: Concept
definition: n/a
in scheme: kitmtxxls Tribology Lab at KIT
scope note: option

kg*m^(-3)
type: Concept
definition: Kg/m3 is a measure of density.
in scheme: kitmtxxls Tribology Lab at KIT
scope note: option

Motion Inducing Subsystems Info Array
type: Concept
definition: Class containing information about the installed subsystems responsible for making parts move in the tribometer.
in scheme: kitmtxxls Tribology Lab at KIT
scope note: dictionary

Maximum Temperature
type: Concept
definition: The equipment setting which specifies the maximum achievable temperature by the machine.
in scheme: kitmtxxls Tribology Lab at KIT
scope note: float
scope note: K, °C

Acetone
type: Concept
definition: A methyl ketone that consists of propane bearing an oxo group at C2.
in scheme: kitmtxxls Tribology Lab at KIT
scope note: option

2110
type: Concept
definition: n/a
in scheme: kitmtxxls Tribology Lab at KIT
scope note: option

Data Processing (Integrated Data)
type: Concept
definition: Class representing the execution of a particular computer code which extracts/reshapes/processes data from one form to another. The data is the result of processing raw data from a Sensofar Optical Surface Profilometer and an Optimol tribometer.
in scheme: kitmtxxls Tribology Lab at KIT
scope note: https://purls.helmholtz-metadaten.de/vp/kitmtxx-41732562-vp/tak_xxx_xxx-ca48d075c7de4872b4f12e464652bcb1-vp: https://purls.helmholtz-metadaten.de/vp/kitmtxx-41732562-vp/opt_mic_xxx-c73af6d31f314907b33d212d43f61891-vp
scope note: https://purls.helmholtz-metadaten.de/vp/kitmtxx-41732562-vp/tak_xxx_xxx-ca48d075c7de4872b4f12e464652bcb1-vp: https://purls.helmholtz-metadaten.de/vp/kitmtxx-41732562-vp/tri_exp_xxx-9b84c31083254e40a6eb78601271d381-vp
scope note: https://purls.helmholtz-metadaten.de/vp/kitmtxx-41732562-vp/use_xxx_xxx-f130aac753c3467a9ef4cd8d2163a609-vp: https://purls.helmholtz-metadaten.de/vp/kitmtxx-41732562-vp/sof_xxx_xxx-43c5e712afb04a16a8954dbb3c865c0f-vp
scope note: process
scope note: record

Lens Magnification
type: Concept
definition: Instances of this class specify the lens magnification.
in scheme: kitmtxxls Tribology Lab at KIT
scope note: float

Specimen Storage Take Out
type: Concept
definition: The act of taking a specimen away from its storage location.
in scheme: kitmtxxls Tribology Lab at KIT
scope note: https://purls.helmholtz-metadaten.de/vp/kitmtxx-41732562-vp/inv_xxx_xxx-c5ceb18203384c359584362949572590-vp: https://purls.helmholtz-metadaten.de/vp/kitmtxx-41732562-vp/sph_sto_box-fd80690682f44da3a7ea061b9ef6a7f7-vp
scope note: https://purls.helmholtz-metadaten.de/vp/kitmtxx-41732562-vp/inv_xxx_xxx-c5ceb18203384c359584362949572590-vp: https://purls.helmholtz-metadaten.de/vp/kitmtxx-41732562-vp/dry_cab_xxx-7382b1a7ced043e19f1c713d0e6f767e-vp
scope note: https://purls.helmholtz-metadaten.de/vp/kitmtxx-41732562-vp/inv_xxx_xxx-c5ceb18203384c359584362949572590-vp: https://purls.helmholtz-metadaten.de/vp/kitmtxx-41732562-vp/blo_spe_xxx-ae137cec891644ec9e9d131be42ef67c-vp
scope note: https://purls.helmholtz-metadaten.de/vp/kitmtxx-41732562-vp/inv_xxx_xxx-c5ceb18203384c359584362949572590-vp: https://purls.helmholtz-metadaten.de/vp/kitmtxx-41732562-vp/des_xxx_xxx-3ee63bf8276444389833022dc1d8c2a1-vp
scope note: process
scope note: record

kHz
type: Concept
definition: A kHz, or kilohertz, is a frequency measurement equal to 1,000 Hertz.
in scheme: kitmtxxls Tribology Lab at KIT
scope note: option

Motion Direction
type: Concept
definition: Instances of this class characterize the direction of motion during the time the demagnetizing field is affecting the workpiece/specimen.
in scheme: kitmtxxls Tribology Lab at KIT
scope note: string

Technical Specifications (Wire Saw)
type: Concept
definition: Term containing information about the technical specifications of a wire saw.
in scheme: kitmtxxls Tribology Lab at KIT
scope note: dictionary

S3.08
type: Concept
definition: n/a
in scheme: kitmtxxls Tribology Lab at KIT
scope note: option

Magnification
type: Concept
definition: Denotes the magnification factor(s) used during the process.
in scheme: kitmtxxls Tribology Lab at KIT
scope note: float

Conversion Factor
type: Concept
definition: Scaling factor that has to be applied to data. The conversion factor to convert V/mA raw-signal into something physically meaningful.
in scheme: kitmtxxls Tribology Lab at KIT
scope note: float
scope note: µm*V^(-1), µm*s^(-1), µm, W, V, s, Pa, null, nm, N*V^(-1), N, MPa, mm^2*s^(-1), mm*s^(-1), mm, ml*h^(-1), ml, min^(-1), min, mbar, MB, m*s^(-1), m, l, km*h^(-1), kHz, kgf, kg*m^(-3), kg, kB, K, Hz, HV20, HV10, h, gf, g, cm, bit, °C, °, %*V^(-1), %, mN*V^(-1), mm*V^(-1)

Minimum Measurement Speed
type: Concept
definition: Instances of this class represent the minimum permissable measument speed.
in scheme: kitmtxxls Tribology Lab at KIT
scope note: float
scope note: µm*s^(-1), mm*s^(-1), m*s^(-1), km*h^(-1)

Circle
type: Concept
definition: n/a
in scheme: kitmtxxls Tribology Lab at KIT
scope note: option

Metadata Published
type: Concept
definition: Is the metadata available?
in scheme: kitmtxxls Tribology Lab at KIT
scope note: boolean

RSE
type: Concept
definition: Relative standard error is calculated by dividing the standard error of the estimate by the estimate itself, then multiplying that result by 100.
in scheme: kitmtxxls Tribology Lab at KIT
scope note: option

Is Specimen kitmtxxl Ferromagnetic
type: Concept
definition: Information on whether the material is ferromagnetic or not. The magnetic state (or magnetic phase) of a material depends on temperature, pressure, and the applied magnetic field. A material may exhibit more than one form of magnetism as these variables change.
in scheme: kitmtxxls Tribology Lab at KIT
scope note: boolean

Abaqus
type: Concept
definition: FEA software from Dassault Systèmes
in scheme: kitmtxxls Tribology Lab at KIT
scope note: option

Reference Name
type: Concept
definition: The name/identifier of a reference source for a measurement.
in scheme: kitmtxxls Tribology Lab at KIT
scope note: string

Ball-on-Flat Contact
type: Concept
definition: The contact partners are a ball and a nominally flat and even surface.
in scheme: kitmtxxls Tribology Lab at KIT
scope note: option

Overview Camera
type: Concept
definition: n/a
in scheme: kitmtxxls Tribology Lab at KIT
scope note: option

Ceramic
type: Concept
definition: A ceramic is an inorganic non-metallic solid made up of either metal or non-metal compounds that have been shaped and then hardened by heating to high temperatures. In general, they are hard, corrosion-resistant and brittle.
in scheme: kitmtxxls Tribology Lab at KIT
scope note: option

Surface Imaging
type: Concept
definition: Term containing information about the taken surface images.
in scheme: kitmtxxls Tribology Lab at KIT
scope note: detached
scope note: dictionary

Linear Variable Differential Transformer (LVDT) Sensing
type: Concept
definition: An LVDT can be defined as an electromechanical passive inductive transducer.
in scheme: kitmtxxls Tribology Lab at KIT
scope note: option

Grinding Machine
type: Concept
definition: Objects of this class pertain to the category of machines called grinding machine.
in scheme: kitmtxxls Tribology Lab at KIT
scope note: https://purls.helmholtz-metadaten.de/vp/kitmtxx-41732562-vp/ism_xxx_xxx-cd4f36f6200648d294054682584c8e2b-vp: https://purls.helmholtz-metadaten.de/vp/kitmtxx-41732562-vp/gri_mac_xxx-b0492ca6bf9043909ee541221a225895-vp
scope note: equipment
scope note: record

Pellet
type: Concept
definition: n/a
in scheme: kitmtxxls Tribology Lab at KIT
scope note: option

Column
type: Concept
definition: n/a
in scheme: kitmtxxls Tribology Lab at KIT
scope note: option

Track Length
type: Concept
definition: n/a
in scheme: kitmtxxls Tribology Lab at KIT
scope note: option

Stone Table with Active Pneumatic Dampers
type: Concept
definition: n/a
in scheme: kitmtxxls Tribology Lab at KIT
scope note: option

OFE Copper
type: Concept
definition: Oxygen-free Electronic Copper contains more than 99.99% pure copper. OFCs are known for their superior electrical conductivity, low electrical resistivity, and ability to resist corrosion.
in scheme: kitmtxxls Tribology Lab at KIT
scope note: option

Maximum Oxidation Depth
type: Concept
definition: Maximum measured depth of oxidation in SEM images
in scheme: kitmtxxls Tribology Lab at KIT
scope note: float
scope note: nm, µm, mm, m

211-15÷16
type: Concept
definition: n/a
in scheme: kitmtxxls Tribology Lab at KIT
scope note: option

MB
type: Concept
definition: Megabyte (MB) is a data measurement unit applied to digital computer or media storage. One MB equals one million (106 or 1,000,000) bytes.
in scheme: kitmtxxls Tribology Lab at KIT
scope note: option

Hexagonal Close Packed Crystal Basal Plane
type: Concept
definition: Basal plane in HCP: The plane perpendicular to the a4 axis is called the basal plane. Its Miller indices are (0001). Note that the basal plane is close- packed plane in HCP.
in scheme: kitmtxxls Tribology Lab at KIT
scope note: option

Leica KL1500
type: Concept
definition: The Schott KL 1500 Electronic Light Source / Fiber Optic Illuminator uses a Halogen Lamp 15V 150W.
in scheme: kitmtxxls Tribology Lab at KIT
scope note: option

*.txt File Technical Specifications
type: Concept
definition: Instances of this class contain the information to open/access/read and interprete a *.txt file's contents adequately.
in scheme: kitmtxxls Tribology Lab at KIT
scope note: dictionary

J967D
type: Concept
definition: Calibration fluid for diesel injection equipment
in scheme: kitmtxxls Tribology Lab at KIT
scope note: option

Mercedes-Benz Standard
type: Concept
definition: Class containing information about the technical standard of the interfacial medium.
in scheme: kitmtxxls Tribology Lab at KIT
scope note: string

stressesAsCounterBody
type: Concept
definition: Denotes that a given process stresses a given block specimen as a counter body in the relevant process. A clear definition of what is to be called ""base body"" and what ""counter body"" in a tribologcial system does not exist. We therefore will use the following set of definitions — whereby always the first applicable definition should be used in a given case (going through the list from top to bottom): The Base body in a model experiment is the sample or body... ...whose nominal contact area is not permanently tribologically stressed during the experiment. ...that is larger. ...expected to show less wear at the end of the experiment. ...that is static during the experiment.
in scheme: kitmtxxls Tribology Lab at KIT
scope note: none
scope note: relationship_type

Maximum Base Speed
type: Concept
definition: Maximum base speed at which the machine can operate.
in scheme: kitmtxxls Tribology Lab at KIT
scope note: float
scope note: min^(-1)

Sawing Blade
type: Concept
definition: The cutting component of a machine used in a cutting process.
in scheme: kitmtxxls Tribology Lab at KIT
preferred label: Trennmittel @de
scope note: consumable
scope note: record

Technical Specifications (Band Saw)
type: Concept
definition: Class containing information about the technical specifications of a bandsaw.
in scheme: kitmtxxls Tribology Lab at KIT
scope note: dictionary

Kadi4Mat Communication Script
type: Concept
definition: n/a
in scheme: kitmtxxls Tribology Lab at KIT
scope note: option

*.dat
type: Concept
definition: A file with the .dat file extension is a generic data file that stores specific information relating to the program that created the file.
in scheme: kitmtxxls Tribology Lab at KIT
scope note: option

Protection Class
type: Concept
definition: Instances of this class characterize the IP class of a machine.
in scheme: kitmtxxls Tribology Lab at KIT
scope note: string

Light Microscopy
type: Concept
definition: Term representing the process of using a light microscope.
in scheme: kitmtxxls Tribology Lab at KIT
scope note: https://purls.helmholtz-metadaten.de/vp/kitmtxx-41732562-vp/que_xxx_xxx-dc882ce905ba4dfbb3a906b1c1b0cdad-vp: https://purls.helmholtz-metadaten.de/vp/kitmtxx-41732562-vp/pol_xxx_xxx-6750b81cc7c9430faa347b428e0356ab-vp
scope note: https://purls.helmholtz-metadaten.de/vp/kitmtxx-41732562-vp/que_xxx_xxx-dc882ce905ba4dfbb3a906b1c1b0cdad-vp: https://purls.helmholtz-metadaten.de/vp/kitmtxx-41732562-vp/opt_sur_pro-f096c110525747cab4fe81f4a23b20f8-vp
scope note: https://purls.helmholtz-metadaten.de/vp/kitmtxx-41732562-vp/que_xxx_xxx-dc882ce905ba4dfbb3a906b1c1b0cdad-vp: https://purls.helmholtz-metadaten.de/vp/kitmtxx-41732562-vp/ele_xxx_xxx-d4cc995b3bd146079672b7b5c49aaabb-vp
scope note: https://purls.helmholtz-metadaten.de/vp/kitmtxx-41732562-vp/que_xxx_xxx-dc882ce905ba4dfbb3a906b1c1b0cdad-vp: https://purls.helmholtz-metadaten.de/vp/kitmtxx-41732562-vp/tri_exp_xxx-9b84c31083254e40a6eb78601271d381-vp
scope note: https://purls.helmholtz-metadaten.de/vp/kitmtxx-41732562-vp/que_xxx_xxx-dc882ce905ba4dfbb3a906b1c1b0cdad-vp: https://purls.helmholtz-metadaten.de/vp/kitmtxx-41732562-vp/opt_mic_xxx-c73af6d31f314907b33d212d43f61891-vp
scope note: https://purls.helmholtz-metadaten.de/vp/kitmtxx-41732562-vp/que_xxx_xxx-dc882ce905ba4dfbb3a906b1c1b0cdad-vp: https://purls.helmholtz-metadaten.de/vp/kitmtxx-41732562-vp/gri_xxx_xxx-3fbc031a08cb41eb81655381c26d3968-vp
scope note: https://purls.helmholtz-metadaten.de/vp/kitmtxx-41732562-vp/que_xxx_xxx-dc882ce905ba4dfbb3a906b1c1b0cdad-vp: https://purls.helmholtz-metadaten.de/vp/kitmtxx-41732562-vp/sem_orx_fib-a3c4c133c9d746378cdf6ace982f8a64-vp
scope note: https://purls.helmholtz-metadaten.de/vp/kitmtxx-41732562-vp/que_xxx_xxx-dc882ce905ba4dfbb3a906b1c1b0cdad-vp: https://purls.helmholtz-metadaten.de/vp/kitmtxx-41732562-vp/fib_cut_xxx-88c4fd89f922478585b33011e810e1f0-vp
scope note: https://purls.helmholtz-metadaten.de/vp/kitmtxx-41732562-vp/pro_xxx_xxx-0a80036373ea40d1ac7401d423b284a0-vp: https://purls.helmholtz-metadaten.de/vp/kitmtxx-41732562-vp/tri_exp_xxx-9b84c31083254e40a6eb78601271d381-vp
scope note: https://purls.helmholtz-metadaten.de/vp/kitmtxx-41732562-vp/cha_xxx_xxx-5b70f2376c68474381ef5cc428fe240b-vp: https://purls.helmholtz-metadaten.de/vp/kitmtxx-41732562-vp/blo_spe_xxx-ae137cec891644ec9e9d131be42ef67c-vp
scope note: https://purls.helmholtz-metadaten.de/vp/kitmtxx-41732562-vp/emp_xxx_xxx-b0c09f9f6cd948839bac12aa4a2ad55d-vp: https://purls.helmholtz-metadaten.de/vp/kitmtxx-41732562-vp/lig_mic_xxx-de64ef91f8544beda63bbf43c6ffdce1-vp
scope note: process
scope note: record

Tribological Experiment
type: Concept
definition: A process representing the combined monitored processes that produce a (set of) wear track(s) on or below a physical surface.
in scheme: kitmtxxls Tribology Lab at KIT
scope note: https://purls.helmholtz-metadaten.de/vp/kitmtxx-41732562-vp/emp_xxx_xxx-b0c09f9f6cd948839bac12aa4a2ad55d-vp: https://purls.helmholtz-metadaten.de/vp/kitmtxx-41732562-vp/tri_xxx_xxx-c98170df4aa14cd38e9ba0d1b94ebdf0-vp
scope note: https://purls.helmholtz-metadaten.de/vp/kitmtxx-41732562-vp/str_xxx_xxx-cb318eeeefba400e84a04629fbd58e2a-vp: https://purls.helmholtz-metadaten.de/vp/kitmtxx-41732562-vp/blo_spe_xxx-ae137cec891644ec9e9d131be42ef67c-vp
scope note: https://purls.helmholtz-metadaten.de/vp/kitmtxx-41732562-vp/mak_xxx_xxx-85937c1afc674792af65bffa0748aa31-vp: https://purls.helmholtz-metadaten.de/vp/kitmtxx-41732562-vp/int_med_xxx-49981b08aa8e441ba36e6fe7e3760a0a-vp
scope note: https://purls.helmholtz-metadaten.de/vp/kitmtxx-41732562-vp/str_xxx_xxx-38d3d4c5680f48e3990540545f2079b0-vp: https://purls.helmholtz-metadaten.de/vp/kitmtxx-41732562-vp/coa_spe_xxx-06aef9c123824fa28b3b5f19c6a5633f-vp
scope note: https://purls.helmholtz-metadaten.de/vp/kitmtxx-41732562-vp/str_xxx_xxx-38d3d4c5680f48e3990540545f2079b0-vp: https://purls.helmholtz-metadaten.de/vp/kitmtxx-41732562-vp/blo_spe_xxx-ae137cec891644ec9e9d131be42ef67c-vp
scope note: process
scope note: record

Floor
type: Concept
definition: The floor in a building. Ground floor has value "0". First underground/basement floor has value "-1"
in scheme: kitmtxxls Tribology Lab at KIT
scope note: integer

COF Hysteresis Value (Measured)
type: Concept
definition: COF hysteresis value. The value is a measurement for the work necessary in one oscillation period for overcoming the friction.
in scheme: kitmtxxls Tribology Lab at KIT
scope note: option

Technician
type: Concept
definition: n/a
in scheme: kitmtxxls Tribology Lab at KIT
scope note: option

Polishing Details
type: Concept
definition: Contains information specific to the polishing procedure.
in scheme: kitmtxxls Tribology Lab at KIT
scope note: dictionary

Droplet (with replenishment)
type: Concept
definition: n/a
in scheme: kitmtxxls Tribology Lab at KIT
scope note: option

Flash Point
type: Concept
definition: Object's Flash Point.
in scheme: kitmtxxls Tribology Lab at KIT
scope note: float
scope note: K, °C

Storage Type
type: Concept
definition: Denotes the storage location of the specimen.
in scheme: kitmtxxls Tribology Lab at KIT
scope note: string

CrFeAl Heating Coil
type: Concept
definition: FeCrAl alloy is made by a high-temperature, ferritic iron-chromium-aluminium alloy which can be used at temperatures up to 1350 degrees.
in scheme: kitmtxxls Tribology Lab at KIT
scope note: option

Leica
type: Concept
definition: n/a
in scheme: kitmtxxls Tribology Lab at KIT
scope note: option

Interfacial Medium Source of Replenishment
type: Concept
definition: Source of supply of the interfacial medium during an industrial or scientific process, where replenishment occurs. Could be for lubrication and/or cooling purposes.
in scheme: kitmtxxls Tribology Lab at KIT
scope note: string

Array of Info on Sensors
type: Concept
definition: Class containing information about all the installed sensors detecting physical quantities during the course of an experiment. These can be force sensors, distance sensors, acoustic transducers etc.
in scheme: kitmtxxls Tribology Lab at KIT
scope note: dictionary

General Info (Process)
type: Concept
definition: Objects of this class contain information that unequivocally identifies the process.
in scheme: kitmtxxls Tribology Lab at KIT
scope note: dictionary

Stage Tilt
type: Concept
definition: Tilt angle of the stage.
in scheme: kitmtxxls Tribology Lab at KIT
scope note: float
scope note: °

Type of Publication
type: Concept
definition: Defines the type of the publication, e.g. thesis or paper.
in scheme: kitmtxxls Tribology Lab at KIT
scope note: string

Plate Rotation Direction
type: Concept
definition: The rotation direction of the plate.
in scheme: kitmtxxls Tribology Lab at KIT
scope note: string

Blade Specifications
type: Concept
definition: Class containing information about the technical specifications of a bandsaw blade.
in scheme: kitmtxxls Tribology Lab at KIT
scope note: dictionary

Count of Objects
type: Concept
definition: The number of objects (or specimens) that occupy a space.
in scheme: kitmtxxls Tribology Lab at KIT
scope note: integer

Experiment Type
type: Concept
definition: A collection of descriptions that together define a class of experiment.
in scheme: kitmtxxls Tribology Lab at KIT
scope note: dictionary

Tribometer
type: Concept
definition: Objects of this class pertain to the category of machines that perform tribological experiments as their primary use.
in scheme: kitmtxxls Tribology Lab at KIT
scope note: https://purls.helmholtz-metadaten.de/vp/kitmtxx-41732562-vp/ism_xxx_xxx-cd4f36f6200648d294054682584c8e2b-vp: https://purls.helmholtz-metadaten.de/vp/kitmtxx-41732562-vp/tri_xxx_xxx-c98170df4aa14cd38e9ba0d1b94ebdf0-vp
scope note: equipment
scope note: record

bit
type: Concept
definition: A bit, or binary digit, is the most basic and smallest unit of data in computing that a computer can process and store.
in scheme: kitmtxxls Tribology Lab at KIT
scope note: option

List of Equipment Roles
type: Concept
definition: Class containing information about the periphery's role/s in a tribometer.
in scheme: kitmtxxls Tribology Lab at KIT
scope note: dictionary

Tip Radius
type: Concept
definition: Instances of this class represent the radius of a measuring tip.
in scheme: kitmtxxls Tribology Lab at KIT
scope note: float
scope note: µm, nm, mm, m, cm

Effective Coefficient of Friction (Measured)
type: Concept
definition: Effective coefficient of friction (CoF) (root mean square value) over one period.
in scheme: kitmtxxls Tribology Lab at KIT
scope note: option

Master Candidate
type: Concept
definition: n/a
in scheme: kitmtxxls Tribology Lab at KIT
scope note: option

Cutting Speed Setpoint
type: Concept
definition: The setting assigned to be maintained by the machine.
in scheme: kitmtxxls Tribology Lab at KIT
scope note: float
scope note: µm*s^(-1), mm*s^(-1), m*s^(-1), km*h^(-1)

CSEM
type: Concept
definition: Swiss Center for Electronics and Microtechnology,
in scheme: kitmtxxls Tribology Lab at KIT
scope note: option

Maximum Working Tool Turning Speed
type: Concept
definition: Instances of this class characterize the maximum permissable working tool turning speed.
in scheme: kitmtxxls Tribology Lab at KIT
scope note: float
scope note: min^(-1)

Number of Files in Archive
type: Concept
definition: Number of files stored in an archive.
in scheme: kitmtxxls Tribology Lab at KIT
scope note: integer

Vacuum Pump
type: Concept
definition: Term containing information about the vacuum pump connected to a furnace.
in scheme: kitmtxxls Tribology Lab at KIT
scope note: dictionary

Raw Topography Data
type: Concept
definition: n/a
in scheme: kitmtxxls Tribology Lab at KIT
scope note: option

xT microscope Control
type: Concept
definition: n/a
in scheme: kitmtxxls Tribology Lab at KIT
scope note: option

Porous Alumina (Soft)
type: Concept
definition: Porous aluminum is a nanostructured material characterized by unique properties, such as chemical stability, regular uniformity, dense hexagonal porous lattice with high aspect ratio nanopores, excellent mechanical strength, and biocompatibility.
in scheme: kitmtxxls Tribology Lab at KIT
scope note: option

Space Length
type: Concept
definition: The maximum length inside the chamber of a piece of equipment.
in scheme: kitmtxxls Tribology Lab at KIT
scope note: float
scope note: µm, nm, mm, m, cm

Interfacial Medium Supply Continuity
type: Concept
definition: Continuity of supply of the interfacial medium during an industrial or scientific process, where replenishment occurs. Could be for lubrication and/or cooling purposes.
in scheme: kitmtxxls Tribology Lab at KIT
scope note: string

TSD-651C25-M6
type: Concept
definition: The TSD-C stages (with center-drive micrometers)
in scheme: kitmtxxls Tribology Lab at KIT
scope note: option

First Name
type: Concept
definition: Operator's first name/s (= given name/s).
in scheme: kitmtxxls Tribology Lab at KIT
scope note: string

Cup Grinding
type: Concept
definition: Class representing the physical process of cup grinding of a specimen with the aim of changing its surface characteristics. It ends with demounting of the sample/workpiece from the mounting table.
in scheme: kitmtxxls Tribology Lab at KIT
scope note: https://purls.helmholtz-metadaten.de/vp/kitmtxx-41732562-vp/emp_xxx_xxx-b0c09f9f6cd948839bac12aa4a2ad55d-vp: https://purls.helmholtz-metadaten.de/vp/kitmtxx-41732562-vp/cup_gri_mac-3136c4f5a61247ca9cf390b86f050459-vp
scope note: https://purls.helmholtz-metadaten.de/vp/kitmtxx-41732562-vp/phy_xxx_xxx-3c41e6aa10d14a51b0c7a950b897fbba-vp: https://purls.helmholtz-metadaten.de/vp/kitmtxx-41732562-vp/blo_spe_xxx-ae137cec891644ec9e9d131be42ef67c-vp
scope note: process
scope note: record

manual
type: Concept
definition: n/a
in scheme: kitmtxxls Tribology Lab at KIT
scope note: option

Scanning Electron Microscope
type: Concept
definition: A piece of apparatus which is used to produce an enlarged image of a specimen by scanning a finely focused (<10 nm diameter) electron beam with an acceleration voltage of 50–150 kV across the specimen under vacuum and measuring the interaction of the electrons with the specimen.
in scheme: kitmtxxls Tribology Lab at KIT
scope note: equipment
scope note: record

Desiccator
type: Concept
definition: A storage space for specimens which is kept at very low pressure and humidity to prevent oxidation.
in scheme: kitmtxxls Tribology Lab at KIT
scope note: equipment
scope note: record

Polishing
type: Concept
definition: Class representing the physical process of polishing of a specimen with the aim of changing its surface characteristics.
in scheme: kitmtxxls Tribology Lab at KIT
scope note: https://purls.helmholtz-metadaten.de/vp/kitmtxx-41732562-vp/mak_xxx_xxx-85937c1afc674792af65bffa0748aa31-vp: https://purls.helmholtz-metadaten.de/vp/kitmtxx-41732562-vp/pol_med_xxx-2b7335ba9b0143feb2e936545b8ea4e2-vp
scope note: https://purls.helmholtz-metadaten.de/vp/kitmtxx-41732562-vp/mak_xxx_xxx-85937c1afc674792af65bffa0748aa31-vp: https://purls.helmholtz-metadaten.de/vp/kitmtxx-41732562-vp/lub_for_pol-a64e0b5bcd2d44bd8c3d7aa2853007f4-vp
scope note: https://purls.helmholtz-metadaten.de/vp/kitmtxx-41732562-vp/emp_xxx_xxx-b0c09f9f6cd948839bac12aa4a2ad55d-vp: https://purls.helmholtz-metadaten.de/vp/kitmtxx-41732562-vp/gri_mac_xxx-b0492ca6bf9043909ee541221a225895-vp
scope note: https://purls.helmholtz-metadaten.de/vp/kitmtxx-41732562-vp/phy_xxx_xxx-3c41e6aa10d14a51b0c7a950b897fbba-vp: https://purls.helmholtz-metadaten.de/vp/kitmtxx-41732562-vp/blo_spe_xxx-ae137cec891644ec9e9d131be42ef67c-vp
scope note: process
scope note: record

Cooling Rate Specifications
type: Concept
definition: Class containing information about the furnace's cooling time to room temperature.
in scheme: kitmtxxls Tribology Lab at KIT
scope note: dictionary

HY 180-4
type: Concept
definition: METAL BANDSAW
in scheme: kitmtxxls Tribology Lab at KIT
scope note: option

Housing Description
type: Concept
definition: More detailed description of the housing components than in Housing Method.
in scheme: kitmtxxls Tribology Lab at KIT
scope note: dictionary

Derived
type: Concept
definition: The values in the time series are dervied from another time series — typical example is the coefficient of friction.
in scheme: kitmtxxls Tribology Lab at KIT
scope note: option

*.xls File Technical Specifications
type: Concept
definition: Term containing the information to open/access/read and interpret a *.xls file's contents adequately.
in scheme: kitmtxxls Tribology Lab at KIT
scope note: dictionary

ISO 2719
type: Concept
definition: Determination of flash point — Pensky-Martens closed cup method
in scheme: kitmtxxls Tribology Lab at KIT
scope note: option

g
type: Concept
definition: n/a
in scheme: kitmtxxls Tribology Lab at KIT
scope note: option

USB
type: Concept
definition: Short for universal serial bus, USB is a plug and play interface that allows a computer to communicate with peripheral and other devices.
in scheme: kitmtxxls Tribology Lab at KIT
scope note: option

Minimum Base Speed
type: Concept
definition: Minimum base speed at which the machine can operate.
in scheme: kitmtxxls Tribology Lab at KIT
scope note: float
scope note: min^(-1)

Block Temperature (Measured)
type: Concept
definition: Temperature within the base block approx. 2mm underneath the supporting surface of the test specimen (this temperature is also the reference temperature for the temperature controller).
in scheme: kitmtxxls Tribology Lab at KIT
scope note: option

USB-6212
type: Concept
definition: 16 AI (16-Bit, 400 kS/s), 2 AO (250 kS/s), Up to 32 DIO, USB Multifunction I/O Device—The USB‑6212 is a multifunction DAQ device. It offers analog inputs, digital inputs and outputs as well as two counters with 32-bit resolution.
in scheme: kitmtxxls Tribology Lab at KIT
scope note: option

AO Factor
type: Concept
definition: Analog Output proportionality factor.
in scheme: kitmtxxls Tribology Lab at KIT
scope note: float

N-Dimensional Tabular Data Specifications
type: Concept
definition: Contains the information describing a tabular data file.
in scheme: kitmtxxls Tribology Lab at KIT
scope note: dictionary

Plasma Cleaner Unit LP
type: Concept
definition: plasma cleaner is used to remove organic and inorganic contamination, increase wettability, increase bond strength, and remove residue.
in scheme: kitmtxxls Tribology Lab at KIT
scope note: option

Measurement Resolution
type: Concept
definition: Instances of this class represent the maximum resolution that the system can capture in one acquisition process/one measurement.
in scheme: kitmtxxls Tribology Lab at KIT
scope note: float
scope note: µm, nm, mm, m, cm, %

wasDoneDuring
type: Concept
definition: Denotes the relationship between a subprocess and the process during which it was done.
in scheme: kitmtxxls Tribology Lab at KIT
scope note: none
scope note: relationship_type

Light Microscope
type: Concept
definition: A light microscope is a biology laboratory instrument or tool, that uses visible light to detect and magnify very small objects and enlarge them.
in scheme: kitmtxxls Tribology Lab at KIT
scope note: equipment
scope note: record

Cross Section Summary
type: Concept
definition: Contains multiple types of information related to the cross section.
in scheme: kitmtxxls Tribology Lab at KIT
scope note: boolean

Origin Position on Side of Tribological Interest
type: Concept
definition: Describes the corner of the specimen in respect to which the origin of the specimen coordinate system is set.
in scheme: kitmtxxls Tribology Lab at KIT
scope note: string

Pole Surface Width
type: Concept
definition: Instances of this class specify the pole surface size.
in scheme: kitmtxxls Tribology Lab at KIT
scope note: float
scope note: µm, nm, mm, m, cm

*.bin File Technical Specifications
type: Concept
definition: Instances of this class contain the information to open/access/read and interprete a *.bin file's contents adequately.
in scheme: kitmtxxls Tribology Lab at KIT
scope note: dictionary

Motion Inducing Subsystem Settings
type: Concept
definition: Class containing information about all settings related to the motion inducing subsystems of the setup that played a role when conducting an experiment.
in scheme: kitmtxxls Tribology Lab at KIT
scope note: dictionary

File Name Pattern
type: Concept
definition: The naming pattern of the given file.
in scheme: kitmtxxls Tribology Lab at KIT
scope note: string

Technical Specifications (Electropolishing Machine)
type: Concept
definition: Term containing information about the technical specifications of an electropolishing machine.
in scheme: kitmtxxls Tribology Lab at KIT
scope note: dictionary

Data Processing
type: Concept
definition: Class representing the execution of a particular computer code which extracts/reshapes/processes data from one form to another.
in scheme: kitmtxxls Tribology Lab at KIT
scope note: https://purls.helmholtz-metadaten.de/vp/kitmtxx-41732562-vp/tak_xxx_xxx-ca48d075c7de4872b4f12e464652bcb1-vp: https://purls.helmholtz-metadaten.de/vp/kitmtxx-41732562-vp/ele_mic_xxx-840bbf9ffd9648fc883b251d106e3733-vp
scope note: https://purls.helmholtz-metadaten.de/vp/kitmtxx-41732562-vp/tak_xxx_xxx-ca48d075c7de4872b4f12e464652bcb1-vp: https://purls.helmholtz-metadaten.de/vp/kitmtxx-41732562-vp/dat_pro_sem-9ed82728f8994d499795b4bc8c049a7b-vp
scope note: https://purls.helmholtz-metadaten.de/vp/kitmtxx-41732562-vp/tak_xxx_xxx-ca48d075c7de4872b4f12e464652bcb1-vp: https://purls.helmholtz-metadaten.de/vp/kitmtxx-41732562-vp/opt_sur_pro-f096c110525747cab4fe81f4a23b20f8-vp
scope note: https://purls.helmholtz-metadaten.de/vp/kitmtxx-41732562-vp/tak_xxx_xxx-ca48d075c7de4872b4f12e464652bcb1-vp: https://purls.helmholtz-metadaten.de/vp/kitmtxx-41732562-vp/opt_mic_xxx-c73af6d31f314907b33d212d43f61891-vp
scope note: https://purls.helmholtz-metadaten.de/vp/kitmtxx-41732562-vp/tak_xxx_xxx-ca48d075c7de4872b4f12e464652bcb1-vp: https://purls.helmholtz-metadaten.de/vp/kitmtxx-41732562-vp/tri_exp_xxx-9b84c31083254e40a6eb78601271d381-vp
scope note: https://purls.helmholtz-metadaten.de/vp/kitmtxx-41732562-vp/tak_xxx_xxx-ca48d075c7de4872b4f12e464652bcb1-vp: https://purls.helmholtz-metadaten.de/vp/kitmtxx-41732562-vp/dat_pro_xxx-b44582ea9cd7420896bc0b644cdcf8f5-vp
scope note: https://purls.helmholtz-metadaten.de/vp/kitmtxx-41732562-vp/tak_xxx_xxx-ca48d075c7de4872b4f12e464652bcb1-vp: https://purls.helmholtz-metadaten.de/vp/kitmtxx-41732562-vp/dat_pro_sen-51a61429b8ef441186b904b69b5a71c7-vp
scope note: https://purls.helmholtz-metadaten.de/vp/kitmtxx-41732562-vp/tak_xxx_xxx-ca48d075c7de4872b4f12e464652bcb1-vp: https://purls.helmholtz-metadaten.de/vp/kitmtxx-41732562-vp/dat_pro_int-9d3853a84ec149a19182e5b54d29c51d-vp
scope note: https://purls.helmholtz-metadaten.de/vp/kitmtxx-41732562-vp/tak_xxx_xxx-ca48d075c7de4872b4f12e464652bcb1-vp: https://purls.helmholtz-metadaten.de/vp/kitmtxx-41732562-vp/har_mea_xxx-cd56d9226fdb45e3a6153034ca19b7c0-vp
scope note: https://purls.helmholtz-metadaten.de/vp/kitmtxx-41732562-vp/tak_xxx_xxx-ca48d075c7de4872b4f12e464652bcb1-vp: https://purls.helmholtz-metadaten.de/vp/kitmtxx-41732562-vp/ten_tes_xxx-b4b8ff243b17440d8da2fbf943194381-vp
scope note: https://purls.helmholtz-metadaten.de/vp/kitmtxx-41732562-vp/tak_xxx_xxx-ca48d075c7de4872b4f12e464652bcb1-vp: https://purls.helmholtz-metadaten.de/vp/kitmtxx-41732562-vp/tac_sur_pro-76cb2538e8b5460b8f71e0ede2db6ddc-vp
scope note: https://purls.helmholtz-metadaten.de/vp/kitmtxx-41732562-vp/tak_xxx_xxx-ca48d075c7de4872b4f12e464652bcb1-vp: https://purls.helmholtz-metadaten.de/vp/kitmtxx-41732562-vp/dat_pro_opt-dd808417f7b54fea9668e68f32f5870e-vp
scope note: https://purls.helmholtz-metadaten.de/vp/kitmtxx-41732562-vp/use_xxx_xxx-f130aac753c3467a9ef4cd8d2163a609-vp: https://purls.helmholtz-metadaten.de/vp/kitmtxx-41732562-vp/sof_xxx_xxx-43c5e712afb04a16a8954dbb3c865c0f-vp
scope note: process
scope note: record

Frequency (Measured)
type: Concept
definition: Frequency of the oscillation drive.
in scheme: kitmtxxls Tribology Lab at KIT
scope note: option

TURBOVAC 90i
type: Concept
definition: Turbomolecular vacuum pumps (TURBOVAC) are used in applications which require a clean high or ultrahigh vacuum
in scheme: kitmtxxls Tribology Lab at KIT
scope note: option

min^(-1)
type: Concept
definition: n/a
in scheme: kitmtxxls Tribology Lab at KIT
scope note: option

,
type: Concept
definition: n/a
in scheme: kitmtxxls Tribology Lab at KIT
scope note: option

Climate Box
type: Concept
definition: n/a
in scheme: kitmtxxls Tribology Lab at KIT
scope note: option

None
type: Concept
definition: n/a
in scheme: kitmtxxls Tribology Lab at KIT
scope note: option

FIB Cutting
type: Concept
definition: FIB Cutting is a subprocess of a SEM session during which the specimen is modified using the focused ion beam (FIB). Process images are stored in this record.
in scheme: kitmtxxls Tribology Lab at KIT
scope note: https://purls.helmholtz-metadaten.de/vp/kitmtxx-41732562-vp/phy_xxx_xxx-3c41e6aa10d14a51b0c7a950b897fbba-vp: https://purls.helmholtz-metadaten.de/vp/kitmtxx-41732562-vp/blo_spe_xxx-ae137cec891644ec9e9d131be42ef67c-vp
scope note: https://purls.helmholtz-metadaten.de/vp/kitmtxx-41732562-vp/was_xxx_xxx-3362f63dcded4e41aa5b40b49059f80a-vp: https://purls.helmholtz-metadaten.de/vp/kitmtxx-41732562-vp/ele_mic_xxx-840bbf9ffd9648fc883b251d106e3733-vp
scope note: https://purls.helmholtz-metadaten.de/vp/kitmtxx-41732562-vp/que_xxx_xxx-dc882ce905ba4dfbb3a906b1c1b0cdad-vp: https://purls.helmholtz-metadaten.de/vp/kitmtxx-41732562-vp/opt_mic_xxx-c73af6d31f314907b33d212d43f61891-vp
scope note: https://purls.helmholtz-metadaten.de/vp/kitmtxx-41732562-vp/que_xxx_xxx-dc882ce905ba4dfbb3a906b1c1b0cdad-vp: https://purls.helmholtz-metadaten.de/vp/kitmtxx-41732562-vp/sem_orx_fib-a3c4c133c9d746378cdf6ace982f8a64-vp
scope note: https://purls.helmholtz-metadaten.de/vp/kitmtxx-41732562-vp/que_xxx_xxx-dc882ce905ba4dfbb3a906b1c1b0cdad-vp: https://purls.helmholtz-metadaten.de/vp/kitmtxx-41732562-vp/tri_exp_xxx-9b84c31083254e40a6eb78601271d381-vp
scope note: https://purls.helmholtz-metadaten.de/vp/kitmtxx-41732562-vp/que_xxx_xxx-dc882ce905ba4dfbb3a906b1c1b0cdad-vp: https://purls.helmholtz-metadaten.de/vp/kitmtxx-41732562-vp/har_mea_xxx-cd56d9226fdb45e3a6153034ca19b7c0-vp
scope note: https://purls.helmholtz-metadaten.de/vp/kitmtxx-41732562-vp/que_xxx_xxx-dc882ce905ba4dfbb3a906b1c1b0cdad-vp: https://purls.helmholtz-metadaten.de/vp/kitmtxx-41732562-vp/opt_sur_pro-f096c110525747cab4fe81f4a23b20f8-vp
scope note: https://purls.helmholtz-metadaten.de/vp/kitmtxx-41732562-vp/use_xxx_xxx-f130aac753c3467a9ef4cd8d2163a609-vp: https://purls.helmholtz-metadaten.de/vp/kitmtxx-41732562-vp/sof_xxx_xxx-43c5e712afb04a16a8954dbb3c865c0f-vp
scope note: https://purls.helmholtz-metadaten.de/vp/kitmtxx-41732562-vp/phy_xxx_xxx-9da2eadd1cba429c8381945b334fe39c-vp: https://purls.helmholtz-metadaten.de/vp/kitmtxx-41732562-vp/blo_spe_xxx-ae137cec891644ec9e9d131be42ef67c-vp
scope note: https://purls.helmholtz-metadaten.de/vp/kitmtxx-41732562-vp/was_xxx_xxx-26c4aa3ea27e41709e31d7e2275182df-vp: https://purls.helmholtz-metadaten.de/vp/kitmtxx-41732562-vp/sem_ses_xxx-75349c79f6be496cbe9631a2acd32562-vp
scope note: https://purls.helmholtz-metadaten.de/vp/kitmtxx-41732562-vp/cha_xxx_xxx-5b70f2376c68474381ef5cc428fe240b-vp: https://purls.helmholtz-metadaten.de/vp/kitmtxx-41732562-vp/blo_spe_xxx-ae137cec891644ec9e9d131be42ef67c-vp
scope note: subprocess
scope note: record

Vertical Infeed Table Rotations Interval
type: Concept
definition: Instances of this class characterize the number of 360° rotations the sample mounting table completes in between two infeed steps.
in scheme: kitmtxxls Tribology Lab at KIT
scope note: float

Water
type: Concept
definition: n/a
in scheme: kitmtxxls Tribology Lab at KIT
scope note: option

Connected Amplifier Info
type: Concept
definition: n/a
in scheme: kitmtxxls Tribology Lab at KIT
scope note: dictionary

Infeed Mode
type: Concept
definition: Instances of this class indicate the type of infeed method.
in scheme: kitmtxxls Tribology Lab at KIT
scope note: string

Minimum Working Tool Turning Speed
type: Concept
definition: Instances of this class characterize the minimum permissable working tool turning speed.
in scheme: kitmtxxls Tribology Lab at KIT
scope note: float
scope note: min^(-1)

Viscosity Specifications
type: Concept
definition: Class containing information about the viscosity of the the piece of interfacial medium.
in scheme: kitmtxxls Tribology Lab at KIT
scope note: dictionary

Specimen Mounting Specifications
type: Concept
definition: Class containing information about the specimen mounting in a cup grinding machine.
in scheme: kitmtxxls Tribology Lab at KIT
scope note: dictionary

General Info (Auxiliary Medium)
type: Concept
definition: Term containing information that unequivocally identifies a piece of interfacial medium.
in scheme: kitmtxxls Tribology Lab at KIT
scope note: dictionary

Gluing Specimen with Carbon Patch onto FIB Stub
type: Concept
definition: n/a
in scheme: kitmtxxls Tribology Lab at KIT
scope note: option

Published Resources
type: Concept
definition: A dictionary of the types of resources that are available at the particular location.
in scheme: kitmtxxls Tribology Lab at KIT
scope note: dictionary

Band Saw Cutting Speed
type: Concept
definition: The maximum permissable round tube diameter.
in scheme: kitmtxxls Tribology Lab at KIT
scope note: float
scope note: min^(-1)

Wire Base kitmtxxl
type: Concept
definition: The name of the base material of the wire.
in scheme: kitmtxxls Tribology Lab at KIT
scope note: string

Bachelor Candidate
type: Concept
definition: n/a
in scheme: kitmtxxls Tribology Lab at KIT
scope note: option

Electropolishing Goal
type: Concept
definition: Denotes the goal of the instance of the process.
in scheme: kitmtxxls Tribology Lab at KIT
scope note: string

Minimum Intensity Threshold
type: Concept
definition: Instances of this class determine whether a recorded signal value is considered valid or not.
in scheme: kitmtxxls Tribology Lab at KIT
scope note: float

Technical Specifications (Electrolyte)
type: Concept
definition: Term containing information about the technical specifications of an electrolyte.
in scheme: kitmtxxls Tribology Lab at KIT
scope note: dictionary

*.tif
type: Concept
definition: TIF (or TIFF) is an image format used for containing high quality graphics. It stands for “Tagged Image File Format” or “Tagged Image Format”.
in scheme: kitmtxxls Tribology Lab at KIT
scope note: option

File (Surface Profilometry)
type: Concept
definition: Term containing a collection of metadata, each associated with a file or a series of files, generated as the output of a surface profilometry process and sharing the same metadata.
in scheme: kitmtxxls Tribology Lab at KIT
scope note: data
scope note: record

Version Date
type: Concept
definition: Release date of the version.
in scheme: kitmtxxls Tribology Lab at KIT
scope note: date

Front-Left-Top Intersection
type: Concept
definition: n/a
in scheme: kitmtxxls Tribology Lab at KIT
scope note: option

X Offset
type: Concept
definition: Instances of this class characterize the measurement offset in x-direction as defined by the equipment.
in scheme: kitmtxxls Tribology Lab at KIT
scope note: float
scope note: µm, nm, mm, m, cm

Gluing
type: Concept
definition: Glue secures a specimen's surface to the equipment's structure.
in scheme: kitmtxxls Tribology Lab at KIT
scope note: option

User Role
type: Concept
definition: Information about a user's role inside an institution's structure.
in scheme: kitmtxxls Tribology Lab at KIT
scope note: string

Combination of Data
type: Concept
definition: Denotes a process which takes multiple data sets as input and combines them into one.
in scheme: kitmtxxls Tribology Lab at KIT
scope note: option

Array of Info on Connected DAQs
type: Concept
definition: Collection containing information about all the installed DAQ boards relevant to the equipment's measurement.
in scheme: kitmtxxls Tribology Lab at KIT
scope note: dictionary

Height Fluctuation Range
type: Concept
definition: For unidrectional tribological experiments using a disc as basebody, this meta-information describes the maximum cyclic fluctuation in the disk's height with respect with the counterbody, before the experiment begins.
in scheme: kitmtxxls Tribology Lab at KIT
scope note: float
scope note: µm, nm, mm, m, cm

Line Contact
type: Concept
definition: E.g. pressing a cylinder with its curved side on a flat surface.
in scheme: kitmtxxls Tribology Lab at KIT
scope note: option

Heraeus
type: Concept
definition: n/a
in scheme: kitmtxxls Tribology Lab at KIT
scope note: option

Submission Date
type: Concept
definition: Date of submission.
in scheme: kitmtxxls Tribology Lab at KIT
scope note: date

Uncontrolled Environment Temperature
type: Concept
definition: The phenomenon called temperature of the surroundings.
in scheme: kitmtxxls Tribology Lab at KIT
scope note: float
scope note: K, °C

v5.5.1 build 3318
type: Concept
definition: n/a
in scheme: kitmtxxls Tribology Lab at KIT
scope note: option

Speed Setpoint
type: Concept
definition: The speed setting assigned to be maintained by the machine in a scientific process.
in scheme: kitmtxxls Tribology Lab at KIT
scope note: https://purls.helmholtz-metadaten.de/vp/kitmtxx-41732562-vp/iss_xxx_xxx-e436989ad73e4b5faefe3394ad4d6efa-vp: https://purls.helmholtz-metadaten.de/vp/kitmtxx-41732562-vp/mot_spe_set-c14ef139c217423b906a2bfcc2f3660e-vp
scope note: float
scope note: µm*s^(-1), mm*s^(-1), m*s^(-1), km*h^(-1)

Equipment Role
type: Concept
definition: Class containing the object's role/s as part of another object or process.
in scheme: kitmtxxls Tribology Lab at KIT
scope note: string

sum_power
type: Concept
definition: The total energy spent by the actuator.
in scheme: kitmtxxls Tribology Lab at KIT
scope note: float
scope note: W

System or Setup Inputs (Hardness Measurement)
type: Concept
definition: Class containing information about the parameters that are put into the involved scientific equipment to run it optimally.
in scheme: kitmtxxls Tribology Lab at KIT
scope note: dictionary

Z-00
type: Concept
definition: n/a
in scheme: kitmtxxls Tribology Lab at KIT
scope note: option

DTA-10D-CA
type: Concept
definition: Linear Position Sensors
in scheme: kitmtxxls Tribology Lab at KIT
scope note: option

Electrolyte Composition
type: Concept
definition: Contains information about the constituents of an electrolyte.
in scheme: kitmtxxls Tribology Lab at KIT
scope note: dictionary

*.txt
type: Concept
definition: A TXT file is an unformatted text file that doesn't require any special programs to be created or opened.
in scheme: kitmtxxls Tribology Lab at KIT
scope note: option

Minimum Normal Load
type: Concept
definition: Instances of this class represent the minimum permissable normal load.
in scheme: kitmtxxls Tribology Lab at KIT
scope note: float
scope note: N, kgf, gf

7-10-106
type: Concept
definition: n/a
in scheme: kitmtxxls Tribology Lab at KIT
scope note: option

Noise Dominant Frequency
type: Concept
definition: n/a
in scheme: kitmtxxls Tribology Lab at KIT
scope note: option

Consumables Used
type: Concept
definition: Class containing a collection of the consumables that participated in a scientific process.
in scheme: kitmtxxls Tribology Lab at KIT
scope note: dictionary

Heat Rods
type: Concept
definition: A rod heater is a cylindrical heating component used in high-temperature industrial applications, including tempering, hardening and baking.
in scheme: kitmtxxls Tribology Lab at KIT
scope note: option

Buehler
type: Concept
definition: Buehler, Esslingen am Neckar, Deutschland
in scheme: kitmtxxls Tribology Lab at KIT
scope note: option

ISO Standard
type: Concept
definition: Class containing information about the technical standard of the interfacial medium.
in scheme: kitmtxxls Tribology Lab at KIT
scope note: string

First Data Row
type: Concept
definition: Denotes the sequential number of the firs row in the tabular data file, which contains raw data values.
in scheme: kitmtxxls Tribology Lab at KIT
scope note: integer

Saphir 320
type: Concept
definition: The Saphir 320 is a single wheel grinder and polisher for working wheels Ø 200 - 250 mm.
in scheme: kitmtxxls Tribology Lab at KIT
scope note: option

KL 1500
type: Concept
definition: The KL 1500 HAL is a 150-watt halogen cold light source, developed and designed for industrial and life science applications in Stereo Microscopy and Macroscopy.
in scheme: kitmtxxls Tribology Lab at KIT
scope note: option

kgf
type: Concept
definition: kg force
in scheme: kitmtxxls Tribology Lab at KIT
scope note: option

Variable Motion Settings
type: Concept
definition: This collects the sequential steps which are executed by the machine and are associated with the relative motion of the specimens.
in scheme: kitmtxxls Tribology Lab at KIT
scope note: https://purls.helmholtz-metadaten.de/vp/kitmtxx-41732562-vp/was_xxx_xxx-3362f63dcded4e41aa5b40b49059f80a-vp: https://purls.helmholtz-metadaten.de/vp/kitmtxx-41732562-vp/var_exp_ste-587692585a9f4aed8d1a4a5ab9340fa5-vp
scope note: sub-workflow

Runtime Setpoint
type: Concept
definition: The duration setting assigned to be maintained by the machine in a tribological process.
in scheme: kitmtxxls Tribology Lab at KIT
scope note: float
scope note: s, min, h

Production Batch Number
type: Concept
definition: The batch number given by a manufacturer.
in scheme: kitmtxxls Tribology Lab at KIT
scope note: string

Specimen Storage Deposit
type: Concept
definition: The act of leaving a specimen at its storage location.
in scheme: kitmtxxls Tribology Lab at KIT
scope note: https://purls.helmholtz-metadaten.de/vp/kitmtxx-41732562-vp/isp_xxx_xxx-8e9a047582b24d5785b5689dd0ecda9b-vp: https://purls.helmholtz-metadaten.de/vp/kitmtxx-41732562-vp/obj_rec_xxx-5edd142fbbde41c3a65f9e6f846a18eb-vp
scope note: https://purls.helmholtz-metadaten.de/vp/kitmtxx-41732562-vp/isp_xxx_xxx-8e9a047582b24d5785b5689dd0ecda9b-vp: https://purls.helmholtz-metadaten.de/vp/kitmtxx-41732562-vp/sil_gel_ren-f60bab27338a4c45afe5c1ca3f4817a5-vp
scope note: https://purls.helmholtz-metadaten.de/vp/kitmtxx-41732562-vp/inv_xxx_xxx-c5ceb18203384c359584362949572590-vp: https://purls.helmholtz-metadaten.de/vp/kitmtxx-41732562-vp/blo_spe_xxx-ae137cec891644ec9e9d131be42ef67c-vp
scope note: https://purls.helmholtz-metadaten.de/vp/kitmtxx-41732562-vp/inv_xxx_xxx-c5ceb18203384c359584362949572590-vp: https://purls.helmholtz-metadaten.de/vp/kitmtxx-41732562-vp/sph_sto_box-fd80690682f44da3a7ea061b9ef6a7f7-vp
scope note: https://purls.helmholtz-metadaten.de/vp/kitmtxx-41732562-vp/inv_xxx_xxx-c5ceb18203384c359584362949572590-vp: https://purls.helmholtz-metadaten.de/vp/kitmtxx-41732562-vp/dry_cab_xxx-7382b1a7ced043e19f1c713d0e6f767e-vp
scope note: https://purls.helmholtz-metadaten.de/vp/kitmtxx-41732562-vp/inv_xxx_xxx-c5ceb18203384c359584362949572590-vp: https://purls.helmholtz-metadaten.de/vp/kitmtxx-41732562-vp/des_xxx_xxx-3ee63bf8276444389833022dc1d8c2a1-vp
scope note: process
scope note: record

*.dat File Technical Specifications
type: Concept
definition: Instances of this class contain the information to open/access/read and interpret a *.dat file's contents adequately.
in scheme: kitmtxxls Tribology Lab at KIT
scope note: dictionary

Technical Specifications (Hardness Testing System)
type: Concept
definition: Class containing information about the technical specifications of a hardness testing system.
in scheme: kitmtxxls Tribology Lab at KIT
scope note: dictionary

PI MiKroMove
type: Concept
definition: PIMikroMove is a general purpose graphical user interface for PI motion controllers.
in scheme: kitmtxxls Tribology Lab at KIT
scope note: option

S2.14
type: Concept
definition: n/a
in scheme: kitmtxxls Tribology Lab at KIT
scope note: option

Principle of Motion Delivery
type: Concept
definition: Field that holds information about the working principle of a subsystem.
in scheme: kitmtxxls Tribology Lab at KIT
scope note: string

Tactile Surface Profilometer
type: Concept
definition: Objects of this class pertain to the category of machines called tactile surface profilometer.
in scheme: kitmtxxls Tribology Lab at KIT
scope note: https://purls.helmholtz-metadaten.de/vp/kitmtxx-41732562-vp/ism_xxx_xxx-cd4f36f6200648d294054682584c8e2b-vp: https://purls.helmholtz-metadaten.de/vp/kitmtxx-41732562-vp/tac_sur_pro-ec98dbf380804321bb8aa65a96c41b24-vp
scope note: equipment
scope note: record

;
type: Concept
definition: n/a
in scheme: kitmtxxls Tribology Lab at KIT
scope note: option

Hardness Scale
type: Concept
definition: The unit that locks the meaning of the amount of the phenomenon of hardness. This gives the scale used for the measurement.
in scheme: kitmtxxls Tribology Lab at KIT
scope note: string

Time Series Data
type: Concept
definition: A multi-dimensional tabular data type with named columns and sequential row data values.
in scheme: kitmtxxls Tribology Lab at KIT
scope note: option

Polishing Medium
type: Concept
definition: Contains information describing a polishing medium.
in scheme: kitmtxxls Tribology Lab at KIT
scope note: consumable
scope note: record

Array of Software Used
type: Concept
definition: Class containing information about the software used to process the data after its initial collection and recording.
in scheme: kitmtxxls Tribology Lab at KIT
scope note: dictionary

Total Traveled Distance
type: Concept
definition: Information about the "distance equivalent" that an experimental contact has been exposed to by the end of an experiment.
in scheme: kitmtxxls Tribology Lab at KIT
scope note: float
scope note: µm, nm, mm, m, cm

Petroleum Spirit (Ligroin)
type: Concept
definition: Ligroin is the petroleum fraction consisting mostly of C7 and C8 hydrocarbons and boiling in the range 90‒140 °C (194–284 °F). The fraction is also called heavy naphtha.[1][2] Ligroin is used as a laboratory solvent. In German: Leichtbenzin
in scheme: kitmtxxls Tribology Lab at KIT
scope note: option

Visualization of Plane Fit to Raw Data
type: Concept
definition: n/a
in scheme: kitmtxxls Tribology Lab at KIT
scope note: option

Structural Information
type: Concept
definition: A collection containing information about the technical Structural Specifications of a piece of lab equipment.
in scheme: kitmtxxls Tribology Lab at KIT
scope note: dictionary

null
type: Concept
definition: Equvallent to not entering any value - the preferred solution. Usually denotes a proportion - like "times" something, for example, magnification; or some type of count a count.
in scheme: kitmtxxls Tribology Lab at KIT
scope note: option

ICE detector
type: Concept
definition: Ion conversion and electron detector
in scheme: kitmtxxls Tribology Lab at KIT
scope note: option

Dual Beam Helios NanoLab 650
type: Concept
definition: The Dual Beam Helios 600 model consists of a 30 kV field-emission scanning electron column and a 30 kV Ga focused ion beam placed at 52º one from each other. The Dual Beam Helios 650 model is an improved version of the Helios 600 one. Thus, the SEM column has resolution of 0.9 nm and it bears a monochromator and beam deceleration.
in scheme: kitmtxxls Tribology Lab at KIT
scope note: option

Ultrasonic Cleaning
type: Concept
definition: The process of ultrasonic cleaning a sample immersed in a liquid medium (solvent).
in scheme: kitmtxxls Tribology Lab at KIT
scope note: option

Controller Attributes
type: Concept
definition: Class containing attributes about the installed subsystems' controller responsible for making parts move/act in the tribometer.
in scheme: kitmtxxls Tribology Lab at KIT
scope note: dictionary

Autodesk Fusion 360
type: Concept
definition: CAD program
in scheme: kitmtxxls Tribology Lab at KIT
scope note: option

Kinematic Mount and Bolt
type: Concept
definition: A bolt or bolts compressing the specimen directly to a kinematic mount, which in turn is attached to the equipment's structure.
in scheme: kitmtxxls Tribology Lab at KIT
scope note: option

6.1
type: Concept
definition: n/a
in scheme: kitmtxxls Tribology Lab at KIT
scope note: option

iFast Developer's Kit
type: Concept
definition: The iFast Developer's Tool Kit combines the flexibility of scripting with the ease of use of graphical programming to make recipe creation faster and easier to fit their specific needs.
in scheme: kitmtxxls Tribology Lab at KIT
scope note: option

Thickness
type: Concept
definition: The specification of an object defining its thickness.
in scheme: kitmtxxls Tribology Lab at KIT
scope note: float
scope note: µm, nm, mm, m, cm

File (Electron Microscopy)
type: Concept
definition: Term containing a collection of metadata, each associated with a file or a series of files, generated as the output of an electron microscopy process and sharing the same metadata.
in scheme: kitmtxxls Tribology Lab at KIT
scope note: data
scope note: record

Ultrasonic Cleaner
type: Concept
definition: Objects of this class pertain to the category of machines called ultrasonic cleaner.
in scheme: kitmtxxls Tribology Lab at KIT
scope note: https://purls.helmholtz-metadaten.de/vp/kitmtxx-41732562-vp/ism_xxx_xxx-cd4f36f6200648d294054682584c8e2b-vp: https://purls.helmholtz-metadaten.de/vp/kitmtxx-41732562-vp/ult_cle_xxx-192eb37ff24644798963cd87107e9a5f-vp
scope note: equipment
scope note: record

Processed Topography Data
type: Concept
definition: n/a
in scheme: kitmtxxls Tribology Lab at KIT
scope note: option

TLD detector
type: Concept
definition: Through-the-lens electron detector for SEM.
in scheme: kitmtxxls Tribology Lab at KIT
scope note: option

Deposition or Cut Settings
type: Concept
definition: Contains information about the settings of the Cross Section Cutting Step.
in scheme: kitmtxxls Tribology Lab at KIT
scope note: dictionary

-105
type: Concept
definition: n/a
in scheme: kitmtxxls Tribology Lab at KIT
scope note: option

Y-Dimension
type: Concept
definition: The size along the y dimension.
in scheme: kitmtxxls Tribology Lab at KIT
scope note: float
scope note: µm, nm, mm, m, cm

Category 2
type: Concept
definition: n/a
in scheme: kitmtxxls Tribology Lab at KIT
scope note: option

Vacuum Pressure
type: Concept
definition: Pressure of the reached vacuum.
in scheme: kitmtxxls Tribology Lab at KIT
scope note: float
scope note: Pa, MPa, mbar

Starting Direction
type: Concept
definition: The intial direction of motion when the relative motion sets in.
in scheme: kitmtxxls Tribology Lab at KIT
scope note: string

Left
type: Concept
definition: n/a
in scheme: kitmtxxls Tribology Lab at KIT
scope note: option

Grinding Disk
type: Concept
definition: A reusable substrate which holds abrasive medium.
in scheme: kitmtxxls Tribology Lab at KIT
scope note: option

MW 210-13-3
type: Concept
definition: n/a
in scheme: kitmtxxls Tribology Lab at KIT
scope note: option

5317-0180
type: Concept
definition: Acrylic Desiccator Cabinet
in scheme: kitmtxxls Tribology Lab at KIT
scope note: option

Disk Rotation Angle
type: Concept
definition: As measured from the feature-indicated mark.
in scheme: kitmtxxls Tribology Lab at KIT
scope note: float
scope note: °

Tribologically Loaded Side
type: Concept
definition: The side of specimen that is loaded during a particular experiment.
in scheme: kitmtxxls Tribology Lab at KIT
scope note: string

Composition Information
type: Concept
definition: A natural-language description of the composition of the medium.
in scheme: kitmtxxls Tribology Lab at KIT
scope note: string

Raw Data Reshaping and Augmentation Script
type: Concept
definition: n/a
in scheme: kitmtxxls Tribology Lab at KIT
scope note: option

Maximum Specimen Height With Ceramic Cup Mounted
type: Concept
definition: The maximum height a workpiece/sample is allowed to have when a (previously unused) ceramic grinding cup is mounted.
in scheme: kitmtxxls Tribology Lab at KIT
scope note: float
scope note: µm, nm, mm, m, cm

Dorfner Schleifmittel GmbH Leonberg
type: Concept
definition: n/a
in scheme: kitmtxxls Tribology Lab at KIT
scope note: option

Heat Treatment
type: Concept
definition: Class representing the physical process of thermal treatment of a specimen with the aim of changing its selfcontained physical characteristcs.
in scheme: kitmtxxls Tribology Lab at KIT
scope note: https://purls.helmholtz-metadaten.de/vp/kitmtxx-41732562-vp/emp_xxx_xxx-b0c09f9f6cd948839bac12aa4a2ad55d-vp: https://purls.helmholtz-metadaten.de/vp/kitmtxx-41732562-vp/fur_xxx_xxx-c04aefd269c64c6fa2773c318193f2d6-vp
scope note: https://purls.helmholtz-metadaten.de/vp/kitmtxx-41732562-vp/phy_xxx_xxx-3c41e6aa10d14a51b0c7a950b897fbba-vp: https://purls.helmholtz-metadaten.de/vp/kitmtxx-41732562-vp/blo_spe_xxx-ae137cec891644ec9e9d131be42ef67c-vp
scope note: process
scope note: record

Loading
type: Concept
definition: n/a
in scheme: kitmtxxls Tribology Lab at KIT
scope note: option

Counterclockwise
type: Concept
definition: n/a
in scheme: kitmtxxls Tribology Lab at KIT
scope note: option

Stream File
type: Concept
definition: With the exception of the original "library" file system, most of the file systems in the IFS store their objects in the "loosely-defined" file structure that's common in Windows and UNIX environments. This type of object is known as a "stream file" because the data in it is thought of as "one continuous stream of bytes."
in scheme: kitmtxxls Tribology Lab at KIT
scope note: option

Camera for Chamber View
type: Concept
definition: n/a
in scheme: kitmtxxls Tribology Lab at KIT
scope note: option

General Info (Software)
type: Concept
definition: Objects of this class contain information that describes the data.
in scheme: kitmtxxls Tribology Lab at KIT
scope note: dictionary

Tensile Test
type: Concept
definition: Class representing the execution of a tensile test to examine the strength of a specimen until failure.
in scheme: kitmtxxls Tribology Lab at KIT
scope note: https://purls.helmholtz-metadaten.de/vp/kitmtxx-41732562-vp/emp_xxx_xxx-b0c09f9f6cd948839bac12aa4a2ad55d-vp: https://purls.helmholtz-metadaten.de/vp/kitmtxx-41732562-vp/ten_tes_xxx-b4b8ff243b17440d8da2fbf943194381-vp
scope note: https://purls.helmholtz-metadaten.de/vp/kitmtxx-41732562-vp/cha_xxx_xxx-5b70f2376c68474381ef5cc428fe240b-vp: https://purls.helmholtz-metadaten.de/vp/kitmtxx-41732562-vp/blo_spe_xxx-ae137cec891644ec9e9d131be42ef67c-vp
scope note: process
scope note: record

Grinding Process Parameters
type: Concept
definition: Term containing information about the parameters specific to the process.
in scheme: kitmtxxls Tribology Lab at KIT
scope note: dictionary

Specimen Storage Handling
type: Concept
definition: The act of depositing a specimen into a storage location or taking a specimen away from its storage location.
in scheme: kitmtxxls Tribology Lab at KIT
scope note: https://purls.helmholtz-metadaten.de/vp/kitmtxx-41732562-vp/was_xxx_xxx-3362f63dcded4e41aa5b40b49059f80a-vp: https://purls.helmholtz-metadaten.de/vp/kitmtxx-41732562-vp/spe_sto_tak-ca54647367f14761b955711dd9e42705-vp
scope note: https://purls.helmholtz-metadaten.de/vp/kitmtxx-41732562-vp/was_xxx_xxx-3362f63dcded4e41aa5b40b49059f80a-vp: https://purls.helmholtz-metadaten.de/vp/kitmtxx-41732562-vp/spe_sto_dep-b91f98713fa240328d26ca685a839e59-vp
scope note: https://purls.helmholtz-metadaten.de/vp/kitmtxx-41732562-vp/wit_xxx_xxx-248b6aaeb28745deb2f61cb6e2bc9c23-vp: https://purls.helmholtz-metadaten.de/vp/kitmtxx-41732562-vp/blo_spe_xxx-ae137cec891644ec9e9d131be42ef67c-vp
scope note: https://purls.helmholtz-metadaten.de/vp/kitmtxx-41732562-vp/wit_xxx_xxx-248b6aaeb28745deb2f61cb6e2bc9c23-vp: https://purls.helmholtz-metadaten.de/vp/kitmtxx-41732562-vp/coa_spe_xxx-06aef9c123824fa28b3b5f19c6a5633f-vp
scope note: https://purls.helmholtz-metadaten.de/vp/kitmtxx-41732562-vp/dep_xxx_xxx-7450d50e913c4db8b42bb5f933111c1a-vp: https://purls.helmholtz-metadaten.de/vp/kitmtxx-41732562-vp/blo_spe_xxx-ae137cec891644ec9e9d131be42ef67c-vp
scope note: https://purls.helmholtz-metadaten.de/vp/kitmtxx-41732562-vp/dep_xxx_xxx-7450d50e913c4db8b42bb5f933111c1a-vp: https://purls.helmholtz-metadaten.de/vp/kitmtxx-41732562-vp/coa_spe_xxx-06aef9c123824fa28b3b5f19c6a5633f-vp
scope note: https://purls.helmholtz-metadaten.de/vp/kitmtxx-41732562-vp/inv_xxx_xxx-c5ceb18203384c359584362949572590-vp: https://purls.helmholtz-metadaten.de/vp/kitmtxx-41732562-vp/dry_cab_xxx-7382b1a7ced043e19f1c713d0e6f767e-vp
scope note: https://purls.helmholtz-metadaten.de/vp/kitmtxx-41732562-vp/inv_xxx_xxx-c5ceb18203384c359584362949572590-vp: https://purls.helmholtz-metadaten.de/vp/kitmtxx-41732562-vp/sph_sto_box-fd80690682f44da3a7ea061b9ef6a7f7-vp
scope note: https://purls.helmholtz-metadaten.de/vp/kitmtxx-41732562-vp/inv_xxx_xxx-c5ceb18203384c359584362949572590-vp: https://purls.helmholtz-metadaten.de/vp/kitmtxx-41732562-vp/des_xxx_xxx-3ee63bf8276444389833022dc1d8c2a1-vp
scope note: process
scope note: record

Mass Density
type: Concept
definition: The specification of an object defining its mass density.
in scheme: kitmtxxls Tribology Lab at KIT
scope note: float
scope note: kg*m^(-3)

stressesAsBaseBody
type: Concept
definition: Denotes that a given process stresses a given block specimen as a base body in the relevant process. A clear definition of what is to be called ""base body"" and what ""counter body"" in a tribologcial system does not exist. We therefore will use the following set of definitions — whereby always the first applicable definition should be used in a given case (going through the list from top to bottom): The Base body in a model experiment is the sample or body... ...whose nominal contact area is not permanently tribologically stressed during the experiment. ...that is larger. ...expected to show less wear at the end of the experiment. ...that is static during the experiment.
in scheme: kitmtxxls Tribology Lab at KIT
scope note: none
scope note: relationship_type

Kistler
type: Concept
definition: n/a
in scheme: kitmtxxls Tribology Lab at KIT
scope note: option

IAM-CMS
type: Concept
definition: Institute for Applied kitmtxxls - Computational kitmtxxls Science. Siezed to exist in 2022, and split into IAM-ZM and IAM-MMS.
in scheme: kitmtxxls Tribology Lab at KIT
scope note: https://purls.helmholtz-metadaten.de/vp/kitmtxx-41732562-vp/iss_xxx_xxx-8555a76208e943669a78ac8e37d61661-vp: https://purls.helmholtz-metadaten.de/vp/kitmtxx-41732562-vp/iam_xxx_xxx-7171b8a9ac9a40f4834d2c0428d66738-vp
scope note: option

Available Subsystems Information
type: Concept
definition: Term containing information about subsystems which offer additional functionality to the machine.
in scheme: kitmtxxls Tribology Lab at KIT
scope note: dictionary

Statement
type: Concept
definition: A statement stores a fact, observation or other bit of information as a text input. This can range from the statement, that the temperature is too high or that a specific observation was made in a graph or image.
in scheme: kitmtxxls Tribology Lab at KIT
scope note: concept
scope note: record

Corundum
type: Concept
definition: Corundum is a rock-forming mineral that is found in igneous, metamorphic, and sedimentary rocks. It is an aluminum oxide with a chemical composition of Al2O3 and a member of the trigonal crystal system.
in scheme: kitmtxxls Tribology Lab at KIT
scope note: option

FIB Cutting Position
type: Concept
definition: Contains information on where FIB cutting is conducted, e.g., “in the center of wear track #XY”.
in scheme: kitmtxxls Tribology Lab at KIT
scope note: string

ImageJ
type: Concept
definition: Schneider, C. A., Rasband, W. S., & Eliceiri, K. W. (2012). NIH Image to ImageJ: 25 years of image analysis. Nature Methods, 9(7), 671–675. doi:10.1038/nmeth.2089
in scheme: kitmtxxls Tribology Lab at KIT
scope note: option

-104
type: Concept
definition: n/a
in scheme: kitmtxxls Tribology Lab at KIT
scope note: option

Jumo dTRON 04.1
type: Concept
definition: Compact microprocessor controller
in scheme: kitmtxxls Tribology Lab at KIT
scope note: option

Datatype Class
type: Concept
definition: Instances of this class give the class of values to read in a file.
in scheme: kitmtxxls Tribology Lab at KIT
scope note: string

Raw Data
type: Concept
definition: Raw data, oftentimes referred to as source or primary data, is data that hasn’t been processed, coded, formatted, or yet analyzed for useful information.
in scheme: kitmtxxls Tribology Lab at KIT
scope note: option

Reshaped Raw Data
type: Concept
definition: n/a
in scheme: kitmtxxls Tribology Lab at KIT
scope note: option

Stylus Tip Type
type: Concept
definition: Instances of this class specify the classification type of stylus tip.
in scheme: kitmtxxls Tribology Lab at KIT
scope note: string

Radial Position on Disk
type: Concept
definition: Instances of this class characterize the contact position with respect to the center of a disc in a pin-on-disc tribological experiment.
in scheme: kitmtxxls Tribology Lab at KIT
scope note: float
scope note: µm, nm, mm, m, cm

Acoustic Emission Sensor 1 Peak Value (Measured)
type: Concept
definition: Peak value of acoustic emissions signal within one motion period.
in scheme: kitmtxxls Tribology Lab at KIT
scope note: option

nm
type: Concept
definition: A nanometer (nm) is a unit of length in the metric system, equal to one billionth of a meter (1 x 10-9 m).
in scheme: kitmtxxls Tribology Lab at KIT
scope note: option

FIB Cutting Steps Array
type: Concept
definition: Term containing the ordered list of sequential steps, in terms of parameters, specific to the process.
in scheme: kitmtxxls Tribology Lab at KIT
scope note: sub-workflow

Micro-Epsilon Eltrotec GmbH
type: Concept
definition: Göppingen, Germany
in scheme: kitmtxxls Tribology Lab at KIT
scope note: option

Immersion Mode
type: Concept
definition: Immersive Mode, also known as full screen mode on Android, hides the status and navigation bars while using certain apps.
in scheme: kitmtxxls Tribology Lab at KIT
scope note: option

Measurement Results (Weighing)
type: Concept
definition: Compiles measurement results from weighing.
in scheme: kitmtxxls Tribology Lab at KIT
scope note: dictionary

Polishing Medium Information
type: Concept
definition: Contains information about the polishing medium used during the process.
in scheme: kitmtxxls Tribology Lab at KIT
scope note: dictionary

M-404.2DG
type: Concept
definition: Precision linear stage
in scheme: kitmtxxls Tribology Lab at KIT
scope note: option

X-direction Measurement Resolution
type: Concept
definition: Instances of this class represent the x-axis/main lateral axis/fast axis resolution that the system can capture.
in scheme: kitmtxxls Tribology Lab at KIT
scope note: float
scope note: µm, nm, mm, m, cm

space
type: Concept
definition: An empty space
in scheme: kitmtxxls Tribology Lab at KIT
scope note: option

Z-direction Minimum Measurement Speed
type: Concept
definition: Instances of this class represent the minimum z-direction (vertical) speed at which the system can capture.
in scheme: kitmtxxls Tribology Lab at KIT
scope note: float
scope note: µm*s^(-1), mm*s^(-1), m*s^(-1), km*h^(-1)

Abrasive Paper
type: Concept
definition: A substrate which holds abrasive medium
in scheme: kitmtxxls Tribology Lab at KIT
scope note: option

Coarse Roughness Adjustment
type: Concept
definition: Reduce sample roughness — which resulted e.g. from previous grinding steps — to get closer to the targeted final roughness.
in scheme: kitmtxxls Tribology Lab at KIT
scope note: option

Position Reading Resolution
type: Concept
definition: The resolution of the position reading system.
in scheme: kitmtxxls Tribology Lab at KIT
scope note: float
scope note: µm, nm, mm, m, cm

White Light Interferometry
type: Concept
definition: White light interferometers are interferometers using broadband light inputs.
in scheme: kitmtxxls Tribology Lab at KIT
scope note: option

Mass
type: Concept
definition: The specification of an object defining its mass.
in scheme: kitmtxxls Tribology Lab at KIT
scope note: float
scope note: t, kg, g, mg, µg

CoF Time Series
type: Concept
definition: Contains coefficient of friction time series data.
in scheme: kitmtxxls Tribology Lab at KIT
scope note: option

Measurement Principle
type: Concept
definition: The principle by which a sensor operates.
in scheme: kitmtxxls Tribology Lab at KIT
scope note: string

Grinding Equipment
type: Concept
definition: Term containing information about the equipment used during the grinding process.
in scheme: kitmtxxls Tribology Lab at KIT
scope note: dictionary

FIB Stub Detachment
type: Concept
definition: This process documents the detachment of a specimen from a FIB stub.
in scheme: kitmtxxls Tribology Lab at KIT
scope note: process
scope note: record

Sliding Track Length
type: Concept
definition: Length between both end points of the sliding track.
in scheme: kitmtxxls Tribology Lab at KIT
scope note: float
scope note: mm

003
type: Concept
definition: n/a
in scheme: kitmtxxls Tribology Lab at KIT
scope note: option

Number of Files
type: Concept
definition: Number of files used or generated by a process.
in scheme: kitmtxxls Tribology Lab at KIT
scope note: integer

Bottom To Top
type: Concept
definition: The beam scan the pattern from bottom to top.
in scheme: kitmtxxls Tribology Lab at KIT
scope note: option

mm
type: Concept
definition: n/a
in scheme: kitmtxxls Tribology Lab at KIT
scope note: option

Delimiter
type: Concept
definition: Instances of this class specify the delimiter used in a file.
in scheme: kitmtxxls Tribology Lab at KIT
scope note: string

Periphery Info
type: Concept
definition: Term containing information about the periphery components connected to a piece of equipment.
in scheme: kitmtxxls Tribology Lab at KIT
scope note: dictionary

Replenishment Rate
type: Concept
definition: The amount of interfacial medium supplied to a process per time, when continuous replenishment setting is used.
in scheme: kitmtxxls Tribology Lab at KIT
scope note: float
scope note: ml*h^(-1)

Width
type: Concept
definition: The specification of an object defining its width.
in scheme: kitmtxxls Tribology Lab at KIT
scope note: float
scope note: µm, nm, mm, m, cm

Setup Start Time
type: Concept
definition: Subsection holds information about when the setup of an experiment was started.
in scheme: kitmtxxls Tribology Lab at KIT
scope note: date

kitmtxxl Category (Interfacial Medium)
type: Concept
definition: The lubricant class which interfacial medium fits into best.
in scheme: kitmtxxls Tribology Lab at KIT
scope note: string

Embedding
type: Concept
alternative label: mounting
definition: A process that prepares a specimen for metalography like grinding, polishing, etching and light microscopy.
in scheme: kitmtxxls Tribology Lab at KIT
scope note: https://purls.helmholtz-metadaten.de/vp/kitmtxx-41732562-vp/inv_xxx_xxx-c5ceb18203384c359584362949572590-vp: https://purls.helmholtz-metadaten.de/vp/kitmtxx-41732562-vp/blo_spe_xxx-ae137cec891644ec9e9d131be42ef67c-vp
scope note: https://purls.helmholtz-metadaten.de/vp/kitmtxx-41732562-vp/phy_xxx_xxx-3c41e6aa10d14a51b0c7a950b897fbba-vp: https://purls.helmholtz-metadaten.de/vp/kitmtxx-41732562-vp/blo_spe_xxx-ae137cec891644ec9e9d131be42ef67c-vp
scope note: process
scope note: record

MaTecK kitmtxxl-Technologie & Kristalle GmbH
type: Concept
definition: n/a
in scheme: kitmtxxls Tribology Lab at KIT
scope note: option

Dry Cabinet
type: Concept
definition: A place that is sealed from the surrounding environment, and contains some way of maintaining low humidity, for example, through silica gels.
in scheme: kitmtxxls Tribology Lab at KIT
scope note: https://purls.helmholtz-metadaten.de/vp/kitmtxx-41732562-vp/con_xxx_xxx-cd1629e056794eae8c5292cd9f6f66b9-vp: https://purls.helmholtz-metadaten.de/vp/kitmtxx-41732562-vp/sph_sto_box-fd80690682f44da3a7ea061b9ef6a7f7-vp
scope note: https://purls.helmholtz-metadaten.de/vp/kitmtxx-41732562-vp/con_xxx_xxx-cd1629e056794eae8c5292cd9f6f66b9-vp: https://purls.helmholtz-metadaten.de/vp/kitmtxx-41732562-vp/blo_spe_xxx-ae137cec891644ec9e9d131be42ef67c-vp
scope note: equipment
scope note: record

Targeted Normal Load
type: Concept
definition: The targeted normal load as a function of another direct input (e.g. dead weight) at the beginning of a process.
in scheme: kitmtxxls Tribology Lab at KIT
scope note: https://purls.helmholtz-metadaten.de/vp/kitmtxx-41732562-vp/iss_xxx_xxx-e436989ad73e4b5faefe3394ad4d6efa-vp: https://purls.helmholtz-metadaten.de/vp/kitmtxx-41732562-vp/nor_loa_set-314656cefcc44a79b756a272ca8cf9a9-vp
scope note: float
scope note: mN, N, kgf, gf

X Offset Between Profiles
type: Concept
definition: Instances of this class characterize the measurement offset in x-direction when multiple profiles from the same sample are taken.
in scheme: kitmtxxls Tribology Lab at KIT
scope note: float
scope note: µm, nm, mm, m, cm

DOI
type: Concept
definition: A DOI is a Digital Object Identifier and is an identifier of any object — physical, digital, or abstract.
in scheme: kitmtxxls Tribology Lab at KIT
scope note: string

Controlled Inputs (Active Controls)
type: Concept
definition: A collection of the variables which drive the execution of an experiment. The kinetics and kinematics.
in scheme: kitmtxxls Tribology Lab at KIT
scope note: dictionary

isModifiedVersionOf
type: Concept
definition: When an object preserves its original main function/characteristics, but has parts modified, then it is a new version of itself.
in scheme: kitmtxxls Tribology Lab at KIT
scope note: none
scope note: relationship_type

Pre-Tilt
type: Concept
definition: The angle that is introduced by the sample holder to angle the specimen for measurements outside of the tilt range of the electron microscope stage.
in scheme: kitmtxxls Tribology Lab at KIT
scope note: float
scope note: °

D46
type: Concept
definition: n/a
in scheme: kitmtxxls Tribology Lab at KIT
scope note: option

Location Information
type: Concept
definition: Class containing a collection of pieces of information about where a process occured, or an object typically resides or is stored.
in scheme: kitmtxxls Tribology Lab at KIT
scope note: dictionary

Process Summary (Electron Microscopy)
type: Concept
definition: Class containing information about the electron microscopy session.
in scheme: kitmtxxls Tribology Lab at KIT
scope note: dictionary

ai6
type: Concept
definition: n/a
in scheme: kitmtxxls Tribology Lab at KIT
scope note: option

Metal Sawing
type: Concept
definition: Class representing the physical process of separating metal bodies for eventual use in scientific process or equipment.
in scheme: kitmtxxls Tribology Lab at KIT
scope note: https://purls.helmholtz-metadaten.de/vp/kitmtxx-41732562-vp/phy_xxx_xxx-9da2eadd1cba429c8381945b334fe39c-vp: https://purls.helmholtz-metadaten.de/vp/kitmtxx-41732562-vp/blo_spe_xxx-ae137cec891644ec9e9d131be42ef67c-vp
scope note: https://purls.helmholtz-metadaten.de/vp/kitmtxx-41732562-vp/phy_xxx_xxx-3c41e6aa10d14a51b0c7a950b897fbba-vp: https://purls.helmholtz-metadaten.de/vp/kitmtxx-41732562-vp/blo_spe_xxx-ae137cec891644ec9e9d131be42ef67c-vp
scope note: https://purls.helmholtz-metadaten.de/vp/kitmtxx-41732562-vp/emp_xxx_xxx-b0c09f9f6cd948839bac12aa4a2ad55d-vp: https://purls.helmholtz-metadaten.de/vp/kitmtxx-41732562-vp/wir_saw_xxx-25611f86ae4d460a9747e0f5c301d8a0-vp
scope note: https://purls.helmholtz-metadaten.de/vp/kitmtxx-41732562-vp/emp_xxx_xxx-b0c09f9f6cd948839bac12aa4a2ad55d-vp: https://purls.helmholtz-metadaten.de/vp/kitmtxx-41732562-vp/ban_saw_xxx-12c7e62cfce14dc783d3015895fc400e-vp
scope note: https://purls.helmholtz-metadaten.de/vp/kitmtxx-41732562-vp/emp_xxx_xxx-b0c09f9f6cd948839bac12aa4a2ad55d-vp: https://purls.helmholtz-metadaten.de/vp/kitmtxx-41732562-vp/saw_bla_xxx-99b624c642ed43b1b6cf21cb17b7ceb6-vp
scope note: process
scope note: record

Object Receival
type: Concept
definition: The event where a specific delivery arrives at the institution.
in scheme: kitmtxxls Tribology Lab at KIT
scope note: https://purls.helmholtz-metadaten.de/vp/kitmtxx-41732562-vp/inv_xxx_xxx-c5ceb18203384c359584362949572590-vp: https://purls.helmholtz-metadaten.de/vp/kitmtxx-41732562-vp/sph_sto_box-fd80690682f44da3a7ea061b9ef6a7f7-vp
scope note: process
scope note: record

Temperature Control Method
type: Concept
definition: The objects of this class specify the type of equipment installed in a device for cooling/heating a sample directly.
in scheme: kitmtxxls Tribology Lab at KIT
scope note: string

Piecewise Speed Parameters
type: Concept
definition: A bundle of parameters which prescribes the speed at particular positions. The speed in-between the prescribed points can be found by linear interpolation.
in scheme: kitmtxxls Tribology Lab at KIT
scope note: dictionary

Interfacial Medium Presence
type: Concept
definition: An indicator about the presence of interfacial medium, which is of fundamental importance to the the experiment. For example, a lubricant.
in scheme: kitmtxxls Tribology Lab at KIT
scope note: boolean

Struers GmbH
type: Concept
definition: Willich, Germany
in scheme: kitmtxxls Tribology Lab at KIT
scope note: option

Analysis of Processed Data
type: Concept
definition: Denotes a process which takes processed data as input and analyses it.
in scheme: kitmtxxls Tribology Lab at KIT
scope note: option

Keyence Deutschland GmbH
type: Concept
definition: Neu-Isenburg, Germany
in scheme: kitmtxxls Tribology Lab at KIT
scope note: option

Hommel-Etamic
type: Concept
definition: n/a
in scheme: kitmtxxls Tribology Lab at KIT
scope note: option

pile_up_left_volume_um3
type: Concept
definition: Volume of the left pile-up measured in the profile in µm^3
in scheme: kitmtxxls Tribology Lab at KIT
scope note: float
scope note: nm^3, µm^3, mm^3, m^3

License
type: Concept
definition: License for software, data etc.
in scheme: kitmtxxls Tribology Lab at KIT
scope note: string

Magnetic
type: Concept
definition: A magnet secures a specimen's surface to the equipment's structure.
in scheme: kitmtxxls Tribology Lab at KIT
scope note: option

Tribological Interest Side(s)
type: Concept
definition: The principal tribological side/s of interest. Defined by ISO (not US) technical drawing standards. Valid after a feature and its side have been defined.
in scheme: kitmtxxls Tribology Lab at KIT
scope note: string

Z-200
type: Concept
definition: n/a
in scheme: kitmtxxls Tribology Lab at KIT
scope note: option

Maximum Head Speed
type: Concept
definition: Maximum head speed at which the machine can operate.
in scheme: kitmtxxls Tribology Lab at KIT
scope note: float
scope note: min^(-1)

Technical Specifications (Sawing Blade)
type: Concept
definition: Term containing information about the technical specifications of a sawing blade.
in scheme: kitmtxxls Tribology Lab at KIT
scope note: dictionary

Batch Number
type: Concept
definition: A batch number is a designation given to products made in the same manufacturing run. A batch number can consist of numerals, letters, or symbols, and it allows the items to be traced after they've been distributed.
in scheme: kitmtxxls Tribology Lab at KIT
scope note: string

VHX-600
type: Concept
definition: The Keyence VHX-600 digital microscope has a 54 mega-pixel 3CCD with exceptional image resolution and color accuracy.
in scheme: kitmtxxls Tribology Lab at KIT
scope note: option

X-Dimension
type: Concept
definition: The size along the x dimension.
in scheme: kitmtxxls Tribology Lab at KIT
scope note: float
scope note: µm, nm, mm, m, cm

Precision Scale
type: Concept
definition: Objects of this class pertain to the category of machines called precision scale.
in scheme: kitmtxxls Tribology Lab at KIT
scope note: equipment
scope note: record

Bruker Nano Analytics
type: Concept
definition: A unique range of analytical tools for materials characterization in electron microscopes.
in scheme: kitmtxxls Tribology Lab at KIT
scope note: option

Reciprocating
type: Concept
definition: n/a
in scheme: kitmtxxls Tribology Lab at KIT
scope note: option

Cup Grinding Tool Type
type: Concept
definition: Instances of this class specify the classification type of cup grinding tool.
in scheme: kitmtxxls Tribology Lab at KIT
scope note: string

Actual Sampling Rate
type: Concept
definition: The actual sample rate of the time series. Please note that this might not be the same as the sample rate setpoint used when conducting the experiment.
in scheme: kitmtxxls Tribology Lab at KIT
scope note: float
scope note: min^(-1), kHz, Hz

Pin-on-Disc Machine
type: Concept
definition: The ball, or pin on disk, wear testing machine presses stationary pin or ball against the rotating disk. Measure coefficient of friction (COF), friction force, wear rate, wear volume, temperature, and several other tribology parameters.
in scheme: kitmtxxls Tribology Lab at KIT
scope note: option

SE Detector R580
type: Concept
definition: n/a
in scheme: kitmtxxls Tribology Lab at KIT
scope note: option

Mass amount
type: Concept
definition: Mass amount of an ingredient.
in scheme: kitmtxxls Tribology Lab at KIT
scope note: float
scope note: kg, g, mg

Technical Specifications (Tactile Surface Profilometer)
type: Concept
definition: Class containing information about the technical specifications of a tactile surface profilometer.
in scheme: kitmtxxls Tribology Lab at KIT
scope note: dictionary

Back and Forth
type: Concept
definition: moving first in one direction and then in the opposite one
in scheme: kitmtxxls Tribology Lab at KIT
scope note: option

Results and Summary
type: Concept
definition: Class containing summary or derived information after the experiment has finished. All derived information stems from the information recorded in other locations of the record, such as the files.
in scheme: kitmtxxls Tribology Lab at KIT
scope note: dictionary

Publishing Date
type: Concept
definition: Date of publication.
in scheme: kitmtxxls Tribology Lab at KIT
scope note: date

OFHC Copper
type: Concept
definition: Oxygen-Free High thermal conductivity Copper, also referred to as Oxygen-free copper (OFC), is a group of high conductivity copper alloys that are refined electrolytically to keep the level of oxygen to as low as 0.001% or below. Characteristics of OFHC copper are more ductility, high thermal & electrical conductivity, high impact strength, more resistance and an easier welding process.
in scheme: kitmtxxls Tribology Lab at KIT
scope note: option

Plate
type: Concept
definition: n/a
in scheme: kitmtxxls Tribology Lab at KIT
scope note: option

Electropolishing Voltage
type: Concept
definition: The voltage used for electropolishing varies depending on the type of metal being treated, but it typically ranges from 2 to 25 volts.
in scheme: kitmtxxls Tribology Lab at KIT
scope note: float
scope note: V

W
type: Concept
definition: n/a
in scheme: kitmtxxls Tribology Lab at KIT
scope note: option

Lab Bench
type: Concept
definition: n/a
in scheme: kitmtxxls Tribology Lab at KIT
scope note: option

kB
type: Concept
definition: A kilobyte (KB or Kbyte) is a unit of measurement for computer memory or data storage.
in scheme: kitmtxxls Tribology Lab at KIT
scope note: option

originatesFromSpecimen
type: Concept
definition: Relates a scientific process to the objects which are physically established as its result. It can also mean it is a combination/separation of other objects, or their subparts. This property relates the parent to the child object.
in scheme: kitmtxxls Tribology Lab at KIT
scope note: none
scope note: relationship_type

V-408.232020
type: Concept
definition: V-408 PIMag® Linear Stage
in scheme: kitmtxxls Tribology Lab at KIT
scope note: option

Location Information (Relative)
type: Concept
definition: The location in relation to another abject, for example, the shelf number within a dry box (which is linked in general to the object of description).
in scheme: kitmtxxls Tribology Lab at KIT
scope note: dictionary

Electron Microscopy Preparation
type: Concept
definition: Preparation for electron microscopy.
in scheme: kitmtxxls Tribology Lab at KIT
scope note: detached
scope note: dictionary

Mass Density Acquisition Temperature
type: Concept
definition: The specification of an object defining its mass density acquisition temperature.
in scheme: kitmtxxls Tribology Lab at KIT
scope note: float
scope note: K, °C

Quenching
type: Concept
definition: Process step intended to cool a metal at a rapid rate. This is most often done to produce a martensite transformation. Depending on the alloy and other considerations (such as concern for maximum hardness vs. cracking and distortion), cooling may be done with forced air or other gases, (such as nitrogen). Liquids may be used, due to their better thermal conductivity, such as oil or water.
in scheme: kitmtxxls Tribology Lab at KIT
scope note: option

Automatic
type: Concept
definition: Capable of operating without external control or intervention.
in scheme: kitmtxxls Tribology Lab at KIT
scope note: option

Pressure After Pumping
type: Concept
definition: Term containing information about the vacuum before venting the chamber to mount the specimen. It is used to track the quality of vacuum in the chamber and serves as an indicator if any part of the vacuum system is causing problems.
in scheme: kitmtxxls Tribology Lab at KIT
scope note: float
scope note: Pa, MPa, mbar, gauge-mark

Cycle Setpoint
type: Concept
definition: The cycle setting assigned to be maintained by the machine in a tribological process.
in scheme: kitmtxxls Tribology Lab at KIT
scope note: integer

List of Available Hardness Measurement Types
type: Concept
definition: Class containing information about the available hardness testing indenters of a hardness testing system.
in scheme: kitmtxxls Tribology Lab at KIT
scope note: string

Minimum Head Speed
type: Concept
definition: Minimum head speed at which the machine can operate.
in scheme: kitmtxxls Tribology Lab at KIT
scope note: float
scope note: min^(-1)

Open Cycle - Fresh Medium
type: Concept
definition: n/a
in scheme: kitmtxxls Tribology Lab at KIT
scope note: option

Polishing Medium Grain Size
type: Concept
definition: Average grain size of polishing medium.
in scheme: kitmtxxls Tribology Lab at KIT
scope note: float
scope note: µm, nm, mm, m, cm

Type of Abrasive
type: Concept
definition: Denotes the type of substrate which holds abrasive medium.
in scheme: kitmtxxls Tribology Lab at KIT
scope note: string

Humidity (Measured)
type: Concept
definition: Relative humidity within the test chamber.
in scheme: kitmtxxls Tribology Lab at KIT
scope note: option

Carbamide
type: Concept
definition: A carbonyl group with two C-bound amine groups. The commercially available fertilizer has an analysis of 46-0-0 (N-P2O5-K2O).
in scheme: kitmtxxls Tribology Lab at KIT
scope note: option

final_humidity_climate
type: Concept
definition: The humidity in the test chamber at the end of the experiment.
in scheme: kitmtxxls Tribology Lab at KIT
scope note: float
scope note: %RH

Number of Collected Profiles
type: Concept
definition: Instances of this class represent the total number of measurements for one sample.
in scheme: kitmtxxls Tribology Lab at KIT
scope note: integer

Line
type: Concept
definition: n/a
in scheme: kitmtxxls Tribology Lab at KIT
scope note: option

Pole Surface Length
type: Concept
definition: Instances of this class specify the pole surface size.
in scheme: kitmtxxls Tribology Lab at KIT
scope note: float
scope note: µm, nm, mm, m, cm

Single-crystal Sapphire
type: Concept
definition: Synthetic Sapphire is a single crystal form of corundum, Al2O3, also known as alpha-alumina, alumina, and single crystal Al2O3. Sapphire is aluminium oxide in the purest form with no porosity or grain boundaries, making it theoretically dense.
in scheme: kitmtxxls Tribology Lab at KIT
scope note: option

Magnetic Drive
type: Concept
definition: Drives such as voice coil, linear, or torque motors are electromagnetic direct drives. In direct drives, the force of the drive element is transmitted directly to the load to be moved (e.g., to a linear or rotary table, without mechanical transmission elements such as coupling, drive screw, or gearhead). Electromagnetic direct drives consist of a winding body (coil) in which a magnetic field is formed when current runs through it and a carrier or magnet assembly on which the magnets are mounted. The force or torque for the acceleration of the load is generated by the Lorentz force. This force is proportional to the magnetic field strength and the current passing through the current-carrying conductor. The electrical energy is converted here into mechanical energy. The generated force acts bidirectionally depending on the direction of the current. In principle, either the winding body (“moving coil”) or the magnet assembly (“moving magnet”) can be moved. The moving part is referred to as the secondary part, the static part as the primary part.
in scheme: kitmtxxls Tribology Lab at KIT
scope note: option

Stroke (Measured)
type: Concept
definition: Current position of the upper test specimen.
in scheme: kitmtxxls Tribology Lab at KIT
scope note: option

isPositionallyAfter
type: Concept
definition: Denotes two processes that always follow one another.
in scheme: kitmtxxls Tribology Lab at KIT
scope note: none
scope note: relationship_type

Composite
type: Concept
definition: n/a
in scheme: kitmtxxls Tribology Lab at KIT
scope note: option

Leybold GmbH
type: Concept
definition: Cologne, Germany
in scheme: kitmtxxls Tribology Lab at KIT
scope note: option

Chromatic Aberration
type: Concept
definition: Chromatic aberration is a phenomenon in which light rays passing through a lens focus at different points, depending on their wavelength.
in scheme: kitmtxxls Tribology Lab at KIT
scope note: option

Maximum Magnification
type: Concept
definition: The maximum magnification is an important specification for macro photography, as it determines how much of the frame you can fill with a tiny subject.
in scheme: kitmtxxls Tribology Lab at KIT
scope note: float

Technical Specifications (Ultrasonic Cleaner)
type: Concept
definition: Class containing information about the technical specifications of a ultrasonic cleaner.
in scheme: kitmtxxls Tribology Lab at KIT
scope note: dictionary

10XDI-N
type: Concept
definition: n/a
in scheme: kitmtxxls Tribology Lab at KIT
scope note: option

DAQ Attributes
type: Concept
definition: Class containing attributes about the installed DAQs.
in scheme: kitmtxxls Tribology Lab at KIT
scope note: dictionary

EBSD
type: Concept
definition: Information if EBSD was used during SEM session.
in scheme: kitmtxxls Tribology Lab at KIT
scope note: boolean

Band Mismatch
type: Concept
definition: Describes the reliablibity of the Hough indexing.
in scheme: kitmtxxls Tribology Lab at KIT
scope note: integer

*.png
type: Concept
definition: PNG is a raster-graphics file format that supports lossless data compression.
in scheme: kitmtxxls Tribology Lab at KIT
scope note: option

Bottom
type: Concept
definition: n/a
in scheme: kitmtxxls Tribology Lab at KIT
scope note: option

Total Number of Reciprocating Cycles
type: Concept
definition: n/a
in scheme: kitmtxxls Tribology Lab at KIT
scope note: integer

Solvent Type
type: Concept
definition: The type of solvent and the way it is referred to. The friendly way to identify it.
in scheme: kitmtxxls Tribology Lab at KIT
scope note: string

Emitter
type: Concept
definition: The name of the beam source of the equipment.
in scheme: kitmtxxls Tribology Lab at KIT
scope note: string

Coated Specimen
type: Concept
definition: A block specimen that has undergone a coating process in order to protect its surface for tribological reasons. There is a multitude of other reasons to coat specimens.
in scheme: kitmtxxls Tribology Lab at KIT
scope note: specimen
scope note: record

Operating Space Info
type: Concept
definition: Class containing information about the furnace's available space for sample treatment.
in scheme: kitmtxxls Tribology Lab at KIT
scope note: dictionary

Row
type: Concept
definition: In relational database terms, a row is a collection of fields that make up a record.
in scheme: kitmtxxls Tribology Lab at KIT
scope note: option

Sliding Velocity Control Type
type: Concept
definition: The control type of Sliding Velocity, which does not prescribe anything in specific - this is not the controlled or measured sliding velocity.
in scheme: kitmtxxls Tribology Lab at KIT
scope note: string

Purchased
type: Concept
definition: n/a
in scheme: kitmtxxls Tribology Lab at KIT
scope note: option

Orientation Indicating Feature Type
type: Concept
definition: The type of orientation indicating feature.
in scheme: kitmtxxls Tribology Lab at KIT
scope note: string

Discontinuous (Irregular Time Interval)
type: Concept
definition: n/a
in scheme: kitmtxxls Tribology Lab at KIT
scope note: option

Grit Size
type: Concept
definition: The physical characteristic called grit size.
in scheme: kitmtxxls Tribology Lab at KIT
scope note: float
scope note: µm, nm, mm, m, cm

Data Publication
type: Concept
definition: This is a representation of the digital records which can be found online and contain part of the data/metadata of the records in the same collection.
in scheme: kitmtxxls Tribology Lab at KIT
scope note: publication
scope note: record

Counter Body Clamping Method
type: Concept
definition: Way of clamping of a physical object with the role of being a counter body (specimen) in a tribometer.
in scheme: kitmtxxls Tribology Lab at KIT
scope note: string

Regular Cross Section
type: Concept
definition: n/a
in scheme: kitmtxxls Tribology Lab at KIT
scope note: option

AO Offset
type: Concept
definition: Analog Output offset amount.
in scheme: kitmtxxls Tribology Lab at KIT
scope note: float

Coarse Vertical Travel Range
type: Concept
definition: The travel range of the coarse/fast vertical drive of the machine's column (the distance inbetween lower limit and upper limit of the z-axis/vertical axis).
in scheme: kitmtxxls Tribology Lab at KIT
scope note: float
scope note: µm, nm, mm, m, cm

Maximum Voltage Setpoint
type: Concept
definition: The physical quantity that characterizes the maximum voltage at which the connection is used.
in scheme: kitmtxxls Tribology Lab at KIT
scope note: float
scope note: V

Mean Sliding Speed (Measured)
type: Concept
definition: Display of the sliding speed in the entire test view. This makes it possible to compare the descriptors for the friction behavior directly to the sliding behavior, e.g. in a µ/v-diagram.
in scheme: kitmtxxls Tribology Lab at KIT
scope note: option

SEM or FIB Pattern Alignment
type: Concept
definition: Explanation of the alignment of the pattern with features on the specimen surface.
in scheme: kitmtxxls Tribology Lab at KIT
scope note: string

Clockwise
type: Concept
definition: n/a
in scheme: kitmtxxls Tribology Lab at KIT
scope note: option

Operating System Name
type: Concept
definition: Name of computer operating system.
in scheme: kitmtxxls Tribology Lab at KIT
scope note: string

T8000 R120-400
type: Concept
definition: Stationary roughness and contour measurement
in scheme: kitmtxxls Tribology Lab at KIT
scope note: option

Setup End Time
type: Concept
definition: Subsection holds information about when the setup of an experiment was finished.
in scheme: kitmtxxls Tribology Lab at KIT
scope note: date

Optical Surface Profilometer
type: Concept
definition: Objects of this class pertain to the category of machines called optical surface profilometer.
in scheme: kitmtxxls Tribology Lab at KIT
scope note: https://purls.helmholtz-metadaten.de/vp/kitmtxx-41732562-vp/ism_xxx_xxx-cd4f36f6200648d294054682584c8e2b-vp: https://purls.helmholtz-metadaten.de/vp/kitmtxx-41732562-vp/opt_sur_pro-9658f444fa7b4e6b8ebf0c678491e2c0-vp
scope note: equipment
scope note: record

Research Question
type: Concept
definition: Describes a certain research question based on some previous results or literature. On its base an experiment or analysis plan can be created.
in scheme: kitmtxxls Tribology Lab at KIT
scope note: concept
scope note: record

SEM Pixel Size
type: Concept
definition: Step size in which the electron beam scans the image
in scheme: kitmtxxls Tribology Lab at KIT
scope note: float
scope note: nm, µm, mm, m

Equipment or Product Model
type: Concept
definition: The model name of equipment/object, which the company has given to its product.
in scheme: kitmtxxls Tribology Lab at KIT
scope note: string

CHR 150 N
type: Concept
definition: CHR 150-N High Resolution Optical Sensor
in scheme: kitmtxxls Tribology Lab at KIT
scope note: option

X-Position
type: Concept
definition: Position of an object on another object in x direction.
in scheme: kitmtxxls Tribology Lab at KIT
scope note: float

*.plu
type: Concept
definition: A binary file generated by Sensofar.
in scheme: kitmtxxls Tribology Lab at KIT
scope note: option

File (Hardness Measurement)
type: Concept
definition: Term containing a collection of metadata, each associated with a file or a series of files, generated as the output of a hardness measurement process and sharing the same metadata.
in scheme: kitmtxxls Tribology Lab at KIT
scope note: data
scope note: record

Travel Range
type: Concept
definition: The travel range of the tribometer.
in scheme: kitmtxxls Tribology Lab at KIT
scope note: float
scope note: µm, nm, mm, m, cm, °

Load Actual Value (Measured)
type: Concept
definition: Applied force measured within the test load unit.
in scheme: kitmtxxls Tribology Lab at KIT
scope note: option

PCI
type: Concept
definition: n/a
in scheme: kitmtxxls Tribology Lab at KIT
scope note: option

Time (Measured Since Experiment Start)
type: Concept
definition: The time which is zero at the first datapoint measured. Used in: Optimol SRV5
in scheme: kitmtxxls Tribology Lab at KIT
scope note: option

Probing System
type: Concept
definition: Class containing information about the technical specifications of a tactile probing system.
in scheme: kitmtxxls Tribology Lab at KIT
scope note: dictionary

Array of Info on Objectives
type: Concept
definition: n/a
in scheme: kitmtxxls Tribology Lab at KIT
scope note: dictionary

mm*s^(-1)
type: Concept
definition: n/a
in scheme: kitmtxxls Tribology Lab at KIT
scope note: option

C-891.130300
type: Concept
definition: PIMag® Motion Controller for Magnetic Direct Drives. 1 Axis, for 3-Phase Linear Motors
in scheme: kitmtxxls Tribology Lab at KIT
scope note: option

Power Consumption
type: Concept
definition: Instances of this class characterize the power consumption of a laboratory equipment.
in scheme: kitmtxxls Tribology Lab at KIT
scope note: float
scope note: W

Beam Voltage
type: Concept
definition: The voltage of the used beam.
in scheme: kitmtxxls Tribology Lab at KIT
scope note: float
scope note: V, kV

BNC
type: Concept
definition: BNC connector types feature a bayonet style coupling mechanism that allows for quick connect and disconnect with positive locking. Mating is achieved with just a quarter-turn of the coupling nut.
in scheme: kitmtxxls Tribology Lab at KIT
scope note: option

Type of Filter
type: Concept
definition: The type of optical filter used during the process.
in scheme: kitmtxxls Tribology Lab at KIT
scope note: string

Constant Settings
type: Concept
definition: The controlled inputs which are intended to not vary during an experiment.
in scheme: kitmtxxls Tribology Lab at KIT
scope note: dictionary

Pneumatic
type: Concept
definition: Pneumatics is how air pressure powers and moves something. Also known as using energy made from the controlled release of compressed air and turning it into movement.
in scheme: kitmtxxls Tribology Lab at KIT
scope note: option

File (Data Processing)
type: Concept
definition: Term containing a collection of metadata, each associated with a file or a series of files, generated as the output of a data processing process and sharing the same metadata.
in scheme: kitmtxxls Tribology Lab at KIT
scope note: data
scope note: record

withdraws
type: Concept
definition: This is used to denote that a process involves storage and specimen in a specific direction. The specimen is taken out of storage.
in scheme: kitmtxxls Tribology Lab at KIT
scope note: none
scope note: relationship_type

Z-Dimension
type: Concept
definition: The size along the z dimension.
in scheme: kitmtxxls Tribology Lab at KIT
scope note: float
scope note: µm, nm, mm, m, cm

FIB
type: Concept
definition: Term containing information if FIB was used.
in scheme: kitmtxxls Tribology Lab at KIT
scope note: boolean

User Token
type: Concept
definition: Operator's abbreviation (if existent).
in scheme: kitmtxxls Tribology Lab at KIT
scope note: string

Kennametal Inc.
type: Concept
definition: n/a
in scheme: kitmtxxls Tribology Lab at KIT
scope note: option

wear_volume_um3
type: Concept
definition: The volume lost as measured by taking the unworn region as a reference.
in scheme: kitmtxxls Tribology Lab at KIT
scope note: float
scope note: µm^3

Vertical Step Size
type: Concept
definition: Instances of this class characterize the vertical step size in a process.
in scheme: kitmtxxls Tribology Lab at KIT
scope note: float
scope note: µm, nm, mm, m, cm

SEM
type: Concept
definition: Contains information whether SEM was used or not.
in scheme: kitmtxxls Tribology Lab at KIT
scope note: boolean

Tick
type: Concept
definition: Indicates consecutiveness.
in scheme: kitmtxxls Tribology Lab at KIT
scope note: option

18.0.1F2 (64-bit)
type: Concept
definition: n/a
in scheme: kitmtxxls Tribology Lab at KIT
scope note: option

Base Rotation Direction
type: Concept
definition: The rotation direction of the base.
in scheme: kitmtxxls Tribology Lab at KIT
scope note: string

Magnetic Field Emission Classification Standard
type: Concept
definition: Class containing information about the technical standard observed by the magnetic field emission.
in scheme: kitmtxxls Tribology Lab at KIT
scope note: string

sliding_direction
type: Concept
definition: Describes the crystallographic direction of sliding on a plane.
in scheme: kitmtxxls Tribology Lab at KIT
scope note: string

Success
type: Concept
definition: Success of the heat treatment procedure.
in scheme: kitmtxxls Tribology Lab at KIT
scope note: boolean

Haseltal Werkzeugbau und Kunststofftechnik GmbH
type: Concept
definition: n/a
in scheme: kitmtxxls Tribology Lab at KIT
scope note: option

Space Width
type: Concept
definition: The maximum width inside the chamber of a piece of equipment.
in scheme: kitmtxxls Tribology Lab at KIT
scope note: float
scope note: µm, nm, mm, m, cm

SAE Standard
type: Concept
definition: Class containing information about the technical standard of the interfacial medium.
in scheme: kitmtxxls Tribology Lab at KIT
scope note: string

Positioning System Turning Speed
type: Concept
definition: Instances of this class characterize the set turning speed.
in scheme: kitmtxxls Tribology Lab at KIT
scope note: float
scope note: min^(-1), h^(-1), s^(-1)

Curved Unidirectional
type: Concept
definition: n/a
in scheme: kitmtxxls Tribology Lab at KIT
scope note: option

MAN Standard
type: Concept
definition: Class containing information about the technical standard of the interfacial medium.
in scheme: kitmtxxls Tribology Lab at KIT
scope note: string

R2022b
type: Concept
definition: The MATLAB® R2022b native Apple® silicon platform open beta is an early build of MATLAB for Apple silicon Mac® users to evaluate the execution of existing code and apps, and to test third-party integrations and add-ons
in scheme: kitmtxxls Tribology Lab at KIT
scope note: option

Polygon
type: Concept
definition: n/a
in scheme: kitmtxxls Tribology Lab at KIT
scope note: option

Vertical End Position
type: Concept
definition: Instances of this class characterize the vertical end height in a process.
in scheme: kitmtxxls Tribology Lab at KIT
scope note: float
scope note: µm, nm, mm, m, cm

VESTA
type: Concept
definition: Program for visualization of crystal structures
in scheme: kitmtxxls Tribology Lab at KIT
scope note: option

Omniprobe Micromanipulator E225868
type: Concept
definition: n/a
in scheme: kitmtxxls Tribology Lab at KIT
scope note: option

System or Setup Inputs (Optical Surface Profilometry)
type: Concept
definition: Class containing information about the parameters that are put into the involved scientific equipment to run it optimally.
in scheme: kitmtxxls Tribology Lab at KIT
scope note: dictionary

Clamping Area Diameter
type: Concept
definition: The maximum permissable diameter of specimen to be held.
in scheme: kitmtxxls Tribology Lab at KIT
scope note: float
scope note: µm, nm, mm, m, cm

Straightness Accuracy
type: Concept
definition: Instances of this class represent the maximum deviation from a prescribed straight motion across the entire measurement range.
in scheme: kitmtxxls Tribology Lab at KIT
scope note: float
scope note: µm, nm, mm, m, cm

Process Summary (Electropolishing)
type: Concept
definition: Class containing derived information after electropolishing.
in scheme: kitmtxxls Tribology Lab at KIT
scope note: dictionary

K
type: Concept
definition: n/a
in scheme: kitmtxxls Tribology Lab at KIT
scope note: option

ao0
type: Concept
definition: n/a
in scheme: kitmtxxls Tribology Lab at KIT
scope note: option

Sensitivity
type: Concept
definition: The sensor sensitivity.
in scheme: kitmtxxls Tribology Lab at KIT
scope note: float
scope note: mV*Vmm^(-1)

R1000
type: Concept
definition: n/a
in scheme: kitmtxxls Tribology Lab at KIT
scope note: option

Uncontrolled Environment Relative Humidity
type: Concept
definition: The phenomenon called relative humidity of the surrounding environment.
in scheme: kitmtxxls Tribology Lab at KIT
scope note: float
scope note: %

Electropolishing Program
type: Concept
definition: Electropolishing is an electrochemical finishing process that removes a thin layer of material from a metal part, typically stainless steel or similar alloys. The process leaves a shiny, smooth, ultra-clean surface finish.
in scheme: kitmtxxls Tribology Lab at KIT
scope note: boolean

EDX
type: Concept
definition: Information if EBSD was used during SEM session.
in scheme: kitmtxxls Tribology Lab at KIT
scope note: boolean

Tilt Angle Range
type: Concept
definition: The tilt angle range of the stage.
in scheme: kitmtxxls Tribology Lab at KIT
scope note: float
scope note: °

Source Category
type: Concept
definition: Instances of this class give the class of source/origin of a measurement.
in scheme: kitmtxxls Tribology Lab at KIT
scope note: string

LEO Ultrasonic Co Ltd
type: Concept
definition: n/a
in scheme: kitmtxxls Tribology Lab at KIT
scope note: option

Blowing With Compressed Air
type: Concept
definition: Remove loose particles/dust/residue by applying compressed air.
in scheme: kitmtxxls Tribology Lab at KIT
scope note: option

S2.15
type: Concept
definition: n/a
in scheme: kitmtxxls Tribology Lab at KIT
scope note: option

Dry Rub
type: Concept
definition: n/a
in scheme: kitmtxxls Tribology Lab at KIT
scope note: option

Cloeren Technology GmbH
type: Concept
definition: Wegberg, Germany
in scheme: kitmtxxls Tribology Lab at KIT
scope note: option

Shape
type: Concept
definition: The very basic shape of a block specimen or other geometric element.
in scheme: kitmtxxls Tribology Lab at KIT
scope note: string

Maximum Electropolishing Voltage
type: Concept
definition: The maximum value of the electropolishing voltage at which the machine can safely operate.
in scheme: kitmtxxls Tribology Lab at KIT
scope note: float
scope note: V

Vertical Starting Position
type: Concept
definition: Instances of this class characterize the vertical start height in a process.
in scheme: kitmtxxls Tribology Lab at KIT
scope note: float
scope note: µm, nm, mm, m, cm

Grinding Cup
type: Concept
definition: Grinding Cup Wheels are often used for re-sharpening and finishing for a few applications counting on abrasive size. The familiar applications is to shine stone or concrete.
in scheme: kitmtxxls Tribology Lab at KIT
scope note: option

Detector
type: Concept
definition: The name of the used detector.
in scheme: kitmtxxls Tribology Lab at KIT
scope note: string

Technical Standards
type: Concept
definition: Class containing information about the technical stadards observed by the piece of interfacial medium.
in scheme: kitmtxxls Tribology Lab at KIT
scope note: dictionary

Si
type: Concept
definition: Silicon makes up 27.7% of the Earth's crust by mass and is the second most abundant element (oxygen is the first).
in scheme: kitmtxxls Tribology Lab at KIT
scope note: option

Measurement Range
type: Concept
definition: The measurement range of the given sensor.
in scheme: kitmtxxls Tribology Lab at KIT
scope note: float
scope note: µm, nm, mm, m, cm

Build-in Drive
type: Concept
definition: n/a
in scheme: kitmtxxls Tribology Lab at KIT
scope note: option

Starting Temperature
type: Concept
definition: The equipment setting which specifies the starting temperature setting of a machine.
in scheme: kitmtxxls Tribology Lab at KIT
scope note: float
scope note: K, °C

Humidity
type: Concept
definition: n/a
in scheme: kitmtxxls Tribology Lab at KIT
scope note: option

cycles_run
type: Concept
definition: Number of cycles run during the entire experiment.
in scheme: kitmtxxls Tribology Lab at KIT
scope note: float

Stepper and Lead Screw
type: Concept
definition: n/a
in scheme: kitmtxxls Tribology Lab at KIT
scope note: option

Maximum Positioning System Turning Speed
type: Concept
definition: Instances of this class characterize the maximum permissable turning speed.
in scheme: kitmtxxls Tribology Lab at KIT
scope note: float
scope note: min^(-1), h^(-1), s^(-1), Hz

Data Processing (Sensofar Data)
type: Concept
definition: Class representing the execution of a particular computer code which extracts/reshapes/processes data from one form to another. The data stems from a Sensofar Optical Surface Profilometer.
in scheme: kitmtxxls Tribology Lab at KIT
scope note: https://purls.helmholtz-metadaten.de/vp/kitmtxx-41732562-vp/use_xxx_xxx-f130aac753c3467a9ef4cd8d2163a609-vp: https://purls.helmholtz-metadaten.de/vp/kitmtxx-41732562-vp/sof_xxx_xxx-43c5e712afb04a16a8954dbb3c865c0f-vp
scope note: https://purls.helmholtz-metadaten.de/vp/kitmtxx-41732562-vp/tak_xxx_xxx-ca48d075c7de4872b4f12e464652bcb1-vp: https://purls.helmholtz-metadaten.de/vp/kitmtxx-41732562-vp/opt_sur_pro-f096c110525747cab4fe81f4a23b20f8-vp
scope note: https://purls.helmholtz-metadaten.de/vp/kitmtxx-41732562-vp/tak_xxx_xxx-ca48d075c7de4872b4f12e464652bcb1-vp: https://purls.helmholtz-metadaten.de/vp/kitmtxx-41732562-vp/opt_mic_xxx-c73af6d31f314907b33d212d43f61891-vp
scope note: process
scope note: record

G&N Genauigkeits Maschinenbau Nuernberg GmbH
type: Concept
definition: n/a
in scheme: kitmtxxls Tribology Lab at KIT
scope note: option

Specimen Orientation
type: Concept
definition: Term informs about the specimen orientation.
in scheme: kitmtxxls Tribology Lab at KIT
scope note: string

Python
type: Concept
definition: Python is an interpreted, object-oriented, high-level programming language with dynamic semantics.
in scheme: kitmtxxls Tribology Lab at KIT
scope note: option

D96
type: Concept
definition: n/a
in scheme: kitmtxxls Tribology Lab at KIT
scope note: option

Maximum Electropolishing Area
type: Concept
definition: The maximum possible size of the electropolished area, as defined by the window within the electropolishing mask.
in scheme: kitmtxxls Tribology Lab at KIT
scope note: float
scope note: mm^2, cm^2

Primary Motion Type
type: Concept
definition: The general motion type that would characterize the tribological experiment for reporting purposes.
in scheme: kitmtxxls Tribology Lab at KIT
scope note: string

Electron Microscopy
type: Concept
definition: A piece of apparatus which is used to produce an enlarged image of a specimen using a finely focused (<10 nm diameter) electron beam with an acceleration voltage of 50–150 kV under vacuum and measuring the interaction of the electrons with the specimen.
in scheme: kitmtxxls Tribology Lab at KIT
scope note: process
scope note: record

Magnetic Drive (Counterweighed and Dampened)
type: Concept
definition: n/a
in scheme: kitmtxxls Tribology Lab at KIT
scope note: option

EDX detector
type: Concept
definition: Energy-dispersive X-ray spectroscopy detector
in scheme: kitmtxxls Tribology Lab at KIT
scope note: option

Process Summary (Cup Grinding)
type: Concept
definition: Class containing derived information about the process. All derived information stems from the information recorded in other locations of the record.
in scheme: kitmtxxls Tribology Lab at KIT
scope note: dictionary

Heating
type: Concept
definition: Process step that increases temperature.
in scheme: kitmtxxls Tribology Lab at KIT
scope note: option

Track Relative Position
type: Concept
definition: The position at which a load, velocity, or another variable setting is specified.
in scheme: kitmtxxls Tribology Lab at KIT
scope note: float
scope note: µm, nm, mm, m, cm

Normal Load Setpoint
type: Concept
definition: The prescribed normal load set at the beginning of a process.
in scheme: kitmtxxls Tribology Lab at KIT
scope note: float
scope note: N, kgf, gf

BCFTools
type: Concept
definition: https://github.com/BlueQuartzSoftware/BCFTools
in scheme: kitmtxxls Tribology Lab at KIT
scope note: option

Overlapping Area
type: Concept
definition: Percentage of overlapping area.
in scheme: kitmtxxls Tribology Lab at KIT
scope note: float
scope note: %

Housing Method
type: Concept
definition: This specifies if the equipment is equipped with a climate box around the investigated scientific process (fixed installation — not improvised solutions). This allows users to filter for pieces of equipment that in general allow experiments in thouroughly controlled environments.
in scheme: kitmtxxls Tribology Lab at KIT
scope note: string

Bruker Corporation
type: Concept
definition: Bruker Corporation, Billerica, MA, USA
in scheme: kitmtxxls Tribology Lab at KIT
scope note: option

SEM Session
type: Concept
definition: A process involving the scanning electron microscope. A session begins with the user logging into the device and ending with logging out. All metadata captured in the lab notebook will be stored in this record. Actions done during this session will have subprocess records with related metadata and files.
in scheme: kitmtxxls Tribology Lab at KIT
scope note: https://purls.helmholtz-metadaten.de/vp/kitmtxx-41732562-vp/emp_xxx_xxx-b0c09f9f6cd948839bac12aa4a2ad55d-vp: https://purls.helmholtz-metadaten.de/vp/kitmtxx-41732562-vp/sca_ele_mic-30855d0d4b6049a6a8fc94f07cdcc312-vp
scope note: https://purls.helmholtz-metadaten.de/vp/kitmtxx-41732562-vp/phy_xxx_xxx-3c41e6aa10d14a51b0c7a950b897fbba-vp: https://purls.helmholtz-metadaten.de/vp/kitmtxx-41732562-vp/blo_spe_xxx-ae137cec891644ec9e9d131be42ef67c-vp
scope note: https://purls.helmholtz-metadaten.de/vp/kitmtxx-41732562-vp/was_xxx_xxx-3362f63dcded4e41aa5b40b49059f80a-vp: https://purls.helmholtz-metadaten.de/vp/kitmtxx-41732562-vp/ele_mic_xxx-840bbf9ffd9648fc883b251d106e3733-vp
scope note: process
scope note: record

Contact Type
type: Concept
definition: The (intial) type of contact used in a tribological experiment.
in scheme: kitmtxxls Tribology Lab at KIT
scope note: string

MD-Dur
type: Concept
definition: MD-Dur polishing cloth from Struers
in scheme: kitmtxxls Tribology Lab at KIT
scope note: option

Beam Settings
type: Concept
definition: Term containing information about the beam settings used for a procedure step
in scheme: kitmtxxls Tribology Lab at KIT
scope note: dictionary

Dwell Time
type: Concept
definition: Time period during which the beam remains on one position/stationary. "Dwell time" means a time for an electron beam to stay per pixel at acquisition of a STEM image by electron-beam scan. The Dwell time is an index for the scan speed of the electron beam. When the Dwell time is multiplied by the number of scan pixels in one horizontal line scan, and then the Flyback time is added, the scan time for one horizontal line scan is obtained. When this scan time is multiplied by the number of the vertical scans (horizontal scan lines), the acquisition time of one scanning image is calculated.
in scheme: kitmtxxls Tribology Lab at KIT
scope note: https://purls.helmholtz-metadaten.de/vp/kitmtxx-41732562-vp/was_xxx_xxx-3362f63dcded4e41aa5b40b49059f80a-vp: https://purls.helmholtz-metadaten.de/vp/kitmtxx-41732562-vp/dwe_tim_xxx-5af62282f2364c10861cf7d11c452b40-vp
scope note: float
scope note: ns, µs, ms, s, min, h

pile_up_right_volume_um3
type: Concept
definition: Volume of the right pile-up measured in the profile in µm^3
in scheme: kitmtxxls Tribology Lab at KIT
scope note: float
scope note: nm^3, µm^3, mm^3, m^3

ai0
type: Concept
definition: n/a
in scheme: kitmtxxls Tribology Lab at KIT
scope note: option

Specimen Submersion Method
type: Concept
definition: Way of containing a liquid during a scientific process. Only fixed, and not improvised, solutions.
in scheme: kitmtxxls Tribology Lab at KIT
scope note: string

Duration
type: Concept
definition: The duration of a procedure.
in scheme: kitmtxxls Tribology Lab at KIT
scope note: https://purls.helmholtz-metadaten.de/vp/kitmtxx-41732562-vp/was_xxx_xxx-26c4aa3ea27e41709e31d7e2275182df-vp: https://purls.helmholtz-metadaten.de/vp/kitmtxx-41732562-vp/fib_cut_xxx-88c4fd89f922478585b33011e810e1f0-vp
scope note: float
scope note: s, min, h

Greisinger electronic
type: Concept
definition: n/a
in scheme: kitmtxxls Tribology Lab at KIT
scope note: option

standard_deviation_of_deformation_depth
type: Concept
definition: Standard deviation of measured depth of deformation in SEM cross section images
in scheme: kitmtxxls Tribology Lab at KIT
scope note: float
scope note: nm, µm, mm, m

Laser Processing
type: Concept
definition: Class representing the physical process of laser processing of a specimen with the aim of changing its surface characteristics, engraving or cutting elastomer foams.
in scheme: kitmtxxls Tribology Lab at KIT
scope note: https://purls.helmholtz-metadaten.de/vp/kitmtxx-41732562-vp/emp_xxx_xxx-b0c09f9f6cd948839bac12aa4a2ad55d-vp: https://purls.helmholtz-metadaten.de/vp/kitmtxx-41732562-vp/las_pro_sys-fbb64d7500b34750b3111761fba2c1cf-vp
scope note: https://purls.helmholtz-metadaten.de/vp/kitmtxx-41732562-vp/phy_xxx_xxx-3c41e6aa10d14a51b0c7a950b897fbba-vp: https://purls.helmholtz-metadaten.de/vp/kitmtxx-41732562-vp/blo_spe_xxx-ae137cec891644ec9e9d131be42ef67c-vp
scope note: process
scope note: record

Sensofar
type: Concept
definition: Sensofar, manufacturer of non-contact 3D surface metrology and device inspection systems, for research, industry and in-line process control.
in scheme: kitmtxxls Tribology Lab at KIT
scope note: option

Experiment or Analysis Plan
type: Concept
definition: A detailed plan for experiments or analysis based on a research question or hypothesis
in scheme: kitmtxxls Tribology Lab at KIT
scope note: https://purls.helmholtz-metadaten.de/vp/kitmtxx-41732562-vp/pla_xxx_xxx-a743aec0cb294aa1a2c3c5f480d0817f-vp: https://purls.helmholtz-metadaten.de/vp/kitmtxx-41732562-vp/res_que_xxx-4df1551dde654ae78591deea588eb4bb-vp
scope note: https://purls.helmholtz-metadaten.de/vp/kitmtxx-41732562-vp/pla_xxx_xxx-a743aec0cb294aa1a2c3c5f480d0817f-vp: https://purls.helmholtz-metadaten.de/vp/kitmtxx-41732562-vp/opt_mic_xxx-c73af6d31f314907b33d212d43f61891-vp
scope note: https://purls.helmholtz-metadaten.de/vp/kitmtxx-41732562-vp/pla_xxx_xxx-a743aec0cb294aa1a2c3c5f480d0817f-vp: https://purls.helmholtz-metadaten.de/vp/kitmtxx-41732562-vp/sem_orx_fib-a3c4c133c9d746378cdf6ace982f8a64-vp
scope note: https://purls.helmholtz-metadaten.de/vp/kitmtxx-41732562-vp/pla_xxx_xxx-a743aec0cb294aa1a2c3c5f480d0817f-vp: https://purls.helmholtz-metadaten.de/vp/kitmtxx-41732562-vp/opt_sur_pro-f096c110525747cab4fe81f4a23b20f8-vp
scope note: https://purls.helmholtz-metadaten.de/vp/kitmtxx-41732562-vp/pla_xxx_xxx-a743aec0cb294aa1a2c3c5f480d0817f-vp: https://purls.helmholtz-metadaten.de/vp/kitmtxx-41732562-vp/hyp_xxx_xxx-4ba97ba7b6ca4991abb7e4aeb49af342-vp
scope note: https://purls.helmholtz-metadaten.de/vp/kitmtxx-41732562-vp/pla_xxx_xxx-a743aec0cb294aa1a2c3c5f480d0817f-vp: https://purls.helmholtz-metadaten.de/vp/kitmtxx-41732562-vp/fib_cut_xxx-88c4fd89f922478585b33011e810e1f0-vp
scope note: https://purls.helmholtz-metadaten.de/vp/kitmtxx-41732562-vp/pla_xxx_xxx-a743aec0cb294aa1a2c3c5f480d0817f-vp: https://purls.helmholtz-metadaten.de/vp/kitmtxx-41732562-vp/har_mea_xxx-cd56d9226fdb45e3a6153034ca19b7c0-vp
scope note: https://purls.helmholtz-metadaten.de/vp/kitmtxx-41732562-vp/pla_xxx_xxx-a743aec0cb294aa1a2c3c5f480d0817f-vp: https://purls.helmholtz-metadaten.de/vp/kitmtxx-41732562-vp/res_que_orx-b43b085ad1cd4536bba773bed0870376-vp
scope note: https://purls.helmholtz-metadaten.de/vp/kitmtxx-41732562-vp/pla_xxx_xxx-a743aec0cb294aa1a2c3c5f480d0817f-vp: https://purls.helmholtz-metadaten.de/vp/kitmtxx-41732562-vp/ele_xxx_xxx-d4cc995b3bd146079672b7b5c49aaabb-vp
scope note: https://purls.helmholtz-metadaten.de/vp/kitmtxx-41732562-vp/pla_xxx_xxx-a743aec0cb294aa1a2c3c5f480d0817f-vp: https://purls.helmholtz-metadaten.de/vp/kitmtxx-41732562-vp/cup_gri_xxx-901bcb5b4d5d44f0a606dcc1ff3d4eea-vp
scope note: https://purls.helmholtz-metadaten.de/vp/kitmtxx-41732562-vp/pla_xxx_xxx-a743aec0cb294aa1a2c3c5f480d0817f-vp: https://purls.helmholtz-metadaten.de/vp/kitmtxx-41732562-vp/blo_spe_xxx-ae137cec891644ec9e9d131be42ef67c-vp
scope note: https://purls.helmholtz-metadaten.de/vp/kitmtxx-41732562-vp/pla_xxx_xxx-c7f6de25f6044aeaba4feca1a99fa1f8-vp: https://purls.helmholtz-metadaten.de/vp/kitmtxx-41732562-vp/lub_for_pol-a64e0b5bcd2d44bd8c3d7aa2853007f4-vp
scope note: https://purls.helmholtz-metadaten.de/vp/kitmtxx-41732562-vp/pla_xxx_xxx-c7f6de25f6044aeaba4feca1a99fa1f8-vp: https://purls.helmholtz-metadaten.de/vp/kitmtxx-41732562-vp/int_med_xxx-49981b08aa8e441ba36e6fe7e3760a0a-vp
scope note: https://purls.helmholtz-metadaten.de/vp/kitmtxx-41732562-vp/pla_xxx_xxx-c7f6de25f6044aeaba4feca1a99fa1f8-vp: https://purls.helmholtz-metadaten.de/vp/kitmtxx-41732562-vp/opt_sur_pro-9658f444fa7b4e6b8ebf0c678491e2c0-vp
scope note: https://purls.helmholtz-metadaten.de/vp/kitmtxx-41732562-vp/pla_xxx_xxx-c7f6de25f6044aeaba4feca1a99fa1f8-vp: https://purls.helmholtz-metadaten.de/vp/kitmtxx-41732562-vp/sph_sto_box-fd80690682f44da3a7ea061b9ef6a7f7-vp
scope note: https://purls.helmholtz-metadaten.de/vp/kitmtxx-41732562-vp/pla_xxx_xxx-c7f6de25f6044aeaba4feca1a99fa1f8-vp: https://purls.helmholtz-metadaten.de/vp/kitmtxx-41732562-vp/pol_mac_xxx-20c35bf0b41948689b5bae72ab59bdb4-vp
scope note: https://purls.helmholtz-metadaten.de/vp/kitmtxx-41732562-vp/pla_xxx_xxx-c7f6de25f6044aeaba4feca1a99fa1f8-vp: https://purls.helmholtz-metadaten.de/vp/kitmtxx-41732562-vp/sca_ele_mic-30855d0d4b6049a6a8fc94f07cdcc312-vp
scope note: https://purls.helmholtz-metadaten.de/vp/kitmtxx-41732562-vp/pla_xxx_xxx-c7f6de25f6044aeaba4feca1a99fa1f8-vp: https://purls.helmholtz-metadaten.de/vp/kitmtxx-41732562-vp/dry_cab_xxx-7382b1a7ced043e19f1c713d0e6f767e-vp
scope note: https://purls.helmholtz-metadaten.de/vp/kitmtxx-41732562-vp/pla_xxx_xxx-c7f6de25f6044aeaba4feca1a99fa1f8-vp: https://purls.helmholtz-metadaten.de/vp/kitmtxx-41732562-vp/las_pro_sys-fbb64d7500b34750b3111761fba2c1cf-vp
scope note: https://purls.helmholtz-metadaten.de/vp/kitmtxx-41732562-vp/pla_xxx_xxx-c7f6de25f6044aeaba4feca1a99fa1f8-vp: https://purls.helmholtz-metadaten.de/vp/kitmtxx-41732562-vp/sof_xxx_xxx-43c5e712afb04a16a8954dbb3c865c0f-vp
scope note: https://purls.helmholtz-metadaten.de/vp/kitmtxx-41732562-vp/pla_xxx_xxx-c7f6de25f6044aeaba4feca1a99fa1f8-vp: https://purls.helmholtz-metadaten.de/vp/kitmtxx-41732562-vp/ult_cle_xxx-192eb37ff24644798963cd87107e9a5f-vp
scope note: https://purls.helmholtz-metadaten.de/vp/kitmtxx-41732562-vp/pla_xxx_xxx-c7f6de25f6044aeaba4feca1a99fa1f8-vp: https://purls.helmholtz-metadaten.de/vp/kitmtxx-41732562-vp/tac_sur_pro-ec98dbf380804321bb8aa65a96c41b24-vp
scope note: https://purls.helmholtz-metadaten.de/vp/kitmtxx-41732562-vp/pla_xxx_xxx-c7f6de25f6044aeaba4feca1a99fa1f8-vp: https://purls.helmholtz-metadaten.de/vp/kitmtxx-41732562-vp/har_tes_xxx-d1fe762442144018958df899aaffe37d-vp
scope note: https://purls.helmholtz-metadaten.de/vp/kitmtxx-41732562-vp/pla_xxx_xxx-c7f6de25f6044aeaba4feca1a99fa1f8-vp: https://purls.helmholtz-metadaten.de/vp/kitmtxx-41732562-vp/cup_gri_mac-3136c4f5a61247ca9cf390b86f050459-vp
scope note: https://purls.helmholtz-metadaten.de/vp/kitmtxx-41732562-vp/pla_xxx_xxx-c7f6de25f6044aeaba4feca1a99fa1f8-vp: https://purls.helmholtz-metadaten.de/vp/kitmtxx-41732562-vp/ten_tes_xxx-b4b8ff243b17440d8da2fbf943194381-vp
scope note: https://purls.helmholtz-metadaten.de/vp/kitmtxx-41732562-vp/pla_xxx_xxx-c7f6de25f6044aeaba4feca1a99fa1f8-vp: https://purls.helmholtz-metadaten.de/vp/kitmtxx-41732562-vp/gri_mac_xxx-b0492ca6bf9043909ee541221a225895-vp
scope note: https://purls.helmholtz-metadaten.de/vp/kitmtxx-41732562-vp/pla_xxx_xxx-c7f6de25f6044aeaba4feca1a99fa1f8-vp: https://purls.helmholtz-metadaten.de/vp/kitmtxx-41732562-vp/blo_spe_xxx-ae137cec891644ec9e9d131be42ef67c-vp
scope note: https://purls.helmholtz-metadaten.de/vp/kitmtxx-41732562-vp/pla_xxx_xxx-c7f6de25f6044aeaba4feca1a99fa1f8-vp: https://purls.helmholtz-metadaten.de/vp/kitmtxx-41732562-vp/wir_saw_xxx-25611f86ae4d460a9747e0f5c301d8a0-vp
scope note: https://purls.helmholtz-metadaten.de/vp/kitmtxx-41732562-vp/pla_xxx_xxx-c7f6de25f6044aeaba4feca1a99fa1f8-vp: https://purls.helmholtz-metadaten.de/vp/kitmtxx-41732562-vp/dem_pla_xxx-c4882064ea124afab8aae0b78eeae19c-vp
scope note: https://purls.helmholtz-metadaten.de/vp/kitmtxx-41732562-vp/pla_xxx_xxx-c7f6de25f6044aeaba4feca1a99fa1f8-vp: https://purls.helmholtz-metadaten.de/vp/kitmtxx-41732562-vp/ele_mac_xxx-903f852b9cef4385aaa4a8fef788e7b5-vp
scope note: https://purls.helmholtz-metadaten.de/vp/kitmtxx-41732562-vp/pla_xxx_xxx-c7f6de25f6044aeaba4feca1a99fa1f8-vp: https://purls.helmholtz-metadaten.de/vp/kitmtxx-41732562-vp/fff_xxx_xxx-6ab1d49a0e5d439b946eeb97e700c23d-vp
scope note: https://purls.helmholtz-metadaten.de/vp/kitmtxx-41732562-vp/pla_xxx_xxx-c7f6de25f6044aeaba4feca1a99fa1f8-vp: https://purls.helmholtz-metadaten.de/vp/kitmtxx-41732562-vp/pre_sca_xxx-ceedd099da754c79bcb9c002a1daa545-vp
scope note: concept
scope note: record

X Number of Points
type: Concept
definition: Instances of this class characterize the measurement number of scanning points per line in x-direction, as defined by the equipment.
in scheme: kitmtxxls Tribology Lab at KIT
scope note: integer
scope note: Pixel

DAQ Related Inputs
type: Concept
definition: Class containing information about the parameters that are put into the involved DAQ equipment, to run it optimally, but are not directly part of achieving the experimental objectives.
in scheme: kitmtxxls Tribology Lab at KIT
scope note: dictionary

Size of Values to Read
type: Concept
definition: Instances of this class indicate the size in bits of the values to read.
in scheme: kitmtxxls Tribology Lab at KIT
scope note: integer
scope note: MB, kB, bit

General Info (Interfacial Lubricating Medium)
type: Concept
definition: Objects of this class contain information that unequivocally identifies a piece of interfacial lubricating medium.
in scheme: kitmtxxls Tribology Lab at KIT
scope note: dictionary

Cup Grinding Machine
type: Concept
definition: Objects of this class pertain to the category of machines called cup grinding machine.
in scheme: kitmtxxls Tribology Lab at KIT
scope note: https://purls.helmholtz-metadaten.de/vp/kitmtxx-41732562-vp/ism_xxx_xxx-cd4f36f6200648d294054682584c8e2b-vp: https://purls.helmholtz-metadaten.de/vp/kitmtxx-41732562-vp/cup_gri_mac-3136c4f5a61247ca9cf390b86f050459-vp
scope note: equipment
scope note: record

Grinding
type: Concept
definition: Class representing the physical process of grinding of a specimen with the aim of changing its surface characteristics.
in scheme: kitmtxxls Tribology Lab at KIT
scope note: https://purls.helmholtz-metadaten.de/vp/kitmtxx-41732562-vp/phy_xxx_xxx-3c41e6aa10d14a51b0c7a950b897fbba-vp: https://purls.helmholtz-metadaten.de/vp/kitmtxx-41732562-vp/blo_spe_xxx-ae137cec891644ec9e9d131be42ef67c-vp
scope note: https://purls.helmholtz-metadaten.de/vp/kitmtxx-41732562-vp/emp_xxx_xxx-b0c09f9f6cd948839bac12aa4a2ad55d-vp: https://purls.helmholtz-metadaten.de/vp/kitmtxx-41732562-vp/gri_mac_xxx-b0492ca6bf9043909ee541221a225895-vp
scope note: https://purls.helmholtz-metadaten.de/vp/kitmtxx-41732562-vp/emp_xxx_xxx-b0c09f9f6cd948839bac12aa4a2ad55d-vp: https://purls.helmholtz-metadaten.de/vp/kitmtxx-41732562-vp/ult_cle_xxx-192eb37ff24644798963cd87107e9a5f-vp
scope note: https://purls.helmholtz-metadaten.de/vp/kitmtxx-41732562-vp/emp_xxx_xxx-b0c09f9f6cd948839bac12aa4a2ad55d-vp: https://purls.helmholtz-metadaten.de/vp/kitmtxx-41732562-vp/pol_mac_xxx-20c35bf0b41948689b5bae72ab59bdb4-vp
scope note: process
scope note: record

HV20
type: Concept
definition: e.g. 200 HV20 means a value of 200 Vickers is obtained and a load of 20 kg was used to make the indent.
in scheme: kitmtxxls Tribology Lab at KIT
scope note: option

Physical Quantity Friendly Name
type: Concept
definition: The user friendly (= long common) name of the variable the time series (or single value) captured.
in scheme: kitmtxxls Tribology Lab at KIT
scope note: string

Constant Controlled Conditions
type: Concept
definition: A list of boolean conditions that describe what is intended to be constant during an experiment.
in scheme: kitmtxxls Tribology Lab at KIT
scope note: dictionary

System or Setup Inputs (Demagnetization)
type: Concept
definition: Class containing information about the parameters that are put into the involved scientific equipment to run it optimally.
in scheme: kitmtxxls Tribology Lab at KIT
scope note: dictionary

Process Summary (Equipment Calibration)
type: Concept
definition: Summarizes process parameters and procedures of equipment calibration.
in scheme: kitmtxxls Tribology Lab at KIT
scope note: dictionary

V 1404
type: Concept
definition: V-1404 PVC Sewer Cap Hub 4in SDR35
in scheme: kitmtxxls Tribology Lab at KIT
scope note: option

Manual Drive
type: Concept
definition: n/a
in scheme: kitmtxxls Tribology Lab at KIT
scope note: option

Grinding Tool Type
type: Concept
definition: Instances of this class give the type of grinding tool used by equipment.
in scheme: kitmtxxls Tribology Lab at KIT
scope note: string

Tool Cleaning Time Interval Type
type: Concept
definition: Instances of this class specify the classification type of tool cleaning time interval.
in scheme: kitmtxxls Tribology Lab at KIT
scope note: string

Experimental Setup (Controlled Variables)
type: Concept
definition: Collection of variables which predefine the execution of an experiment.
in scheme: kitmtxxls Tribology Lab at KIT
scope note: dictionary

Institution Name
type: Concept
definition: The official name of the institution which the responsible person/operator belongs to.
in scheme: kitmtxxls Tribology Lab at KIT
scope note: string

Normal Load Control Type
type: Concept
definition: The control type of Normal Load, which does not prescribe anything in specific - this is not the controlled or measured normal load.
in scheme: kitmtxxls Tribology Lab at KIT
scope note: https://purls.helmholtz-metadaten.de/vp/kitmtxx-41732562-vp/isr_xxx_xxx-14ceeb9f5e964ebbbfd7fd93e0e9aef2-vp: https://purls.helmholtz-metadaten.de/vp/kitmtxx-41732562-vp/tar_nor_loa-7d053b02021e4bec8ba7e2d5e13993ac-vp
scope note: string

Z-direction Travel Range
type: Concept
definition: Instances of this class represent the distance between the lower and upper limits of the z-axis/vertical axis.
in scheme: kitmtxxls Tribology Lab at KIT
scope note: float
scope note: µm, nm, mm, m, cm

Software File
type: Concept
definition: A file containing some non-specified software.
in scheme: kitmtxxls Tribology Lab at KIT
scope note: option

National Instruments
type: Concept
definition: Austin, Texas, USA
in scheme: kitmtxxls Tribology Lab at KIT
scope note: option

*.zip
type: Concept
definition: ZIP is a common file format that's used to compress one or more files together into a single location.
in scheme: kitmtxxls Tribology Lab at KIT
scope note: option

Tape Used
type: Concept
definition: Denotes whether scotch tape was used to reduce the electropolished area. If the desired area is not covered by the existing masks, it is possible to define the area by use of said scotch tape.
in scheme: kitmtxxls Tribology Lab at KIT
scope note: boolean

roughness_virgin_region_nm
type: Concept
definition: The unworn region used for referencing wear calculations
in scheme: kitmtxxls Tribology Lab at KIT
scope note: float
scope note: nm

FIB Cutting Purpose
type: Concept
definition: Describes the purpose for which the cutting process is conducted such as cutting a cross section or a micro pillar.
in scheme: kitmtxxls Tribology Lab at KIT
scope note: string

Archive File Technical Specifications
type: Concept
definition: Contains the information to open/access/read and interpret an archive file's contents adequately.
in scheme: kitmtxxls Tribology Lab at KIT
scope note: dictionary

Hardness Measurement
type: Concept
definition: Class representing the monitored processes that produce a (set of) file(s) with various types whose contents indicate the hardness of a speciment based on indentation measurement.
in scheme: kitmtxxls Tribology Lab at KIT
scope note: https://purls.helmholtz-metadaten.de/vp/kitmtxx-41732562-vp/phy_xxx_xxx-3c41e6aa10d14a51b0c7a950b897fbba-vp: https://purls.helmholtz-metadaten.de/vp/kitmtxx-41732562-vp/blo_spe_xxx-ae137cec891644ec9e9d131be42ef67c-vp
scope note: https://purls.helmholtz-metadaten.de/vp/kitmtxx-41732562-vp/cha_xxx_xxx-5b70f2376c68474381ef5cc428fe240b-vp: https://purls.helmholtz-metadaten.de/vp/kitmtxx-41732562-vp/blo_spe_xxx-ae137cec891644ec9e9d131be42ef67c-vp
scope note: https://purls.helmholtz-metadaten.de/vp/kitmtxx-41732562-vp/emp_xxx_xxx-b0c09f9f6cd948839bac12aa4a2ad55d-vp: https://purls.helmholtz-metadaten.de/vp/kitmtxx-41732562-vp/har_tes_xxx-d1fe762442144018958df899aaffe37d-vp
scope note: process
scope note: record

Helios Nanolab 650
type: Concept
definition: The FEI Helios NanoLab 650 dual beam is a state of the art scanning electron microscope (SEM) and a focused ion beam (FIB) packaged in one, designed for extreme high resolution 2D and 3D characterisation, nanoprototyping and sample preparation.
in scheme: kitmtxxls Tribology Lab at KIT
scope note: option

Z-250
type: Concept
definition: n/a
in scheme: kitmtxxls Tribology Lab at KIT
scope note: option

Pressure Before Venting
type: Concept
definition: Term containing information about the vacuum before venting the chamber to mount the sample. It is used to track the quality of vacuum in the chamber and serves as an indicator if any part of the vacuum system is causing problems
in scheme: kitmtxxls Tribology Lab at KIT
scope note: float
scope note: Pa, MPa, mbar, gauge-mark

Loading Mode
type: Concept
definition: The way of loading the sample(s).
in scheme: kitmtxxls Tribology Lab at KIT
scope note: string

Minimum Magnification
type: Concept
definition: The minimum magnification is determined by the exit pupil of the telescope system. Exit pupil is the diameter of the beam of light coming out of the eyepiece. The larger this beam is, the brighter the image will appear.
in scheme: kitmtxxls Tribology Lab at KIT
scope note: float

Maximum Drive Velocity
type: Concept
definition: The maximum speed of what is usually a stage for realizing motion in a machine.
in scheme: kitmtxxls Tribology Lab at KIT
scope note: float
scope note: mm/s, µm/s, m/s

Disk
type: Concept
definition: A cylinder whose height is smaller than its diameter.
in scheme: kitmtxxls Tribology Lab at KIT
scope note: option

.
type: Concept
definition: n/a
in scheme: kitmtxxls Tribology Lab at KIT
scope note: option

Porous Alumina (Soft Followed by Hard)
type: Concept
definition: Porous aluminum is a nanostructured material characterized by unique properties, such as chemical stability, regular uniformity, dense hexagonal porous lattice with high aspect ratio nanopores, excellent mechanical strength, and biocompatibility.
in scheme: kitmtxxls Tribology Lab at KIT
scope note: option

Mounting Information
type: Concept
definition: A collection that specifies the way samples/specimens were mounted, and consequently, oriented to one another at the beginning of the experiment.
in scheme: kitmtxxls Tribology Lab at KIT
scope note: dictionary

Tungsten
type: Concept
definition: Tungsten is a greyish-white lustrous metal, which is a solid at room temperature. Tungsten has the highest melting point and lowest vapor pressure of all metals, and at temperatures over 1650°C has the highest tensile strength. It has excellent corrosion resistance and is attacked only slightly by most mineral acids.
in scheme: kitmtxxls Tribology Lab at KIT
scope note: option

Minimum Voltage Setpoint
type: Concept
definition: The physical quantity that characterizes the minimum voltage at which the connection is used.
in scheme: kitmtxxls Tribology Lab at KIT
scope note: float
scope note: V

Description
type: Concept
definition: The description of the variable the time series captured.
in scheme: kitmtxxls Tribology Lab at KIT
scope note: string

DAQ AI Offset
type: Concept
definition: DAQ Analog Input offset.
in scheme: kitmtxxls Tribology Lab at KIT
scope note: float

Equipment Calibration
type: Concept
definition: Class representing the execution of a calibration of a particular equipment like scale, microscope, tribometer,...
in scheme: kitmtxxls Tribology Lab at KIT
scope note: https://purls.helmholtz-metadaten.de/vp/kitmtxx-41732562-vp/emp_xxx_xxx-b0c09f9f6cd948839bac12aa4a2ad55d-vp: https://purls.helmholtz-metadaten.de/vp/kitmtxx-41732562-vp/tri_xxx_xxx-c98170df4aa14cd38e9ba0d1b94ebdf0-vp
scope note: https://purls.helmholtz-metadaten.de/vp/kitmtxx-41732562-vp/emp_xxx_xxx-b0c09f9f6cd948839bac12aa4a2ad55d-vp: https://purls.helmholtz-metadaten.de/vp/kitmtxx-41732562-vp/lig_mic_xxx-de64ef91f8544beda63bbf43c6ffdce1-vp
scope note: https://purls.helmholtz-metadaten.de/vp/kitmtxx-41732562-vp/emp_xxx_xxx-b0c09f9f6cd948839bac12aa4a2ad55d-vp: https://purls.helmholtz-metadaten.de/vp/kitmtxx-41732562-vp/har_tes_xxx-d1fe762442144018958df899aaffe37d-vp
scope note: https://purls.helmholtz-metadaten.de/vp/kitmtxx-41732562-vp/emp_xxx_xxx-b0c09f9f6cd948839bac12aa4a2ad55d-vp: https://purls.helmholtz-metadaten.de/vp/kitmtxx-41732562-vp/sca_ele_mic-30855d0d4b6049a6a8fc94f07cdcc312-vp
scope note: https://purls.helmholtz-metadaten.de/vp/kitmtxx-41732562-vp/emp_xxx_xxx-b0c09f9f6cd948839bac12aa4a2ad55d-vp: https://purls.helmholtz-metadaten.de/vp/kitmtxx-41732562-vp/pre_sca_xxx-ceedd099da754c79bcb9c002a1daa545-vp
scope note: https://purls.helmholtz-metadaten.de/vp/kitmtxx-41732562-vp/emp_xxx_xxx-b0c09f9f6cd948839bac12aa4a2ad55d-vp: https://purls.helmholtz-metadaten.de/vp/kitmtxx-41732562-vp/opt_sur_pro-9658f444fa7b4e6b8ebf0c678491e2c0-vp
scope note: https://purls.helmholtz-metadaten.de/vp/kitmtxx-41732562-vp/emp_xxx_xxx-b0c09f9f6cd948839bac12aa4a2ad55d-vp: https://purls.helmholtz-metadaten.de/vp/kitmtxx-41732562-vp/tac_sur_pro-ec98dbf380804321bb8aa65a96c41b24-vp
scope note: https://purls.helmholtz-metadaten.de/vp/kitmtxx-41732562-vp/use_xxx_xxx-f130aac753c3467a9ef4cd8d2163a609-vp: https://purls.helmholtz-metadaten.de/vp/kitmtxx-41732562-vp/sof_xxx_xxx-43c5e712afb04a16a8954dbb3c865c0f-vp
scope note: process
scope note: record

Reference Pressure
type: Concept
definition: The pressure measured by a reference. For undefined scales "none" is acceptable as a unit.
in scheme: kitmtxxls Tribology Lab at KIT
scope note: float
scope note: Pa, MPa, mbar, gauge-mark, none,

Software Name
type: Concept
definition: The official name of the software under which it's distributed.
in scheme: kitmtxxls Tribology Lab at KIT
scope note: https://purls.helmholtz-metadaten.de/vp/kitmtxx-41732562-vp/isr_xxx_xxx-14ceeb9f5e964ebbbfd7fd93e0e9aef2-vp: https://purls.helmholtz-metadaten.de/vp/kitmtxx-41732562-vp/pro_lan_xxx-8e2739412c7d4453aaa2ee5c961012f4-vp
scope note: string

Direction of Sequence
type: Concept
definition: Denotes the direction in which the sequential data should be read.
in scheme: kitmtxxls Tribology Lab at KIT
scope note: string

System or Setup Inputs (Light Microscopy)
type: Concept
definition: Term containing information about the parameters that are put into the involved scientific equipment to run it optimally, but are not directly part of achieving the experimental objectives.
in scheme: kitmtxxls Tribology Lab at KIT
scope note: dictionary

Volumetric amount
type: Concept
definition: Volumetric amount of an ingredient.
in scheme: kitmtxxls Tribology Lab at KIT
scope note: float
scope note: ml

Alois Schmitt GmbH & Co. KG
type: Concept
definition: n/a
in scheme: kitmtxxls Tribology Lab at KIT
scope note: option

Stroke Motor Power Current Value (Measured)
type: Concept
definition: Actual value of motor power of the oscillation drive.
in scheme: kitmtxxls Tribology Lab at KIT
scope note: option

usesSoftware
type: Concept
definition: Denotes that a given process uses a piece of software to process data.
in scheme: kitmtxxls Tribology Lab at KIT
scope note: none
scope note: relationship_type

Al2O3
type: Concept
definition: Aluminum oxide is a white odorless crystalline powder. Water insoluble.
in scheme: kitmtxxls Tribology Lab at KIT
scope note: option

wear_track_depth
type: Concept
definition: Depth of the wear track at its deepest spot measured from the profile
in scheme: kitmtxxls Tribology Lab at KIT
scope note: float
scope note: nm, µm, mm, m

deposits
type: Concept
definition: This is used to denote that a process involves storage and specimen in a specific direction. The specimen is put into storage.
in scheme: kitmtxxls Tribology Lab at KIT
scope note: none
scope note: relationship_type

Measure Stage Position of Sliding Direction Axis Motion
type: Concept
definition: n/a
in scheme: kitmtxxls Tribology Lab at KIT
scope note: option

Dark Correction Performed
type: Concept
definition: Instances of this class indicate whether the sensor's dark correction functions prior to the measurement was performed.
in scheme: kitmtxxls Tribology Lab at KIT
scope note: boolean

Probe Arm Mounting Method
type: Concept
definition: Instances of this class characterize the method of clamping of a probe arm.
in scheme: kitmtxxls Tribology Lab at KIT
scope note: string

100Cr6 Steel
type: Concept
definition: 100Cr6 is a through hardening bearing steels intended for rolling contact and other high fatigue applications, that consists of Chromium (1.35% - 1.6%), Manganese (0.2% - 0.4%), Carbon (0.95% - 1.0%), Iron (96.28% - 97.3%) as primary components.
in scheme: kitmtxxls Tribology Lab at KIT
scope note: option

Lubricant for Polishing
type: Concept
definition: A lubricant used along with the polishing medium to lubricate the sample/specimen during the polishing process.
in scheme: kitmtxxls Tribology Lab at KIT
scope note: consumable
scope note: record

half-automatic (central pressure)
type: Concept
definition: n/a
in scheme: kitmtxxls Tribology Lab at KIT
scope note: option

SiC
type: Concept
definition: Silicon carbide (SiC) is a synthetic crystalline mineral containing silicon and carbon, generally produced in electrical resistance furnaces at high temperatures of 1700 – 2500 °C.
in scheme: kitmtxxls Tribology Lab at KIT
scope note: option

Citation
type: Concept
definition: Description how to correctly cite the software or data.
in scheme: kitmtxxls Tribology Lab at KIT
scope note: string

Length
type: Concept
definition: The specification of an object defining its length.
in scheme: kitmtxxls Tribology Lab at KIT
scope note: float
scope note: µm, nm, mm, m, cm

005
type: Concept
definition: n/a
in scheme: kitmtxxls Tribology Lab at KIT
scope note: option

Maximum Measurement Speed
type: Concept
definition: Instances of this class represent the maximum permissable measument speed.
in scheme: kitmtxxls Tribology Lab at KIT
scope note: float
scope note: µm*s^(-1), mm*s^(-1), m*s^(-1), km*h^(-1)

Cleaning Cross Section
type: Concept
definition: n/a
in scheme: kitmtxxls Tribology Lab at KIT
scope note: option

Constant
type: Concept
definition: Throughout an experiment it does not change.
in scheme: kitmtxxls Tribology Lab at KIT
scope note: option

final_temp_base
type: Concept
definition: The temperature of the mounting block at the end of the experiment.
in scheme: kitmtxxls Tribology Lab at KIT
scope note: float
scope note: °C

Plµ Neox
type: Concept
definition: n/a
in scheme: kitmtxxls Tribology Lab at KIT
scope note: option

Windows Vista
type: Concept
definition: Released to the public on January 30, 2007, Windows Vista is the successor to Windows XP in Microsoft's Windows line of operating systems. With the Vista iteration, Windows saw significant changes, both in aesthetic design and available features, with a focus on creating a more diverse and user-friendly experience
in scheme: kitmtxxls Tribology Lab at KIT
scope note: option

Z-direction Measurement Resolution
type: Concept
definition: Instances of this class represent the z-direction (vertical) resolution that the system can capture.
in scheme: kitmtxxls Tribology Lab at KIT
scope note: float
scope note: µm, nm, mm, m, cm

Process Summary (Data Processing)
type: Concept
definition: Summarizes process parameters and procedures of data processing.
in scheme: kitmtxxls Tribology Lab at KIT
scope note: dictionary

Air (Humidity Controlled)
type: Concept
definition: n/a
in scheme: kitmtxxls Tribology Lab at KIT
scope note: option

Maximum Duration
type: Concept
definition: Instances of this class characterize the maximum permissible duration for a process maintained by a machine.
in scheme: kitmtxxls Tribology Lab at KIT
scope note: float
scope note: s, min, h

physicallyModifies
type: Concept
definition: Denotes that a given process results in a modified size/shape/state/appearance/topography of the original physical item. This property relates a process to the objects which are physically influenced temporarily (elastically), or permanently (plastically).
in scheme: kitmtxxls Tribology Lab at KIT
scope note: none
scope note: relationship_type

Actual Applied Deadweight Setpoint
type: Concept
definition: The weight applied by the weighing object placed to supply normal load.
in scheme: kitmtxxls Tribology Lab at KIT
scope note: float
scope note: kg, g

Tabular Data Type
type: Concept
definition: Defines the specific type of tabular data.
in scheme: kitmtxxls Tribology Lab at KIT
scope note: string

Polishing Step
type: Concept
definition: n/a
in scheme: kitmtxxls Tribology Lab at KIT
scope note: detached
scope note: option

Polishing Cloth
type: Concept
definition: Contains information about the cloth used during a polishing step.
in scheme: kitmtxxls Tribology Lab at KIT
scope note: dictionary

Negative
type: Concept
definition: n/a
in scheme: kitmtxxls Tribology Lab at KIT
scope note: option

Pattern X Resolution
type: Concept
definition: Describes the resolution of EBSD patterns or other images in horizontal direction.
in scheme: kitmtxxls Tribology Lab at KIT
scope note: integer
scope note: pixels

takesDataFromProcess
type: Concept
definition: Denotes that a given process takes data from a previous process or a dataset. This property relates a data manipulation process to the process that generated the data needed to be supplied for its excution.
in scheme: kitmtxxls Tribology Lab at KIT
scope note: none
scope note: relationship_type

Array of Connected PC's
type: Concept
definition: Class containing information about the PC's connected to a tribometer.
in scheme: kitmtxxls Tribology Lab at KIT
scope note: dictionary

Master's Thesis
type: Concept
definition: n/a
in scheme: kitmtxxls Tribology Lab at KIT
scope note: option

Furnace
type: Concept
definition: Objects of this class pertain to the category of machines called furnace.
in scheme: kitmtxxls Tribology Lab at KIT
scope note: https://purls.helmholtz-metadaten.de/vp/kitmtxx-41732562-vp/ism_xxx_xxx-cd4f36f6200648d294054682584c8e2b-vp: https://purls.helmholtz-metadaten.de/vp/kitmtxx-41732562-vp/fur_xxx_xxx-c04aefd269c64c6fa2773c318193f2d6-vp
scope note: equipment
scope note: record

Minimum Travel Speed
type: Concept
definition: Instances of this class represent the minimum permissable travel speed, while no measurement is taken.
in scheme: kitmtxxls Tribology Lab at KIT
scope note: float
scope note: µm*s^(-1), mm*s^(-1), m*s^(-1), km*h^(-1)

Gas Deposition
type: Concept
definition: kitmtxxl which is deposited from the gas phase using electron or Ga+ beam.
in scheme: kitmtxxls Tribology Lab at KIT
scope note: string

QATM
type: Concept
definition: Quality Assured Metallography / kitmtxxlography / Hardness Testing
in scheme: kitmtxxls Tribology Lab at KIT
scope note: option

FE-Analysis
type: Concept
definition: Class representing the execution of a finite-element-analysis to investigate the reaction of a part to ceratin boundary conditions.
in scheme: kitmtxxls Tribology Lab at KIT
scope note: process
scope note: record

Row/Column Number
type: Concept
definition: Denotes the sequential number of the respective row or column described by 'Tabular Data Contents Specifications'.
in scheme: kitmtxxls Tribology Lab at KIT
scope note: integer

providesAdditionalInformationAbout
type: Concept
definition: This relationship characterizes a chain of related processes, unified by the use of the same specimen.
in scheme: kitmtxxls Tribology Lab at KIT
scope note: none
scope note: relationship_type

Drive Power Supplied (Measured)
type: Concept
definition: The power of the motor which is responsible for the motion of the tribological base body. Used in: Optimol SRV5
in scheme: kitmtxxls Tribology Lab at KIT
scope note: option

Radius
type: Concept
definition: The specification of a preferencially curved object defining its radius.
in scheme: kitmtxxls Tribology Lab at KIT
scope note: float
scope note: µm, nm, mm, m, cm

Axis Rotation Angle
type: Concept
definition: Describes the angle offset between two coordinate systems.
in scheme: kitmtxxls Tribology Lab at KIT
scope note: float
scope note: °

Sample Rotation
type: Concept
definition: The angle of the sample on the sample holder. Most often represented as the angle between the horizontal axis to the wear track.
in scheme: kitmtxxls Tribology Lab at KIT
scope note: float
scope note: °

Lenses Used
type: Concept
definition: Contains information about the lenses used during the process.
in scheme: kitmtxxls Tribology Lab at KIT
scope note: dictionary

Toolpath Generation
type: Concept
definition: Class representing the execution of a slicer for additive manufacturing. A slicer is a toolpath generation software used in 3D printing. It facilitates the conversion of a 3D object model to specific instructions for the printer. The slicer converts a model in STL (stereolithography) format into printer commands in G-code format.
in scheme: kitmtxxls Tribology Lab at KIT
scope note: https://purls.helmholtz-metadaten.de/vp/kitmtxx-41732562-vp/tak_xxx_xxx-ca48d075c7de4872b4f12e464652bcb1-vp: https://purls.helmholtz-metadaten.de/vp/kitmtxx-41732562-vp/too_gen_xxx-8d2c6b16030c465f97af9a7eed1ba400-vp
scope note: https://purls.helmholtz-metadaten.de/vp/kitmtxx-41732562-vp/tak_xxx_xxx-ca48d075c7de4872b4f12e464652bcb1-vp: https://purls.helmholtz-metadaten.de/vp/kitmtxx-41732562-vp/cad_mod_xxx-fc0120f3bf2f4e17ac90d9f1dc350492-vp
scope note: https://purls.helmholtz-metadaten.de/vp/kitmtxx-41732562-vp/tak_xxx_xxx-ca48d075c7de4872b4f12e464652bcb1-vp: https://purls.helmholtz-metadaten.de/vp/kitmtxx-41732562-vp/str_mec_opt-8fdc88ce9f6a48aba88e3be36447f855-vp
scope note: process
scope note: record

Mass Density Specifications
type: Concept
definition: Class containing information about the mass density of the the piece of interfacial medium.
in scheme: kitmtxxls Tribology Lab at KIT
scope note: dictionary

WC-Ni
type: Concept
definition: Tungsten Carbide/Nickel Powder (WC/Ni Powder) is a metal-ceramic- (cermet) composite material used as high-temperature wear and corrosion-resistant coating. The alloyed form gives superior hardness.
in scheme: kitmtxxls Tribology Lab at KIT
scope note: option

Summary About Processed Topography Data
type: Concept
definition: n/a
in scheme: kitmtxxls Tribology Lab at KIT
scope note: option

Detector Position
type: Concept
definition: The insertion distance of the detector into the chamber of the SEM.
in scheme: kitmtxxls Tribology Lab at KIT
scope note: float
scope note: nm, µm, mm, m

Flat-on-Flat Contact
type: Concept
definition: The mating surfaces are nominally flat and even.
in scheme: kitmtxxls Tribology Lab at KIT
scope note: option

M110
type: Concept
definition: n/a
in scheme: kitmtxxls Tribology Lab at KIT
scope note: option

Physik Instrumente (PI) GmbH & Co. KG
type: Concept
definition: Karlsruhe, Germany
in scheme: kitmtxxls Tribology Lab at KIT
scope note: option

Total Number of Completed Cycles
type: Concept
definition: The total number of cycles experienced by the tribo pair after an entire experiment.
in scheme: kitmtxxls Tribology Lab at KIT
scope note: float

EBSD or TKD Settings
type: Concept
definition: Term containing information about the EBSD/TKD settings used for an EBSD/TKD scan.
in scheme: kitmtxxls Tribology Lab at KIT
scope note: dictionary

Y-direction Travel Range
type: Concept
definition: Instances of this class represent the distance between the lower and upper limits of the y-axis/secondary lateral axis/slow axis.
in scheme: kitmtxxls Tribology Lab at KIT
scope note: float
scope note: µm, nm, mm, m, cm

Minimum Beam Voltage
type: Concept
definition: The minimum beam voltage under which the equipment can operate.
in scheme: kitmtxxls Tribology Lab at KIT
scope note: float
scope note: V, kV

Electropolishing Steps
type: Concept
definition: Describes the sequential order of electropolishing steps.
in scheme: kitmtxxls Tribology Lab at KIT
scope note: sub-workflow

Nalgene
type: Concept
definition: The Thermo Scientific Nalgene brand name today is well-known and very respected in the laboratory community as the go to name for quality plastic labware. Nalgene is designed to be extremely durable and provides the best quality material for long product life and dependably low extractables.
in scheme: kitmtxxls Tribology Lab at KIT
scope note: option

standard_deviation_of_oxidation_depth
type: Concept
definition: Standard deviation of measured depth of oxidation in SEM cross sections
in scheme: kitmtxxls Tribology Lab at KIT
scope note: float
scope note: nm, µm, mm, m

Windows 98
type: Concept
definition: Windows 98 is the operating system from Microsoft that succeeded Windows 95. Windows 98's boot sequence was based on MS-DOS, and the operating system introduced features to help in greater Web integration.
in scheme: kitmtxxls Tribology Lab at KIT
scope note: option

Piezo Electric Drive
type: Concept
definition: Piezo inertia drives are space-saving and inexpensive piezo-based drives with relatively high holding forces and a virtually unlimited travel range. They make use of the stick-slip effect (inertia effect) – a cyclical alternation of static and sliding friction between a runner and the drive element generated by the piezo element – for a continuous feed of the runner. The operating frequency of more than 20 kHz enables the runner to be directly driven at velocities in excess of 5 mm/s. The inertia drive principle is based on a single piezoelectrical actuator that is controlled with a modified sawtooth voltage generated by the drive electronics. The actuator expands slowly and moves the runner. Due to its inertia, the runner is unable to follow the fast contraction of the actuator and remains at its position.
in scheme: kitmtxxls Tribology Lab at KIT
scope note: option

Positional Repeatability
type: Concept
definition: Instances of this class represent the maximum deviation from a prescribed position.
in scheme: kitmtxxls Tribology Lab at KIT
scope note: float
scope note: µm, nm, mm, m, cm

Desiccator Storage History
type: Concept
definition: Historical list of desiccator in- and outputs of the specimen.
in scheme: kitmtxxls Tribology Lab at KIT
scope note: dictionary

C
type: Concept
definition: Carbon
in scheme: kitmtxxls Tribology Lab at KIT
scope note: option

Specimen Container
type: Concept
definition: n/a
in scheme: kitmtxxls Tribology Lab at KIT
scope note: option

Goodfellow
type: Concept
definition: n/a
in scheme: kitmtxxls Tribology Lab at KIT
scope note: option

Contained Object Specifications
type: Concept
definition: Denotes the specifications of objects that are physically within the object being described.
in scheme: kitmtxxls Tribology Lab at KIT
scope note: dictionary

File(s) Purpose
type: Concept
definition: Instances of this class specify the purpose of generation of a specific output file during conduction of the experiment. Free text allowed.
in scheme: kitmtxxls Tribology Lab at KIT
scope note: string

Bytes or Bits Order
type: Concept
definition: Instances of this class give the order for reading or writing bytes or bits in a file.
in scheme: kitmtxxls Tribology Lab at KIT
scope note: string

Height (Derived)
type: Concept
definition: The height of a particular position after analysis.
in scheme: kitmtxxls Tribology Lab at KIT
scope note: option

Polymer
type: Concept
definition: Polymers are large molecules made by bonding (chemically linking) a series of building blocks.
in scheme: kitmtxxls Tribology Lab at KIT
scope note: option

Y Pixel Position (Set)
type: Concept
definition: The y coordinate of a pixel in the range of scanning.
in scheme: kitmtxxls Tribology Lab at KIT
scope note: option

kitmtxxl Information
type: Concept
definition: Class containing information about the material details of a block specimen.
in scheme: kitmtxxls Tribology Lab at KIT
scope note: dictionary

Minimum Turning Speed
type: Concept
definition: The minimum permissable turning speed.
in scheme: kitmtxxls Tribology Lab at KIT
scope note: float
scope note: min^(-1)

Tip Angle
type: Concept
definition: Instances of this class represent the angle of a measuring tip, when examined from the side in a measurement.
in scheme: kitmtxxls Tribology Lab at KIT
scope note: float
scope note: °

Transversal Axis Position
type: Concept
definition: Describes the transversal offset between two coordinate systems.
in scheme: kitmtxxls Tribology Lab at KIT
scope note: float

COF
type: Concept
definition: n/a
in scheme: kitmtxxls Tribology Lab at KIT
scope note: option

Sample Point Array for Spectrogram
type: Concept
definition: n/a
in scheme: kitmtxxls Tribology Lab at KIT
scope note: option

Test Load (Measured)
type: Concept
definition: Applied force measured within the test load unit (compensated for inclination, with the respective option).
in scheme: kitmtxxls Tribology Lab at KIT
scope note: option

Horizontal Field Width
type: Concept
definition: n/A
in scheme: kitmtxxls Tribology Lab at KIT
scope note: float
scope note: µm, nm, mm

km*h^(-1)
type: Concept
definition: An object moving at a constant speed of 1 km/h covers a distance of one kilometer in one hour.
in scheme: kitmtxxls Tribology Lab at KIT
scope note: option

ai1
type: Concept
definition: n/a
in scheme: kitmtxxls Tribology Lab at KIT
scope note: option

Uncontrolled Atmospheric Pressure
type: Concept
definition: The phenomenon called atmospheric pressure of the surroundings.
in scheme: kitmtxxls Tribology Lab at KIT
scope note: float
scope note: Pa, MPa, mbar

Heating Rate Specifications
type: Concept
definition: Class containing information about the furnace's heating time to temperature.
in scheme: kitmtxxls Tribology Lab at KIT
scope note: dictionary

Bruker eFlash Head Change
type: Concept
definition: Contains information whether the head of the Bruker EBSD eFlash detector has been changed during this session.
in scheme: kitmtxxls Tribology Lab at KIT
scope note: boolean

Stone Table
type: Concept
definition: n/a
in scheme: kitmtxxls Tribology Lab at KIT
scope note: option

Measured
type: Concept
definition: Values that are acquired by means of DAQ devices.
in scheme: kitmtxxls Tribology Lab at KIT
scope note: option

Used Objective
type: Concept
definition: The type of objective used during the process.
in scheme: kitmtxxls Tribology Lab at KIT
scope note: string

LEO-801
type: Concept
definition: LEO-801 SERIES ULTRASONIC CLEANER MACHINE
in scheme: kitmtxxls Tribology Lab at KIT
scope note: option

Face Orientation Information
type: Concept
definition: Class containing information about the spatial orientation of a block specimen.
in scheme: kitmtxxls Tribology Lab at KIT
scope note: dictionary

IP54
type: Concept
definition: IP54. Protected from limited dust ingress. Protected from water spray from any direction.
in scheme: kitmtxxls Tribology Lab at KIT
scope note: option

Measure Load Cell Displacement - Respectively the Friction Force
type: Concept
definition: n/a
in scheme: kitmtxxls Tribology Lab at KIT
scope note: option

Polishing Medium Type
type: Concept
definition: Term containing information about the type of the abrasive particles within the polishing medium
in scheme: kitmtxxls Tribology Lab at KIT
scope note: string

A3-2
type: Concept
definition: n/a
in scheme: kitmtxxls Tribology Lab at KIT
scope note: option

Process Purpose
type: Concept
definition: Denotes the goal of the given process.
in scheme: kitmtxxls Tribology Lab at KIT
scope note: string

E-Column Alignment
type: Concept
definition: Alignment: UC Supervisor Alignment was performed.
in scheme: kitmtxxls Tribology Lab at KIT
scope note: boolean

Air (Unconditioned)
type: Concept
definition: Air that not directly conditioned, or indirectly conditioned.
in scheme: kitmtxxls Tribology Lab at KIT
scope note: option

cm
type: Concept
definition: centimeter
in scheme: kitmtxxls Tribology Lab at KIT
scope note: option

File Persistent ID
type: Concept
definition: The file's Persistent ID used to identify the file within the Kadi4Mat database.
in scheme: kitmtxxls Tribology Lab at KIT
scope note: string

%*V^(-1)
type: Concept
definition: n/a
in scheme: kitmtxxls Tribology Lab at KIT
scope note: option

Operator(s) in Charge
type: Concept
definition: Class containing information about who performed a scientific process, or is responsible for an object.
in scheme: kitmtxxls Tribology Lab at KIT
scope note: dictionary

Variable Load Settings
type: Concept
definition: This collects the sequential steps which are executed by the machine and are associated with Normal Load.
in scheme: kitmtxxls Tribology Lab at KIT
scope note: https://purls.helmholtz-metadaten.de/vp/kitmtxx-41732562-vp/was_xxx_xxx-3362f63dcded4e41aa5b40b49059f80a-vp: https://purls.helmholtz-metadaten.de/vp/kitmtxx-41732562-vp/var_exp_ste-587692585a9f4aed8d1a4a5ab9340fa5-vp
scope note: sub-workflow

Pre-Process Cleaning
type: Concept
definition: n/a
in scheme: kitmtxxls Tribology Lab at KIT
scope note: option

Pneumatic Drive
type: Concept
definition: Pneumatic drives operate based on a principle which involves transforming pressurised air (or other gas) energy into linear or rotational movement.
in scheme: kitmtxxls Tribology Lab at KIT
scope note: option

FB 15046
type: Concept
definition: Ultrasound for the laboratory
in scheme: kitmtxxls Tribology Lab at KIT
scope note: option

Hz
type: Concept
definition: Frequency is the rate at which current changes direction per second. It is measured in hertz (Hz), an international unit of measure where 1 hertz is equal to 1 cycle per second.
in scheme: kitmtxxls Tribology Lab at KIT
scope note: option

Dwell Time (old)
type: Concept
definition: Time period during which the beam remains on one position/stationary.
in scheme: kitmtxxls Tribology Lab at KIT
scope note: concept
scope note: record
scope note: ns, μs, s, min, h

Grinding Steps
type: Concept
definition: Class containing the ordered list of sequential steps, in terms of parameters, specific to the process.
in scheme: kitmtxxls Tribology Lab at KIT
scope note: sub-workflow

Scratch Mark
type: Concept
definition: n/a
in scheme: kitmtxxls Tribology Lab at KIT
scope note: option

MPS 2 R300
type: Concept
definition: Precision vertical rotary table surface grinding machine
in scheme: kitmtxxls Tribology Lab at KIT
scope note: option

Fine Vertical Travel Range
type: Concept
definition: The travel range of the precise/fine/slow vertical drive of the machine's column (the distance in between lower limit and upper limit of the z-axis/vertical axis).
in scheme: kitmtxxls Tribology Lab at KIT
scope note: float
scope note: µm, nm, mm, m, cm

EK36
type: Concept
definition: n/a
in scheme: kitmtxxls Tribology Lab at KIT
scope note: option

Equipment Resolution
type: Concept
definition: Equipment Distance/Displacement Resolution
in scheme: kitmtxxls Tribology Lab at KIT
scope note: float
scope note: µm, nm, mm, m, cm

Metadata
type: Concept
definition: Metadata are contextual data about your experimental data. Metadata are the who, what, when, where, and why of these data. Metadata put these data into context.
in scheme: kitmtxxls Tribology Lab at KIT
scope note: option

Tool Cleaning Accessory Type
type: Concept
definition: Instances of this class specify the classification type of tool cleaning accessory.
in scheme: kitmtxxls Tribology Lab at KIT
scope note: string

GMN Georg Mueller Nuernberg AG
type: Concept
definition: n/a
in scheme: kitmtxxls Tribology Lab at KIT
scope note: option

C-863 Mercury Servocontroller
type: Concept
definition: 1 Axis Servo Controller, for DC Motors and PWM Motor Drivers
in scheme: kitmtxxls Tribology Lab at KIT
scope note: option

Cup Grinding Goal
type: Concept
definition: Instances of this class specify the classification goal of cup grinding step.
in scheme: kitmtxxls Tribology Lab at KIT
scope note: string

Focusing Method
type: Concept
definition: The method of focusing the microscope.
in scheme: kitmtxxls Tribology Lab at KIT
scope note: string

Z-20
type: Concept
definition: n/a
in scheme: kitmtxxls Tribology Lab at KIT
scope note: option

N*V^(-1)
type: Concept
definition: n/a
in scheme: kitmtxxls Tribology Lab at KIT
scope note: option

Object ID or Label
type: Concept
definition: The unique alphanumeric ID of the machine. Could be the serial number or any other assigned unique ID.
in scheme: kitmtxxls Tribology Lab at KIT
scope note: string

Optical Surface Profilometry
type: Concept
definition: Class representing the monitored processes that produce a (set of) file(s) whose contents could be used for visualization.
in scheme: kitmtxxls Tribology Lab at KIT
scope note: https://purls.helmholtz-metadaten.de/vp/kitmtxx-41732562-vp/emp_xxx_xxx-b0c09f9f6cd948839bac12aa4a2ad55d-vp: https://purls.helmholtz-metadaten.de/vp/kitmtxx-41732562-vp/opt_sur_pro-9658f444fa7b4e6b8ebf0c678491e2c0-vp
scope note: https://purls.helmholtz-metadaten.de/vp/kitmtxx-41732562-vp/cha_xxx_xxx-5b70f2376c68474381ef5cc428fe240b-vp: https://purls.helmholtz-metadaten.de/vp/kitmtxx-41732562-vp/blo_spe_xxx-ae137cec891644ec9e9d131be42ef67c-vp
scope note: https://purls.helmholtz-metadaten.de/vp/kitmtxx-41732562-vp/que_xxx_xxx-dc882ce905ba4dfbb3a906b1c1b0cdad-vp: https://purls.helmholtz-metadaten.de/vp/kitmtxx-41732562-vp/tri_exp_xxx-9b84c31083254e40a6eb78601271d381-vp
scope note: https://purls.helmholtz-metadaten.de/vp/kitmtxx-41732562-vp/que_xxx_xxx-dc882ce905ba4dfbb3a906b1c1b0cdad-vp: https://purls.helmholtz-metadaten.de/vp/kitmtxx-41732562-vp/opt_mic_xxx-c73af6d31f314907b33d212d43f61891-vp
scope note: process
scope note: record

Data Processing (Optimol Data)
type: Concept
definition: Class representing the execution of a particular computer code which extracts/reshapes/processes data from one form to another. The data stems from an Optimol tribometer.
in scheme: kitmtxxls Tribology Lab at KIT
scope note: https://purls.helmholtz-metadaten.de/vp/kitmtxx-41732562-vp/tak_xxx_xxx-ca48d075c7de4872b4f12e464652bcb1-vp: https://purls.helmholtz-metadaten.de/vp/kitmtxx-41732562-vp/tri_exp_xxx-9b84c31083254e40a6eb78601271d381-vp
scope note: https://purls.helmholtz-metadaten.de/vp/kitmtxx-41732562-vp/tak_xxx_xxx-ca48d075c7de4872b4f12e464652bcb1-vp: https://purls.helmholtz-metadaten.de/vp/kitmtxx-41732562-vp/opt_mic_xxx-c73af6d31f314907b33d212d43f61891-vp
scope note: https://purls.helmholtz-metadaten.de/vp/kitmtxx-41732562-vp/use_xxx_xxx-f130aac753c3467a9ef4cd8d2163a609-vp: https://purls.helmholtz-metadaten.de/vp/kitmtxx-41732562-vp/sof_xxx_xxx-43c5e712afb04a16a8954dbb3c865c0f-vp
scope note: process
scope note: record

Grease Seal Renewal
type: Concept
definition: The operation of exchanging the grease seal with the purpose of the new one sealing the desiccator thighter. A grease seal renewal is always necessary when renewing the silica gel.
in scheme: kitmtxxls Tribology Lab at KIT
scope note: https://purls.helmholtz-metadaten.de/vp/kitmtxx-41732562-vp/mak_xxx_xxx-85937c1afc674792af65bffa0748aa31-vp: https://purls.helmholtz-metadaten.de/vp/kitmtxx-41732562-vp/gre_xxx_xxx-da54759e955743e298096baa0840c10f-vp
scope note: https://purls.helmholtz-metadaten.de/vp/kitmtxx-41732562-vp/isp_xxx_xxx-8e9a047582b24d5785b5689dd0ecda9b-vp: https://purls.helmholtz-metadaten.de/vp/kitmtxx-41732562-vp/sil_gel_ren-f60bab27338a4c45afe5c1ca3f4817a5-vp
scope note: https://purls.helmholtz-metadaten.de/vp/kitmtxx-41732562-vp/inv_xxx_xxx-c5ceb18203384c359584362949572590-vp: https://purls.helmholtz-metadaten.de/vp/kitmtxx-41732562-vp/dry_cab_xxx-7382b1a7ced043e19f1c713d0e6f767e-vp
scope note: https://purls.helmholtz-metadaten.de/vp/kitmtxx-41732562-vp/inv_xxx_xxx-c5ceb18203384c359584362949572590-vp: https://purls.helmholtz-metadaten.de/vp/kitmtxx-41732562-vp/des_xxx_xxx-3ee63bf8276444389833022dc1d8c2a1-vp
scope note: process
scope note: record

Test Chamber Temperature (Measured)
type: Concept
definition: Air temperature within the test chamber.
in scheme: kitmtxxls Tribology Lab at KIT
scope note: option

DASYLab
type: Concept
definition: Allroundsoftware for measurement techniques like tensile tests Company: measX GmbH & Co. KG
in scheme: kitmtxxls Tribology Lab at KIT
scope note: option

Little-Endian Ordering, 64-Bit Long Data Type
type: Concept
definition: n/a
in scheme: kitmtxxls Tribology Lab at KIT
scope note: option

characterizesSpecimen
type: Concept
definition: Denotes that a given process characterizes a block specimen. For example: optical microscopy, weight measurement, length measurement.
in scheme: kitmtxxls Tribology Lab at KIT
scope note: none
scope note: relationship_type

Cumulative Specimen Exposure Time in Ambient Air
type: Concept
definition: Term containing the time the specimen was already exposed to air before the process/procedure/experiment has started.
in scheme: kitmtxxls Tribology Lab at KIT
scope note: float
scope note: s, min, h

Pattern Y Resolution
type: Concept
definition: Describes the resolution of EBSD patterns or other images in vertical direction.
in scheme: kitmtxxls Tribology Lab at KIT
scope note: integer
scope note: pixels

Porous Alumina (Hard)
type: Concept
definition: Porous aluminum is a nanostructured material characterized by unique properties, such as chemical stability, regular uniformity, dense hexagonal porous lattice with high aspect ratio nanopores, excellent mechanical strength, and biocompatibility.
in scheme: kitmtxxls Tribology Lab at KIT
scope note: option

4113
type: Concept
definition: n/a
in scheme: kitmtxxls Tribology Lab at KIT
scope note: option

Reshaped and Augmented Raw Data
type: Concept
definition: n/a
in scheme: kitmtxxls Tribology Lab at KIT
scope note: option

μTC, 30.49
type: Concept
definition: n/a
in scheme: kitmtxxls Tribology Lab at KIT
scope note: option

File (Tribological Experiment)
type: Concept
definition: Term containing a collection of metadata, each associated with a file or a series of files, generated as the output of a tribological experiment and sharing the same metadata.
in scheme: kitmtxxls Tribology Lab at KIT
scope note: data
scope note: record

Ethanol
type: Concept
definition: A primary alcohol that is ethane in which one of the hydrogens is substituted by a hydroxy group.
in scheme: kitmtxxls Tribology Lab at KIT
scope note: option

Bosch Standard
type: Concept
definition: Class containing information about the technical standard of the interfacial medium.
in scheme: kitmtxxls Tribology Lab at KIT
scope note: string

Cycle
type: Concept
definition: n/a
in scheme: kitmtxxls Tribology Lab at KIT
scope note: option

Vise
type: Concept
definition: A vise mechanism compressing the base body's side surfaces to secure them to the machinery's construction.
in scheme: kitmtxxls Tribology Lab at KIT
scope note: option

Abrasive kitmtxxl Type
type: Concept
definition: Instances of this class specify the abrasive material that a grinding tool is made of. This refers to the material doing the actual grinding, not the bond (if there is any).
in scheme: kitmtxxls Tribology Lab at KIT
scope note: string

Big-Endian Ordering
type: Concept
definition: Big-endian is an order in which the "big end" (most significant value in the sequence) is stored first, at the lowest storage address.
in scheme: kitmtxxls Tribology Lab at KIT
scope note: option

Grit
type: Concept
definition: Denotes the size of the abrasive particles.
in scheme: kitmtxxls Tribology Lab at KIT
scope note: string

Local ID of Physical Quantity
type: Concept
definition: The kitmttxxulary Local ID, used for machine interoperability of the field's contents.
in scheme: kitmtxxls Tribology Lab at KIT
scope note: string

Diamond Wire
type: Concept
definition: Diamond wire is made in a number of ways, but the most common way is by attaching fine diamond particles to steel wire through an electroplating process.
in scheme: kitmtxxls Tribology Lab at KIT
scope note: option

Y-direction Measurement Resolution
type: Concept
definition: Instances of this class represent the y-axis/secondary lateral axis/slow axis resolution that the system can capture.
in scheme: kitmtxxls Tribology Lab at KIT
scope note: float
scope note: µm, nm, mm, m, cm

Analysis of Raw Data
type: Concept
definition: Denotes a process which takes raw data as input and analyses it.
in scheme: kitmtxxls Tribology Lab at KIT
scope note: option

Publication
type: Concept
definition: Objects of this class contain publications of the kind of papers, posters or theses.
in scheme: kitmtxxls Tribology Lab at KIT
scope note: https://purls.helmholtz-metadaten.de/vp/kitmtxx-41732562-vp/doc_xxx_xxx-0e7f7d94b537444bb387aaecf77cbb0a-vp: https://purls.helmholtz-metadaten.de/vp/kitmtxx-41732562-vp/tri_xxx_xxx-c98170df4aa14cd38e9ba0d1b94ebdf0-vp
scope note: publication
scope note: record

DBL 6513.00
type: Concept
definition: n/a
in scheme: kitmtxxls Tribology Lab at KIT
scope note: option

Diamond
type: Concept
definition: Diamond is an allotrope of carbon. It is solid in its form and its atoms are present in a crystal structure known as diamond cubic.
in scheme: kitmtxxls Tribology Lab at KIT
scope note: option

DAQ Interface Name
type: Concept
definition: Field that specifies the interface that is used to connect the DAQ device to the recording PC.
in scheme: kitmtxxls Tribology Lab at KIT
scope note: string

General Info (Specimen)
type: Concept
definition: Objects of this class contain information that unequivocally identifies a specimen.
in scheme: kitmtxxls Tribology Lab at KIT
scope note: dictionary

First Data Column
type: Concept
definition: Denotes the sequential number of the firs column in the tabular data file, which contains raw data values.
in scheme: kitmtxxls Tribology Lab at KIT
scope note: integer

final_mu
type: Concept
definition: The average CoF in the last cycle of the experiment.
in scheme: kitmtxxls Tribology Lab at KIT
scope note: float

1
type: Concept
definition: n/a
in scheme: kitmtxxls Tribology Lab at KIT
scope note: option

Middle Position
type: Concept
definition: n/a
in scheme: kitmtxxls Tribology Lab at KIT
scope note: option

Specimen Positioning Info
type: Concept
definition: Class containing information that characterizes the block specimen positioning.
in scheme: kitmtxxls Tribology Lab at KIT
scope note: dictionary

Working Area Height
type: Concept
definition: Instances of this class specify the available height of the volume for manipulation within a machine.
in scheme: kitmtxxls Tribology Lab at KIT
scope note: float
scope note: µm, nm, mm, m, cm

Cooling Medium Flow Rate
type: Concept
definition: Instances of this class characterize the prescribed coolant flow rate.
in scheme: kitmtxxls Tribology Lab at KIT
scope note: float
scope note: %

Silica Gel Renewal
type: Concept
definition: The operation of exchanging the silica gels with the purpose of the new ones being able to absorb more humidity.
in scheme: kitmtxxls Tribology Lab at KIT
scope note: https://purls.helmholtz-metadaten.de/vp/kitmtxx-41732562-vp/inv_xxx_xxx-c5ceb18203384c359584362949572590-vp: https://purls.helmholtz-metadaten.de/vp/kitmtxx-41732562-vp/dry_cab_xxx-7382b1a7ced043e19f1c713d0e6f767e-vp
scope note: https://purls.helmholtz-metadaten.de/vp/kitmtxx-41732562-vp/inv_xxx_xxx-c5ceb18203384c359584362949572590-vp: https://purls.helmholtz-metadaten.de/vp/kitmtxx-41732562-vp/des_xxx_xxx-3ee63bf8276444389833022dc1d8c2a1-vp
scope note: https://purls.helmholtz-metadaten.de/vp/kitmtxx-41732562-vp/isp_xxx_xxx-8e9a047582b24d5785b5689dd0ecda9b-vp: https://purls.helmholtz-metadaten.de/vp/kitmtxx-41732562-vp/spe_sto_tak-ca54647367f14761b955711dd9e42705-vp
scope note: process
scope note: record

Pt dep
type: Concept
definition: n/a
in scheme: kitmtxxls Tribology Lab at KIT
scope note: option

Kinematic Viscosity Specifications
type: Concept
definition: Class containing information about the kinematic viscosity of the piece of interfacial medium.
in scheme: kitmtxxls Tribology Lab at KIT
scope note: dictionary

TKD
type: Concept
definition: Contains information whether TKD (transmission Kikuchi diffraction) was used or not.
in scheme: kitmtxxls Tribology Lab at KIT
scope note: boolean

Technical Specifications (Furnace)
type: Concept
definition: Class containing information about the technical specifications of a furnace.
in scheme: kitmtxxls Tribology Lab at KIT
scope note: dictionary

Average Data Time Series
type: Concept
definition: Contains time series data denoting the result of an averaging process over some input data.
in scheme: kitmtxxls Tribology Lab at KIT
scope note: option

Maximum Number of Specimens
type: Concept
definition: Maximum number of specimens which can be attached to the machine
in scheme: kitmtxxls Tribology Lab at KIT
scope note: integer

Thermo Fisher Scientific
type: Concept
definition: Waltham, Massachusetts, USA
in scheme: kitmtxxls Tribology Lab at KIT
scope note: option

Motion Parameters
type: Concept
definition: Instances of this class list information on the chosen parameters to define the relative motion during an experiment.
in scheme: kitmtxxls Tribology Lab at KIT
scope note: dictionary

MaTecK - kitmtxxl-Technologie & Kristalle GmbH
type: Concept
definition: Im Langenbroich 20, 52428 Jülich, Germany
in scheme: kitmtxxls Tribology Lab at KIT
scope note: option

Timestamp
type: Concept
definition: Subsection holds information about when the experiment was conducted.
in scheme: kitmtxxls Tribology Lab at KIT
scope note: date

Electropolishing Machine
type: Concept
definition: Objects of this class pertain to the category of machines that perform electropolishing tasks as their primary use.
in scheme: kitmtxxls Tribology Lab at KIT
scope note: https://purls.helmholtz-metadaten.de/vp/kitmtxx-41732562-vp/ism_xxx_xxx-cd4f36f6200648d294054682584c8e2b-vp: https://purls.helmholtz-metadaten.de/vp/kitmtxx-41732562-vp/ele_mac_xxx-903f852b9cef4385aaa4a8fef788e7b5-vp
scope note: equipment
scope note: record

General Info (Publication)
type: Concept
definition: Objects of this class contain information that describes the data.
in scheme: kitmtxxls Tribology Lab at KIT
scope note: dictionary

File Technical Specifications
type: Concept
definition: Instances of this class contain the information to open/access/read and interprete a file's contents adequately.
in scheme: kitmtxxls Tribology Lab at KIT
scope note: dictionary

Number of Plasma Cleanings
type: Concept
definition: Number of plasma cleanings performed.
in scheme: kitmtxxls Tribology Lab at KIT
scope note: integer

General Info (Equipment or Object)
type: Concept
definition: Objects of this class contain information that unequivocally identifies a piece of equipment.
in scheme: kitmtxxls Tribology Lab at KIT
scope note: dictionary

ai2
type: Concept
definition: n/a
in scheme: kitmtxxls Tribology Lab at KIT
scope note: option

Process Summary (Tensile Test)
type: Concept
definition: Summarizes process parameters and procedures of tensile testing.
in scheme: kitmtxxls Tribology Lab at KIT
scope note: dictionary

ml*h^(-1)
type: Concept
definition: n/a
in scheme: kitmtxxls Tribology Lab at KIT
scope note: option

Minimum Incremental Motion
type: Concept
definition: The Minimum Incremental Motion is the smallest step size for which the criteria is satisfied. This ensures that an individual step will result in a real displacement within a certain tolerance.
in scheme: kitmtxxls Tribology Lab at KIT
scope note: float
scope note: µm, nm, mm, m, cm

Speed
type: Concept
definition: n/a
in scheme: kitmtxxls Tribology Lab at KIT
scope note: option

Working Area Length
type: Concept
definition: Instances of this class specify the available length of the area for manipulation within a machine.
in scheme: kitmtxxls Tribology Lab at KIT
scope note: float
scope note: µm, nm, mm, m, cm

Polishing Process Step Type
type: Concept
definition: Describes the step in the polishing process.
in scheme: kitmtxxls Tribology Lab at KIT
scope note: string

Paper
type: Concept
definition: Paper
in scheme: kitmtxxls Tribology Lab at KIT
scope note: option

Bolt
type: Concept
definition: A bolt or bolts compressing the specimen directly to the machinery's construction.
in scheme: kitmtxxls Tribology Lab at KIT
scope note: option

Maximum Specimen Treatable Thickness
type: Concept
definition: The specification of an object defining its thickness.
in scheme: kitmtxxls Tribology Lab at KIT
scope note: float
scope note: µm, nm, mm, m, cm

makesUseOfConsumable
type: Concept
definition: This relationship relates a scientific process to an object which supports the process, but is readily replacable during or after the process, as it its function deteriorates over time.
in scheme: kitmtxxls Tribology Lab at KIT
scope note: none
scope note: relationship_type

Technical Specifications (Polishing Medium)
type: Concept
definition: Term containing information about the technical specifications of a polishing medium.
in scheme: kitmtxxls Tribology Lab at KIT
scope note: dictionary

Little-Endian Ordering
type: Concept
definition: In a binary number consisting of multiple bytes (e.g., a 32-bit unsigned integer value, the Group Number, the Element Number, etc.), the least significant byte shall be encoded first; with the remaining bytes encoded in increasing order of significance.
in scheme: kitmtxxls Tribology Lab at KIT
scope note: option

well Diamantdrahtsägen GmbH
type: Concept
definition: Mannheim, Germany
in scheme: kitmtxxls Tribology Lab at KIT
scope note: option

Flash Point Specifications
type: Concept
definition: Class containing information about the flash point the piece of interfacial medium.
in scheme: kitmtxxls Tribology Lab at KIT
scope note: dictionary

Pa
type: Concept
definition: One Pascal (Pa) is defined as the pressure imparted by a Force of one Newton perpendicularly on the area of one square meter.
in scheme: kitmtxxls Tribology Lab at KIT
scope note: option

Process Summary (Laser Processing)
type: Concept
definition: Summarizes process parameters and procedures of laser processing.
in scheme: kitmtxxls Tribology Lab at KIT
scope note: dictionary

Amplitude Matrix for Spectrogram
type: Concept
definition: The digital spectrogram is a matrix of amplitudes. Each amplitude of that matrix corresponds to a single pixel (picture element) of the spectrogram image.
in scheme: kitmtxxls Tribology Lab at KIT
scope note: option

Electrolyte Temperature
type: Concept
definition: The temperature of the electrolyte prior to the beginning of the process.
in scheme: kitmtxxls Tribology Lab at KIT
scope note: float
scope note: K, °C

*.xls
type: Concept
definition: Files with XLS extension represent Excel Binary File Format. Such files can be created by Microsoft Excel as well as other similar spreadsheet programs such as OpenOffice Calc or Apple Numbers.
in scheme: kitmtxxls Tribology Lab at KIT
scope note: option

Grinding Step
type: Concept
definition: n/a
in scheme: kitmtxxls Tribology Lab at KIT
scope note: detached
scope note: option

Array of References
type: Concept
definition: A structure of information about reference values that are meant to be compared to the values part of the process of interest.
in scheme: kitmtxxls Tribology Lab at KIT
scope note: dictionary

010
type: Concept
definition: n/a
in scheme: kitmtxxls Tribology Lab at KIT
scope note: option

Isopropyl Alcohol (Isopropanol)
type: Concept
definition: n/a
in scheme: kitmtxxls Tribology Lab at KIT
scope note: option

Platform Name
type: Concept
definition: The name by which the platform is best known.
in scheme: kitmtxxls Tribology Lab at KIT
scope note: string

Bitmap
type: Concept
definition: A bitmap (or raster graphic) is a digital image composed of a matrix of dots. When viewed at 100%, each dot corresponds to an individual pixel on a display.
in scheme: kitmtxxls Tribology Lab at KIT
scope note: option

°C
type: Concept
definition: n/a
in scheme: kitmtxxls Tribology Lab at KIT
scope note: option

Equipment Friendly Name
type: Concept
definition: The type of machine and the way it is referred to. The friendly way to identify it.
in scheme: kitmtxxls Tribology Lab at KIT
scope note: string

3.10
type: Concept
definition: n/a
in scheme: kitmtxxls Tribology Lab at KIT
scope note: option

Wagner Magnete
type: Concept
definition: n/a
in scheme: kitmtxxls Tribology Lab at KIT
scope note: option

Principle of Load Application
type: Concept
definition: The method (principle) of load application. For Tribometers, the way the normal load is applied can have a big influence on the tribologically induced processes in the frictional contact and the long-term evolution of the tribo-system (e.g. due to wear).
in scheme: kitmtxxls Tribology Lab at KIT
scope note: string

D25
type: Concept
definition: n/a
in scheme: kitmtxxls Tribology Lab at KIT
scope note: option

CCD
type: Concept
definition: Charge-Coupled Device: In-chamber Nav-Cam sample navigation camera
in scheme: kitmtxxls Tribology Lab at KIT
scope note: option

Electropolishing Process Parameters
type: Concept
definition: Term containing information about the parameters specific to the process.
in scheme: kitmtxxls Tribology Lab at KIT
scope note: dictionary

sum_mu
type: Concept
definition: The frictional energy spent in the entirety of the test within the analyzed loop region.
in scheme: kitmtxxls Tribology Lab at KIT
scope note: float
scope note: W

Imaging Mode
type: Concept
definition: The mode in which the images are taken.
in scheme: kitmtxxls Tribology Lab at KIT
scope note: string

final_temp_climate
type: Concept
definition: The temperature in the test chamber at the end of the experiment.
in scheme: kitmtxxls Tribology Lab at KIT
scope note: float
scope note: °C

Orientation Indicating Feature Side
type: Concept
definition: The side on which indicating feature is. Defined by ISO (not US) technical drawing standards.
in scheme: kitmtxxls Tribology Lab at KIT
scope note: string

Structural Mechanical Optimization
type: Concept
definition: Class representing the execution of a structural mechanical optimization.
in scheme: kitmtxxls Tribology Lab at KIT
scope note: https://purls.helmholtz-metadaten.de/vp/kitmtxx-41732562-vp/tak_xxx_xxx-ca48d075c7de4872b4f12e464652bcb1-vp: https://purls.helmholtz-metadaten.de/vp/kitmtxx-41732562-vp/fea_xxx_xxx-cace9ae92eb64cc0a7939a2a74ead689-vp
scope note: process
scope note: record

X-Max
type: Concept
definition: n/a
in scheme: kitmtxxls Tribology Lab at KIT
scope note: option

Cemented Carbide
type: Concept
definition: Cemented carbides, or hardmetals as they are often called, are materials made by "cementing" very hard tungsten monocarbide (WC) grains in a binder matrix of a tough cobalt or nickel alloy by liquid phase sintering.
in scheme: kitmtxxls Tribology Lab at KIT
scope note: option

Turning Direction
type: Concept
definition: The direction of motion when the relative (with respect to the machine) motion sets in.
in scheme: kitmtxxls Tribology Lab at KIT
scope note: string

Turning Frequency
type: Concept
definition: Instances of this class quantify the turning frequency in a process.
in scheme: kitmtxxls Tribology Lab at KIT
scope note: float
scope note: min^(-1), kHz, Hz

°
type: Concept
definition: n/a
in scheme: kitmtxxls Tribology Lab at KIT
scope note: option

Top To Bottom
type: Concept
definition: The beam scans the pattern from top to bottom.
in scheme: kitmtxxls Tribology Lab at KIT
scope note: option

EMsoft
type: Concept
definition: Software for dictionary indexing EBSP.
in scheme: kitmtxxls Tribology Lab at KIT
scope note: option

Zenodo
type: Concept
definition: The place found at https://zenodo.org/
in scheme: kitmtxxls Tribology Lab at KIT
scope note: option

D91
type: Concept
definition: n/a
in scheme: kitmtxxls Tribology Lab at KIT
scope note: option

Continuous
type: Concept
definition: n/a
in scheme: kitmtxxls Tribology Lab at KIT
scope note: option

After-test Unloaded Zero Offset Load
type: Concept
definition: The force for uncertatinty calculation of the normal force sensor immediately after the experiment finished.
in scheme: kitmtxxls Tribology Lab at KIT
scope note: float

mN
type: Concept
definition: n/a
in scheme: kitmtxxls Tribology Lab at KIT
scope note: option

Best Estimate of Sliding Track Starting Position w.r.t. Prescribed Origin
type: Concept
definition: Collection of parameters which describe the coordinate transformation between the two specimen coordinate systems.
in scheme: kitmtxxls Tribology Lab at KIT
scope note: dictionary

Software and Hardware Setup
type: Concept
definition: Class containing information about the parameters that are put into the involved scientific equipment to run it optimally, but are not directly part of achieving the experimental objectives.
in scheme: kitmtxxls Tribology Lab at KIT
scope note: dictionary

IAM-ZM
type: Concept
definition: Institute for Applied kitmtxxls - Reliability and Microstructure. Previously known as IAM-CMS.
in scheme: kitmtxxls Tribology Lab at KIT
scope note: https://purls.helmholtz-metadaten.de/vp/kitmtxx-41732562-vp/was_xxx_xxx-3362f63dcded4e41aa5b40b49059f80a-vp: https://purls.helmholtz-metadaten.de/vp/kitmtxx-41732562-vp/iam_xxx_xxx-cdd3e2e8127f46cb914ad6138f40b13e-vp
scope note: https://purls.helmholtz-metadaten.de/vp/kitmtxx-41732562-vp/was_xxx_xxx-3362f63dcded4e41aa5b40b49059f80a-vp: https://purls.helmholtz-metadaten.de/vp/kitmtxx-41732562-vp/iam_xxx_xxx-7171b8a9ac9a40f4834d2c0428d66738-vp
scope note: option

Sphere Storage Box
type: Concept
definition: A box containing a certain number of unused spheres of the same batch. They belong together based on their packaging and delivery.
in scheme: kitmtxxls Tribology Lab at KIT
scope note: object
scope note: record

mbar
type: Concept
definition: A millibar is 1/1000th of a bar and is the amount of force it takes to move an object weighing a gram, one centimeter, in one second.
in scheme: kitmtxxls Tribology Lab at KIT
scope note: option

Wiping
type: Concept
definition: The process of wiping the sample's surface with some kind of tissue/fabric. Can involve a liquid medium (solvent).
in scheme: kitmtxxls Tribology Lab at KIT
scope note: option

average_oxidation_depth
type: Concept
definition: Mean measured depth of oxidation in SEM cross sections
in scheme: kitmtxxls Tribology Lab at KIT
scope note: float

kg
type: Concept
definition: The kilogram, symbol kg, is the SI unit of mass. It is defined by taking the fixed numerical value of the Planck constant h to be 6.626 070 15 x 10–34 when expressed in the unit J s, which is equal to kg m2 s–1, where the metre and the second are defined in terms of c and ΔνCs.
in scheme: kitmtxxls Tribology Lab at KIT
scope note: option

Process Summary (FE-Analysis)
type: Concept
definition: Summarizes process parameters and procedures of finite element analysis.
in scheme: kitmtxxls Tribology Lab at KIT
scope note: dictionary

Frequency Array for Spectrogram
type: Concept
definition: In the spectrogram view, the vertical axis displays frequency in Hertz, the horizontal axis represents time (just like the waveform display), and amplitude is represented by brightness.
in scheme: kitmtxxls Tribology Lab at KIT
scope note: option

Front
type: Concept
definition: n/a
in scheme: kitmtxxls Tribology Lab at KIT
scope note: option

Confocal
type: Concept
definition: Confocal micrograph. An image obtained by illuminating the specimen with visible light, and passing the light through pinhole before it reaches a system of magnifying lenses. The pinhole allows only light from the focal point to pass to the detector, reducing background interference.
in scheme: kitmtxxls Tribology Lab at KIT
scope note: option

Unit of Measure
type: Concept
definition: Instances of this class lock the meaning of a magnitude.
in scheme: kitmtxxls Tribology Lab at KIT
scope note: string

Abbreviation (Column or Row Key)
type: Concept
definition: The identifier of the value(s) that precedes them in the file. This is optional.
in scheme: kitmtxxls Tribology Lab at KIT
scope note: string

Interfacial Lubricating Medium
type: Concept
definition: Objects of this class act as the immediate medium at the tribological interface, which is not the surrounding medium of the instrument as a whole.
in scheme: kitmtxxls Tribology Lab at KIT
scope note: consumable
scope note: record

Stroke Sliding Distance (Measured)
type: Concept
definition: Peak to peak distance of the oscillation drive over one period.
in scheme: kitmtxxls Tribology Lab at KIT
scope note: option

Number of option Value Sets in File
type: Concept
definition: Instances of this class provide information on how many option value sets a file contains (= number of option time series or number of recorded channels).
in scheme: kitmtxxls Tribology Lab at KIT
scope note: integer

Wire Specifications
type: Concept
definition: Term containing information about the technical specifications of the wire
in scheme: kitmtxxls Tribology Lab at KIT
scope note: dictionary

Stroke Zero Position (Measured)
type: Concept
definition: The value shown is the steady component of the position signal per period - i.e. the position of the zero position of the oscillating movement. This value increases along with the disturbances in the tribocontact.
in scheme: kitmtxxls Tribology Lab at KIT
scope note: option

Spatial Information (Specimen)
type: Concept
definition: Class containing information about the spatial (dimensions, position and arientation) details of a block specimen.
in scheme: kitmtxxls Tribology Lab at KIT
scope note: dictionary

VH-Z250R
type: Concept
definition: Dual-light high-magnification zoom lens (250 x to 2500 x)
in scheme: kitmtxxls Tribology Lab at KIT
scope note: option

Interfacial Medium Supply Method
type: Concept
definition: Way of supply of the interfacial medium during an industrial or scientific process. Could be for lubrication and/or cooling purposes.
in scheme: kitmtxxls Tribology Lab at KIT
scope note: string

Backlash
type: Concept
definition: n/A
in scheme: kitmtxxls Tribology Lab at KIT
scope note: float
scope note: µm, nm, mm, m, cm

Sawing Blade Type
type: Concept
definition: The type of blade used for sawing.
in scheme: kitmtxxls Tribology Lab at KIT
scope note: string

Minimum Probe Current
type: Concept
definition: The minimum probe current under which the machine can operate.
in scheme: kitmtxxls Tribology Lab at KIT
scope note: float
scope note: pA, nA, µA, mA, A, kA

Apprentice
type: Concept
definition: n/a
in scheme: kitmtxxls Tribology Lab at KIT
scope note: option

Maximum Beam Voltage
type: Concept
definition: The maximum beam voltage under which the equipment can operate.
in scheme: kitmtxxls Tribology Lab at KIT
scope note: float
scope note: V, kV

ai3
type: Concept
definition: n/a
in scheme: kitmtxxls Tribology Lab at KIT
scope note: option

Maximum Electrolyte Flow Rate
type: Concept
definition: Maximum electrolyte flow rate at which the machine can safely operate.
in scheme: kitmtxxls Tribology Lab at KIT
scope note: float

EK80
type: Concept
definition: n/a
in scheme: kitmtxxls Tribology Lab at KIT
scope note: option

Motion Start Distance in Front of Demagnetizing Plate
type: Concept
definition: Instances of this class give information about the distance between sample and the leading edge of the demagnetizing plate at the start of the respective demagnetizing motion.
in scheme: kitmtxxls Tribology Lab at KIT
scope note: float
scope note: µm, nm, mm, m, cm

Y Offset
type: Concept
definition: Instances of this class characterize the measurement offset in y-direction as defined by the equipment.
in scheme: kitmtxxls Tribology Lab at KIT
scope note: float
scope note: µm, nm, mm, m, cm

Number of Rows
type: Concept
definition: Denotes the total number of rows in the tabular data file.
in scheme: kitmtxxls Tribology Lab at KIT
scope note: integer

Self-Mixed
type: Concept
definition: n/a
in scheme: kitmtxxls Tribology Lab at KIT
scope note: option

Raw Data Mapping
type: Concept
definition: n/a
in scheme: kitmtxxls Tribology Lab at KIT
scope note: option

Technical Specifications (Cup Grinding Machine)
type: Concept
definition: Class containing information about the technical specifications of a cup grinding machine.
in scheme: kitmtxxls Tribology Lab at KIT
scope note: dictionary

involves
type: Concept
definition: Characterizes a process which involves an object. What’s special here is that this is such a general relationship that the connection between the process and the object must be obvious.
in scheme: kitmtxxls Tribology Lab at KIT
scope note: none
scope note: relationship_type

Maximum Deformation Depth
type: Concept
definition: Maximum measured depth of deformation in SEM images
in scheme: kitmtxxls Tribology Lab at KIT
scope note: float
scope note: nm, µm, mm, m

Relative Lateral Position of Sensor
type: Concept
definition: n/a
in scheme: kitmtxxls Tribology Lab at KIT
scope note: float
scope note: µm, nm, mm, m, cm

V
type: Concept
definition: n/a
in scheme: kitmtxxls Tribology Lab at KIT
scope note: option

Falcon 608
type: Concept
definition: INNOVATEST FALCON 608 Micro Vickers Hardness Tester 1gf -31,25kgf, Impressions V2, Joystick.
in scheme: kitmtxxls Tribology Lab at KIT
scope note: option

Connected Conditioner Info
type: Concept
definition: Class containing attributes about the installed sensors responsible for conditioning sensor outputs of a sensor.
in scheme: kitmtxxls Tribology Lab at KIT
scope note: dictionary

Indicated Face Orientation
type: Concept
definition: Class containing information about the spatial orientation of a specific face of a block specimen.
in scheme: kitmtxxls Tribology Lab at KIT
scope note: dictionary

Electropolishing Equipment
type: Concept
definition: Term containing information about the equipment used during the electropolishing process.
in scheme: kitmtxxls Tribology Lab at KIT
scope note: dictionary

Acoustic Emission Sensor 1 (Measured)
type: Concept
definition: Raw value of acoustic emission signal of sensor 1.
in scheme: kitmtxxls Tribology Lab at KIT
scope note: option

Publication Locations
type: Concept
definition: The platforms where the records are located.
in scheme: kitmtxxls Tribology Lab at KIT
scope note: dictionary

Data Processing and Plotting Script
type: Concept
definition: n/a
in scheme: kitmtxxls Tribology Lab at KIT
scope note: option

Multi Load Cell
type: Concept
definition: n/a
in scheme: kitmtxxls Tribology Lab at KIT
scope note: option

Cleaning Duration
type: Concept
definition: The duration setting assigned to be maintained by the machine or user in a cleaning process.
in scheme: kitmtxxls Tribology Lab at KIT
scope note: float
scope note: s, min, h

Specimen Sledge
type: Concept
definition: n/a
in scheme: kitmtxxls Tribology Lab at KIT
scope note: option

Manufacturing Process
type: Concept
definition: Contains information about the manufacturing process of the medium.
in scheme: kitmtxxls Tribology Lab at KIT
scope note: string

Coefficient Of Friction (Measured)
type: Concept
definition: Current value of the coefficient of friction,
in scheme: kitmtxxls Tribology Lab at KIT
scope note: option

Research Question or Hypothesis Evaluation
type: Concept
definition: Evaluates a hypothesis and research question with statements from analysis and experiments.
in scheme: kitmtxxls Tribology Lab at KIT
scope note: concept
scope note: record

Base Body Rotation
type: Concept
definition: n/a
in scheme: kitmtxxls Tribology Lab at KIT
scope note: option

MicroProf
type: Concept
definition: As an established standard measuring instrument in modern 3D surface metrology, the MicroProf® enables a quick overview measurement of the entire sample as well as high-resolution detailed measurements down to the sub-nanometer range.
in scheme: kitmtxxls Tribology Lab at KIT
scope note: option

Manual
type: Concept
definition: n/a
in scheme: kitmtxxls Tribology Lab at KIT
scope note: option

Y Number of Points
type: Concept
definition: Instances of this class characterize the measurement number of scanning points per line in y-direction, as defined by the equipment.
in scheme: kitmtxxls Tribology Lab at KIT
scope note: integer
scope note: Pixel

Interferometry
type: Concept
definition: The measurement of the properties of two or more lasers or waves by studying the pattern of interference created by their superposition.
in scheme: kitmtxxls Tribology Lab at KIT
scope note: option

EK200
type: Concept
definition: n/a
in scheme: kitmtxxls Tribology Lab at KIT
scope note: option

Grease
type: Concept
definition: Grease is a semisolid liquid that consists of a liquid lubricant mixed with a thickener.
in scheme: kitmtxxls Tribology Lab at KIT
scope note: option

Process Summary (Structural Mechanical Optimization)
type: Concept
definition: Summarizes process parameters and procedures of structural mechanical optimization.
in scheme: kitmtxxls Tribology Lab at KIT
scope note: dictionary

average_deformation_depth
type: Concept
definition: Measured depth of deformation in SEM cross section images
in scheme: kitmtxxls Tribology Lab at KIT
scope note: float

X-direction Travel Range
type: Concept
definition: Instances of this class represent the distance between the lower and upper limits of the x-axis/main lateral axis/fast axis.
in scheme: kitmtxxls Tribology Lab at KIT
scope note: float
scope note: µm, nm, mm, m, cm

Relaxation Duration Setpoint
type: Concept
definition: The prescribed duration of relaxation of the induced load, in order for a system to stabilize prior to the start/end of the process.
in scheme: kitmtxxls Tribology Lab at KIT
scope note: float
scope note: s, min, h

*.tif File Technical Specifications
type: Concept
definition: Term containing the information to open/access/read and interprete a *.tif file's contents adequately.
in scheme: kitmtxxls Tribology Lab at KIT
scope note: dictionary

Uniform Specimen Height
type: Concept
definition: First step of grinding. The grinding tool will typically start to abrade at merely one point of the surface. After this process step, the whole surface is being abraded.
in scheme: kitmtxxls Tribology Lab at KIT
scope note: option

S3.09
type: Concept
definition: n/a
in scheme: kitmtxxls Tribology Lab at KIT
scope note: option

Infeed Info
type: Concept
definition: Class containing information that gives information on the infeed parameters in this grinding step.
in scheme: kitmtxxls Tribology Lab at KIT
scope note: dictionary

s
type: Concept
definition: n/a
in scheme: kitmtxxls Tribology Lab at KIT
scope note: option

Technical Specifications (Scanning Electron Microscope)
type: Concept
definition: Term containing information about the technical specifications of a scanning electron microscope.
in scheme: kitmtxxls Tribology Lab at KIT
scope note: dictionary

Technical Specifications (Polishing Machine)
type: Concept
definition: Term containing information about the technical specifications of a polishing machine.
in scheme: kitmtxxls Tribology Lab at KIT
scope note: dictionary

Demagnetization
type: Concept
definition: Class representing the monitored processes that produce a (set of) file(s) whose contents could be used for 1D visualization.
in scheme: kitmtxxls Tribology Lab at KIT
scope note: https://purls.helmholtz-metadaten.de/vp/kitmtxx-41732562-vp/phy_xxx_xxx-3c41e6aa10d14a51b0c7a950b897fbba-vp: https://purls.helmholtz-metadaten.de/vp/kitmtxx-41732562-vp/blo_spe_xxx-ae137cec891644ec9e9d131be42ef67c-vp
scope note: https://purls.helmholtz-metadaten.de/vp/kitmtxx-41732562-vp/emp_xxx_xxx-b0c09f9f6cd948839bac12aa4a2ad55d-vp: https://purls.helmholtz-metadaten.de/vp/kitmtxx-41732562-vp/dem_pla_xxx-c4882064ea124afab8aae0b78eeae19c-vp
scope note: process
scope note: record

LabVIEW Program(s) Info
type: Concept
definition: Class containing information about the file containing the program to run an experiment.
in scheme: kitmtxxls Tribology Lab at KIT
scope note: dictionary

Company or Vendor Name
type: Concept
definition: The official name of the insitution where the object was manufactured.
in scheme: kitmtxxls Tribology Lab at KIT
scope note: string

Electropolishing
type: Concept
definition: Class representing the monitored processes that produce an electropolishing procedure which removes surface layers.
in scheme: kitmtxxls Tribology Lab at KIT
scope note: https://purls.helmholtz-metadaten.de/vp/kitmtxx-41732562-vp/mak_xxx_xxx-85937c1afc674792af65bffa0748aa31-vp: https://purls.helmholtz-metadaten.de/vp/kitmtxx-41732562-vp/ele_xxx_xxx-bb7ad7a160aa4ffea9a480879ffa0351-vp
scope note: https://purls.helmholtz-metadaten.de/vp/kitmtxx-41732562-vp/phy_xxx_xxx-3c41e6aa10d14a51b0c7a950b897fbba-vp: https://purls.helmholtz-metadaten.de/vp/kitmtxx-41732562-vp/blo_spe_xxx-ae137cec891644ec9e9d131be42ef67c-vp
scope note: https://purls.helmholtz-metadaten.de/vp/kitmtxx-41732562-vp/emp_xxx_xxx-b0c09f9f6cd948839bac12aa4a2ad55d-vp: https://purls.helmholtz-metadaten.de/vp/kitmtxx-41732562-vp/ele_mac_xxx-903f852b9cef4385aaa4a8fef788e7b5-vp
scope note: process
scope note: record

Cooling
type: Concept
definition: Process step that reduces temperature
in scheme: kitmtxxls Tribology Lab at KIT
scope note: option

Oil
type: Concept
definition: n/a
in scheme: kitmtxxls Tribology Lab at KIT
scope note: option

Standard Machine-Generated Metadata
type: Concept
definition: Metadata generated by a machine in a standard fashion.
in scheme: kitmtxxls Tribology Lab at KIT
scope note: option

Magnetic Field Emission Classification
type: Concept
definition: Class containing information about the technical standard emission observed by the magnetic field.
in scheme: kitmtxxls Tribology Lab at KIT
scope note: string

Z-direction Maximum Measurement Speed
type: Concept
definition: Instances of this class represent the maximum z-direction (vertical) speed at which the system can capture.
in scheme: kitmtxxls Tribology Lab at KIT
scope note: float
scope note: µm*s^(-1), mm*s^(-1), m*s^(-1), km*h^(-1)

Variable Experimental Steps Array
type: Concept
definition: Class containing the ordered list of sequential steps, in terms of parameters, specific to the process.
in scheme: kitmtxxls Tribology Lab at KIT
scope note: sub-workflow

tab
type: Concept
definition: n/a
in scheme: kitmtxxls Tribology Lab at KIT
scope note: option

TUC 2442 91
type: Concept
definition: n/a
in scheme: kitmtxxls Tribology Lab at KIT
scope note: option

PhD Candidate
type: Concept
definition: n/a
in scheme: kitmtxxls Tribology Lab at KIT
scope note: option

Advisor(s)
type: Concept
definition: Name of the advisor of the work or thesis.
in scheme: kitmtxxls Tribology Lab at KIT
scope note: dictionary

Procedure or Experiment End Time
type: Concept
definition: Subsection holds information about when the procedure (could be an experiment) was finished.
in scheme: kitmtxxls Tribology Lab at KIT
scope note: date

Surface Image Position
type: Concept
definition: Contains information on where the surface image is taken.
in scheme: kitmtxxls Tribology Lab at KIT
scope note: detached
scope note: string

Method of Specimen Positioning
type: Concept
definition: Instances of this class indicate the type of sample containment method for positioning it in a particular place.
in scheme: kitmtxxls Tribology Lab at KIT
scope note: string

Abrasive Particles kitmtxxl
type: Concept
definition: Denotes the material of the abrasive particles.
in scheme: kitmtxxls Tribology Lab at KIT
scope note: string

Maximum Travel Speed
type: Concept
definition: Instances of this class represent the maximum permissable travel speed, while no measurement is taken.
in scheme: kitmtxxls Tribology Lab at KIT
scope note: float
scope note: µm*s^(-1), mm*s^(-1), m*s^(-1), km*h^(-1)

N
type: Concept
definition: n/a
in scheme: kitmtxxls Tribology Lab at KIT
scope note: option

SEM or FIB Pattern Information
type: Concept
definition: Term containing information about scanning with the beam for the deposition or cutting pattern.
in scheme: kitmtxxls Tribology Lab at KIT
scope note: dictionary

plansInvestigationOn
type: Concept
definition: A plan is linked to an specimen, object or specific location from another process which it plans to investigate.
in scheme: kitmtxxls Tribology Lab at KIT
scope note: none
scope note: relationship_type

wasDerivedFrom
type: Concept
definition: This is used to denote that a kitmttxxulary model evolves, and obsoletes previous terms and structures. (It should not be visible in FS-DigitalBook)
in scheme: kitmtxxls Tribology Lab at KIT
scope note: none
scope note: relationship_type

Vibration Mitigation Method
type: Concept
definition: Object of this class provide information about the mounting base or foundation the measurment equipment sits on. This influences how vibrations created due to an experiment interact with the surroundings and how vibrations from the environment might influence the outcome of an experiment.
in scheme: kitmtxxls Tribology Lab at KIT
scope note: string

Ingredient
type: Concept
definition: Ingredient of a chemical mixture.
in scheme: kitmtxxls Tribology Lab at KIT
scope note: string

Lens Used
type: Concept
definition: Contains information about the lens used during the process.
in scheme: kitmtxxls Tribology Lab at KIT
scope note: string

No Gas Deposition
type: Concept
definition: n/a
in scheme: kitmtxxls Tribology Lab at KIT
scope note: option

Y-direction Measurement Range
type: Concept
definition: Instances of this class represent the maximum range of values in y-direction (second lateral) that the system can capture in one acquisition process/one measurement.
in scheme: kitmtxxls Tribology Lab at KIT
scope note: float
scope note: µm, nm, mm, m, cm

STEM II detector
type: Concept
definition: Scanning transmission electron detector with BF/ DF/ HAADF segments
in scheme: kitmtxxls Tribology Lab at KIT
scope note: option

Cryo Trap
type: Concept
definition: Cryogenic cold trapping is a technique where part of a column is cooled down to temperatures down to -150°C.
in scheme: kitmtxxls Tribology Lab at KIT
scope note: option

FIB Cutting Summary
type: Concept
definition: Contains information about the process of cutting in the SEM with the FIB.
in scheme: kitmtxxls Tribology Lab at KIT
scope note: dictionary

Scan Topography
type: Concept
definition: n/a
in scheme: kitmtxxls Tribology Lab at KIT
scope note: option

Pt
type: Concept
definition: Platinum
in scheme: kitmtxxls Tribology Lab at KIT
scope note: option

Variable Controlled Conditions
type: Concept
definition: A list of boolean conditions that describe what is intended to NOT be constant during an experiment.
in scheme: kitmtxxls Tribology Lab at KIT
scope note: dictionary

OptoSigma
type: Concept
definition: Optical Systems, Optical Assemblies, Optical Coatings, Opto-Mechanics, Manual and Motion Control Stages
in scheme: kitmtxxls Tribology Lab at KIT
scope note: option

Eucentric height
type: Concept
definition: The height of the specimen at which its image does not moved laterally as a function of specimen tilt. In SEM this height is at the crossing of the electron and ion beam focus plane.
in scheme: kitmtxxls Tribology Lab at KIT
scope note: float
scope note: mm

MSC7401
type: Concept
definition: The induSENSOR MSC7401 controller is used for displacement and distance measurements in automation technologies and machine building.
in scheme: kitmtxxls Tribology Lab at KIT
scope note: option

Hypothesis
type: Concept
definition: A hypothesis that is based on a research question.
in scheme: kitmtxxls Tribology Lab at KIT
scope note: concept
scope note: record

Desiccator Access Direction
type: Concept
definition: Direction of the access to the desiccator, specimen in or out of the desiccator.
in scheme: kitmtxxls Tribology Lab at KIT
scope note: string

Electrolyte
type: Concept
definition: Contains information describing a medium containing ions that is electrically conducting through the movement of those ions, but not conducting electrons.
in scheme: kitmtxxls Tribology Lab at KIT
scope note: consumable
scope note: record

HV10
type: Concept
definition: The length of the two diagonals is measured and used to calculate the Vickers hardness (HV). Together with the measured value also the used load is stated, e.g. 100 HV10 means a value of 100 Vickers is obtained and a load of 10 kg was used to make the indent.
in scheme: kitmtxxls Tribology Lab at KIT
scope note: option

Flash Point Acquisition Method
type: Concept
definition: Class containing information about the flashpoint acquisition of the interfacial medium.
in scheme: kitmtxxls Tribology Lab at KIT
scope note: string

PowerPro 4000
type: Concept
definition: EcoMet® 4000 is a variable speed 12" (305mm) grinder-polisher.
in scheme: kitmtxxls Tribology Lab at KIT
scope note: option

Room Number
type: Concept
definition: The "unique identifier" of the room in which a process occurs or an object resides.
in scheme: kitmtxxls Tribology Lab at KIT
scope note: string

Binary File Offset Amount
type: Concept
definition: Offset amount that has to be applied to all data in a file to get meaningful values.
in scheme: kitmtxxls Tribology Lab at KIT
scope note: float

A6-2
type: Concept
definition: n/a
in scheme: kitmtxxls Tribology Lab at KIT
scope note: option

Storage Box Specifications
type: Concept
definition: A collection of terms that allow the description of a box of specimens (or other objects) with their specifics.
in scheme: kitmtxxls Tribology Lab at KIT
scope note: dictionary

Clamping Area Width
type: Concept
definition: The maximum permissable width of specimen to be held. Shorter than Length dimension.
in scheme: kitmtxxls Tribology Lab at KIT
scope note: float
scope note: µm, nm, mm, m, cm

Software Version
type: Concept
definition: The version of a particular software.
in scheme: kitmtxxls Tribology Lab at KIT
scope note: string

contains
type: Concept
definition: A relationship between two objects that show that one is occupying completely the volume of the contained one.
in scheme: kitmtxxls Tribology Lab at KIT
scope note: none
scope note: relationship_type

Gwyddion
type: Concept
definition: Gwyddion is a modular program for SPM (scanning probe microscopy) data visualization and analysis
in scheme: kitmtxxls Tribology Lab at KIT
scope note: option

isRelatedTo
type: Concept
definition: The property skos:related is used to assert an associative link between two SKOS concepts.
in scheme: kitmtxxls Tribology Lab at KIT
scope note: none
scope note: relationship_type

Measurement Range
type: Concept
definition: Instances of this class represent the maximum range of values that the system can capture in one acquisition process/one measurement.
in scheme: kitmtxxls Tribology Lab at KIT
scope note: float
scope note: µm, nm, mm, m, cm

Height
type: Concept
definition: The specification of an object defining its height.
in scheme: kitmtxxls Tribology Lab at KIT
scope note: float
scope note: µm, nm, mm, m, cm

Vertical Infeed Time Interval
type: Concept
definition: Instances of this class characterize the vertical infeed time interval in a process. i.e. The time in between two option infeed operations.
in scheme: kitmtxxls Tribology Lab at KIT
scope note: float
scope note: s, min, h

Data Published
type: Concept
definition: Is the data available?
in scheme: kitmtxxls Tribology Lab at KIT
scope note: boolean

Procedure or Experiment Start Time
type: Concept
definition: Subsection holds information about when the procedure or experiment was started. This is the major part of interest starting time.
in scheme: kitmtxxls Tribology Lab at KIT
scope note: date

Postdoc
type: Concept
definition: n/a
in scheme: kitmtxxls Tribology Lab at KIT
scope note: option

Piezo Drive
type: Concept
definition: Piezo drivers are amplifier type power supplies for the stable driving of the amount of displacement and the amount of vibration for each piezo element based on its purpose
in scheme: kitmtxxls Tribology Lab at KIT
scope note: option

Strain Gauge
type: Concept
definition: A strain gauge is a sensor whose measured electrical resistance varies with changes in strain.
in scheme: kitmtxxls Tribology Lab at KIT
scope note: option

Cutting Pressure Setpoint
type: Concept
definition: The setting assigned to be maintained by the machine.
in scheme: kitmtxxls Tribology Lab at KIT
scope note: float
scope note: Pa, MPa, mbar

RADAR4KIT
type: Concept
definition: An instance of the RADAR repository for KIT (Karlsruhe Institute of Technology)
in scheme: kitmtxxls Tribology Lab at KIT
scope note: option

Relative Height at Track Relative Positive End
type: Concept
definition: The relative height measured for example by the stage at the relative positive track end.
in scheme: kitmtxxls Tribology Lab at KIT
scope note: float
scope note: µm, nm, mm, m, cm

semi-automated
type: Concept
definition: A semi-automated system is a manufacturing system that combines human labour with automated machinery to produce goods.
in scheme: kitmtxxls Tribology Lab at KIT
scope note: option

Karlsruhe Institute of Technology (KIT)
type: Concept
definition: n/a
in scheme: kitmtxxls Tribology Lab at KIT
scope note: option

Graph of Processed Data
type: Concept
definition: n/a
in scheme: kitmtxxls Tribology Lab at KIT
scope note: option

Programming Language
type: Concept
definition: Language in which the program is written, e.g. MATLAB, Python.
in scheme: kitmtxxls Tribology Lab at KIT
scope note: string

Band Saw
type: Concept
definition: Objects of this class pertain to the category of machines called band saw.
in scheme: kitmtxxls Tribology Lab at KIT
scope note: https://purls.helmholtz-metadaten.de/vp/kitmtxx-41732562-vp/ism_xxx_xxx-cd4f36f6200648d294054682584c8e2b-vp: https://purls.helmholtz-metadaten.de/vp/kitmtxx-41732562-vp/ban_saw_xxx-12c7e62cfce14dc783d3015895fc400e-vp
scope note: equipment
scope note: record

plansToUse
type: Concept
definition: This is used to describe that a future process is planned which will use a specific machine, specimen, consumable or object.
in scheme: kitmtxxls Tribology Lab at KIT
scope note: none
scope note: relationship_type

Process Summary (Heat Treatment)
type: Concept
definition: Class containing derived information about the process. All derived information stems from the information recorded in other locations of the record.
in scheme: kitmtxxls Tribology Lab at KIT
scope note: dictionary

Centre Suisse d'Electronique et de Microtechnique
type: Concept
definition: Swiss Center for Electronics and Microtechnology,
in scheme: kitmtxxls Tribology Lab at KIT
scope note: option

Saphirwerk AG
type: Concept
definition: Brügg, Switzerland
in scheme: kitmtxxls Tribology Lab at KIT
scope note: option

Brinell
type: Concept
definition: The Brinell hardness test method as used to determine Brinell hardness, is defined in ASTM E10. Most commonly it is used to test materials that have a structure that is too coarse or that have a surface that is too rough to be tested using another test method, e.g., castings and forgings.
in scheme: kitmtxxls Tribology Lab at KIT
scope note: option

ai4
type: Concept
definition: n/a
in scheme: kitmtxxls Tribology Lab at KIT
scope note: option

Sub-Section ID or Label
type: Concept
definition: The ID of a sub-space in larger physical space.
in scheme: kitmtxxls Tribology Lab at KIT
scope note: string

Bolt (Mandrel)
type: Concept
definition: n/a
in scheme: kitmtxxls Tribology Lab at KIT
scope note: option

Measure the Height of the Base Body's Surface of Tribological Interest - Respectively Its Waviness
type: Concept
definition: n/a
in scheme: kitmtxxls Tribology Lab at KIT
scope note: option

Knoop
type: Concept
definition: n/a
in scheme: kitmtxxls Tribology Lab at KIT
scope note: option

Fries Research and Technology GmbH
type: Concept
definition: n/a
in scheme: kitmtxxls Tribology Lab at KIT
scope note: option

Maximum Normal Load
type: Concept
definition: Instances of this class represent the maximum permissable normal load.
in scheme: kitmtxxls Tribology Lab at KIT
scope note: float
scope note: N, kgf, gf

Dissertation
type: Concept
definition: n/a
in scheme: kitmtxxls Tribology Lab at KIT
scope note: option

Scan Rotation
type: Concept
definition: Angle in which the electron beam scan is rotated to align the feature in the image.
in scheme: kitmtxxls Tribology Lab at KIT
scope note: float
scope note: °

Maximum Specimen Height With Diamond Cup Mounted
type: Concept
definition: The maximum height a workpiece/sample is allowed to have when a (previously unused) diamond grinding cup is mounted.
in scheme: kitmtxxls Tribology Lab at KIT
scope note: float
scope note: µm, nm, mm, m, cm

documentsDescriptionOf
type: Concept
definition: Relates to an object's ability to store information about the description of another object.
in scheme: kitmtxxls Tribology Lab at KIT
scope note: none
scope note: relationship_type

MPS 2
type: Concept
definition: KUGEL MULLER MPS 2 Bell-disc grinder
in scheme: kitmtxxls Tribology Lab at KIT
scope note: option

Measure Acoustic Emission
type: Concept
definition: Acoustic emission (AE) testing is a non-destructive testing (NDT) technique that detects and monitors the release of ultrasonic stress waves from localised sources when a material deforms under stress.
in scheme: kitmtxxls Tribology Lab at KIT
scope note: option

FIB Sample Preparation
type: Concept
definition: A process that prepares a specimen for the scientific procedure in the SEM. It can, for example, involve glueing the specimen onto a FIB stub with silver glue.
in scheme: kitmtxxls Tribology Lab at KIT
scope note: https://purls.helmholtz-metadaten.de/vp/kitmtxx-41732562-vp/inv_xxx_xxx-c5ceb18203384c359584362949572590-vp: https://purls.helmholtz-metadaten.de/vp/kitmtxx-41732562-vp/blo_spe_xxx-ae137cec891644ec9e9d131be42ef67c-vp
scope note: https://purls.helmholtz-metadaten.de/vp/kitmtxx-41732562-vp/inv_xxx_xxx-c5ceb18203384c359584362949572590-vp: https://purls.helmholtz-metadaten.de/vp/kitmtxx-41732562-vp/des_xxx_xxx-3ee63bf8276444389833022dc1d8c2a1-vp
scope note: process
scope note: record

Maximum Stage Range
type: Concept
definition: The maximum range in which the stage can be moved.
in scheme: kitmtxxls Tribology Lab at KIT
scope note: dictionary

X-direction Measurement Range
type: Concept
definition: Instances of this class represent the maximum range of values in x-direction (first lateral) that the system can capture in one acquisition process/one measurement.
in scheme: kitmtxxls Tribology Lab at KIT
scope note: float
scope note: µm, nm, mm, m, cm

kitmtxxl Empirical Formula
type: Concept
definition: In chemistry, the empirical formula of a chemical compound is the simplest positive integer ratio of atoms present in a compound.
in scheme: kitmtxxls Tribology Lab at KIT
scope note: string

Topography Preview
type: Concept
definition: Visual preview of topographical data.
in scheme: kitmtxxls Tribology Lab at KIT
scope note: option

Unsigned Integer
type: Concept
definition: An unsigned integer is a 32-bit datum that encodes a nonnegative integer in the range [0 to 4294967295].
in scheme: kitmtxxls Tribology Lab at KIT
scope note: option

Embedding Summary
type: Concept
definition: Describes all necessary equipment and other information about embedding.
in scheme: kitmtxxls Tribology Lab at KIT
scope note: dictionary

Camera View Type
type: Concept
definition: Instances of this class specify the available camera views.
in scheme: kitmtxxls Tribology Lab at KIT
scope note: string

Laser Processing System
type: Concept
definition: A piece of apparatus which is uses a laser to texture, smoothen or engrave surfaces. It can also be used to cut materials like elastomer foams.
in scheme: kitmtxxls Tribology Lab at KIT
scope note: equipment
scope note: record

Last Name
type: Concept
definition: Operator's last name/s (= family name/s).
in scheme: kitmtxxls Tribology Lab at KIT
scope note: string

Positive
type: Concept
definition: n/a
in scheme: kitmtxxls Tribology Lab at KIT
scope note: option

LabVIEW
type: Concept
definition: LabVIEW is a graphical programming environment engineers use to develop automated research, validation, and production test systems.
in scheme: kitmtxxls Tribology Lab at KIT
scope note: option

Matching Orientation on Original Sample
type: Concept
definition: Defines the side of the specimen which resembles a specific side on the original sample where it originates from.
in scheme: kitmtxxls Tribology Lab at KIT
scope note: string

Dead Weight(s) (Dampened)
type: Concept
definition: n/a
in scheme: kitmtxxls Tribology Lab at KIT
scope note: option

Y-Position
type: Concept
definition: Position of an object on another object in y direction.
in scheme: kitmtxxls Tribology Lab at KIT
scope note: float

Coolant
type: Concept
definition: Coolants are used most often in industrial processes. Important: this is the object in term of its function/role/application, and not its particular chemical composition (that would be instead an abstract representation of the internal structure).
in scheme: kitmtxxls Tribology Lab at KIT
scope note: string

Maximum Probe Current
type: Concept
definition: The maximum probe current under which the equipment can operate.
in scheme: kitmtxxls Tribology Lab at KIT
scope note: float
scope note: pA, nA, µA, mA, A, kA

e- Flash HD
type: Concept
definition: Bruker’s latest e–FlashHD detector has a CCD resolution of almost 2 MP, which is equivalent to 1600 x 1200 pixels, and modern camera optics to minimize distortions. The e–FlashHD detector uses a high quality and high efficient phosphor screen for acquiring very detailed Kikuchi patterns. The
in scheme: kitmtxxls Tribology Lab at KIT
scope note: option

Maintain Predefined Humidity
type: Concept
definition: n/a
in scheme: kitmtxxls Tribology Lab at KIT
scope note: option

6
type: Concept
definition: n/a
in scheme: kitmtxxls Tribology Lab at KIT
scope note: option

Surrounding Medium
type: Concept
definition: For Tribological Processes: Objects of this class act as the medium between the tribological interface, or interfacial medium (if present), and the air in the lab as a whole. This, for example, the medium in a glove box.
in scheme: kitmtxxls Tribology Lab at KIT
scope note: string

EBSP Resolution
type: Concept
definition: Resolution of electron backscattered diffraction pattern is captured, measured in pixels.
in scheme: kitmtxxls Tribology Lab at KIT
scope note: string

Big-Endian Ordering, 64-Bit Long Data Type
type: Concept
definition: n/a
in scheme: kitmtxxls Tribology Lab at KIT
scope note: option

DAQ Connection Port
type: Concept
definition: The port which collects/outputs signal to a DAQ device.
in scheme: kitmtxxls Tribology Lab at KIT
scope note: string

Kinematic Mount and Vise
type: Concept
definition: A vise compressing the specimen directly to a kinematic mount, which in turn is attached to the equipment's structure.
in scheme: kitmtxxls Tribology Lab at KIT
scope note: option

Sawing Process Parameters
type: Concept
definition: Class containing information about the parameters specific to the process.
in scheme: kitmtxxls Tribology Lab at KIT
scope note: dictionary

Power Mean
type: Concept
definition: n/a
in scheme: kitmtxxls Tribology Lab at KIT
scope note: option

VS 15665-OL
type: Concept
definition: BOSCH VS 15665-OL-CV
in scheme: kitmtxxls Tribology Lab at KIT
scope note: option

Heat Treatment Steps Array
type: Concept
definition: Class containing the ordered list of sequential steps, in terms of parameters, specific to the process.
in scheme: kitmtxxls Tribology Lab at KIT
scope note: sub-workflow

Z 16758
type: Concept
definition: n/a
in scheme: kitmtxxls Tribology Lab at KIT
scope note: option

ETD detector
type: Concept
definition: Everhart-Thornley SE detector
in scheme: kitmtxxls Tribology Lab at KIT
scope note: option

DIN EN 12198
type: Concept
definition: Techanical standards of Safety of machinery - Assessment and reduction of risks arising from radiation emitted by machinery
in scheme: kitmtxxls Tribology Lab at KIT
scope note: option

Professor
type: Concept
definition: n/a
in scheme: kitmtxxls Tribology Lab at KIT
scope note: option

Tempering
type: Concept
definition: Tempering is a process of heat treating, which is used to increase the toughness of iron-based alloys. It is usually performed after hardening, to reduce some of the excess hardness, and is done by heating the metal to some temperature below the critical point for a certain period of time, then allowing it to cool in still air.
in scheme: kitmtxxls Tribology Lab at KIT
scope note: option

FIB Cutting Step
type: Concept
definition: Describes the step of FIB cutting, e.g. gas deposition or cutting.
in scheme: kitmtxxls Tribology Lab at KIT
scope note: string

Cutting Face
type: Concept
definition: Term used to specify to specify the cut edge of the specimen(s).
in scheme: kitmtxxls Tribology Lab at KIT
scope note: dictionary

m
type: Concept
definition: The metre, symbol m, is the SI unit of length. It is defined by taking the fixed numerical value of the speed of light in vacuum c to be 299 792 458 when expressed in the unit m s–1, where the second is defined in terms of the caesium frequency ΔνCs.
in scheme: kitmtxxls Tribology Lab at KIT
scope note: option

Temperature Base
type: Concept
definition: n/a
in scheme: kitmtxxls Tribology Lab at KIT
scope note: option

angle_of_slip_traces_to_sliding_direction
type: Concept
definition: Angle between slip traces and sliding direction measured in SEM images
in scheme: kitmtxxls Tribology Lab at KIT
scope note: float

Time
type: Concept
definition: n/a
in scheme: kitmtxxls Tribology Lab at KIT
scope note: option

Position on Source Specimen
type: Concept
definition: Position on Source Specimen. Position is measured w.r.t. the two origins as defined by "Spatial Information".
in scheme: kitmtxxls Tribology Lab at KIT
scope note: dictionary

Rod
type: Concept
definition: n/a
in scheme: kitmtxxls Tribology Lab at KIT
scope note: option

Polishing Orientation Steps
type: Concept
definition: Contains a list of step of specimen orientations on the polishing machine.
in scheme: kitmtxxls Tribology Lab at KIT
scope note: sub-workflow

General Info (Concept)
type: Concept
definition: Objects of this class contain information about a conceptual record.
in scheme: kitmtxxls Tribology Lab at KIT
scope note: dictionary

Specimen ID
type: Concept
definition: A unique alphanumeric ID of a specimen. Could be an assigned unique ID. Could be a list of unique IDs.
in scheme: kitmtxxls Tribology Lab at KIT
scope note: string

mm^2*s^(-1)
type: Concept
definition: n/a
in scheme: kitmtxxls Tribology Lab at KIT
scope note: option

Embedding Form
type: Concept
definition: Describes the form in which the specimen was embedded.
in scheme: kitmtxxls Tribology Lab at KIT
scope note: dictionary

XY Table Specifications
type: Concept
definition: Class containing information about the XY table of a hardness testing system.
in scheme: kitmtxxls Tribology Lab at KIT
scope note: dictionary

DAQ Used Channel Info
type: Concept
definition: Class containing combined information about the parameters that are put into the involved DAQ channels, to run it optimally, but are not directly part of achieving the experimental objectives.
in scheme: kitmtxxls Tribology Lab at KIT
scope note: dictionary

SEM or FIB Imaging Summary
type: Concept
definition: Term containing information about the images taken in SEM with the electron or ion beam.
in scheme: kitmtxxls Tribology Lab at KIT
scope note: dictionary

Electropolishing Window Area
type: Concept
definition: The area of the window on the mask which defines the electropolished area.
in scheme: kitmtxxls Tribology Lab at KIT
scope note: float
scope note: mm^2, cm^2

Motion Control
type: Concept
definition: Motion control is defined as the process of monitoring the movement of components within a machine or device to allow them to move properly and accurately for the device to function correctly.
in scheme: kitmtxxls Tribology Lab at KIT
scope note: option

Physical Unit Conversion Details
type: Concept
definition: Instances of this class contain the information about the neccessary information to convert recorded V or mA signals into the respective physical unit.
in scheme: kitmtxxls Tribology Lab at KIT
scope note: dictionary

Annealing
type: Concept
definition: A heat treatment that alters the microstructure of a material causing changes in its properties such as strength and hardness
in scheme: kitmtxxls Tribology Lab at KIT
scope note: option

Interfacial Medium Settings
type: Concept
definition: Instances of this class list information on the chosen parameters to define the controllables associated with the delivery of interfacial medium.
in scheme: kitmtxxls Tribology Lab at KIT
scope note: dictionary

Scan Direction
type: Concept
definition: Direction of the beam scan of the procedure step
in scheme: kitmtxxls Tribology Lab at KIT
scope note: string

Cold Air Jet
type: Concept
definition: Jet cooler is a cold air generator, applying a principle of swirling theory, which does not have any moving parts. Without need of refrigerant or electricity, the jet cooler whirls compressed air inside the tube at high speed and then separates it into hot air and cold air.
in scheme: kitmtxxls Tribology Lab at KIT
scope note: option

Control the Tribometer in Use
type: Concept
definition: n/a
in scheme: kitmtxxls Tribology Lab at KIT
scope note: option

Remove Scale Layer
type: Concept
definition: n/a
in scheme: kitmtxxls Tribology Lab at KIT
scope note: option

Mask (Electropolishing)
type: Concept
definition: Contains information about the mask used to confine the electropolished area to the desired size. The mask contains a window with a (usually) defined area.
in scheme: kitmtxxls Tribology Lab at KIT
scope note: dictionary

Vertical Measuring Column Subsystem
type: Concept
definition: Class containing information about the technical specifications of a tactile profilometer vertical measuring column.
in scheme: kitmtxxls Tribology Lab at KIT
scope note: dictionary

Uncontrolled Environmental Conditions
type: Concept
definition: Information on surrounding conditions that are not actively chosen or controlled by the researcher, which, however, might play a role in the outcome of the scientific process (e.g. "moon phase", "weather", ...).
in scheme: kitmtxxls Tribology Lab at KIT
scope note: dictionary

µm
type: Concept
definition: n/a
in scheme: kitmtxxls Tribology Lab at KIT
scope note: option

*.jpg
type: Concept
definition: A Joint Photographic Experts Group image.
in scheme: kitmtxxls Tribology Lab at KIT
scope note: option

kitmtxxls Tribology Lab at KIT
type: ConceptScheme
contributor: Malte Flachmann
contributor: Ilia Bagov
created: 2024-12-16T11:56:22.625933
license: https://creativecommons.org/licenses/by/4.0
publisher: Malte Flachmann

Lateral Axis Position
type: Concept
definition: Describes the magnitude of lateral axis offset between two coordinate system.
in scheme: kitmtxxls Tribology Lab at KIT
scope note: float

Data Processing (SEM Data)
type: Concept
definition: Class representing the execution of a particular computer code/program which extracts/reshapes/processes data from one form to another. The data stems from scanning electron microscopy images.
in scheme: kitmtxxls Tribology Lab at KIT
scope note: https://purls.helmholtz-metadaten.de/vp/kitmtxx-41732562-vp/pro_xxx_xxx-0a80036373ea40d1ac7401d423b284a0-vp: https://purls.helmholtz-metadaten.de/vp/kitmtxx-41732562-vp/tri_exp_xxx-9b84c31083254e40a6eb78601271d381-vp
scope note: https://purls.helmholtz-metadaten.de/vp/kitmtxx-41732562-vp/use_xxx_xxx-f130aac753c3467a9ef4cd8d2163a609-vp: https://purls.helmholtz-metadaten.de/vp/kitmtxx-41732562-vp/sof_xxx_xxx-43c5e712afb04a16a8954dbb3c865c0f-vp
scope note: https://purls.helmholtz-metadaten.de/vp/kitmtxx-41732562-vp/tak_xxx_xxx-ca48d075c7de4872b4f12e464652bcb1-vp: https://purls.helmholtz-metadaten.de/vp/kitmtxx-41732562-vp/ele_mic_xxx-840bbf9ffd9648fc883b251d106e3733-vp
scope note: https://purls.helmholtz-metadaten.de/vp/kitmtxx-41732562-vp/tak_xxx_xxx-ca48d075c7de4872b4f12e464652bcb1-vp: https://purls.helmholtz-metadaten.de/vp/kitmtxx-41732562-vp/sem_orx_fib-a3c4c133c9d746378cdf6ace982f8a64-vp
scope note: process
scope note: record

Keyence
type: Concept
definition: n/a
in scheme: kitmtxxls Tribology Lab at KIT
scope note: option

Wire Saw
type: Concept
definition: Objects of this class pertain to the category of machines called wire saw.
in scheme: kitmtxxls Tribology Lab at KIT
scope note: https://purls.helmholtz-metadaten.de/vp/kitmtxx-41732562-vp/ism_xxx_xxx-cd4f36f6200648d294054682584c8e2b-vp: https://purls.helmholtz-metadaten.de/vp/kitmtxx-41732562-vp/wir_saw_xxx-25611f86ae4d460a9747e0f5c301d8a0-vp
scope note: equipment
scope note: record

Illumination System
type: Concept
definition: Denotes the way of introducing light to the system.
in scheme: kitmtxxls Tribology Lab at KIT
scope note: string

Spreadsheet
type: Concept
definition: A tabular data type with named columns and/or rows.
in scheme: kitmtxxls Tribology Lab at KIT
scope note: option

Sphere
type: Concept
definition: n/a
in scheme: kitmtxxls Tribology Lab at KIT
scope note: option

Equipment Cleaning
type: Concept
definition: Class representing the physical process of reducing the amount of residue on a physical object's surfaces.
in scheme: kitmtxxls Tribology Lab at KIT
scope note: https://purls.helmholtz-metadaten.de/vp/kitmtxx-41732562-vp/emp_xxx_xxx-b0c09f9f6cd948839bac12aa4a2ad55d-vp: https://purls.helmholtz-metadaten.de/vp/kitmtxx-41732562-vp/des_xxx_xxx-3ee63bf8276444389833022dc1d8c2a1-vp
scope note: https://purls.helmholtz-metadaten.de/vp/kitmtxx-41732562-vp/emp_xxx_xxx-b0c09f9f6cd948839bac12aa4a2ad55d-vp: https://purls.helmholtz-metadaten.de/vp/kitmtxx-41732562-vp/fff_xxx_xxx-6ab1d49a0e5d439b946eeb97e700c23d-vp
scope note: https://purls.helmholtz-metadaten.de/vp/kitmtxx-41732562-vp/emp_xxx_xxx-b0c09f9f6cd948839bac12aa4a2ad55d-vp: https://purls.helmholtz-metadaten.de/vp/kitmtxx-41732562-vp/ten_tes_xxx-b4b8ff243b17440d8da2fbf943194381-vp
scope note: https://purls.helmholtz-metadaten.de/vp/kitmtxx-41732562-vp/emp_xxx_xxx-b0c09f9f6cd948839bac12aa4a2ad55d-vp: https://purls.helmholtz-metadaten.de/vp/kitmtxx-41732562-vp/wir_saw_xxx-25611f86ae4d460a9747e0f5c301d8a0-vp
scope note: https://purls.helmholtz-metadaten.de/vp/kitmtxx-41732562-vp/emp_xxx_xxx-b0c09f9f6cd948839bac12aa4a2ad55d-vp: https://purls.helmholtz-metadaten.de/vp/kitmtxx-41732562-vp/tac_sur_pro-ec98dbf380804321bb8aa65a96c41b24-vp
scope note: https://purls.helmholtz-metadaten.de/vp/kitmtxx-41732562-vp/emp_xxx_xxx-b0c09f9f6cd948839bac12aa4a2ad55d-vp: https://purls.helmholtz-metadaten.de/vp/kitmtxx-41732562-vp/opt_sur_pro-9658f444fa7b4e6b8ebf0c678491e2c0-vp
scope note: https://purls.helmholtz-metadaten.de/vp/kitmtxx-41732562-vp/emp_xxx_xxx-b0c09f9f6cd948839bac12aa4a2ad55d-vp: https://purls.helmholtz-metadaten.de/vp/kitmtxx-41732562-vp/sca_ele_mic-30855d0d4b6049a6a8fc94f07cdcc312-vp
scope note: https://purls.helmholtz-metadaten.de/vp/kitmtxx-41732562-vp/emp_xxx_xxx-b0c09f9f6cd948839bac12aa4a2ad55d-vp: https://purls.helmholtz-metadaten.de/vp/kitmtxx-41732562-vp/sph_sto_box-fd80690682f44da3a7ea061b9ef6a7f7-vp
scope note: https://purls.helmholtz-metadaten.de/vp/kitmtxx-41732562-vp/emp_xxx_xxx-b0c09f9f6cd948839bac12aa4a2ad55d-vp: https://purls.helmholtz-metadaten.de/vp/kitmtxx-41732562-vp/lig_mic_xxx-de64ef91f8544beda63bbf43c6ffdce1-vp
scope note: https://purls.helmholtz-metadaten.de/vp/kitmtxx-41732562-vp/emp_xxx_xxx-b0c09f9f6cd948839bac12aa4a2ad55d-vp: https://purls.helmholtz-metadaten.de/vp/kitmtxx-41732562-vp/dem_xxx_xxx-556b66cdf6b44a3a83603ddcd7b61d48-vp
scope note: https://purls.helmholtz-metadaten.de/vp/kitmtxx-41732562-vp/emp_xxx_xxx-b0c09f9f6cd948839bac12aa4a2ad55d-vp: https://purls.helmholtz-metadaten.de/vp/kitmtxx-41732562-vp/ult_cle_xxx-192eb37ff24644798963cd87107e9a5f-vp
scope note: https://purls.helmholtz-metadaten.de/vp/kitmtxx-41732562-vp/emp_xxx_xxx-b0c09f9f6cd948839bac12aa4a2ad55d-vp: https://purls.helmholtz-metadaten.de/vp/kitmtxx-41732562-vp/ele_mac_xxx-903f852b9cef4385aaa4a8fef788e7b5-vp
scope note: https://purls.helmholtz-metadaten.de/vp/kitmtxx-41732562-vp/emp_xxx_xxx-b0c09f9f6cd948839bac12aa4a2ad55d-vp: https://purls.helmholtz-metadaten.de/vp/kitmtxx-41732562-vp/fur_xxx_xxx-c04aefd269c64c6fa2773c318193f2d6-vp
scope note: https://purls.helmholtz-metadaten.de/vp/kitmtxx-41732562-vp/emp_xxx_xxx-b0c09f9f6cd948839bac12aa4a2ad55d-vp: https://purls.helmholtz-metadaten.de/vp/kitmtxx-41732562-vp/har_tes_xxx-d1fe762442144018958df899aaffe37d-vp
scope note: https://purls.helmholtz-metadaten.de/vp/kitmtxx-41732562-vp/emp_xxx_xxx-b0c09f9f6cd948839bac12aa4a2ad55d-vp: https://purls.helmholtz-metadaten.de/vp/kitmtxx-41732562-vp/pre_sca_xxx-ceedd099da754c79bcb9c002a1daa545-vp
scope note: https://purls.helmholtz-metadaten.de/vp/kitmtxx-41732562-vp/emp_xxx_xxx-b0c09f9f6cd948839bac12aa4a2ad55d-vp: https://purls.helmholtz-metadaten.de/vp/kitmtxx-41732562-vp/gri_mac_xxx-b0492ca6bf9043909ee541221a225895-vp
scope note: https://purls.helmholtz-metadaten.de/vp/kitmtxx-41732562-vp/emp_xxx_xxx-b0c09f9f6cd948839bac12aa4a2ad55d-vp: https://purls.helmholtz-metadaten.de/vp/kitmtxx-41732562-vp/cup_gri_mac-3136c4f5a61247ca9cf390b86f050459-vp
scope note: https://purls.helmholtz-metadaten.de/vp/kitmtxx-41732562-vp/emp_xxx_xxx-b0c09f9f6cd948839bac12aa4a2ad55d-vp: https://purls.helmholtz-metadaten.de/vp/kitmtxx-41732562-vp/dry_cab_xxx-7382b1a7ced043e19f1c713d0e6f767e-vp
scope note: https://purls.helmholtz-metadaten.de/vp/kitmtxx-41732562-vp/emp_xxx_xxx-b0c09f9f6cd948839bac12aa4a2ad55d-vp: https://purls.helmholtz-metadaten.de/vp/kitmtxx-41732562-vp/tri_xxx_xxx-c98170df4aa14cd38e9ba0d1b94ebdf0-vp
scope note: process
scope note: record

006
type: Concept
definition: n/a
in scheme: kitmtxxls Tribology Lab at KIT
scope note: option

Comment
type: Concept
definition: Unconstrained statement by operator about a process or object.
in scheme: kitmtxxls Tribology Lab at KIT
scope note: string

File Type
type: Concept
definition: Instances of this class give first information about file format/structure.
in scheme: kitmtxxls Tribology Lab at KIT
scope note: string

General Info (Subprocess SEM)
type: Concept
definition: Objects of this class contain information that unequivocally identifies the subprocess of a SEM session.
in scheme: kitmtxxls Tribology Lab at KIT
scope note: dictionary