** *******************************************************************
**  Abaqus/fromNastran 6.14-1
**
**  reading bulk data from: C:\Users\Paolo Minigher\Desktop\MSc Thesis\Block
** 1\iSTAR\TipLoad\Abaqus\run_file_103_complete.bdf
**   creating Abaqus input: C:\Users\Paolo Minigher\Desktop\MSc Thesis\Block
** 1\iSTAR\TipLoad\Abaqus\run_file_103_complete.inp
**  writing diagnostics to: C:\Users\Paolo Minigher\Desktop\MSc Thesis\Block
** 1\iSTAR\TipLoad\Abaqus\run_file_103_complete.log
**
**   environment variables: fromnastran_wtmass_fixup <not present>
**                        : fromnastran_distribution <not present>
**                        : fromnastran_pbar_zero_reset <not present>
**                        : fromnastran_loadcases <not present>
**                        : fromnastran_surface_based_coupling <not present>
**                        : fromnastran_cquad4 <not present>
**                        : fromnastran_chexa <not present>
**                        : fromnastran_ctetra <not present>
**                        : fromnastran_cbar <not present>
**                        : fromnastran_beam_offset_coupling <not present>
**                        : fromnastran_beam_orientation_vector <not present>
**                        : fromnastran_shell_general_section <not present>
**                        : fromnastran_eigensolver <not present>
**                        : fromnastran_plotel <not present>
**                        : fromnastran_cdh_weld <not present>
**                        : fromnastran_spoint_dof <not present>
**
**  command line arguments: wtmass_fixup=ON
**                        : distribution=preservePID
**                        : pbar_zero_reset=1e-20
**                        : loadcases=ON
**                        : surface_based_coupling=ON
**                        : cquad4=S4R
**                        : chexa=C3D8I
**                        : ctetra=C3D10M
**                        : cbar=B31
**                        : beam_offset_coupling=ON
**                        : beam_orientation_vector=ON
**                        : shell_general_section=OFF
**                        : plotel <not present>
**                        : cdh_weld <not present>
**                        : eigensolver <not present>
**                        : spoint_dof <not present, using default=9>
**
**  --------------------------------
**  Nastran Case Control entities processed:
**       keyword   number
**  ------------   ------
**    BEGIN BULK        1
**  DISPLACEMENT        1
**        METHOD        1
**           SPC        1
**       SUBCASE        1
**      SUBTITLE        1
**  --------------------------------
**  Nastran Case Control entities not processed:
**       keyword   number
**  ------------   ------
**         AEROF        1
**     APRESSURE        1
**          ECHO        1
**       GPFORCE        1
**        STRAIN        1
**  --------------------------------
**  Nastran Bulk Data processed:
**       keyword   number
**  ------------   ------
**         CONM2        3
**        CORD2R       20
**        CQUAD4     1574
**         EIGRL        1
**       ENDDATA        1
**          GRID     1432
**          MAT8       17
**         PARAM        5
**         PCOMP     1574
**          RBE2       17
**          RBE3       19
**          SPC1        5
**       SUPORT1        3
**          SET1        1
**  --------------------------------
**  Nastran Bulk Data not processed:
**       keyword   number
**  ------------   ------
**           DMI        2
**        AELIST        1
**         AEROS        1
**        AESTAT        3
**        AESURF        1
**        CAERO1       13
**        PAERO1        1
**       SPLINE1       13
**          TRIM        2
**
**  environment_variable / command_line_argument summary:
**  PARAM,WTMASS will be used to adjust structural mass/density
**  *DISTRIBUTION will be used for shell offsets, orientations, and thicknesses
**   shell elements will be grouped by PSHELL ID
**  Zero PBAR/PBEAM cross sectional parameters will be reset to 1e-20
**  Rigid links will be modeled using surface-based *COUPLING constraints
**  Beam orientations will be modeled using vectors on beam sections
**  Beam offsets will be modeled using rigid couplings and extra nodes
**  PSHELL/PCOMP will default to *SHELL SECTION
**  PLOTELs will not be translated
**  "CDH welds" (isolated CHEXAs with 8 RBE3s) will not be translated to
**   rigid fasteners
**  CWELDs will be translated to compliant fasteners
**  CQUAD4 elements will be translated to S4R
**  SPOINT DOF 0 will be reset to 9 in DMIG, MPC, CELAS2, and CMASS2 data
** **************************************
**  WARNING: did not find PARAM, INREL, <integer>
**  *INERTIA RELIEF loads will *not* be created from 3 SUPORT entries
** **************************************
**
**  ---------------------------------------------------
**  ---- *HEADING--------------------------------------
**  ---------------------------------------------------
**
*Heading
** Job name: Job-1 Model name: run_file_103_complete
** Generated by: Abaqus/CAE 6.14-1
*Preprint, echo=NO, model=NO, history=NO, contact=NO
**
** PARTS
**
*Part, name=PART-1
*Node
*Element, type=S4R
*Elset, elset=PCOMP_DIST_100501
*Elset, elset=PCOMP_DIST_100502
*Elset, elset=PCOMP_DIST_100503
*Elset, elset=PCOMP_DIST_100504
*Elset, elset=PCOMP_DIST_100505
*Elset, elset=PCOMP_DIST_100506
*Elset, elset=PCOMP_DIST_100507
*Elset, elset=PCOMP_DIST_100508
*Elset, elset=PCOMP_DIST_100509
*Elset, elset=PCOMP_DIST_100510
*Elset, elset=PCOMP_DIST_100511
*Elset, elset=PCOMP_DIST_100512
*Elset, elset=PCOMP_DIST_100513
*Elset, elset=PCOMP_DIST_100514
*Elset, elset=PCOMP_DIST_100515
*Elset, elset=PCOMP_DIST_100516
*Elset, elset=PCOMP_DIST_100517
*Elset, elset=PCOMP_DIST_100518
*Elset, elset=PCOMP_DIST_100519
*Elset, elset=PCOMP_DIST_100520
** ... 1150 like lines cut
*Orientation, name=Ori-1171
** Region: (CompositeLayup-1-1: Generated From Layup), (Controls:EC-1)
*Elset, elset=CompositeLayup-1-1, generate
** Section: CompositeLayup-1-1
*Shell Section, elset=CompositeLayup-1-1, composite, orientation=Ori-1171, controls=EC-1, offset=SNEG, layup=CompositeLayup-1
3.5e-05, 3, MAT_MID_52, 0., Ply-1
8.525e-06, 3, MAT_MID_153, 0., Ply-2
8.525e-06, 3, MAT_MID_153, 90., Ply-3
5.456e-05, 3, MAT_MID_154, 0., Ply-4
5.456e-05, 3, MAT_MID_154, 90., Ply-5
5.456e-05, 3, MAT_MID_154, -45., Ply-6
5.456e-05, 3, MAT_MID_154, 45., Ply-7
5.456e-05, 3, MAT_MID_154, 45., Ply-8
5.456e-05, 3, MAT_MID_154, -45., Ply-9
5.456e-05, 3, MAT_MID_154, 90., Ply-10
5.456e-05, 3, MAT_MID_154, 0., Ply-11
0.0015, 3, MAT_MID_61, 0., Ply-12
1.67e-05, 3, MAT_MID_152, -45., Ply-13
1.67e-05, 3, MAT_MID_152, 45., Ply-14
0.0015, 3, MAT_MID_61, 0., Ply-15
1.67e-05, 3, MAT_MID_152, -45., Ply-16
1.67e-05, 3, MAT_MID_152, 45., Ply-17
0.0015, 3, MAT_MID_61, 0., Ply-18
1.67e-05, 3, MAT_MID_152, -45., Ply-19
1.67e-05, 3, MAT_MID_152, 45., Ply-20
*End Part
**
**
** ASSEMBLY
**
*Assembly, name=Assembly
**
*Instance, name=PART-1-1, part=PART-1
*End Instance
**
*Node
*Node
*Node
*Elset, elset=ALL_MASSIVE_ELEMENTS, instance=PART-1-1, generate
*Elset, elset=ALL_SHELL_ANISO, instance=PART-1-1, generate
*Elset, elset=AxialStrainElem_Elem2, instance=PART-1-1
*Nset, nset=Set-13, instance=PART-1-1
*Nset, nset=Set-14, instance=PART-1-1
*Nset, nset=Set-17
*Nset, nset=Set-113, instance=PART-1-1
*Elset, elset=Set-AllElements, instance=PART-1-1, generate
*Nset, nset=Set-AllNodes, instance=PART-1-1, generate
*Nset, nset=Set-AxialStrain, instance=PART-1-1
*Elset, elset=Set-AxialStrainElem_Elem1, instance=PART-1-1
*Nset, nset=Set-AxialStrain_Elem1, instance=PART-1-1
*Nset, nset=Set-AxialStrain_Elem2, instance=PART-1-1
*Nset, nset=Set-Section3, instance=PART-1-1
*Elset, elset=Set-StrainGaugesElem, instance=PART-1-1
*Nset, nset=m_Set-15, instance=PART-1-1
*Nset, nset=m_Set-18, instance=PART-1-1
*Nset, nset=m_Set-19
*Nset, nset=s_Set-15
*Nset, nset=s_Set-19, instance=PART-1-1
*End Assembly
**
** ELEMENT CONTROLS
**
*Section Controls, name=EC-1, hourglass=STIFFNESS
**
** MATERIALS
**
**  material data from MAT8 with MID = 51
**
*Material, name=MAT_MID_51
*Density
52.,
*Elastic, type=LAMINA
 7e+07,    7.06e+07,        0.35,     1.9e+07, 1.58333e+07, 1.58333e+07
**  material data from MAT8 with MID = 52
**
*Material, name=MAT_MID_52
*Density
1300.,
*Elastic, type=LAMINA
10000.,  10000.,    0.35,   1000., 833.333, 833.333
**  material data from MAT8 with MID = 53
**
*Material, name=MAT_MID_53
*Density
2700.,
*Elastic, type=LAMINA
 7.2e+10,     7.2e+10,        0.34,   2.687e+10, 2.23917e+10, 2.23917e+10
**  material data from MAT8 with MID = 55
**
*Material, name=MAT_MID_55
*Density
1200.,
*Elastic, type=LAMINA
 3.3e+09,   3.3e+09,   0.39241, 1.185e+09, 9.875e+08, 9.875e+08
**  material data from MAT8 with MID = 61
**
*Material, name=MAT_MID_61
*Density
75.,
*Elastic, type=LAMINA
 9.2e+07,    9.26e+07,         0.4,     2.9e+07, 2.41667e+07, 2.41667e+07
**  material data from MAT8 with MID = 71
**
*Material, name=MAT_MID_71
*Elastic, type=LAMINA
1.,       1.,     0.35,       1., 0.833333, 0.833333
**  material data from MAT8 with MID = 81
**
*Material, name=MAT_MID_81
*Elastic, type=LAMINA
 4.175e+10,   1.294e+10,     0.26375,   4.961e+09, 4.13417e+09, 4.13417e+09
**  ---------------------------------------------------
**  ---- *MATERIAL ------------------------------------
**  ---------------------------------------------------
**
**  material data from MAT8 with MID = 101
**
*Material, name=MAT_MID_101
*Density
 1539.2,
*Elastic, type=LAMINA
 1.156e+11, 9.886e+09,   0.25225, 3.996e+09,  3.33e+09,  3.33e+09
**  material data from MAT8 with MID = 111
**
*Material, name=MAT_MID_111
*Density
 1550.8,
*Elastic, type=LAMINA
 1.928e+11,   6.963e+09,        0.35,   2.452e+09, 2.04333e+09, 2.04333e+09
**  material data from MAT8 with MID = 151
**
*Material, name=MAT_MID_151
*Density
 1976.2,
*Elastic, type=LAMINA
 4.175e+10,   1.294e+10,     0.26375,   4.961e+09, 4.13417e+09, 4.13417e+09
**  material data from MAT8 with MID = 152
**
*Material, name=MAT_MID_152
*Density
 1976.2,
*Elastic, type=LAMINA
 4.175e+10,   1.294e+10,     0.26375,   4.961e+09, 4.13417e+09, 4.13417e+09
**  material data from MAT8 with MID = 153
**
*Material, name=MAT_MID_153
*Density
 1976.2,
*Elastic, type=LAMINA
 4.175e+10,   1.294e+10,     0.26375,   4.961e+09, 4.13417e+09, 4.13417e+09
**  material data from MAT8 with MID = 154
**
*Material, name=MAT_MID_154
*Density
 1976.2,
*Elastic, type=LAMINA
 4.175e+10,   1.294e+10,     0.26375,   4.961e+09, 4.13417e+09, 4.13417e+09
**  material data from MAT8 with MID = 155
**
*Material, name=MAT_MID_155
*Density
 1976.2,
*Elastic, type=LAMINA
 4.175e+10,   1.294e+10,     0.26375,   4.961e+09, 4.13417e+09, 4.13417e+09
**  material data from MAT8 with MID = 201
**
*Material, name=MAT_MID_201
*Density
 1550.8,
*Elastic, type=LAMINA
 2.073e+11,   6.963e+09,        0.35,   2.452e+09, 2.04333e+09, 2.04333e+09
**  material data from MAT8 with MID = 251
**
*Material, name=MAT_MID_251
*Density
 1976.2,
*Elastic, type=LAMINA
 4.175e+10,   1.294e+10,     0.26375,   4.961e+09, 4.13417e+09, 4.13417e+09
**  material data from MAT8 with MID = 252
**
*Material, name=MAT_MID_252
*Density
 1976.2,
*Elastic, type=LAMINA
 4.175e+10,   1.294e+10,     0.26375,   4.961e+09, 4.13417e+09, 4.13417e+09
**
** BOUNDARY CONDITIONS
**
** Name: BC-1 Type: Symmetry/Antisymmetry/Encastre
*Boundary
Set-14, ENCASTRE
** ----------------------------------------------------------------
**
** STEP: NatFreq
**
*Step, name=NatFreq, nlgeom=NO, perturbation
*Frequency, eigensolver=Lanczos, sim, acoustic coupling=off, normalization=mass
10, , 10000., , ,
**
** OUTPUT REQUESTS
**
*Restart, write, frequency=0
**
** FIELD OUTPUT: F-Output-2
**
*Output, field
*Node Output
U,
*Element Output, directions=YES
E,
*End Step