*Heading
** Job name: Nitrile-PU-withPartition Model name: Nitrile-PU-withPartition
** Generated by: Abaqus/CAE 2021.HF5
*Preprint, echo=NO, model=NO, history=NO, contact=NO
**
** PARTS
**
*Part, name=Ball
*Node
*Element, type=CAX4R
*Element, type=CAX3
*Nset, nset=Set-1, generate
*Elset, elset=Set-1, generate
** Section: Nitrile
*Solid Section, elset=Set-1, material=Nitrile_rubber
*End Part
**
*Part, name=Soft-PU
*Node
*Element, type=CAX4R
*Element, type=CAX3
*Nset, nset=bottomLine
*Elset, elset=bottomLine
*Nset, nset=Set-2, generate
*Elset, elset=Set-2, generate
** Section: Soft-PU
*Solid Section, elset=Set-2, material=Soft-PU
*End Part
**
**
** ASSEMBLY
**
*Assembly, name=Assembly
**
*Instance, name=Ball-1, part=Ball
*End Instance
**
*Instance, name=Soft-PU-1, part=Soft-PU
*End Instance
**
*End Assembly
**
** MATERIALS
**
*Material, name=Nitrile_rubber
*Density
 0.001,
*Hyperelastic, marlow, moduli=LONG TERM
*Uniaxial Test Data
*Viscoelastic, time=PRONY
  0.082426,   0.082426, 5.2223e-05
  0.082369,   0.082369,  7.024e-05
   0.10359,    0.10359, 2.1051e-06
    0.1007,     0.1007, 0.00041364
   0.22371,    0.22371, 2.3127e-07
  0.026828,   0.026828,  0.0039748
   0.10833,    0.10833, 1.4915e-06
 0.0067068,  0.0067068,     0.1108
*Material, name=Soft-PU
*Density
 0.001103,
*Hyperelastic, marlow, moduli=LONG TERM, poisson=0.4
*Uniaxial Test Data
*Viscoelastic, time=PRONY
 0.0969,     0.0969, 4.1819e-05
 0.0164,     0.0164,     1.3929
  0.146,      0.146, 2.6317e-11
 0.1253,     0.1253, 3.5549e-06
 0.0063,     0.0063,    24.3587
 0.0394,     0.0394,     0.0048
 0.2594,     0.2594, 4.1327e-09
 0.0023,     0.0023,    371.998
**
** INTERACTION PROPERTIES
**
*Surface Interaction, name=IntProp-1
*Friction
 0.12,
*Surface Behavior, pressure-overclosure=HARD
*Time Points, name=Stresses, GENERATE
0.0003, 0.0012, 0.0003
*Time Points, name=TimePoints-1
0.025
*Time Points, name=TimePoints-2
0.0012
*Time Points, name=Time_0_to_0p001, GENERATE
0., 0.001, 0.0001
*Time Points, name=Time_0_to_0p03, GENERATE
0., 0.3, 0.0003
*Time Points, name=Time_0p00001_0p08
1e-05, 1.5e-05, 2e-05, 2.5e-05, 3e-05, 3.5e-05, 4e-05, 4.5e-05
5e-05, 5.5e-05, 6e-05, 6.5e-05, 7e-05, 7.5e-05, 8e-05, 8.5e-05
9e-05, 9.5e-05, 0.0001, 0.00015, 0.0002, 0.00025, 0.0003, 0.00035
0.0004, 0.00045, 0.0005, 0.00055, 0.0006, 0.00065, 0.0007, 0.00075
0.0008, 0.00085, 0.0009, 0.00095, 0.001, 0.0015, 0.002, 0.0025
0.003, 0.0035, 0.004, 0.0045, 0.005, 0.0055, 0.006, 0.0065
0.007, 0.0075, 0.008, 0.0085, 0.009, 0.0095, 0.01, 0.015
0.02, 0.025, 0.03, 0.035, 0.04, 0.045, 0.05, 0.055
**
** PREDEFINED FIELDS
**
** Name: Predefined Field-1   Type: Velocity
*Initial Conditions, type=VELOCITY
Ball-1.Set-1, 2, -168.34
** ----------------------------------------------------------------
**
** STEP: Impact
**
*Step, name=Impact, nlgeom=YES
*Dynamic, Explicit
, 0.25
*Bulk Viscosity
**
** BOUNDARY CONDITIONS
**
** Name: BC-2 Type: Displacement/Rotation
*Boundary
Soft-PU-1.bottomLine, 2, 2
**
** INTERACTIONS
**
** Interaction: Int-1
*Contact, op=NEW
*Contact Inclusions, ALL EXTERIOR
*Contact Property Assignment
 ,  , IntProp-1
**
** OUTPUT REQUESTS
**
*Restart, write, number interval=1, time marks=NO
**
** FIELD OUTPUT: ball
**
*Output, field, number interval=100, time marks=YES
*Node Output, nset=Ball-1.Set-1
A, AR, AT, U, UR, UT, V, VR
VT
*Element Output, elset=Ball-1.Set-1, directions=YES
EDCDEN, ELEDEN, ELEN, ENER
**
** FIELD OUTPUT: F-Output-1
**
*Node Output, nset=Soft-PU-1.Set-2
A, RF, U, V
*Element Output, elset=Soft-PU-1.Set-2, directions=YES
EDCDEN, ELEDEN, ELEN, ENER, ER, EVF, LE, PE, PEEQ, PEEQVAVG, PEVAVG, S, SVAVG
**
** HISTORY OUTPUT: H-Output-6
**
*Output, history
*Energy Output
ALLAE, ALLVD
*End Step